##TITLE=1H_LR-737-K2
 CDCl3
 8 sc, 
 8.07.2022
##JCAMPDX= 6.0         $$ Bruker NMR JCAMP-DX V2.0
##DATA TYPE= NMR FID
##DATA CLASS= NTUPLES
##ORIGIN= UXNMR, Bruker Analytische Messtechnik GmbH
##OWNER= root
$$ XWIN-NMR		Version 3.5
$$ Fri Jul  8 14:31:16 2022 Russian Standard Time (UT+4h)  she@DPX200
##.OBSERVE FREQUENCY= 200.1313499994
##.OBSERVE NUCLEUS= ^1H
##.DELAY= (6, 6)
##.ACQUISITION MODE= SIMULTANEOUS
##.ACQUISITION SCHEME= undefined
##.AVERAGES= 8
##.DIGITISER RES= 18
##SPECTROMETER/DATA SYSTEM= spect
##.PULSE SEQUENCE= zg30
##.SOLVENT NAME= CDCl3
##.SHIFT REFERENCE= (INTERNAL, CDCl3, 0, 15.7039)
##AUDIT TRAIL= $$ (NUMBER, WHEN, WHO, WHERE, WHAT)
$$ ##TITLE= Audit trail, XWIN-NMR		Version 3.5
$$ ##JCAMPDX= 5.01
$$ ##ORIGIN= Bruker BioSpin GmbH
$$ ##OWNER= she
$$ F:/spectra/data/she/nmr/H-F/1/audita.txt
$$ ##AUDIT TRAIL=  $$ (NUMBER, WHEN, WHO, WHERE, WHAT)
(   1,<2022-07-08 14:30:18.95 +0400>,<she>,<DPX200>,
      <created by zg, POWCHK disabled, PULCHK disabled
       configuration hash MD5:
       00 E9 B6 7A A2 85 ED C7 34 08 36 98 17 FE 4E 26
       data hash MD5: 16K
       FA 5B 3E C7 52 B9 D5 A9 75 F3 5D E4 63 E7 60 F1>)
$$ ##END=
$$ 
$$ hash MD5
$$ 9D DC B7 8D 89 FB B5 3E 80 7E 9D FD C7 D2 94 20
##$RELAX= 
##$RELAX= 
##$RELAX= 
##$RELAX= 
##$RELAX= 
##$RELAX= 
$$ Bruker specific parameters
$$ --------------------------
##$DU= <F:/spectra>
##$EXPNO= 1
##$NAME= <H-F>
##$PROCNO= 1
##$TYPE= <nmr>
##$USER= <she>
##$AMP= (0..31)
100 100 100 100 100 100 100 100 100 100 100 100 100 100 100 100 100 100 
100 100 100 100 100 100 100 100 100 100 100 100 100 100 
##$AQSEQ= 0
##$AQ_mod= 1
##$AUNM= <au_zg>
##$AUTOPOS= <>
##$BF1= 200.13
##$BF2= 200.13
##$BF3= 200.13
##$BF4= 200.13
##$BF5= 200.13
##$BF6= 200.13
##$BF7= 200.13
##$BF8= 200.13
##$BYTORDA= 1
##$CFDGTYP= 0
##$CFRGTYP= 5
##$CHEMSTR= <none>
##$CNST= (0..31)
1 1 145 1 1 1 1 1 1 1 1 1 1 1 1 1 1 1 1 1 1 1 1 1 1 1 1 1 1 1 1 1 
##$CPDPRG= <>
##$CPDPRG1= <>
##$CPDPRG2= <>
##$CPDPRG3= <>
##$CPDPRG4= <mlev>
##$CPDPRG5= <mlev>
##$CPDPRG6= <mlev>
##$CPDPRG7= <mlev>
##$CPDPRG8= <mlev>
##$CPDPRGB= <>
##$CPDPRGT= <>
##$D= (0..31)
0 1.2 0 0 0 0 0 0 0 0.06 0 0.03 0 0 0 0 0.0002 0 0 0 0 0 0 0 0 0 0 0 0 
0 0 0 
##$DATE= 1657276218
##$DBL= (0..7)
120 120 120 120 120 120 120 120 
##$DBP= (0..7)
150 150 150 150 150 150 150 150 
##$DBP07= 0
##$DBPNAM0= <>
##$DBPNAM1= <>
##$DBPNAM2= <>
##$DBPNAM3= <>
##$DBPNAM4= <>
##$DBPNAM5= <>
##$DBPNAM6= <>
##$DBPNAM7= <>
##$DBPOAL= (0..7)
0.5 0.5 0.5 0.5 0.5 0.5 0.5 0.5 
##$DBPOFFS= (0..7)
0 0 0 0 0 0 0 0 
##$DE= 6
##$DECBNUC= <off>
##$DECIM= 32
##$DECNUC= <off>
##$DECSTAT= 4
##$DIGMOD= 1
##$DIGTYP= 9
##$DL= (0..7)
0 120 120 120 120 120 120 120 
##$DP= (0..7)
150 150 150 150 150 150 150 150 
##$DP07= 0
##$DPNAME0= <>
##$DPNAME1= <>
##$DPNAME2= <>
##$DPNAME3= <>
##$DPNAME4= <>
##$DPNAME5= <>
##$DPNAME6= <>
##$DPNAME7= <>
##$DPOAL= (0..7)
0.5 0.5 0.5 0.5 0.5 0.5 0.5 0.5 
##$DPOFFS= (0..7)
0 0 0 0 0 0 0 0 
##$DQDMODE= 0
##$DR= 18
##$DS= 0
##$DSLIST= <SSSSSSSSSSSSSSS>
$$ [...]
##$SUBNAM2= <"">
##$SUBNAM3= <"">
##$SUBNAM4= <"">
##$SUBNAM5= <"">
##$SUBNAM6= <"">
##$SUBNAM7= <"">
##$SUBNAM8= <"">
##$SUBNAM9= <"">
##$SW= 18.0517283424941
##$SWIBOX= (0..15)
0 0 2 0 0 0 0 0 0 0 0 0 0 0 0 0 
##$SW_h= 3612.71676300578
##$TD= 16384
##$TD0= 1
##$TE= 0
##$TE2= 300
##$TE3= 300
##$TEG= 300
##$TL= (0..7)
0 120 120 120 120 120 120 120 
##$TP= (0..7)
150 150 150 150 150 150 150 150 
##$TP07= 0
##$TPNAME0= <>
##$TPNAME1= <>
##$TPNAME2= <>
##$TPNAME3= <>
##$TPNAME4= <>
##$TPNAME5= <>
##$TPNAME6= <>
##$TPNAME7= <>
##$TPOAL= (0..7)
0.5 0.5 0.5 0.5 0.5 0.5 0.5 0.5 
##$TPOFFS= (0..7)
0 0 0 0 0 0 0 0 
##$TUNHIN= 0
##$TUNHOUT= 0
##$TUNXOUT= 0
##$USERA1= <user>
##$USERA2= <user>
##$USERA3= <user>
##$USERA4= <user>
##$USERA5= <user>
##$V9= 5
##$VALIST= <valist>
##$VCLIST= <CCCCCCCCCCCCCCC>
##$VD= 0
##$VDLIST= <DDDDDDDDDDDDDDD>
##$VPLIST= <PPPPPPPPPPPPPPP>
##$VTLIST= <TTTTTTTTTTTTTTT>
##$WBST= 1024
##$WBSW= 4
##$XGAIN= (0..3)
0 0 0 0 
##$XL= 0
##$YL= 0
##$YMAX_a= 31820
##$YMIN_a= -54375
##$ZGOPTNS= <>
##$ZL1= 120
##$ZL2= 120
##$ZL3= 120
##$ZL4= 120
##$ABSF1= 10
##$ABSF2= 0
##$ABSG= 5
##$ABSL= 3
##$ALPHA= 0
##$AQORDER= 0
##$ASSFAC= 0
##$ASSFACI= 0
##$ASSFACX= 0
##$ASSWID= 0
##$AUNMP= <proc_1d>
##$AZFE= 0.1
##$AZFW= 0.1
##$BCFW= 1
##$BC_mod= 2
##$BYTORDP= 1
##$COROFFS= 0
##$CY= 11.3945322036743
##$DATMOD= 1
##$DC= 2
##$DFILT= <>
##$DTYPP= 0
##$F1P= 2.36226072786647
##$F2P= -0.459571619588291
##$FCOR= 0.5
##$FTSIZE= 0
##$FT_mod= 4
##$GAMMA= 1
##$GB= 0.15
##$INTBC= 1
##$INTSCL= 1
##$ISEN= 128
##$LB= 0.24
##$LEV0= 0
##$LPBIN= 0
##$MAXI= 10000
##$MC2= 0
##$MEAN= 0
##$ME_mod= 0
##$MI= 1.114404
##$NCOEF= 0
##$NC_proc= 0
##$NLEV= 6
##$NOISF1= 3.799351
##$NOISF2= 2.8
##$NSP= 1
##$NTH_PI= 0
##$NZP= 0
##$OFFSET= 15.70392
##$PC= 1
##$PHC0= -18069.97
##$PHC1= 20.00068
##$PH_mod= 1
##$PKNL= yes
##$PPARMOD= 0
##$PSCAL= 0
##$PSIGN= 0
##$REVERSE= no
##$SF= 200.130013532006
##$SI= 16384
##$SIGF1= 3
##$SIGF2= 2
##$SINO= 400
##$SIOLD= 16384
##$SREGLST= <1H.CDCl3>
##$SSB= 0
##$STSI= 0
##$STSR= 0
##$SW_p= 3612.71676300578
##$SYMM= 0
##$S_DEV= 0
##$TDeff= 0
##$TDoff= 0
##$TI= <>
##$TILT= no
##$TM1= 0
##$TM2= 0
##$TOPLEV= 0
##$USERP1= <user>
##$USERP2= <user>
##$USERP3= <user>
##$USERP4= <user>
##$USERP5= <user>
##$WDW= 1
##$XDIM= 8192
##$YMAX_p= 0
##$YMIN_p= 0
$$ End of Bruker specific parameters
$$ ---------------------------------
##NTUPLES= NMR FID
##VAR_NAME=  TIME,          FID/REAL,        FID/IMAG
##SYMBOL=    X,             R,               I
##VAR_TYPE=  INDEPENDENT,   DEPENDENT,       DEPENDENT
##VAR_FORM=  AFFN,          ASDF,            ASDF
##VAR_DIM=   8192,          8192,            8192
##UNITS=     SECONDS,       ARBITRARY UNITS, ARBITRARY UNITS
##FACTOR=    0.0002768,     1,               1
##FIRST=     0,             0,               0
##LAST=      2.2672688,     0,               0
##MIN=       0,             -54375,          0
##MAX=       2.2672688,     31820,           0
$$ Real data points
##PAGE= N=1
##DATA TABLE= (X++(R..R)), XYDATA
0 0 0 0 0 0 0 0 0 0 0 0 0 0 0 0 0 0 0 0 -1 8 -8 8 -8 8 -8 16 -16 16 -20 24 -24 32 -33 40 -43 49 -56 61 -69 77
40 77 -85 96 -107 118 -130 143 -159 175 -193 213 -233 257 -284 314 -346 383 -425 472 -527 593 -670
61 -670 765 -882 1035 -1239 1530 -1979 2781 -4659 22222 -8422 -12840 30363 1871 -5086 26828
76 26828 21035 -11409 -746 -152 -12927 6989 23282 -5985 -12399 5731 -10614 -27802 99
89 99 11474 -10065 -13143 -4871 -14524 -10115 6492 2666 1053 12773 314 -16213 3173 17196
103 17196 -1660 -3472 11652 -1907 -16853 -2068 6159 -1398 4173 6465 -7149 -4136 8311
116 8311 270 -2688 13337 8275 -11261 -5198 6485 -1351 -3742 6366 2596 -5068 -1225 -701
130 -701 -1119 7183 7711 -2995 -929 5314 -2527 -5245 5634 5598 -4375 -3468 -477 -3906 -2238 2374
146 2374 -1150 -1925 1817 -3518 -7549 927 4391 -3681 -3346 2488 -2056 -5576 606 3461 269 1120
162 1120 1342 -1596 718 3262 214 85 4494 1335 -4374 -481 2984 -664 -1025 1831 484 -1658
178 -1658 -404 -173 174 2098 1179 -2093 277 1882 -1487 -1705 2141 1359 -2134 -1182 245 -619 -630
195 -630 446 -234 -289 439 -901 -1071 1373 1672 -1181 -645 1475 192 -1194 492 1154 -177 -12 -91
213 -91 -171 291 420 -679 -126 816 -332 -1424 -116 787 -295 -626 178 343 -218 -345 -21 154 498
232 498 -36 -525 509 508 -256 -764 428 191 -683 -478 206 146 -168 -161 -182 170 262 -199 -99 351 252 -380
254 -380 97 526 -3 -171 110 400 -4 54 -34 250 209 -74 29 75 89 -262 -342 70 158 -316 -143 -25 502
277 502 -128 -109 -12 277 -1 -247 73 88 53 -139 41 93 304 -19 97 234 40 -382 178 297 -8 -307
299 -307 -242 104 145 -92 -369 -149 9 -123 178 79 356 148 -112 250 55 24 -192 -32 -69 -155 -160 153 29
322 29 115 82 -109 164 237 -237 59 -60 -161 6 0 -53 32 36 -129 -125 -89 55 -132 102 -158 -84 -197 209 -205
347 -205 -12 53 -49 65 -68 -5 -27 146 -114 -70 193 215 -7 7 -83 151 -134 21 95 -49 59 -2 18 0
371 0 -16 -76 -35 87 -170 -64 17 -133 -5 -33 63 136 167 12 -191 24 165 5 -102 -202 56 233 73 -3
395 -3 13 139 -225 117 144 -283 -219 -24 283 -74 152 7 -2 -38 -89 38 -43 -110 -151 -85 139 -111 14 -150 -84
420 -84 179 188 -63 107 -91 -125 -96 -83 -101 19 -88 22 116 -82 181 73 132 -141 -161 172 -9 -27 -200 -87
444 -87 -122 -54 296 30 182 232 169 -16 54 52 -107 -39 293 133 -10 71 132 -20 -15 121 -504 23 85 -373 -51
469 -51 187 -11 19 123 161 -187 -74 -12 -243 9 8 134 -16 24 107 -67 2 241 -1 -216 -27 77 15 169
493 169 302 -222 123 46 51 272 126 -24 138 18 79 -355 165 28 -216 -18 126 71 3 181 -62 -139 -60
516 -60 88 -289 68 63 96 -82 227 195 -227 139 188 229 -196 -148 -293 -36 5 160 167 54 173 -133 -50 82
540 82 -106 -148 176 -16 -7 210 -37 71 -123 142 42 -208 -42 256 -37 95 239 17 -401 -121 14 -196
562 -196 -41 330 -177 119 -124 -77 -36 2 80 30 190 -65 168 -55 113 -14 19 76 -40 -213 63 -91 -28
585 -28 226 137 128 -203 94 -67 -16 2 73 -158 127 -143 59 78 77 -50 -193 -174 36 62 33 233 -53 -72 193
610 193 147 84 183 105 -46 -158 -56 -491 224 141 53 132 49 -108 -47 141 48 -176 56 147 -130 -163 -260 129 31
635 31 66 20 -25 -96 61 4 68 9 118 -69 -49 -133 49 -133 20 -158 -78 105 -108 92 250 62 159 -117
659 -117 13 135 113 107 -77 95 -150 -111 54 -212 178 22 38 101 16 -320 119 24 -171 228 -78 -10 -57 21
683 21 -11 -468 -547 -566 559 355 -1 -317 -256 -383 337 -357 -208 293 202 419 -308 18 -193 -80 -40 -18 5
706 5 7 -175 39 -110 -82 16 121 -29 -235 124 -112 28 29 301 -322 -67 -4 -27 73 -283 34 3 -44 242
730 242 87 139 -18 72 10 -91 53 82 -39 -65 117 -187 29 28 -76 156 70 -46 -81 157 -307 165 -3
753 -3 21 21 165 -63 79 -138 -76 -89 16 -373 120 -142 4 102 -172 -156 7 101 71 67 11 -201 120 196 157 234
779 234 -57 6 -159 -42 -218 -23 -36 194 52 106 57 -187 159 122 -64 85 -149 163 -102 -29 91 -83
801 -83 38 50 -189 -154 -104 -338 -23 -154 241 115 86 241 -38 141 3 -182 143 28 63 72 126 -39 45 47
825 47 -36 58 159 -198 -69 133 141 7 133 -118 -115 24 67 27 -108 159 87 145 78 232 -104 -101 -194 -157 62 42
851 42 88 45 -106 -99 -59 75 -140 77 166 299 -89 11 -62 -157 -138 227 17 196 -162 134 91 -158 -16 18
875 18 204 -361 133 -64 -97 16 -262 -31 68 -26 -201 -152 193 39 57 -157 -126 779 -304 661 263 78
897 78 375 -85 121 -91 -78 186 8 -216 6 200 155 -111 -40 -77 -23 39 48 -74 -106 -4 -89 -92 -20 54 43 -205
923 -205 216 63 59 22 -226 -50 186 -27 -138 -72 -41 -6 -49 165 54 37 -43 128 16 27 -9 174 -100 80
947 80 -150 -91 -73 -35 -74 90 102 -141 282 -645 -856 494 818 372 -567 -70 125 -286 32 -3 39 69 164
970 164 -45 74 -49 -49 27 -121 -10 88 -32 -90 -28 32 202 58 98 -109 -27 0 -234 26 84 76 94 169 103 74
996 74 -82 -229 80 7 28 102 109 -124 236 140 -45 -170 -56 -131 -287 70 -177 559 84 -282 391 -457 31
1019 31 -532 -428 296 -103 -10 36 -236 48 110 216 -53 -27 -94 153 -100 -44 59 2 39 -43 -20 -36 -190 -107
1043 -107 99 162 243 -132 -26 -73 207 -160 489 -7 -131 -270 243 -41 -59 236 -36 239 -104 381 93
1064 93 98 -278 45 503 -7 185 -115 167 -664 187 793 -454 -378 457 260 -723 85 457 -442 -54 608
1085 608 -222 -69 -180 32 -272 216 71 -135 45 -137 -217 354 -186 250 -3 -80 -351 -472 -157 -105 432
1106 432 -221 130 -9 -144 10 -98 -58 126 -82 97 -181 -90 25 154 93 55 -85 -86 130 8 130 4
1128 4 116 25 -11 167 -18 215 -24 -160 370 167 -199 21 6 120 81 33 -14 98 -107 -112 -110 -13 -55 125 -104
1153 -104 44 190 -133 31 4 43 65 122 -93 192 -369 3 -88 66 326 -94 -190 181 46 38 313 -485 135
1176 135 372 695 343 618 -291 -42 377 65 442 94 107 113 428 378 217 63 19 -190 112 52 -178 -80
1198 -80 20 76 -9 -4 -80 54 52 50 76 188 -146 -11 213 5 -142 93 -141 -41 117 23 -171 104 -145 -78
1222 -78 -106 -260 -59 -201 -11 -75 -147 176 -92 63 -25 100 174 21 144 -150 -210 51 -93 8 -12 -44 26
1245 26 83 -129 -15 -217 -35 -145 -232 29 -65 -52 -225 -131 17 -21 -72 -176 -112 154 -8 -126 169 -75 86
1268 86 -141 -228 89 -238 -11 68 -187 -31 -88 -132 47 81 44 -90 -261 94 13 7 62 -143 69 -10 -43 -231
1292 -231 164 -34 -123 20 -104 84 137 47 -82 -161 -253 -100 -43 -3 -6 -100 -214 17 -7 -54 204 57 -97 27
1316 27 -65 -30 78 132 -242 25 -34 -34 86 -131 -26 -27 251 -132 -154 -115 -259 -77 7 -221 -113 -166 91 -69
1340 -69 162 -21 -170 -103 24 7 -110 202 159 186 -96 -28 93 -46 142 -15 -14 82 -134 19 128 -189 -32
1363 -32 85 -186 -77 218 -149 -147 -175 225 -74 -64 -41 36 -96 13 13 150 -35 178 -33 167 -94 -70 191
1386 191 6 11 -30 107 132 -14 16 17 -158 108 -35 -14 -117 -20 -137 42 60 127 152 -190 227 -25 118 -42
1410 -42 58 71 30 151 -105 -117 -39 55 -33 20 -17 -56 36 -125 56 152 11 41 -199 74 161 -93 4 66 125 -100
1436 -100 70 267 -118 -18 -40 22 -205 255 131 81 125 -242 118 38 -111 -67 95 -320 -131 -95 5 13 12 -217
1460 -217 66 -202 -127 -156 -71 25 -169 -28 -3 -106 13 11 60 -47 36 -40 31 71 41 -196 57 42 140 -138 101
1485 101 124 119 -75 -51 -67 61 -128 -333 215 28 -33 -68 53 -152 -196 184 42 -8 192 -59 -132 144 -105
1508 -105 137 1 17 -141 159 -77 -159 -67 80 160 -130 -53 26 -61 34 -72 5 -156 -133 25 -55 87 -66 -8
1532 -8 -44 -52 87 -66 -27 14 -50 -29 138 -41 -100 -91 11 11 -192 -136 -76 -27 112 -143 -45 109 -388 51 132 -112
1558 -112 35 8 -48 -141 -244 -205 -109 15 -69 63 8 -110 23 -75 196 144 -119 -21 69 -164 -12 -134 -22 -52
1582 -52 213 189 29 -202 -194 -32 331 86 -530 -27 -447 4 -728 227 -628 -94 1009 -124 -99 -243 32
1603 32 256 -41 411 242 -323 -817 393 58 -232 398 175 231 100 -13 -14 37 -17 84 -149 -78 68 75 -185
1626 -185 105 -44 -70 21 -124 -169 -152 -43 -232 48 141 -43 -110 -58 214 254 -122 -25 -13 -110 103 30 148 83
1650 83 -1 -8 -202 129 13 -178 56 221 15 103 173 -57 -60 -62 -154 87 -56 -53 70 -23 8 182 -223 -125 -92 -87
1676 -87 253 -45 112 -24 -97 233 107 181 5 -79 -34 -100 -124 74 41 -121 5 106 -269 -113 153 153 -52
1699 -52 56 139 140 -7 68 -114 -91 33 50 223 12 -12 -74 20 23 286 -58 125 24 -108 -10 163 153 -78 162
1724 162 21 -52 -46 -22 -82 105 -133 5 138 -26 127 -126 -9 -34 -61 27 53 43 -83 59 35 9 -112 -26
1748 -26 170 37 163 197 193 -7 -42 56 -82 193 98 -50 -91 168 56 -26 -70 -181 73 -67 -304 89 44 -23
1772 -23 126 -45 -49 -58 -126 86 -86 -47 -50 29 -205 94 55 32 224 -102 72 8 -60 180 -221 144 -91 -12 -235
1797 -235 154 224 -150 98 -197 -140 172 -33 266 -26 -117 -80 -119 -36 22 -67 -102 -131 -76 72 -63 -33 -43 56 20
1822 20 -34 -146 -25 49 -90 15 65 -17 1 -111 132 191 0 -50 147 -186 69 51 1 -92 152 -6 55 -91
1846 -91 173 -100 -43 82 -129 72 -80 -2 -240 -22 -302 -152 50 -196 -46 -149 144 -155 -97 175 71
1867 71 -55 178 170 -85 28 3 208 51 135 -123 -49 88 -84 -13 117 -56 -20 21 -37 135 112 -196 -74 -20
1891 -20 -16 103 -110 76 29 153 93 125 -97 -190 153 65 134 -137 -30 -74 163 -105 -16 9 31 81 -39 -68 -43
1916 -43 -46 214 161 37 -142 221 -29 -234 95 8 150 15 41 -34 71 126 -29 164 195 -5 18 198 144 3
1940 3 26 -45 -352 105 -88 -15 50 40 -75 -115 94 193 126 -106 -122 35 107 -151 -225 19 -93 68 -20 185 -139
1965 -139 197 49 -29 -51 -24 -154 34 63 55 96 -19 -6 -278 30 51 -15 -24 188 -141 87 -206 -58 48 -210
1989 -210 30 3 -45 -41 -157 67 -136 -17 30 166 91 9 -207 -75 -69 -106 -134 20 35 -64 -64 44 -45 40 117 -204
2015 -204 89 -25 87 7 -139 -16 -154 -239 -10 -81 129 4 104 82 9 43 71 211 104 27 58 -122 -147
2038 -147 58 -6 -240 9 73 313 -123 53 -89 61 143 -136 -13 94 101 -57 121 -83 57 -65 -97 6
2060 6 141 237 83 -9 -30 275 -101 82 186 -104 69 74 182 -35 239 28 -45 -266 338 501 -313 -540 -56
2083 -56 64 -6 -6 -84 -238 -90 152 145 -7 8 -131 151 40 -215 144 -361 49 79 -8 154 -477 188 124 -155
2107 -155 -9 265 -412 445 -28 -57 -55 -113 -473 60 162 -145 -407 -12 224 -121 270 -455 247 -38 -46 -634
2129 -634 292 27 -644 185 545 167 161 627 385 600 276 -36 -94 -174 25 109 90 126 286 722 -46 -36 95
2152 95 -209 112 34 100 75 -141 -85 -51 -189 -137 15 25 -112 58 124 -19 88 274 80 -176 -140 -76 102 -156
2176 -156 102 -33 -181 -160 -281 16 25 -78 -47 167 -166 -34 -18 -58 42 57 -288 26 114 -1 84 98 178 39
2200 39 123 65 -63 -72 112 97 97 -1 -53 -64 -128 -47 -77 -103 -104 90 -46 -123 105 250 3 140 113 -22 -99 -21 89
2227 89 -48 -20 54 -128 118 37 -114 2 72 -57 76 123 -27 157 -42 -65 41 -49 -119 283 15 -6 -110
2250 -110 159 -26 -88 61 129 -80 30 299 155 -62 -99 -105 -14 -191 81 173 110 62 -229 -131 -59 181 83 -60
2274 -60 -44 -30 37 -52 -87 -85 93 -169 63 51 -172 16 -175 -114 -136 12 167 -41 -83 46 187 150 -104 -27 57
2299 57 162 -136 -70 85 114 -286 186 -308 -88 -17 -94 22 12 -140 -8 -37 -105 -88 -57 168 -23 93 -52
2322 -52 -243 -134 -63 -71 51 142 -19 154 -59 67 -63 3 160 12 -72 37 32 -185 112 -85 130 -40 25
2345 25 -65 21 283 156 -3 62 59 11 -146 -17 -16 33 -11 -150 52 -27 60 120 -15 -6 251 -174 -131 66 -89 -144
2371 -144 104 254 -66 -48 -8 47 -37 260 15 -142 255 123 116 -26 -215 5 92 46 96 136 -157 74 137 166
2395 166 89 -317 -89 -4 -4 209 -183 -42 202 -140 -96 51 191 133 -66 82 -91 -27 -18 -33 -83 -176 -67 125
2419 125 -265 175 40 -51 337 -2 -39 51 24 54 -6 -150 137 -75 109 -20 49 9 251 67 104 181 56
2442 56 91 -168 -190 -12 77 223 22 -172 -30 -254 -13 16 -76 18 -122 -135 -8 -58 175 151 -43 -35 -140 202
2466 202 -109 -119 232 -180 -22 -126 -295 -57 35 -171 -51 158 -226 -30 -6 -44 -80 -44 90 15 215 56
2488 56 -135 20 3 156 34 152 38 82 -58 -28 86 -98 98 58 -39 192 -67 61 -30 207 -143 73
2510 73 54 29 41 -107 -52 269 69 100 135 -49 -86 113 -51 61 18 -29 41 168 252 -168 52 -170 48 -4
2534 -4 161 -57 -139 191 -367 -171 136 -85 74 -52 -258 84 70 -133 15 -4 -91 13 -165 61 62 155 101
2557 101 33 -108 -16 -30 116 49 -115 -1 40 48 -70 -19 86 -9 122 -52 4 123 -105 -29 -154 -149 110 -202
2581 -202 -93 -77 48 -79 -58 4 9 -72 96 -149 -99 -96 -220 -34 88 146 -449 -119 -200 138 -85 98 53 75
2605 75 -105 11 14 134 138 -3 76 165 26 -213 -68 215 -36 -44 21 -72 -124 -33 103 14 -44 154 22 59 -231
2630 -231 22 -96 36 -176 -38 -52 -309 3 173 -72 57 -117 40 -134 141 -28 -106 59 -26 -65 43
2651 43 0 -55 63 26 103 -20 160 8 -95 34 -87 -114 25 56 4 -55 222 81 55 -118 -146 36 -333 -21
2675 -21 25 -83 112 149 138 -129 -197 -78 -123 -37 50 15 64 -19 -84 -204 65 29 77 -47 0 32 2 -13 -73 17 126
2702 126 111 109 31 198 36 -81 -42 103 54 6 10 -7 -90 68 56 39 -121 271 -170 73 -244 23 -134 -138 -7
2727 -7 -91 -20 269 -144 -98 88 80 105 -235 14 -94 -262 -355 64 219 69 -134 -60 48 83 95 66 -30 69 -95
2752 -95 -162 -27 86 180 -11 -200 -52 -61 106 240 96 44 -95 64 -196 -265 -105 72 -102 111 -7 -47 7
2775 7 -141 -100 -77 -188 -19 -57 -220 133 66 -65 109 -113 102 195 -47 -51 -61 -100 -38 -234 133 -160 -41 21
2799 21 0 65 -28 -115 109 88 5 47 48 21 -47 36 -91 -167 -105 16 -41 3 -132 -47 -287 -136 83 -3 -46 -164 -131
2826 -131 -74 -173 -109 101 -99 -33 -57 -7 -125 -89 -26 -43 -127 126 -86 -131 0 -53 -86 -61 -88 -143 -188 -66 -99 125
2852 125 0 -14 166 190 -78 317 -47 72 -152 -138 -69 -78 94 166 132 -164 41 -76 204 77 248 13 -65
2875 -65 88 -142 -64 74 -7 42 96 89 -157 -219 -152 -135 50 16 90 -84 7 -48 48 -165 258 131 -69 25 -57 -160
2901 -160 -2 -18 -44 120 -19 92 -2 -156 52 86 -85 -8 -208 75 -98 -77 -3 -3 72 52 294 -59 -52 153
2925 153 20 -42 49 -94 -120 50 17 120 -44 -20 -62 1 117 329 137 52 191 -66 91 -18 -64 -179 69
2948 69 9 5 -176 -105 209 247 103 490 306 128 241 -70 87 52 225 393 710 1292 -596 -21 -183 446
2970 446 -231 -86 166 -412 -13 6 -28 82 65 -59 109 -129 41 267 55 68 63 -114 -148 155 -75 -105 45
2993 45 95 95 -218 -20 107 93 13 -37 266 34 37 -89 -4 94 160 132 -32 78 -72 -139 114 -105 50 68 -19
3018 -19 133 66 49 3 6 157 -38 2 -187 -320 -10 54 6 64 -10 -49 -127 -52 30 -83 -64 -119 160 51 -221 157
3044 157 -111 -142 -47 -50 17 -28 170 -64 -167 -100 318 -97 174 -108 -44 -69 -132 -90 88 74 79 -6 60 86 -83 41
3070 41 -65 -134 -217 29 85 184 81 -65 212 280 -83 162 -136 -120 -91 -6 30 101 44 129 -317 -34 149 -88
3094 -88 129 -95 -57 39 130 30 -130 -2 25 10 -225 247 -156 143 -153 178 -6 48 3 -10 -146 143 -8
3117 -8 15 -74 54 143 -68 -144 -108 87 -85 18 63 94 -189 -108 34 -51 -120 38 11 -2 -5 9 -149 19 -152 -142
3143 -142 -189 76 13 -142 -58 -37 13 -90 163 87 -5 54 46 39 -197 114 266 207 182 -126 -26 86 -28 136 -32
3168 -32 -102 -94 -47 -118 -87 -146 153 -88 -52 81 -15 11 -89 80 -141 109 -71 3 -144 -139 -14 -101 240 54 -23
3193 -23 -102 138 44 -34 -198 37 -350 250 213 134 106 18 -23 -230 -42 -53 -57 154 -14 -185 -69 100 -15 -21 -40
3218 -40 -214 88 -141 142 58 -35 -128 70 -11 99 -64 -26 -42 -11 130 272 -107 103 -155 33 -100 -185 -72
3241 -72 193 -156 40 -37 12 184 155 -94 -67 100 143 -309 -165 212 75 -21 -80 -6 51 -20 -114 29 0 -48 152
3266 152 -59 197 75 -25 105 265 210 -57 177 59 15 -56 86 293 -31 126 -54 -76 -7 62 -57 -60 -204
3289 -204 -80 88 -82 -161 70 165 91 162 19 217 -242 159 50 -33 180 49 -106 321 -90 -209 26 -715
3311 -715 -283 -107 -321 -194 82 71 -49 -321 76 -121 -92 159 -83 -196 102 -39 -167 -106 -90 -179 70 45
3333 45 26 -221 -76 150 -56 228 451 417 -128 38 -291 205 200 -215 -50 -208 56 -118 -94 114 96 49 -10
3356 -10 82 -125 -14 44 -241 -43 -148 158 -3 98 69 -151 299 78 91 46 12 234 -95 -174 -83 -70 5 261
3380 261 72 262 92 -51 -19 -337 -109 -298 -216 -168 -95 142 -230 129 249 -132 80 157 -62 20 -12 -42 58
3403 58 72 -26 5 -67 129 137 94 168 -54 15 64 100 -58 23 36 -169 89 236 -27 -182 -48 -63 -88 -90 159 -63
3429 -63 -244 -93 53 -237 95 -128 26 -99 -244 103 81 -18 49 -5 257 -38 490 -67 65 368 -184 216
3451 216 56 78 177 -8 -71 34 144 222 -84 41 -276 -69 -75 133 -49 18 174 -131 -197 82 -28 23 221
3474 221 -35 2 -136 23 47 -60 152 136 -34 129 17 98 -180 131 -101 -103 146 -153 184 -178 24 -37
3496 -37 -97 142 -119 -90 244 -79 156 -66 -208 -34 36 -44 -39 83 -71 -14 96 -66 146 -129 -11 -83 -143
3519 -143 67 -80 -75 28 -15 163 -239 146 -178 -61 165 -17 182 -125 -105 -34 -283 -166 253 -6 8 220
3541 220 -93 55 116 -198 63 -70 -157 16 57 -58 67 -138 158 42 128 -180 144 -225 -201 76 290 64
3563 64 -333 200 514 205 253 62 -123 -35 -134 91 71 -444 -32 -206 11 -188 63 -12 -3 -61 -30 -1 -71 211
3587 211 105 23 -3 -134 19 -51 -344 -73 42 -108 62 -100 -189 -90 -36 127 16 259 125 -4 156 -39
3609 -39 -163 -25 -7 -31 -162 -180 -55 -231 -58 53 -19 -191 -7 305 77 50 24 47 14 -93 83 -71 24
3632 24 -165 164 -53 38 -97 80 108 -110 -148 306 21 -77 41 145 187 197 86 -36 30 -90 -9 34 -155
3655 -155 -15 20 -31 182 -62 222 -100 141 22 28 -52 96 8 -199 56 -111 151 -244 282 -139 250 383
3677 383 104 231 -176 41 -46 25 4 -148 120 -297 -43 75 129 -131 -67 -31 -58 77 -134 69 -179 -177 -8
3700 -8 98 -21 -83 81 31 -185 51 52 27 203 381 -200 444 -100 -101 9 39 126 -145 -401 -424 -416 -359 -258 233
3725 233 -375 -106 -101 258 161 59 -71 56 -91 -116 -47 17 -110 -50 -139 67 32 200 125 95 34 192 127 54 -184
3750 -184 -130 -276 -57 73 143 189 -9 -99 19 76 -72 -168 32 127 -11 -262 -174 64 41 8 16 99 -269 168
3774 168 65 -125 -36 -143 -105 148 -98 174 -52 33 -238 18 -44 -56 63 -179 152 100 -22 -58 27 -66 133
3797 133 -52 -48 183 297 97 -12 38 137 -25 7 52 -179 -184 -90 -10 -145 -3 82 -62 -111 26 -176 126 47
3821 47 -133 20 -87 92 29 -83 -116 287 98 25 110 155 143 85 -103 107 -196 -41 -114 44 30 -100 -74 20
3845 20 -105 -230 101 58 -57 319 -185 -198 -49 -22 19 -49 11 -74 37 -3 4 -81 107 99 -95 166 -268 -41 12
3870 12 137 186 139 -209 -152 65 133 -113 -91 -145 63 17 -141 170 -9 -42 -203 155 -101 53 -105 -155 -29
3893 -29 169 -239 18 136 101 177 86 -100 333 -107 -331 22 -271 51 -59 139 -189 -268 -719 592 -172
3914 -172 -699 -275 -118 -118 214 -29 -140 -265 126 86 41 15 -323 -260 -176 19 162 4 8 -61 48 -27 -131 133
3938 133 -176 -186 -297 18 108 -173 -54 50 26 102 26 193 -139 -205 22 -18 615 263 86 -419 -415 1138 291
3961 291 -29 312 -1187 320 389 285 201 38 508 336 -44 -3 151 57 -97 66 -141 162 -141 -16 -8
3982 -8 -23 -56 32 -207 21 12 148 131 -51 -111 -6 -59 222 -238 -50 -433 74 -159 150 347 62 -26 -1138
4005 -1138 -48 332 1210 -479 -474 291 -341 -199 -316 -94 75 -807 -351 -284 -116 366 -4 125 -300 81
4025 81 -176 -681 389 -186 158 -829 -205 165 83 -56 -170 139 45 169 -144 174 -73 124 -316 313 156
4046 156 -186 -82 -86 85 91 -315 -39 -225 -102 -229 54 -74 183 102 628 244 85 79 327 -58 447 651
4068 651 -130 -101 51 101 245 -81 -159 324 -162 -78 -133 -228 2 144 28 -31 202 139 157 -33 -204 -48 -134
4091 -134 88 58 -35 -125 11 -46 66 24 33 -53 16 -213 226 64 -126 -51 81 -31 -80 19 -158 -100 161 -40
4115 -40 19 -165 -205 3 -16 -2 135 214 -120 57 34 -53 -272 80 124 -1 77 -450 80 401 -228 53 78 -127
4139 -127 -508 -61 128 383 -264 -486 -150 -31 -238 -880 527 -597 131 3 104 47 -383 294 134 13
4159 13 -186 156 -20 230 -121 272 50 -185 20 -63 -189 99 132 63 78 25 -21 -101 94 55 -3 165 152 -178
4183 -178 -78 -407 -85 199 0 37 89 -65 4 111 -58 -174 96 5 54 130 33 -99 -82 146 -119 -170 218
4206 218 74 58 136 -74 41 277 197 7 30 -26 -195 -222 187 -74 261 -17 56 -9 -254 -225 -71 -262 -18
4229 -18 -160 20 51 -249 11 -153 -241 90 207 197 159 -153 -206 130 27 207 67 191 -189 -240 -165 202 47
4252 47 -274 81 -127 66 192 132 -271 35 -27 60 -17 -40 -45 162 49 -103 -98 7 80 182 237 -212 7 111
4276 111 87 42 -107 478 -13 147 -44 -54 11 144 133 79 10 122 53 245 -660 -369 77 92 180 197 -30 -166
4300 -166 -60 -169 155 -52 -99 -108 66 -69 -25 -216 -31 149 89 -113 -172 -119 120 -87 -60 101 -15 17 -194
4323 -194 -36 101 -8 -41 -36 -203 13 -34 -79 -55 57 330 50 58 66 -80 160 107 -139 -104 80 176 46 136 -33
4348 -33 134 -108 -15 -112 2 95 298 126 176 -114 -24 109 227 138 -370 11 40 -174 3 -238 -15 -182 -126
4371 -126 -341 37 -493 -592 -1 -330 -356 -490 -741 -367 -606 -139 -554 30 -153 461 -1 -1 13 -330 -39 -194
4393 -194 82 -142 72 -123 162 -194 -98 -16 -4 -146 -179 245 97 -247 18 -9 -220 -289 21 -113 60 51 77
4416 77 53 -74 72 21 57 -120 225 -132 -126 -75 -229 15 157 167 3 -110 -77 -163 -96 -31 -38 -120 143 -4 -196
4441 -196 -203 45 14 -91 -33 -47 -67 -115 50 -48 28 -166 -211 67 105 -74 -21 259 175 94 -249 162 -111 90 212
4466 212 39 205 90 -58 -28 -287 160 -75 96 140 115 -85 -3 -123 0 125 -183 -142 -29 -39 97 128
4488 128 61 305 63 47 -46 32 -57 -264 13 107 -69 -26 39 -147 -46 281 156 -29 -1 -199 -32 45 -15 122
4512 122 83 34 -21 96 -241 -45 -39 -195 119 -121 -22 -15 -44 178 -16 56 36 -24 1 -86 -250 28 -46 -216 -86
4537 -86 27 -197 177 -236 -144 13 47 169 -20 -22 -57 81 -20 -48 39 -74 -182 -56 -100 -61 244 -267 -34
4560 -34 122 373 -134 51 -69 -68 41 -227 104 2 -31 -46 34 -4 -80 32 -47 10 70 -128 -113 -106 173 -107 73
4585 73 143 -35 -325 -148 115 23 -111 103 43 -3 25 -63 -151 -11 -69 -156 0 87 -8 -31 106 22 41 -133 101
4610 101 -32 -25 7 172 -168 -254 -10 21 34 -113 164 -162 108 -123 86 73 -91 72 -132 75 -236 149
4632 149 161 50 55 -204 -7 137 5 -240 -20 97 5 -49 -46 -49 -93 -158 8 -83 -216 178 118 36 82 61 -168
4657 -168 75 -1 -91 -184 -102 227 58 98 -140 -91 -70 -110 6 15 -155 -102 36 121 168 -24 250 175 35 -93 130
4682 130 78 147 -23 -223 130 90 -88 -290 -34 -91 205 105 -36 122 -134 -54 1 -152 96 -72 114 131
4704 131 -174 -31 -104 68 91 49 -130 -61 -114 -77 77 64 40 -43 -14 -81 90 -34 -46 -129 14 -18 23 -85 -97
4729 -97 131 -32 38 94 -49 -116 -37 160 -92 -130 4 -136 71 -107 30 54 117 -27 -98 60 21 23 64 224
4753 224 -133 16 30 -60 106 92 78 62 -9 -138 -55 -46 -56 95 -40 -37 10 -60 -222 -80 -131 26 -73 81 64 -53
4779 -53 144 -34 -78 -70 39 -143 -149 -204 -137 57 -105 75 136 -8 50 -67 193 -54 -102 166 104 104 -44 -184 -11
4804 -11 -5 138 -18 128 154 -55 73 73 31 -180 3 25 -49 127 62 -75 3 133 -78 222 -181 146 15 101
4828 101 -109 -4 58 -153 -131 -205 -3 218 -77 -22 -179 -44 -97 -121 7 -159 16 63 82 147 189 -82 276
4851 276 37 103 -123 -211 149 48 26 28 54 -106 -125 2 -45 -35 -20 -29 112 39 -97 -51 -106 -114 -3 -13 106 133
4877 133 108 -20 -86 48 -81 166 6 39 -133 123 282 -237 -6 -129 53 -221 187 183 -117 -19 -53 129
4899 129 -41 -197 -53 -182 92 -49 -182 54 191 -67 248 -19 -105 188 -12 -96 -150 -60 -200 268 442
4920 442 -771 -281 -26 428 84 -157 -364 -196 199 -25 -196 66 -237 243 92 63 394 -228 -7 292
4940 292 -214 156 107 -99 -91 647 56 -311 126 -81 -10 -104 110 42 0 -366 -82 77 -186 377 215 -56
4962 -56 -64 53 -71 -104 54 144 104 5 -196 -13 -19 126 51 264 20 -214 -156 -106 -25 -289 21 -246 -56 9 37
4987 37 -206 -400 342 75 -444 -241 15 -23 75 -105 -86 -52 -91 78 -152 -74 -46 -59 30 54 18 50 77 -95 -107
5012 -107 29 -13 17 -91 -108 -50 224 62 -73 91 6 -98 41 46 84 -162 57 271 117 265 133 43 -82
5035 -82 72 -81 -152 -167 -19 83 248 10 -145 80 -112 97 84 60 20 -147 -114 -24 -79 -114 22 95 17 291
5059 291 4 -90 124 68 -22 12 7 -34 26 -179 -159 -118 201 -22 -5 108 -67 190 148 -25 -114 -39 8 211 -271
5084 -271 24 -111 32 47 -26 21 60 147 251 41 -189 159 -46 -240 -68 67 36 -49 -19 -96 -38 -137 -11 102
5108 102 175 -150 -53 -39 146 -130 -44 -154 62 -90 -40 9 53 -3 -75 81 113 -36 -12 -85 -29 21 -55 -48 117 -95
5134 -95 -134 -160 28 -74 -188 49 -52 99 -124 128 63 36 10 -254 323 -591 319 992 -305 120 2 153
5156 153 -364 235 -54 -171 30 138 -24 32 -153 -43 162 -116 100 -104 -386 139 -97 190 -48 9 64
5177 64 -123 10 -153 49 -171 38 -113 90 98 175 -35 0 158 -31 -178 26 -92 -147 1 -14 -19 -45 -268
5200 -268 256 -191 -323 148 140 74 -8 42 -79 9 -70 -73 -28 17 74 155 42 -233 -59 -234 50 -27 61 528 166
5225 166 365 92 -26 407 270 233 -397 -102 -108 29 -222 -128 -106 -96 -23 184 332 -181 -512 -94 211 344
5247 344 -559 29 1087 -591 158 -391 -42 111 -12 10 -8 -237 23 44 -158 -180 -80 44 239 -168 -255
5268 -255 78 -43 369 -211 -42 -123 -344 -34 -179 -246 -113 -342 -541 668 78 362 310 -94 -175 -136 -459
5289 -459 -420 -135 -352 71 69 -62 -268 -22 -25 -53 46 -771 543 -11 187 -101 160 -17 -177 209 -184 264
5311 264 -280 -97 -179 -292 153 87 31 49 -69 131 -2 -30 92 147 42 -151 43 3 35 13 40 162 -18
5334 -18 176 -122 76 42 -109 232 109 -117 50 225 7 79 -491 -227 721 -512 -586 591 354 -79 -498
5355 -498 128 1 641 500 -9 -511 288 -665 102 -90 -47 -240 -376 345 -298 80 -102 409 420 252 182
5376 182 372 54 -233 194 -398 -97 -464 -49 382 86 -295 27 320 -15 -101 167 6 228 102 -89
5396 -89 -24 -341 81 27 41 24 -285 -46 230 238 377 -51 311 -896 183 114 164 -90 1103 627 -324 197
5418 197 388 -199 -53 927 -458 189 394 345 211 216 93 52 292 -337 -213 -145 102 82 -123 33 82 641
5440 641 278 -146 354 -11 522 -402 340 66 -92 24 -316 -116 -191 -340 -601 -172 -172 304 25 16 -366 -68
5462 -68 -171 -183 -453 324 -62 222 355 290 -478 4 212 -490 -1252 -583 134 -86 -644 626 -379 -30
5482 -30 -21 -202 79 4 -128 -337 -893 -301 -23 -40 338 -287 79 -219 -428 -188 -151 569 -201 226 -605 492
5504 492 261 -94 -167 104 -477 -505 -574 -77 -124 237 -43 -40 -190 -187 252 -155 -36 -180 -218 87 155 -235 115
5527 115 116 -110 163 -14 150 197 -152 45 130 44 76 -134 -29 -84 10 -260 68 -13 -182 26 116 -90 -123 126
5551 126 144 100 229 73 -163 -130 -8 -30 54 -145 31 51 -9 -15 -210 126 69 329 186 21 159 19 -90
5574 -90 13 -43 89 126 15 81 161 -110 -117 -99 14 -63 133 153 19 85 -137 74 61 -33 68 -109 -234 82
5598 82 32 200 167 46 -39 2 -6 57 40 28 -155 154 15 -159 -190 -26 -51 -82 -2 -103 7 188 99 56 -222
5623 -222 181 20 -42 1 -159 -41 3 -22 177 -220 -224 96 -172 536 240 33 207 109 226 -48 48 21 -19
5646 -19 253 190 202 -62 60 227 210 5 -155 -36 92 -75 5 -84 219 44 141 83 84 63 -18 178 254 6
5670 6 192 -43 49 -50 253 -39 -43 -102 -177 -123 -52 110 -82 12 -64 239 232 87 19 137 119 -100 -31 223 71 8
5696 8 -112 -221 78 10 -168 -68 16 -269 -57 -165 69 85 17 -67 -22 165 -182 4 -99 -124 -231 96 -82
5719 -82 -214 131 24 -196 -185 3 -42 61 202 93 -55 -152 91 42 5 -151 117 -64 103 53 55 -38 47 -54
5743 -54 -171 240 -33 29 122 -41 192 -153 -97 -77 -77 154 170 243 2 158 78 -135 34 79 -107 -429 -197 32
5767 32 -820 -388 -214 269 -698 -219 303 -224 -8 -422 273 -209 -145 -155 6 44 124 -116 195 -13 -17 -39 -176
5790 -176 -235 -296 5 19 -49 96 -41 -150 -69 -100 243 -179 143 -196 -148 -230 107 -35 -11 -126 318 442 -258
5813 -258 54 -150 599 -99 -229 142 73 339 55 4 170 45 -37 186 39 -43 37 102 -159 -225 60 -6 -44
5836 -44 65 -247 -40 57 -215 77 -83 53 -66 -35 -27 -5 71 -93 53 -126 -113 158 107 -117 -136 154 157 -66
5860 -66 -150 1 28 33 -236 219 43 37 -90 20 -61 172 -308 147 35 -118 51 23 -5 -13 -7 -269 48 111 122
5885 122 -45 12 300 -40 -94 -117 75 4 42 171 -215 -191 110 64 290 177 50 -96 -55 85 -161 55 52
5908 52 89 111 171 92 -207 2 -58 112 -75 -161 -27 32 16 97 -19 -146 116 -105 65 -12 124 -65 22 -121
5932 -121 203 123 -14 -87 -94 -90 397 40 81 -135 -26 -168 51 89 -214 -57 -115 -44 140 -2 105 -85 7 30
5956 30 -266 14 -73 71 105 111 -142 14 -85 3 19 -177 11 -131 -65 3 -61 57 167 18 108 -12 -163 100
5980 100 102 -50 -29 69 -38 101 -70 174 108 180 13 94 73 185 133 93 14 -193 -34 11 27 67 150 -33 -155
6005 -155 -162 301 -118 24 -53 6 -222 66 29 -128 68 88 -48 54 -130 -71 -187 46 90 41 170 -32 33
6028 33 -56 85 -4 -28 -107 62 -104 9 64 47 -280 -26 65 36 27 29 59 -91 24 -131 -39 -100 -35 -26 -28 -109 62
6055 62 0 141 -126 -62 -9 -18 -66 -58 -40 -60 81 57 -39 -22 -55 157 -105 67 -31 -131 284 -87 -231 29 -126
6080 -126 104 -6 -73 203 65 -110 8 -105 162 -179 -169 91 -150 -99 -123 -90 -129 58 -82 -69 18 -34 -29 175
6104 175 73 -67 76 -68 98 100 15 -75 -56 10 -99 -115 6 -238 200 155 -30 95 48 -81 92 141 -19
6127 -19 -59 139 19 -99 -18 31 -22 64 50 -38 -92 7 39 -218 -302 -247 57 -144 136 -124 209 -75 -121 -205 141
6152 141 -5 167 135 -433 -384 -718 -1068 -658 -136 42 275 -709 257 -153 241 279 127 -417 -417 535 60 -198
6174 -198 -609 344 285 472 250 -116 -325 38 -268 -100 -504 -106 242 -235 -394 -308 -210 -18 196 -126 -78
6195 -78 121 86 -5 -75 -134 -74 32 -89 -184 -146 -83 43 108 65 -198 -30 -162 209 -91 44 165 -95 -50 -61
6219 -61 178 113 21 -146 71 -53 108 -187 -11 -153 65 95 84 29 235 -190 56 182 -150 144 29 -318
6241 -318 -439 -53 78 -162 -216 11 170 -207 -373 -143 64 34 593 -4 233 -415 -248 210 270 118 -408
6262 -408 361 182 -276 -369 540 44 545 204 -204 -235 -16 -138 329 -320 127 7 -168 373 -74 -5 83
6283 83 -19 -263 39 30 17 527 -309 -751 -508 26 -31 -465 215 -373 -234 326 -105 218 -43 -224 -242 152
6305 152 147 -240 237 35 298 -51 -84 -193 -95 -44 186 152 -49 5 -11 222 101 -101 127 241 92 -213 15
6328 15 -83 18 -84 -50 -108 -45 39 -17 -3 -79 -39 -34 33 -29 215 220 170 60 50 101 -77 -38 -111 -179 120 63 18 264
6356 264 -79 -3 105 -138 -126 -106 -155 -111 -47 -133 167 134 -119 -261 394 144 -43 -116 -59 253 -4 254 -65
6379 -65 66 -9 -138 119 111 -117 57 106 40 111 -58 -145 -20 -128 -9 -128 -41 72 413 239 -3 -98 92
6402 92 208 99 4 -9 -86 -47 104 -186 -17 -216 -104 -77 -57 -32 10 -49 105 -61 -13 -67 -34 -181 -77 -281
6426 -281 60 -62 -219 192 -1024 -220 92 -22 342 40 116 -92 -118 194 -163 84 39 83 -238 200 32
6447 32 -57 260 75 -183 6 2 -88 -41 111 -21 -127 -16 -81 113 35 -21 -124 193 96 367 -32 103 -102
6470 -102 15 -106 227 -15 -126 51 73 113 -32 -110 16 -15 -14 11 -192 278 -195 -42 67 60 139 5 23 71
6494 71 -23 221 -31 -36 0 -207 -91 66 -115 -85 35 -240 -168 234 63 130 -80 47 -41 104 -147 28 -304
6517 -304 -46 26 -53 231 -97 -76 -19 -3 111 90 -143 -90 27 79 -15 214 -85 171 68 169 153 136 -38 42
6541 42 98 -255 -9 -158 17 -180 24 -259 91 215 139 -99 94 103 246 -29 -233 86 27 -90 84 -74
6563 -74 -79 31 -113 58 97 134 41 -102 328 55 -185 118 -90 -263 -25 -68 -176 -197 -285 79 114 -7 -48 240
6587 240 118 76 73 -52 -265 118 -98 -151 92 -146 100 -45 84 -35 -111 -43 -26 -49 -169 32 -5 2 -77 46
6611 46 -78 60 -47 9 22 -55 47 -100 13 -26 -121 -94 -29 84 27 -78 43 175 26 256 -111 -30 75
6634 75 135 -140 108 -204 -164 59 -64 148 66 49 -39 -155 -69 66 -131 -64 -46 35 30 89 173 -8 -159 -44 160
6659 160 146 28 -11 -159 -95 76 -42 -22 -175 -16 -130 319 338 494 -319 -291 24 -312 -81 119 92 131 24
6682 24 154 123 205 86 -155 46 -27 246 151 178 12 -246 -51 184 -123 -692 468 -192 147 347 288 370
6704 370 425 262 372 129 89 -36 39 48 126 20 78 -86 99 100 131 70 152 223 -51 143 1 -7 20 161 -95
6729 -95 150 -83 -92 35 38 -87 98 90 27 53 -14 -130 34 -117 5 3 -34 -146 113 261 -161 -165 -10 -57 -203
6754 -203 -65 7 2 181 37 -38 -6 39 -124 -37 134 11 149 -24 -45 120 -220 -3 120 65 117 -30 13 -17
6778 -17 109 -79 33 -83 -54 -34 8 -201 55 -15 143 236 -97 -266 243 -123 158 109 227 -21 99 -6
6800 -6 194 -4 -106 -71 -47 148 283 -42 -191 148 -88 -22 -120 -140 123 -131 10 81 -15 98 -8 -62 62
6823 62 147 -99 151 139 -108 22 -188 93 -153 -29 -159 -81 54 203 -25 45 -11 -9 95 -46 160 -135 -69
6846 -69 99 -39 -9 20 -52 135 1 -48 60 43 -112 252 -46 -110 52 -124 -101 -36 28 42 142 22 186 -210
6870 -210 98 143 67 -148 -122 -138 -44 39 201 165 137 37 -38 -22 -37 29 126 -209 52 96 53 -24 -77 -13 -168 -44
6896 -44 -3 -106 -180 -132 71 56 -4 73 45 159 -115 44 8 128 -91 -36 -41 9 -215 -110 -18 11 34 -147 108
6921 108 57 99 -110 -23 72 98 27 -229 135 -77 86 -215 148 -182 -228 -122 -6 -50 102 21 191 -106 -5
6944 -5 -122 -25 58 2 -89 144 206 -203 445 443 167 -356 251 462 30 107 -87 -127 561 46 156 -151 -103 -97 2
6969 2 49 91 201 -107 87 -442 225 -24 15 -52 265 121 183 87 141 103 -29 261 -66 225 -362 -67 -245
6992 -245 169 161 77 -144 -257 55 165 298 -87 -475 -92 118 -259 243 -9 360 -674 -162 24 -21 411
7013 411 -259 97 173 290 -205 111 -387 94 160 -24 132 -166 -185 -71 -249 26 73 9 147 -44 -24 -209
7035 -209 -91 -123 185 -171 -112 41 128 132 -129 -20 25 -84 18 -30 149 -157 -210 140 -111 173 -47 -207 -62
7058 -62 47 -165 144 18 43 -17 123 -15 -82 247 -71 59 -78 31 -108 -53 -164 70 59 36 109 317 273
7081 273 -79 63 74 -77 -58 15 -8 -283 112 -46 37 95 315 3 -135 108 -10 -95 -120 7 255 107 182
7104 182 9 322 199 -8 286 191 187 -694 25 -443 72 -218 -630 714 290 526 648 206 -234 92 898
7125 898 -23 -411 283 249 -553 553 429 73 282 -320 -515 -413 -53 246 127 -99 -300 -15 51 -105
7145 -105 94 244 215 383 4 -22 -38 155 -157 -175 -261 -57 -53 -41 17 -81 4 -50 151 -51 50 40 30 201 133
7170 133 -179 -98 -176 23 -74 -161 326 -494 22 101 190 54 223 -144 -54 125 177 -179 -72 102 49 95 22 -85
7194 -85 -66 211 -165 190 -165 186 -60 154 92 -85 54 97 9 -249 580 342 -195 409 -149 411 344 -204
7216 -204 -592 -204 -24 152 200 555 173 455 -452 124 -235 423 492 85 -68 162 -48 -107 140 -90 3
7237 3 38 -233 -37 101 -18 -4 -102 -34 -93 77 -60 41 65 287 33 19 226 -22 -222 -86 -87 -15 55 24 -49
7262 -49 -57 120 207 -38 -184 93 59 -135 19 -1 64 179 -140 -44 -164 209 71 -120 52 -23 153 -40 80
7285 80 10 11 142 -30 -173 140 2 93 -148 158 58 79 -7 135 -105 -215 -139 97 301 96 -76 -46 -233
7308 -233 117 94 35 -335 -10 -166 -12 58 -29 -40 204 110 -12 183 -128 -57 -198 309 47 -145 85 -123
7330 -123 -69 156 -44 -58 100 57 107 -129 -309 73 -93 47 89 117 102 64 -134 -5 -157 281 -155 147 88
7353 88 38 127 -161 -43 127 -82 -24 -40 -38 -10 -42 -217 60 1 -33 191 -130 -72 83 42 -145 31 3 -132 -7
7378 -7 5 -170 -2 -5 -224 -14 -32 -22 328 -63 75 -55 117 136 213 139 40 -218 70 -14 -153 96 161 -1
7402 -1 100 52 54 92 96 78 134 -136 -160 96 136 327 204 99 79 -196 -65 41 -23 -29 -12 45 -95 -99 193 35 93
7429 93 105 22 115 -117 10 -10 77 53 -59 116 -258 53 58 255 91 -47 169 91 90 116 -87 -14 130 106 40
7454 40 -58 91 -137 83 -81 28 -118 -63 132 -140 -40 -99 -12 58 55 105 -16 65 -159 -167 -200 91 278 -48
7478 -48 42 51 110 160 -137 -338 220 -144 16 -367 264 253 230 121 149 96 115 -211 -79 124 -13 -148 130 35
7502 35 -126 133 163 -76 148 3 -7 29 13 -65 213 -74 -33 57 8 -104 129 55 -138 51 -82 167 -151
7525 -151 -324 326 -54 53 -65 -257 58 -40 127 109 91 -163 29 -123 169 -109 -124 247 -44 37 -25 14
7547 14 120 -235 -230 85 37 41 131 230 19 13 127 -30 119 121 36 -2 -187 -105 14 -196 -69 62 125 -235 34
7572 34 187 -104 200 192 -83 -2 232 -154 74 170 -104 0 -143 37 -44 -58 22 38 -126 -77 25 26 -44 67
7596 67 -90 105 -113 -115 -71 -44 52 -132 102 -19 -106 -307 -21 -35 129 -103 3 -80 54 -90 90 -97 73
7619 73 -69 24 -59 -85 8 -169 3 -199 14 48 96 -40 129 -102 -271 -107 183 -173 -35 46 49 145 221 -34
7643 -34 -22 -47 234 88 -73 54 -161 65 -54 -38 -22 22 -144 11 226 164 22 150 -311 -124 -47 -79 172
7666 172 53 -169 -16 376 -144 -218 -134 140 -62 167 167 -41 229 -148 -72 -116 76 191 226 -157 -31 -73 -119
7689 -119 -51 -120 37 17 67 -63 331 -85 -17 -44 -150 49 71 52 28 -25 -84 -124 40 -87 48 -6 6 4 76 -5
7715 -5 104 98 -87 -38 -216 -5 4 -69 -169 -34 235 -27 82 -15 194 -37 -12 80 104 88 -190 -19 101 22 -223
7740 -223 -160 170 -102 -135 56 80 13 96 -48 104 66 -147 -41 9 6 -177 72 -84 -231 -150 73 -43 134
7763 134 102 -201 147 103 44 26 148 -102 52 159 -83 -99 -40 33 -9 0 181 17 -8 142 -226 115 -51 -154
7787 -154 100 177 -146 25 -45 -60 -27 -199 -185 -40 79 -96 -200 18 -20 75 15 -111 37 -84 -13 -75 185
7810 185 -199 126 31 133 88 -103 29 -44 -84 -76 151 -59 -14 29 -50 68 -31 -72 124 -41 -58 -66 -100 -127 -233
7835 -233 13 -344 -538 87 57 183 -171 128 -456 388 459 -85 279 555 -420 25 661 19 -200 -110 148
7856 148 746 -313 342 -101 83 254 82 87 148 2 -54 -635 835 -134 200 -892 29 780 -481 211
7876 211 -141 683 912 56 51 -95 156 780 45 470 -177 -203 -265 -296 59 -83 163 71 -99 -385 -373 406
7898 406 89 529 828 377 38 -98 21 531 15 -32 285 -281 -349 253 48 322 -45 -178 118 167 -174
7919 -174 70 121 -75 -42 -112 -187 -59 -35 28 139 188 -42 -142 -72 -57 163 -231 -40 -23 3 317 170 149 84
7943 84 -154 101 38 30 20 -63 69 -153 -157 86 -25 334 58 -194 143 -82 -233 -103 106 -99 -64 -53 -128 -56
7967 -56 145 104 96 -233 -36 -7 -148 321 26 86 -200 -171 78 179 -207 44 303 161 -2 69 -89 219 -74
7990 -74 -217 17 130 161 -284 -48 41 -18 183 157 85 112 3 9 166 -55 101 -113 -110 -192 -44 43 -292 185
8014 185 15 40 11 11 -27 62 -36 -260 -212 121 19 -92 84 -126 -47 -75 -123 87 -163 89 236 142 -125 125
8038 125 -80 -4 -139 -50 -9 4 -6 -225 -315 211 19 155 10 -49 172 39 30 114 17 -353 -11 -5 -90 24 79
8063 79 -125 -131 162 70 -204 280 31 -78 -75 131 -28 128 273 -15 107 230 3 -74 247 -173 155 -60
8085 -60 -71 79 -58 86 -198 91 -194 18 10 -55 -213 -124 -6 17 -260 141 -55 -155 -104 -20 -25 -24 -198 -66
8109 -66 45 20 -34 -100 -201 -129 6 -70 199 -217 120 62 136 101 -83 -10 143 92 63 -10 -34 132 19 252 -59
8134 -59 46 -167 147 -164 389 -23 279 -4 -465 0 -157 -53 -27 -4 -45 64 -316 121 59 -540 -310 132
8156 132 -338 41 -193 98 56 -108 4 42 -35 -138 -26 186 -166 -202 -83 201 -275 4 3 118 -136 -56
8178 -56 32 49 -132 98 8 -64 254 -94 43 -203 -30 99 144
8191A44
$$ Imaginary data points
##PAGE= N=2
##DATA TABLE= (X++(I..I)), XYDATA
0 0 0 0 0 0 0 0 0 0 0 0 0 0 0 0 0 0 0 -7 8 -8 8 -8 8 -13 16 -16 17 -24 24 -31 32 -39 42 -48 55 -63 71 -79 87
39 87 -97 109 -121 135 -146 162 -180 200 -219 241 -267 293 -324 356 -394 435 -483 535 -597 670
59 670 -752 855 -983 1141 -1351 1640 -2063 2752 -4059 7428 -38627 -54375 12193 -4605
73 -4605 -18991 11993 17284 -17187 -3946 14000 5316 15333 31820 1725 -12051 8488 2622
86 2622 -16910 6478 19096 -7882 -17018 -1711 -4921 -4609 10791 7411 -3754 4297 -1329 -15681
100 -15681 1498 18460 -1348 -9894 6686 474 -14615 1500 14120 3021 1439 5825 -5305
113 -5305 -5033 9403 3807 -4549 6856 4753 -13995 -8334 8467 1652 -5030 4263 2685 -6396
127 -6396 -2221 2595 -25 4316 4560 -6011 -5857 2846 -1715 -5623 4352 5739 -4983 -4079 2571
142 2571 821 946 5310 2106 -1562 1849 -825 -5044 1745 5407 -3509 -5361 1357 -1406 -5961
157 -5961 147 3910 -795 -1383 315 -1885 -464 2987 493 -944 2733 710 -3951 -197 4406
172 4406 720 -1135 1841 925 -1531 -190 1069 636 1655 536 -2536 -847 1940 -508 -1806 1829
188 1829 1497 -2372 -1379 1347 309 -458 768 -39 -923 -80 -766 -1416 805 1036 -1863 -1732 816 -185
206 -185 -1282 349 1640 222 -526 22 126 411 626 -223 -34 696 -133 -1055 319 1250 -207 -569
224 -569 425 448 -266 -249 -33 331 189 -36 -466 238 550 -256 -444 685 478 -352 -159 253 181 -347 -226
245 -226 99 -37 -137 -610 -221 270 61 -542 -173 52 -152 -230 154 319 180 -341 -58 396 278 -203 -75
266 -75 259 209 31 -236 50 453 -93 -600 149 81 -156 -142 117 136 221 18 -237 79 5 -306 -98 93 275
289 275 -317 84 321 24 -300 62 -25 -23 -110 -44 -166 301 -216 -278 69 53 -15 11 99 320 151 36 218 73
313 73 -53 173 -108 24 75 66 -4 275 -67 -103 -35 119 -13 -125 215 160 -28 240 203 39 142 -144 -191 113
337 113 37 48 -17 27 -163 -88 63 -182 23 10 37 277 227 -77 -3 -33 -39 89 111 -241 356 261 115 32 155
362 155 -17 199 82 101 -26 -234 45 -78 118 -140 107 21 -10 8 302 -220 -141 -23 47 -168 202 34
384 34 226 -116 33 -133 -26 131 1 -171 -98 -70 14 31 -107 54 336 -158 8 44 27 44 29 193 168 -22
408 -22 287 275 -152 -94 156 333 22 -44 109 -14 -73 75 -24 -125 172 -170 52 -29 -132 81 -263 78 -137
431 -137 -10 -98 138 -97 114 -40 -15 -94 87 12 -19 112 -29 -170 -260 108 217 14 130 -79 36 250
453 250 -114 214 123 -110 -186 7 160 -179 -184 -16 -321 -235 339 -135 24 -81 -79 -290 -116 -37 70 48 162
476 162 -76 -155 5 15 -115 -34 53 79 -57 155 -119 -276 53 227 167 -69 24 20 -254 195 147 177 41 96
500 96 65 66 -54 -180 63 147 136 -231 110 163 -172 34 -21 -213 -35 58 -83 111 34 -168 -32 148 -46 -48
524 -48 25 27 165 -175 -147 -74 13 54 -59 -11 -60 -61 -149 -90 120 10 -149 104 89 -236 -78 204 -126 -25 188
549 188 15 -238 157 80 90 25 96 -3 68 42 -29 -160 176 -6 -263 -113 -3 -16 101 50 -5 -113 236 -109
573 -109 -255 -305 124 112 -181 -14 -53 45 8 4 6 123 -38 -81 61 222 169 -158 -152 -95 -14 -47 -27 -55 66 291
599 291 39 -56 -136 52 -57 185 -54 8 -46 25 -44 50 -144 -131 30 12 -19 -20 32 57 121 -157 63 -142 -173 10
625 10 40 -67 -77 46 -98 103 -243 -29 140 -127 33 -17 -47 98 -86 -43 164 -47 118 52 -55 15 -86
648 -86 -140 108 102 -355 -20 45 127 25 -41 -48 -254 -168 159 -72 -3 -52 92 131 -171 111 104 43 -181 40 8 51
674 51 -207 -17 101 -99 125 -32 143 29 156 -89 570 -136 -149 -269 -567 170 126 290 55 515 -88
695 -88 -225 93 -75 94 -271 -82 45 -148 -171 177 -301 88 -235 168 -117 278 -46 180 -218 -75 62
716 62 3 4 -201 -5 -107 112 248 52 -118 -157 -87 153 -181 73 173 -4 -48 -26 44 11 2 44 68 -37 -8
741 -8 -228 207 91 -57 96 -99 -169 33 -182 -165 -59 -83 -8 -87 -123 216 89 125 100 52 240 87 71 -52
765 -52 28 61 -4 151 -123 78 142 45 36 -42 -66 78 -63 -230 212 4 6 86 12 57 -121 -52 -18 79 35 -115 -13
792 -13 -128 -168 -252 38 159 -8 77 -55 210 73 9 -12 291 14 66 -157 38 106 -112 -147 -209 5 181 -143
816 -143 92 126 99 145 182 65 -87 81 -69 84 287 148 -214 -138 169 -48 -67 -100 56 106 36 270 -34
839 -34 31 46 -242 -455 -46 -19 -130 -215 119 -224 128 -36 -161 -44 93 -201 -130 -39 206 -77 237 7 69
862 69 163 -27 -70 -79 -7 -58 85 -31 83 120 -44 117 33 -51 -59 9 -142 -40 -118 30 92 105 -321 -315 256 47
888 47 204 -85 -92 130 -181 602 -569 -733 -42 -271 -210 12 124 29 52 130 -50 -54 105 -95 18 -233 -32
911 -32 -48 -195 293 -89 -14 78 222 62 43 -157 -26 145 -87 64 -144 126 -147 -90 -80 39 104 54 35 -70
935 -70 -183 136 -60 -301 176 143 105 63 230 -2 -91 -63 26 -101 -29 7 -94 -90 86 -143 519 -93 -185 -160 -201
960 -201 -245 -150 -161 -65 112 70 152 10 46 172 37 96 -33 117 45 -72 122 45 54 56 -42 172 -184 -279 78 -153
986 -153 111 -131 -54 55 29 -156 169 -168 -15 23 -140 -9 105 -64 162 -168 36 109 -42 190 -246 101
1008 101 -169 241 -68 123 153 246 55 412 92 481 68 -103 -5 190 47 -216 -248 -26 34 -253 44 -55
1030 -55 -17 48 -157 200 -104 -8 -132 27 110 -118 -74 -179 32 -150 -95 -194 44 -62 58 -127 666 -769
1052 -769 374 -240 -220 -73 -160 131 -17 -2 -9 62 -89 16 31 -37 -49 -49 126 286 312 517 139 716 232 522
1076 522 -339 -203 718 310 502 -526 43 393 -246 65 -469 -46 9 -44 145 66 66 168 -213 263 -558
1097 -558 -149 -326 -392 423 -482 257 419 -19 202 251 347 -52 251 -128 6 211 -12 -34 -101 144 10 122
1119 122 48 18 190 -182 -85 -44 -58 172 3 213 53 102 64 -200 18 -103 -89 33 -135 107 -125 -47 23
1142 23 -24 2 -97 -17 -5 -154 -22 -103 69 60 100 -145 46 316 189 -158 32 -148 -150 -41 -230 91 -82 74
1166 74 318 266 111 -73 -138 149 199 -60 20 89 -171 164 -82 182 330 32 45 214 -363 -2 -80 160 178
1189 178 10 194 43 -2 -32 161 60 31 114 59 201 3 109 107 92 -86 -145 32 31 48 23 -174 -154 7 -277
1214 -277 60 -164 -122 70 137 -57 21 80 -265 -122 9 -21 24 230 -86 2 -33 -15 -106 179 -120 68 -8 115
1238 115 -69 211 -78 128 53 169 -117 82 -89 98 -80 -66 87 -189 8 -112 -53 59 141 -79 116
1259 116 189 -203 -193 189 -83 256 187 214 56 93 11 3 142 79 -164 -202 65 14 112 -179 -294 -92 -126 -162 -73
1284 -73 6 113 132 102 -13 -151 2 78 -25 2 0 -131 -142 199 75 -54 48 -110 -39 -376 -130 3 29 -3
1308 -3 64 130 103 -80 61 136 125 -110 -70 61 -330 105 -120 -109 -177 107 -143 -311 230 12 139 147 -35 -165
1332 -165 -83 104 188 -69 -174 -103 -110 -132 -16 -98 151 60 -59 -38 -8 35 84 -75 -24 34 -2 -158 -98 246 76
1357 76 153 57 -192 92 -68 -4 -22 45 -301 -85 -28 75 -59 24 -45 -135 127 -226 20 -46 20 -19 -13 48 -58
1382 -58 -222 53 -167 -185 -86 8 358 -82 41 75 -71 31 -132 93 186 135 -63 -99 -41 -167 132 -291 -1
1405 -1 -8 -16 1 18 -15 154 78 100 -168 -17 109 -2 -58 -31 195 -90 48 234 -151 -147 55 -80 37 2 64 -179
1431 -179 -57 29 13 227 91 122 -185 228 -10 171 -88 -13 201 146 81 -6 178 -26 15 28 184 -203 -52
1454 -52 -168 -8 -26 226 79 42 -30 16 56 -269 -2 95 17 -221 -100 209 80 132 -5 -93 -29 -12 81 169 -156
1479 -156 -8 -1 8 100 -293 -91 -224 4 -110 -108 91 -167 96 143 1 -45 -26 -19 0 191 -145 -14 -33 -86 -173
1504 -173 55 -182 -21 -67 -128 128 -38 20 -143 5 146 12 -77 -35 382 -33 -134 45 102 29 -87 -37 -157
1527 -157 162 50 267 14 -1 87 -94 -203 -79 67 -26 -14 -275 -242 23 -98 167 55 86 -195 124 -71
1549 -71 -13 240 543 39 -156 74 -107 -68 -98 -141 40 24 243 105 87 -25 -33 -26 -63 -68 -152 -183 62 -237 162
1574 162 120 -208 144 -49 -16 -164 -29 -107 -29 301 90 -79 90 -170 218 -316 -9 -34 -509 -25 346 118
1596 118 -882 -5 -386 293 182 -377 -527 773 563 293 -1 256 -416 444 -211 -504 307 -132 -5
1615 -5 -239 -143 197 72 148 -174 77 27 -134 -111 38 192 21 15 44 96 -178 114 -89 -282 63 309 105
1638 105 -102 58 170 30 -105 130 -155 -101 -64 -57 -209 -104 151 72 -11 102 56 -20 69 -30 -86 72 -191 -13
1662 -13 -32 47 145 -46 86 -354 61 0 74 18 140 -46 38 -3 -137 -36 220 -89 24 71 67 -84 -82 97 -172
1687 -172 55 66 88 -29 -208 191 -15 -106 -68 152 17 -88 -78 -315 -240 -200 123 -75 1 -123 -33 -14 30 116
1711 116 69 14 17 29 -61 87 -110 101 -117 194 -311 15 -165 18 132 -255 17 -132 -7 -51 -144 49 59
1734 59 97 54 -6 115 85 -194 -143 147 -46 -42 8 221 -20 -27 64 -253 -96 -64 322 -122 83 125 17 87 -398
1759 -398 -280 15 -6 252 -74 42 -8 120 -18 69 4 0 58 -164 88 -112 93 115 95 -42 -26 -165 45
1782 45 -37 -69 -121 -166 -45 206 -74 76 40 42 -120 -171 -226 208 -864 -7 205 -5 -53 -111 57 -57 -171 -155
1806 -155 -9 -86 195 -42 -163 14 -15 31 11 63 119 37 -117 5 -175 51 -96 -103 -171 -26 125 -142 -193 53
1830 53 42 -6 131 -47 -130 114 -190 -234 -105 40 -295 -221 91 -263 -47 104 38 -48 81 127 160 -156 -60 44
1854 44 48 51 -124 -155 38 -70 70 -66 -64 -174 23 173 -30 -69 11 3 23 227 -23 179 -155 -6 -77 -156 -237
1879 -237 -64 -54 -62 -33 14 -22 74 136 -146 -66 13 -76 79 82 -201 -77 202 -67 4 302 75 40 -3 30 79 -137
1905 -137 235 -127 14 211 -159 75 -163 46 -57 -93 166 -54 90 -153 -122 145 -115 -164 93 -92 -95 -137
1927 -137 191 38 18 59 -2 -198 -70 -53 -82 -1 -175 298 -8 -49 -2 -51 -168 157 22 243 89 195 92
1950 92 -60 41 319 139 220 -15 -10 67 4 -59 -177 60 -59 -67 120 -256 91 80 -23 -167 -52 151 63 -193
1974 -193 218 -52 69 -34 -44 -214 85 -17 -20 -93 177 50 42 -175 -47 200 -81 -21 -72 196 -25 186 308
1997 308 87 58 156 -73 -131 -149 -249 -57 44 68 23 72 126 -142 58 -105 42 33 265 -4 39 3 -63 -43 84
2022 84 -123 -106 289 -1 97 96 -46 106 25 -152 -164 30 126 121 166 -107 7 96 181 -90 191 -1 33 -144 116
2047 116 231 -147 -50 -134 -7 -98 -175 111 -81 26 -30 100 41 -70 -8 40 -58 -86 124 88 12 -52 -151 -177 81
2072 81 -84 121 25 2 -123 380 -384 323 120 0 -72 -211 -266 84 118 -175 268 333 -35 -22 103 -59 88
2095 88 73 190 -139 166 171 -211 -403 337 -155 8 -93 -62 -108 -92 537 334 219 -189 157 190 54 58 316
2118 316 -104 -423 -848 259 230 -274 374 -415 -14 291 -179 363 393 -328 -350 327 30 -200 -297 -424 -656
2139 -656 629 320 -388 -327 63 -641 99 -7 313 241 -206 97 87 4 0 85 -60 -11 -202 -124 -60 -3 -137
2162 -137 -171 -113 202 -245 -67 -108 95 214 -92 124 -40 152 31 61 178 -6 -73 -166 -15 220 -25 33
2184 33 193 -10 -66 -38 106 51 51 11 -296 -32 -314 -157 90 -119 6 -100 114 108 13 41 -67 51 -185 -264
2208 -264 175 -126 -97 18 -263 37 -63 -174 26 212 -104 -215 31 349 80 -22 9 92 -8 -62 -196
2229 -196 25 -162 -164 -8 30 186 -43 54 -71 -41 -256 -191 -51 200 222 5 148 -44 -224 -118 -3 -61 16
2252 16 -4 -8 9 -35 -99 105 -154 2 -69 -40 148 84 -111 -264 -49 25 61 -164 174 7 45 45 -87 71 21
2277 21 8 8 -36 -48 -203 -64 -55 6 42 79 38 89 82 208 155 -105 1 51 -14 28 36 158 194 -68 76 109 -119 -60
2305 -60 -69 5 -16 24 -154 144 -161 -18 -73 71 65 40 -104 -16 -143 89 -47 -200 168 11 2 -21 -115 -154 -62 176
2331 176 -87 149 -1 98 -45 84 96 104 90 -207 -10 -114 -327 -98 84 -21 165 -6 103 -10 207 -35
2353 -35 113 -34 143 -65 47 -107 -158 69 -60 11 -173 77 -172 184 111 -14 131 -28 39 179 3 205
2375 205 -33 162 245 -8 105 164 159 63 157 -322 -129 13 70 249 -195 -4 61 -52 -92 -171 -67 95 41 -74
2399 -74 26 115 -170 115 -231 -17 -64 -65 145 -20 39 -225 -8 54 -38 51 -188 31 -40 -52 88 -112 -31 188
2423 188 -17 -20 -51 131 -66 36 -38 228 -34 -27 -109 55 69 -92 10 -33 -80 -87 295 -49 -10 -45 48 95 130 -64
2449 -64 15 102 144 13 127 35 -89 -91 138 74 36 35 88 304 -151 60 57 -122 -44 -123 24 11 -96 181 122 -161
2475 -161 -125 40 -63 -68 -100 38 170 12 -140 -77 -130 -22 108 -243 -21 81 -167 -76 -5 165 -87 -77 -36
2498 -36 141 113 -44 -150 103 17 -81 217 49 -230 88 -142 80 23 -14 31 33 -18 -12 3 104 73 -59 140 83
2523 83 55 37 49 90 94 87 55 -193 26 221 -22 43 -40 14 -74 171 15 5 -110 18 -28 185 63 83 -168 -61
2549 -61 167 -231 -80 -113 153 93 143 54 -205 -199 2 71 -58 104 35 69 130 -23 -101 134 74 -27 50 9 189
2574 189 -89 -146 -75 73 -145 161 148 -248 9 -170 -185 -151 179 -33 103 81 52 103 164 -136 35 -74 12
2597 12 100 -22 109 33 21 -45 115 77 61 282 68 84 -58 37 14 131 113 -315 95 -59 -152 -91 53 150 -77
2622 -77 52 60 -75 57 24 -13 -174 233 -86 -64 -28 140 57 107 259 -61 -50 -188 -18 -220 -184 149 -48 42
2646 42 -183 17 47 44 161 237 207 -41 -89 105 -113 6 -56 -122 -32 19 198 -133 -83 100 -71 248 186 124 -9
2671 -9 74 -104 -104 55 -35 -168 -86 120 153 -46 134 -55 45 -36 141 -171 -217 12 -65 -92 384 106 89 51 63
2696 63 -99 -137 38 -17 -64 -81 -309 -77 19 4 21 -100 70 82 -99 -143 -83 37 -17 36 -59 -44 20 15 113 134 11
2723 11 157 -9 208 -90 136 82 2 296 215 29 -106 45 -54 73 -90 -39 42 -45 -80 -19 -41 -30 23 81 -1
2748 -1 195 -172 73 6 -98 -52 30 50 100 -61 62 55 -123 31 236 -235 119 -34 146 248 38 101 -78
2771 -78 -73 140 -50 -32 -29 216 -139 23 -250 114 95 106 -191 -11 45 -159 -144 107 16 -88 -98 -95 -183 -296 -160
2796 -160 -1 74 -95 -295 85 182 253 -124 5 -41 97 -122 -45 283 95 183 -254 -99 149 70 7 -31 -142
2819 -142 -119 -134 -162 -354 -58 -50 18 -170 -23 -62 -218 68 -129 -63 88 -77 -101 21 33 207 -118 74 10 -21
2843 -21 118 64 -2 136 154 163 92 80 -247 -97 78 75 31 -19 -190 88 185 62 38 -51 117 7 53 74 131 298
2869 298 27 -99 103 -25 74 35 -94 -31 149 7 8 -118 -31 -174 2 -15 152 171 -31 46 125 -15 160
2892 160 41 -69 26 -68 90 -48 -148 358 145 -85 116 -103 -91 -84 -105 11 197 46 -68 178 -311 -46
2914 -46 110 93 -8 137 34 -237 -285 -170 3 -13 114 175 -43 105 -96 34 -105 -101 -59 -37 11 -147 138
2937 138 -19 67 -44 83 32 -138 -22 205 -94 -95 -154 -55 -365 -117 100 251 395 -89 -125 105 -17 -22 215
2960 215 59 241 -714 -155 120 865 36 -542 593 93 393 280 -470 77 -31 -112 105 221 -16 81
2980 81 -24 66 53 -221 55 76 87 5 -52 81 -88 -113 14 133 -15 72 -84 71 -135 -11 78 -184 -61
3003 -61 124 -157 144 -129 -50 -22 179 45 -30 -86 114 -116 -288 18 43 60 85 -73 50 -56 73 -145 -165
3026 -165 -22 -153 -129 16 156 -110 93 18 -87 -67 -26 -87 -65 -61 122 -29 65 33 -223 -69 7 17 -67 48
3050 48 -5 99 -73 -125 236 54 -53 -254 20 13 -10 171 -96 -99 84 14 170 67 -172 12 -126 -85 39
3073 39 -38 83 -80 -133 16 -86 -151 -113 65 -133 59 84 12 123 50 -8 -8 86 52 -74 -80 146 54 -69 53
3098 53 88 -77 168 26 -153 107 -122 -71 142 -175 60 -40 259 -150 236 73 -156 -22 42 83 145 -132
3120 -132 190 14 24 -77 -15 246 -4 -94 24 -146 200 -33 -114 146 -76 99 -175 36 92 122 -62 58
3142 58 -99 -53 26 110 88 -73 -66 151 32 40 -15 -65 -154 216 132 -91 70 -223 -89 -104 -198 -119 -165 -108 8 -75
3168 -75 105 106 -216 -145 -267 43 -119 24 169 8 73 -200 174 22 19 -38 1 -27 -36 -38 86 150 121 -92 76
3193 76 -40 26 126 -38 8 -10 -235 195 166 -40 -175 -44 250 133 -261 -132 184 -223 -28 -67 -101 72
3215 72 181 109 -225 278 151 -48 208 26 59 -67 13 52 190 65 -24 242 -120 101 127 84 111 92 -83
3238 -83 -105 -21 141 116 62 67 -6 -173 64 -75 -270 121 326 217 -5 1 2 -121 14 256 196 -69 -138 -74 77
3263 77 14 19 -48 -266 -34 -90 85 -201 0 -39 7 206 64 107 145 -32 -96 -8 121 5 70 -220 -130 -273 16
3288 16 125 -67 27 83 -129 -83 83 -47 -8 3 -73 -85 -150 116 151 -94 -68 112 -169 35 -147 250 601 468
3312 468 712 -637 51 97 104 -63 -64 107 75 11 21 -153 3 -57 154 -47 100 -4 -183 -158 324 237 729
3335 729 427 208 -117 -134 -94 -592 -211 27 296 290 -157 -106 -97 -111 35 225 -70 91 -104 15 139 -41 188
3358 188 -32 -134 -69 -57 -285 -12 64 24 -62 -2 -284 716 -72 181 33 -539 220 -89 42 -254 -41 -229
3380 -229 212 -94 65 30 510 2 232 -495 -10 129 -149 -286 -207 -293 1107 -210 -313 166 -107 -140 39
3401 39 32 -208 -44 -195 118 152 -91 -6 155 -40 124 0 44 12 142 -75 11 18 -75 55 181 -361 -53 121
3425 121 -280 27 92 -20 -2 4 -28 -69 155 105 78 156 129 -263 -259 -54 279 178 256 -17 185 -398 -43 308
3449 308 -180 180 -198 -76 -121 -54 38 -92 -108 -172 144 100 -42 -30 -161 -54 -20 -166 109 42 -77 -79 -150 -104
3473 -104 222 55 192 -31 95 -55 43 249 -160 -187 42 66 -84 291 33 79 28 -160 -16 117 250 184
3495 184 -4 53 44 58 -25 203 -34 97 -105 -60 -221 64 213 -1 242 190 -35 -77 -71 -27 0 -187 -66 34
3519 34 -39 -226 -102 -48 -118 -107 70 5 -17 21 27 -61 22 -200 -273 23 244 -119 114 258 -21 19 91 103 36 23
3545 23 173 -151 224 160 8 -172 -145 123 -47 68 66 -59 88 -100 -182 266 130 -12 -72 222 -76 148
3567 148 -88 -189 -27 33 -95 218 182 -54 -87 21 -1 170 303 -62 45 -28 -77 -12 127 57 -84 88 149
3590 149 -208 -85 13 23 110 -59 133 26 189 -180 -58 187 -112 -34 37 60 189 137 -130 20 -76 26 20
3613 20 -26 29 132 -126 35 1 -37 -108 -56 40 52 48 131 147 -21 109 -19 -52 -55 22 -121 124 7 151 -39 89
3639 89 244 47 132 -142 -274 -154 9 53 -25 34 67 -56 257 166 -254 274 30 -98 34 226 -90 -134 -27
3662 -27 159 44 1 222 -63 12 -182 56 24 144 -71 -2 309 -212 222 115 241 223 -68 -25 35 52 44 192
3686 192 123 71 44 20 4 199 112 -29 61 -113 184 19 -218 58 45 -35 59 6 18 -59 31 250 334 233 1
3711 1 -415 44 36 45 1 27 -45 410 258 1015 -151 -167 413 144 393 139 211 -106 -143 -149 -95 -54 22 -26 8 92
3737 92 62 69 72 15 -149 -33 52 -202 -68 -196 238 -9 -36 -39 -147 83 -111 -89 37 194 48 212 -15 19
3761 19 -2 219 -174 2 -54 96 -57 -129 125 31 125 -84 37 -119 15 48 -13 -27 29 -28 -39 57 -239 82
3785 82 133 64 -134 177 72 -4 -79 -9 -44 134 70 116 213 -130 137 -83 -64 56 -101 38 103 89 49 -29 -167
3810 -167 89 43 94 94 -17 -156 -19 -63 157 -173 47 115 33 14 -198 -61 -25 13 -157 -25 22 153 -77 -131
3834 -131 -13 -192 101 121 41 52 94 53 -41 6 -162 -91 109 2 225 10 -266 66 57 -91 117 21 79 82 169
3859 169 -73 75 157 46 -77 -111 -194 70 93 53 12 -15 -50 -53 -67 -110 44 -58 -37 -62 -82 74 -211 -114 -79 261
3885 261 181 66 -202 -149 24 -18 -62 110 -39 173 -214 -98 -172 54 -85 -134 12 -62 44 -136 -151 109 -231
3908 -231 73 238 -15 652 294 -301 -464 -533 601 51 -94 -255 -403 -244 -76 -212 190 -10 -196 5
3928 5 114 137 -79 135 -132 -134 -89 -155 -48 353 225 42 -31 -139 -66 -51 -180 174 -183 123 23 -74 51 18
3952 18 -318 248 45 232 -110 -130 331 278 -47 624 -439 253 648 355 -198 357 160 -318 -125 -78 -226
3973 -226 302 208 -134 -25 -126 -71 -47 158 43 -248 -50 -104 -68 141 -7 4 -100 115 26 97 -617 137 202
3996 202 -158 -103 188 136 466 132 629 332 196 57 716 630 1055 923 -128 1248 -147 805 221 725
4016 725 -536 191 -218 868 35 273 204 -549 843 -39 -172 65 764 -59 934 699 -283 19 172
4035 172 -285 24 60 -183 -188 -164 -54 49 -96 54 -297 154 45 203 -19 -216 59 -56 13 121 -11 -242
4057 -242 33 -414 -47 476 -192 472 -20 -230 516 128 636 -79 131 20 -449 355 640 -106 -64 -126 85
4078 85 -45 99 62 75 -40 -61 174 -27 45 167 116 112 57 -78 -76 36 -91 195 37 49 77 -416 -32 118
4102 118 -235 229 -272 30 -51 202 81 -138 -32 19 -17 -5 143 8 -90 0 -81 -91 -232 237 214 65 110
4125 110 144 -142 -97 26 -237 -315 224 -310 -99 505 -242 778 397 15 -34 241 -93 78 188 70 -56
4146 -56 22 -51 -110 414 743 -5 534 -165 -196 -46 315 148 -106 -2 27 99 13 68 25 65 -158 -113 288 92
4170 92 53 102 -33 -28 80 -125 76 71 37 -270 222 -7 -256 -54 185 -69 -90 77 -41 -87 140 150 -162 -188
4194 -188 -113 21 166 -101 11 68 -190 -14 97 -53 -136 183 4 37 -128 79 -198 -273 79 95 90 52 -36
4217 -36 79 36 -132 -109 122 32 -126 -73 134 150 121 23 -37 2 -7 -60 -103 14 215 -54 7 18 92 -113 -103 -32
4243 -32 132 3 -127 66 -123 21 -48 182 129 51 -52 -285 -196 -18 23 -157 -183 -54 -27 21 -30 11 -118 -165
4267 -165 210 -147 -4 155 61 -142 -239 46 191 -63 177 83 110 -94 26 81 138 34 22 -143 16 -87
4289 -87 140 -394 135 138 27 -62 502 311 116 -127 244 -69 -185 -94 -199 -150 -157 58 -108 -44 -150 91 -68
4312 -68 -39 243 -85 17 92 -33 -178 -18 -101 161 -81 -226 86 -44 67 -63 67 -122 100 27 -70 -96
4334 -96 142 -315 -118 -190 98 -2 -113 -96 -176 157 42 -86 64 30 170 161 49 110 3 -182 172 7 5
4357 5 -299 93 189 -82 6 -23 223 81 116 487 210 -107 216 598 -583 100 -308 478 336 -335 392 -792
4379 -792 126 262 808 635 -76 -137 -208 -112 183 244 -15 -50 -52 -77 -43 186 71 -45 60 -30 -9 -51 -31 91
4403 91 -117 -34 -34 2 -101 30 -49 142 28 7 -61 210 -91 7 136 8 -2 272 -177 190 -160 -19 -152
4426 -152 -28 -22 44 160 51 -166 -132 119 -12 -75 36 -43 -60 -112 -125 104 -66 8 -9 -203 38 56 329 -80
4450 -80 -90 57 -143 17 -121 50 -178 -202 78 95 126 -29 182 88 -134 -87 143 103 92 142 -125 139 283
4473 283 -14 114 -137 -161 76 60 60 74 -15 -116 -49 37 -191 -30 -48 -64 -30 -54 41 -42 -28 -35 124 119 119 -143 -25
4500 -25 52 -60 109 -53 36 -152 107 2 -173 172 2 -28 74 232 -311 168 -50 -195 -34 -67 -53 107
4522 107 -116 184 88 -43 -149 86 -17 -99 -83 -206 -206 148 64 -30 47 -28 5 -13 -4 -387 63 -142 3 -49 29
4547 29 6 -16 -52 -243 -7 172 199 -25 -103 44 187 69 -103 48 -80 19 79 75 -195 -79 -18 -17 -31 101 -56
4572 -56 140 155 -169 -87 -39 -79 33 -187 -56 -102 -79 -7 171 80 61 -3 -25 -222 14 8 -96 -109 -135 -19 -220
4597 -220 33 -43 -148 -142 -200 -53 -7 -111 85 -9 -71 -162 153 86 -40 -194 -66 171 -64 -25 123 177 -380 -149
4621 -149 -84 76 7 -17 -174 115 220 109 -215 69 -24 -3 224 63 2 -10 -88 -233 107 -124 -54 -58 61 -191
4645 -191 -213 16 201 -4 -153 -291 38 -33 17 58 -104 -36 145 122 23 -27 63 -72 -67 76 31 51 19 72 -65
4670 -65 -103 -53 -181 142 -109 -20 71 -93 -182 151 -106 50 -17 -44 116 -86 5 -7 37 14 -54 -72 35 -89 91
4695 91 -48 -206 -329 104 -208 -156 26 36 -46 99 -246 -31 14 243 56 -98 -147 209 30 -64 -78 -94 -64
4718 -64 -159 -88 132 154 40 -71 -30 -156 -176 -136 -64 -233 -154 78 -25 -41 -177 38 28 -37 54 -87 172 80 182
4743 182 -100 -4 -41 2 224 -61 132 177 -116 -44 290 -23 -193 -51 84 -63 177 5 -131 55 -64 246
4765 246 166 93 77 144 98 12 -164 100 39 128 -38 -194 -46 -59 141 132 94 28 241 62 132 155 41 28 -206
4790 -206 29 10 89 -83 -24 1 20 92 255 -82 86 -78 -59 -7 243 0 195 64 -96 160 116 -14 136
4813 136 73 -160 3 -192 -96 103 27 -50 -74 33 72 -45 -197 -226 121 54 108 116 -173 -50 -75 -6 94 263
4837 263 40 164 -94 133 -164 46 -33 24 42 86 54 176 -96 -51 -78 37 283 4 -111 -189 -13 -128 -14
4860 -14 -28 -200 9 92 50 -162 64 -87 -31 71 -200 -81 -116 -201 20 95 99 -37 85 -46 -156 -12 -2 -161
4884 -161 -24 -144 160 190 -16 -111 -44 29 164 199 -137 9 -299 -29 -105 -376 58 198 150 -223 -92 126
4906 126 245 -57 8 -21 -47 63 144 170 -65 134 -40 -887 908 -172 517 654 7 274 311 -99 210
4927 210 148 84 248 174 112 96 101 -36 -10 217 133 273 -30 0 300 89 351 -237 318 58 -56 117 216 194
4951 194 -109 -260 82 -50 -144 126 -120 -8 -31 50 -141 190 23 -151 299 -122 -31 -125 78 160 301 -286
4973 -286 -761 84 238 -21 -60 -63 64 69 140 147 112 -220 -169 -176 483 -384 -16 277 325 -346 -88 85 64 40 -160
4998 -160 27 -245 265 -24 -154 -190 3 0 -56 -86 188 -68 144 201 18 266 -179 8 -147 -36 -77 193
5020 193 211 141 -41 -126 141 92 89 83 -15 -58 345 94 153 -66 -247 119 39 -237 -65 27 -170 50 -36 170 -17
5045 -17 110 33 -107 55 8 -188 -37 23 -32 159 -360 -219 12 29 75 -77 1 195 -13 -11 -131 72 -48
5068 -48 -104 110 -55 5 112 -109 -11 71 -146 199 126 -46 -82 7 -120 121 128 196 26 89 80 116 124 95 -154 -79
5094 -79 58 45 -59 -49 68 -20 182 288 12 -18 -135 66 145 56 60 107 -9 -39 37 87 -127 96 -65 -111 -70
5119 -70 -57 -170 89 -82 -139 73 11 84 -130 67 5 -130 78 -271 68 102 185 43 -13 -7 221 -125 -34 108
5143 108 -54 66 -82 37 212 -28 -92 -164 365 647 -404 -631 186 -24 -752 245 362 -183 -275 -316 -198
5164 -198 -93 9 -41 76 34 -95 381 92 -46 -309 125 36 -158 17 -45 144 -75 -94 2 -18 13 71 -31
5187 -31 43 393 -149 116 23 -100 -110 -13 -25 -56 82 -190 -44 76 -137 -49 63 -24 102 23 312 30 -83
5210 -83 -151 -151 -35 2 -113 -37 149 -160 33 350 -15 -100 19 -333 -223 -4 95 -297 -89 793 210 454 -542
5233 -542 10 188 238 169 26 476 -147 429 804 61 416 -305 -623 -574 1046 -163 -330 315 -69 16 -86
5254 -86 -117 -61 -53 30 215 -59 -219 -228 -24 2 253 112 -128 -251 -41 -150 232 309 323 -126 392 26 12 -286
5278 -286 -30 -60 37 -131 -329 -182 259 -140 -195 277 -79 -8 -3 453 -143 -108 -266 452 154 -402 -169 -631
5300 -631 510 39 -408 -279 -253 -159 -162 42 -84 32 0 134 -135 -113 -433 -19 175 66 112 -17 6 39 96
5323 96 72 -181 220 111 274 -84 128 21 111 -99 -203 -66 -131 -212 -41 66 -140 -7 -40 123 68 -287
5345 -287 169 359 -15 115 -202 -304 432 -571 -382 -511 -200 -408 -249 980 -96 265 -182 -289 -16
5364 -16 -214 246 504 28 216 -45 -10 -40 -21 461 -115 152 -358 -514 -96 -66 -638 -27 603 475 280 150
5386 150 131 389 450 -78 -65 -389 104 271 501 -273 -63 -29 -188 108 141 -253 137 -442 -37 327 -257 293
5408 293 -439 -45 55 797 129 -372 57 708 391 200 58 218 -549 -159 224 -474 -424 -125 -321 -208
5428 -208 -8 319 161 -158 2 101 -248 105 -143 -233 -348 195 -158 273 -5 -263 497 121 119 23 127 -185
5450 -185 -249 -12 -157 -133 171 79 230 239 17 -214 264 65 402 -41 42 -158 400 224 -320 398 502 128
5472 128 -23 96 240 23 -500 -392 -271 308 -30 458 -98 -50 92 140 631 345 564 68 330 61 708
5493 708 -442 -104 200 609 -696 -435 114 -357 -975 76 -790 -107 351 -76 460 575 214 75 290
5512 290 573 410 -80 421 -441 -429 367 152 57 72 248 -62 220 160 -158 107 -122 102 -26 26 31 33 78
5535 78 -66 -130 -55 67 29 -159 88 -12 6 -253 -117 -186 -96 206 50 -56 40 14 -121 90 -68 343 -132
5558 -132 125 -215 -73 20 -207 46 -74 -238 -286 67 -45 9 -41 60 188 -72 74 23 -55 -35 -66 -48 -19
5581 -19 -43 76 5 116 102 128 1 176 5 -49 71 122 12 -115 30 -32 -149 -42 -150 -69 -21 -206 -36
5604 -36 104 27 40 13 15 151 40 92 223 -94 -8 -128 -94 173 247 -234 85 -37 77 -95 188 31 -224
5627 -224 -76 -254 190 -168 156 -70 408 -150 99 -364 -657 332 114 -77 -124 73 39 -14 -226 111 -279
5648 -279 203 102 38 -248 89 20 -43 -229 171 -159 -91 -80 -85 36 154 -94 -19 -28 -24 173 134 111 2 91 234
5673 234 63 -162 81 -20 -69 118 -95 -51 -154 -42 -45 -118 83 -49 58 8 46 -187 97 -128 -168 -60 -8
5696 -8 44 291 -230 -124 -51 -11 18 244 -56 36 28 -19 -138 88 124 -60 71 -91 -168 -105 4 233 -94 179
5720 179 3 191 -40 166 -102 -37 16 -11 -87 -38 285 85 -23 -73 -341 -112 49 -296 60 -83 -75 303 -106
5743 -106 172 63 -66 80 203 195 -160 94 173 74 -119 -145 133 -95 -175 220 77 77 -193 -261 -527 128 140
5766 140 -231 -4 -691 450 374 306 -216 128 291 477 800 323 205 96 63 -176 115 116 74 -88 -169 -34
5788 -34 -65 -66 -93 -23 77 229 79 393 113 12 42 161 27 117 -142 6 -1 6 95 79 -384 217 374 -385 -21
5813 -21 104 -452 351 147 262 236 -446 -12 -223 -124 58 -145 34 -5 -124 -153 -179 170 -180 -93 -158 -220 27
5836 27 111 -149 -71 142 -53 -73 185 -102 157 33 -259 84 27 -149 72 15 200 -76 0 -206 -114 -109 -154 -92
5860 -92 -58 -20 -92 82 -82 -51 -24 -46 -33 -175 67 -114 5 65 -31 -95 116 154 13 -53 68 84 25 -38 -37 -51
5886 -51 33 -285 36 170 39 -120 -100 -124 124 -161 -59 45 210 130 4 58 209 217 -19 218 -20 133 179
5909 179 174 88 10 -166 -270 -11 106 -223 72 -100 -182 80 148 -3 -234 -15 74 61 131 -16 -49 -225 -85
5932 -85 -6 -78 125 41 205 -141 47 242 270 23 160 39 31 -56 188 -69 159 4 -259 51 -70 76 -43
5955 -43 -21 -251 47 -53 79 -64 -154 -127 -91 183 -80 -42 -220 -180 -64 125 -23 161 65 -126 99 -96 -27
5978 -27 -8 80 -9 -20 -94 -126 30 196 10 121 -57 17 -46 -170 26 -107 -151 166 -71 -86 -96 -92 -94 -43 196 4
6004 4 -43 161 -136 -20 1 -169 229 1 84 375 -112 89 50 -97 231 14 -71 -82 -52 -105 -98 -126 -24 43 -139
6029 -139 58 -98 -191 71 -120 23 -226 33 -34 -138 120 23 -171 159 -68 11 256 115 -147 108 -106
6050 -106 47 11 -139 139 20 36 97 219 -41 70 -106 77 168 -18 17 46 0 -105 -34 -29 24 66 -3 39 -50
6075 -50 15 48 143 99 -1 -87 68 -155 -71 -98 78 14 112 79 -115 -102 -96 341 240 118 309 -182 -103 77 -25
6100 -25 159 51 48 -11 -124 -121 -154 5 189 -28 32 -26 -166 14 27 66 -137 -2 29 14 -39 283 33 156 109
6125 109 -177 -174 -234 27 -202 38 89 93 24 69 -35 -36 139 76 247 36 373 18 485 -74 368 133 -435 295
6149 295 -203 -124 -134 383 -253 465 -101 429 -179 -199 -663 -520 950 -81 -258 73 -121 -162 611 -260 191
6170 191 -43 476 -505 -851 422 -154 158 -138 36 601 566 313 288 -156 -69 50 -169 130 -253 -204 -198 249
6192 249 -60 -223 305 -158 251 204 178 49 261 217 166 1 163 44 -181 19 103 -198 -50 -15 202 198 151
6215 151 97 134 241 5 39 -41 116 187 -107 99 -277 214 -21 -31 -59 59 40 8 -45 -94 191 47 22 -20
6239 -20 -12 204 4 -326 141 92 34 -7 31 211 -35 294 167 39 88 -381 235 409 -49 245 289 -9 -207
6262 -207 -426 302 -662 37 -452 688 390 215 -9 114 267 289 -186 -60 96 164 -18 -413 95 62 104
6283 104 121 269 443 201 260 192 266 52 -417 170 39 206 31 748 341 -339 388 -169 171 308 260 189
6305 189 -326 45 151 508 -52 87 84 -154 66 -2 -86 -130 -3 -24 -150 -109 -33 -142 114 58 -9 22 98 -149
6329 -149 47 -108 -262 -118 -146 -4 137 141 21 -59 -105 -140 14 -123 36 -24 -1 60 -183 -4 269 62 155
6352 155 -30 115 -265 116 83 -57 -111 -61 76 -229 -145 165 6 309 120 -1 133 -81 -83 233 193 -1
6374 -1 431 -217 -131 -100 -311 -44 -342 -147 72 -481 23 -205 135 431 -31 42 55 26 -266 -135 -18 232
6396 232 -122 99 -60 11 65 -88 102 30 -49 41 89 10 122 43 -73 114 -34 80 -37 -191 7 -181 -87
6419 -87 105 96 -218 91 -135 43 -121 -295 418 127 442 178 682 -247 122 252 -442 143 -174 38 -46
6440 -46 283 -111 -86 -41 230 27 -23 106 -83 -236 -177 -131 -14 225 138 25 269 184 217 -45 -65 257 250 1
6464 1 -27 -127 72 -39 80 58 26 -155 -20 129 83 212 41 -72 2 -32 102 -52 -134 -81 175 -39 -101 49
6488 49 212 8 94 219 240 -40 133 -186 68 90 -23 30 -20 112 -90 39 -199 20 352 146 14 -162
6510 -162 169 176 63 -46 -9 -108 53 2 153 110 96 69 -52 67 50 52 -33 -24 99 -18 129 100 -8 -101 84
6535 84 -53 194 25 -148 79 33 -34 -192 -27 18 -16 -119 143 -33 166 100 -12 -60 -22 0 -36 -216 84
6558 84 93 93 -25 -200 126 44 -128 33 5 55 107 3 12 -127 110 99 279 -4 -25 52 -56 51 191 217 106
6583 106 -21 -69 274 -84 197 -82 206 -60 19 -200 -52 -164 46 -140 -31 88 -193 148 80 -56 -8
6604 -8 -161 81 27 230 18 -133 -164 307 -18 -14 -118 -236 -144 -82 -36 48 91 -129 90 -101 -16 -19 36 200 93
6629 93 82 -126 -12 11 -56 53 51 97 201 -84 -92 -28 49 -304 -165 -75 67 -54 14 -23 123 -126 -57 75 -113
6654 -113 -135 110 183 9 225 30 16 -208 -30 41 103 68 48 -16 101 113 -188 -483 467 -65 -313 487 -117
6677 -117 96 295 -45 146 108 -8 0 -24 22 94 -284 -4 -18 92 -193 128 164 -45 166 332 159 78 116
6700 116 392 -46 -12 -63 466 270 357 -236 13 184 -63 -102 46 -133 -140 57 25 -121 -113 -89 -129 78 71 159 -33
6725 -33 2 160 -10 -158 -154 -73 25 52 -5 -42 -13 -172 -112 137 123 -38 -99 -41 152 -1 31 237 256 2 -59 -173
6751 -173 56 75 54 -34 -157 23 -29 -67 -187 -22 -158 11 -240 -70 -41 106 78 -136 -68 85 190 -68 29
6774 29 198 126 137 222 13 -60 -78 -11 131 16 253 -27 19 -75 59 -230 20 70 -90 65 -12 -110 31 133
6798 133 89 103 -29 -118 -146 2 -97 -105 84 -61 -13 82 -36 85 -4 101 -62 42 46 -108 60 -34 -125 355 56
6823 56 120 -32 157 -139 -99 -26 82 -32 -107 -132 136 -130 64 104 -244 -62 -90 -9 25 36 -45 -140 -147 324 173
6848 173 42 135 -60 -84 -77 75 123 5 103 167 118 16 -24 115 -120 38 144 -42 86 83 -38 -123 77 -67
6872 -67 23 -34 18 -12 27 5 38 78 14 -10 -45 131 -65 -127 17 -166 52 -114 -127 -114 194 70 -146 -17 181
6897 181 -152 185 -26 -63 -38 41 -57 29 210 -123 25 -89 37 7 95 16 33 122 79 0 -103 -42 -22 52 31
6922 31 41 -42 -122 82 -7 -18 198 -126 98 -49 -23 -129 33 -209 75 89 31 -67 -117 -53 209 -108 -56 39 -141
6947 -141 82 -346 111 432 -329 233 -239 -310 -59 407 -221 224 -416 -219 -264 -55 236 -127 304 66 -38
6968 -38 -163 143 212 54 -1 5 -252 26 -108 73 43 -35 216 246 -39 -69 -551 -170 -373 102 -345 -40 327
6991 327 78 -264 -29 -75 20 -147 41 243 -356 180 188 414 42 113 287 85 -288 -160 65 -404 140 232
7013 232 -291 -2 -244 -217 -463 -67 73 -449 336 10 118 -110 118 -49 178 112 -22 125 133 -93 82
7034 82 -288 -142 179 59 92 -181 -230 93 -62 84 14 -14 192 -122 -66 -105 -142 -48 103 -5 70 256 78
7057 78 108 -22 148 104 138 52 -76 -82 -245 -75 32 26 121 -29 130 181 12 8 72 137 -306 118 -265 144 162
7082 162 -26 -24 -19 213 94 46 -82 -32 93 162 -19 -106 -237 -45 -56 110 87 -152 -147 -43 651 185 32 -38
7106 -38 -314 -397 132 47 -711 170 441 187 189 64 21 167 -310 -179 -111 410 -93 -151 12 255 668 246 -731
7129 -731 25 -187 -362 464 -341 712 246 141 -216 243 -121 8 -36 257 253 179 76 -136 294 -349 -324
7150 -324 -45 59 -140 8 -346 72 -43 12 -259 124 -133 -85 -71 134 42 -56 -40 -51 106 85 191 264 78
7173 78 101 -472 287 537 33 -28 -96 181 -81 14 -83 214 -42 -62 -49 -144 -248 100 -102 127 -101 72 82
7196 82 114 82 -125 -67 63 -104 -63 30 189 -103 82 466 1025 359 360 -449 -813 -544 -166 57 32 137 -565
7219 -565 266 -298 -262 240 -346 -359 -94 4 -233 30 190 8 144 -71 -53 -68 -58 -9 -110 -20 -150 -87 -101
7242 -101 -22 0 134 -87 -34 -133 61 -94 157 -48 214 215 -225 0 -120 -44 70 79 -88 8 -128 69 -90
7265 -90 -117 -182 245 45 206 128 118 -154 -42 -61 -11 127 119 -100 105 -53 24 253 128 46 34 58 -44 -63 -14
7290 -14 170 -34 71 245 176 -125 204 -12 -93 -10 245 -219 -131 -128 147 99 -11 -92 -48 -9 -116 -172 -96 -170 -107
7315 -107 230 132 -343 -9 -67 119 21 14 -136 -155 -39 -128 290 111 -232 38 2 -4 154 12 -32 -125 196 -35
7339 -35 35 64 119 189 -20 143 14 0 114 56 -199 -35 -120 15 -171 107 147 -3 -231 124 100 -42 -180
7362 -180 -212 108 46 -156 39 61 81 11 -47 66 116 225 -22 111 -101 157 -89 -66 77 77 75 170 -214 55
7386 55 240 126 51 136 -68 -174 148 -123 192 -213 -5 -153 175 152 42 58 -121 -77 -134 163 -113 -41 -202
7409 -202 34 184 66 77 92 67 -304 38 112 -62 -78 -52 -10 -101 -256 128 179 135 63 -94 -172 -101 -112 -76 11
7434 11 -226 17 21 69 -41 -63 13 -145 87 -56 -37 -44 -57 134 -37 66 43 121 -123 -32 137 -161 195 -144
7458 -144 6 -25 -6 -83 -73 -89 59 156 74 28 -30 -195 -84 93 -36 -49 110 286 185 -16 86 108 271 33
7482 33 -28 194 -119 68 655 69 89 -387 150 234 -355 -402 209 -137 -78 26 18 -22 -139 -156 -213 -180 -25 -168
7506 -168 9 -173 24 -99 -30 -114 21 14 -158 -131 25 15 56 -154 -226 -180 -58 -93 62 244 -161 7 -103
7529 -103 30 -211 89 -71 -36 77 -10 52 -1 -76 -153 -89 -170 -27 -22 33 -118 -40 -136 -209 -48 -123 -280 85 200
7554 200 156 39 13 286 -97 -96 44 -83 -99 -44 115 150 150 -2 -18 -160 -95 11 220 -79 -22 -47 182 35
7578 35 -45 156 139 -169 -86 -74 -87 -33 -180 -48 -73 -19 -2 55 35 70 -94 51 169 128 -154 -115 -184 -54 73
7603 73 -91 42 -30 -225 -81 8 33 186 -42 -32 -99 -45 -136 9 -5 6 -80 -261 10 78 -148 27 1 87 -172
7628 -172 -235 50 162 -29 -75 146 221 66 220 32 -114 27 -76 -19 61 23 7 51 -6 7 39 42 -135 -4
7652 -4 -74 -109 178 -174 -11 29 199 253 -9 -181 -45 76 -31 -15 -63 13 -6 96 31 -54 57 32 -78 38
7676 38 -138 -111 -79 -141 -55 -79 43 119 -187 -118 64 107 8 93 30 -137 -23 62 120 180 142 -93 -117 -21 56 -47
7702 -47 2 -26 48 -67 -64 -6 111 12 -9 -296 -155 -97 178 -50 -128 -139 172 -61 76 -78 257 53 21 -67 -330
7727 -330 140 114 39 -205 -143 31 100 41 40 283 298 -21 -15 168 33 60 190 120 168 25 55 -113 -134 111 122
7752 122 43 -12 -161 24 -62 -196 124 -65 76 56 103 54 -58 132 -82 -30 -74 186 -173 -72 65 33 32 75
7776 75 291 40 -193 -115 -106 150 58 -42 11 24 -58 -244 -10 31 46 -57 85 169 97 -135 106 57 15 53 206
7801 206 20 -113 102 -115 32 40 -129 -256 32 42 75 -207 -226 100 68 -59 161 -45 127 -75 75 -153
7823 -153 80 155 36 36 23 223 64 212 287 182 245 -59 -224 -284 30 434 -78 103 156 41 -415 -134 -348
7846 -348 529 431 -237 -78 -186 403 -19 -97 249 -53 694 64 -344 121 -197 541 -173 826 -143 93 248
7867 248 -326 -182 332 -377 1103 238 175 328 714 566 -528 119 2 -291 607 491 253 34 -143 -642
7887 -642 265 411 -219 -158 494 329 -205 105 286 -338 -788 -766 -355 -41 -503 -119 -239 223 -107 376 -3
7908 -3 88 -26 -24 -227 -170 -19 -172 -101 326 163 -261 35 -191 -102 -19 70 62 56 90 219 52 75 -21 182 -108 34
7934 34 51 -298 -6 112 -72 -84 36 -124 -174 95 -38 179 -135 -175 240 -265 -125 226 -55 154 1 33
7956 33 2 263 313 94 68 130 381 117 -168 42 -92 -94 331 -83 53 93 -87 286 -142 84 -56 -47 124
7979 124 20 5 281 141 20 106 59 214 71 -8 -50 -92 43 -37 -110 -121 -19 194 -112 -73 -143 56 133 -84
8003 -84 -51 134 61 14 -17 171 -129 -83 -44 172 -38 -48 -40 -46 -27 37 56 218 -218 178 -125 93 -78 83 19
8028 19 204 38 -251 -149 360 -120 -271 181 -158 -178 -403 -11 -27 126 220 -7 195 -48 195 87 -73
8049 -73 -7 -7 152 8 -167 144 -90 -221 80 29 -65 -45 160 76 12 -212 65 -166 17 130 105 69 -146 89
8073 89 -209 58 143 -140 61 53 -27 -6 -139 40 -117 -67 -59 -62 8 50 -132 91 -63 23 -179 -54 190 -48 66
8098 66 -176 -56 -51 -9 -99 4 -245 35 2 30 -15 90 -39 83 -186 29 -162 -166 -80 81 -154 -55 -170 42
8122 42 111 211 18 -22 -91 183 125 -78 159 168 177 -25 171 200 -122 253 -490 78 228 94 -377 -270 -14
8145 -14 -135 -101 -70 -49 -316 103 -325 54 -100 -198 -106 52 50 39 -13 18 -127 24 -70 -53 -208 31 41 28 -114
8170 -114 151 123 198 -12 -16 140 -42 -227 -129 -119 -24 -2 23 82 -52 37 36 -204 -26 231 -99
8191i9
##END NTUPLES=NMR FID
##END=
