##TITLE=1H_LR-736-C-K1
 CDCl3, 8 sc, 
 11.06.2021
##JCAMPDX= 6.0         $$ Bruker NMR JCAMP-DX V2.0
##DATA TYPE= NMR FID
##DATA CLASS= NTUPLES
##ORIGIN= UXNMR, Bruker Analytische Messtechnik GmbH
##OWNER= root
$$ XWIN-NMR		Version 3.5
$$ Fri Jun 11 10:36:31 2021 Russian Standard Time (UT+4h)  she@DPX200
##.OBSERVE FREQUENCY= 200.131506
##.OBSERVE NUCLEUS= ^1H
##.DELAY= (6, 6)
##.ACQUISITION MODE= SIMULTANEOUS
##.ACQUISITION SCHEME= undefined
##.AVERAGES= 8
##.DIGITISER RES= 18
##SPECTROMETER/DATA SYSTEM= spect
##.PULSE SEQUENCE= zg30
##.SOLVENT NAME= CDCl3
##.SHIFT REFERENCE= (INTERNAL, CDCl3, 0, 15.7039)
##AUDIT TRAIL= $$ (NUMBER, WHEN, WHO, WHERE, WHAT)
$$ ##TITLE= Audit trail, XWIN-NMR		Version 3.5
$$ ##JCAMPDX= 5.01
$$ ##ORIGIN= Bruker BioSpin GmbH
$$ ##OWNER= she
$$ F:/spectra/data/she/nmr/H-F/1/audita.txt
$$ ##AUDIT TRAIL=  $$ (NUMBER, WHEN, WHO, WHERE, WHAT)
(   1,<2021-06-11 10:34:44.31 +0400>,<she>,<DPX200>,
      <created by zg, POWCHK disabled, PULCHK disabled
       configuration hash MD5:
       00 E9 B6 7A A2 85 ED C7 34 08 36 98 17 FE 4E 26
       data hash MD5: 16K
       B0 89 5D 74 84 AE CC 22 EC 75 9E E2 E5 39 93 F5>)
$$ ##END=
$$ 
$$ hash MD5
$$ 98 C9 59 5B E7 A4 A0 B5 C1 63 41 3B 46 A9 70 77
##$RELAX= 
##$RELAX= 
##$RELAX= 
##$RELAX= 
##$RELAX= 
##$RELAX= 
$$ Bruker specific parameters
$$ --------------------------
##$DU= <F:/spectra>
##$EXPNO= 1
##$NAME= <H-F>
##$PROCNO= 1
##$TYPE= <nmr>
##$USER= <she>
##$AMP= (0..31)
100 100 100 100 100 100 100 100 100 100 100 100 100 100 100 100 100 100 
100 100 100 100 100 100 100 100 100 100 100 100 100 100 
##$AQSEQ= 0
##$AQ_mod= 1
##$AUNM= <au_zg>
##$AUTOPOS= <>
##$BF1= 200.13
##$BF2= 200.13
##$BF3= 200.13
##$BF4= 200.13
##$BF5= 200.13
##$BF6= 200.13
##$BF7= 200.13
##$BF8= 200.13
##$BYTORDA= 1
##$CFDGTYP= 0
##$CFRGTYP= 5
##$CHEMSTR= <none>
##$CNST= (0..31)
1 1 145 1 1 1 1 1 1 1 1 1 1 1 1 1 1 1 1 1 1 1 1 1 1 1 1 1 1 1 1 1 
##$CPDPRG= <>
##$CPDPRG1= <>
##$CPDPRG2= <>
##$CPDPRG3= <>
##$CPDPRG4= <mlev>
##$CPDPRG5= <mlev>
##$CPDPRG6= <mlev>
##$CPDPRG7= <mlev>
##$CPDPRG8= <mlev>
##$CPDPRGB= <>
##$CPDPRGT= <>
##$D= (0..31)
0 1.2 0 0 0 0 0 0 0 0.06 0 0.03 0 0 0 0 0.0002 0 0 0 0 0 0 0 0 0 0 0 0 
0 0 0 
##$DATE= 1623393283
##$DBL= (0..7)
120 120 120 120 120 120 120 120 
##$DBP= (0..7)
150 150 150 150 150 150 150 150 
##$DBP07= 0
##$DBPNAM0= <>
##$DBPNAM1= <>
##$DBPNAM2= <>
##$DBPNAM3= <>
##$DBPNAM4= <>
##$DBPNAM5= <>
##$DBPNAM6= <>
##$DBPNAM7= <>
##$DBPOAL= (0..7)
0.5 0.5 0.5 0.5 0.5 0.5 0.5 0.5 
##$DBPOFFS= (0..7)
0 0 0 0 0 0 0 0 
##$DE= 6
##$DECBNUC= <off>
##$DECIM= 32
##$DECNUC= <off>
##$DECSTAT= 4
##$DIGMOD= 1
##$DIGTYP= 9
##$DL= (0..7)
0 120 120 120 120 120 120 120 
##$DP= (0..7)
150 150 150 150 150 150 150 150 
##$DP07= 0
##$DPNAME0= <>
##$DPNAME1= <>
##$DPNAME2= <>
##$DPNAME3= <>
##$DPNAME4= <>
##$DPNAME5= <>
##$DPNAME6= <>
##$DPNAME7= <>
##$DPOAL= (0..7)
0.5 0.5 0.5 0.5 0.5 0.5 0.5 0.5 
##$DPOFFS= (0..7)
0 0 0 0 0 0 0 0 
##$DQDMODE= 0
##$DR= 18
##$DS= 0
##$DSLIST= <SSSSSSSSSSSSSSS>
$$ [...]
##$SUBNAM2= <"">
##$SUBNAM3= <"">
##$SUBNAM4= <"">
##$SUBNAM5= <"">
##$SUBNAM6= <"">
##$SUBNAM7= <"">
##$SUBNAM8= <"">
##$SUBNAM9= <"">
##$SW= 20.0188882624521
##$SWIBOX= (0..15)
0 0 2 0 0 0 0 0 0 0 0 0 0 0 0 0 
##$SW_h= 4006.41025641026
##$TD= 16384
##$TD0= 1
##$TE= 0
##$TE2= 300
##$TE3= 300
##$TEG= 300
##$TL= (0..7)
0 120 120 120 120 120 120 120 
##$TP= (0..7)
150 150 150 150 150 150 150 150 
##$TP07= 0
##$TPNAME0= <>
##$TPNAME1= <>
##$TPNAME2= <>
##$TPNAME3= <>
##$TPNAME4= <>
##$TPNAME5= <>
##$TPNAME6= <>
##$TPNAME7= <>
##$TPOAL= (0..7)
0.5 0.5 0.5 0.5 0.5 0.5 0.5 0.5 
##$TPOFFS= (0..7)
0 0 0 0 0 0 0 0 
##$TUNHIN= 0
##$TUNHOUT= 0
##$TUNXOUT= 0
##$USERA1= <user>
##$USERA2= <user>
##$USERA3= <user>
##$USERA4= <user>
##$USERA5= <user>
##$V9= 5
##$VALIST= <valist>
##$VCLIST= <CCCCCCCCCCCCCCC>
##$VD= 0
##$VDLIST= <DDDDDDDDDDDDDDD>
##$VPLIST= <PPPPPPPPPPPPPPP>
##$VTLIST= <TTTTTTTTTTTTTTT>
##$WBST= 1024
##$WBSW= 4
##$XGAIN= (0..3)
0 0 0 0 
##$XL= 0
##$YL= 0
##$YMAX_a= 180275
##$YMIN_a= -62699
##$ZGOPTNS= <>
##$ZL1= 120
##$ZL2= 120
##$ZL3= 120
##$ZL4= 120
##$ABSF1= 10
##$ABSF2= 0
##$ABSG= 5
##$ABSL= 3
##$ALPHA= 0
##$AQORDER= 0
##$ASSFAC= 0
##$ASSFACI= 0
##$ASSFACX= 0
##$ASSWID= 0
##$AUNMP= <proc_1d>
##$AZFE= 0.1
##$AZFW= 0.1
##$BCFW= 1
##$BC_mod= 2
##$BYTORDP= 1
##$COROFFS= 0
##$CY= 11.3945322036743
##$DATMOD= 1
##$DC= 2
##$DFILT= <>
##$DTYPP= 0
##$F1P= 15.9154993809931
##$F2P= -4.1035820241983
##$FCOR= 0.5
##$FTSIZE= 0
##$FT_mod= 4
##$GAMMA= 1
##$GB= 0.15
##$INTBC= 1
##$INTSCL= 1
##$ISEN= 128
##$LB= 0.24
##$LEV0= 0
##$LPBIN= 0
##$MAXI= 10000
##$MC2= 0
##$MEAN= 0
##$ME_mod= 0
##$MI= 1.114404
##$NCOEF= 0
##$NC_proc= 0
##$NLEV= 6
##$NOISF1= 3.799351
##$NOISF2= 2.8
##$NSP= 1
##$NTH_PI= 0
##$NZP= 0
##$OFFSET= 15.70392
##$PC= 1
##$PHC0= -11473.01
##$PHC1= -6.59899
##$PH_mod= 1
##$PKNL= yes
##$PPARMOD= 0
##$PSCAL= 0
##$PSIGN= 0
##$REVERSE= no
##$SF= 200.130013532006
##$SI= 16384
##$SIGF1= 3
##$SIGF2= 2
##$SINO= 400
##$SIOLD= 16384
##$SREGLST= <1H.CDCl3>
##$SSB= 0
##$STSI= 0
##$STSR= 0
##$SW_p= 3612.71676300578
##$SYMM= 0
##$S_DEV= 0
##$TDeff= 0
##$TDoff= 0
##$TI= <>
##$TILT= no
##$TM1= 0
##$TM2= 0
##$TOPLEV= 0
##$USERP1= <user>
##$USERP2= <user>
##$USERP3= <user>
##$USERP4= <user>
##$USERP5= <user>
##$WDW= 1
##$XDIM= 8192
##$YMAX_p= 0
##$YMIN_p= 0
$$ End of Bruker specific parameters
$$ ---------------------------------
##NTUPLES= NMR FID
##VAR_NAME=  TIME,          FID/REAL,        FID/IMAG
##SYMBOL=    X,             R,               I
##VAR_TYPE=  INDEPENDENT,   DEPENDENT,       DEPENDENT
##VAR_FORM=  AFFN,          ASDF,            ASDF
##VAR_DIM=   8192,          8192,            8192
##UNITS=     SECONDS,       ARBITRARY UNITS, ARBITRARY UNITS
##FACTOR=    0.0002496,     1,               1
##FIRST=     0,             0,               0
##LAST=      2.0444736,     0,               0
##MIN=       0,             -62699,          0
##MAX=       2.0444736,     180275,          0
$$ Real data points
##PAGE= N=1
##DATA TABLE= (X++(R..R)), XYDATA
0@%%%%%%%%%%%%%%qJ6j6J6k2L0l2L9m7N5o3P2q8J00j14J33j51J68j91K18k45K77
36A47l11L48l90M34m84N38n96O61p33Q12q95R86j087J197j319J453j601J767j951
55a024K160k398K668k981L351l793M333n010N888p078Q789j1475J6327k7826J05925
70H7856R2419j46857L6192Q1933m2928p4936N8682L2670m1592j9797L2179p237
82H8584k2624o58P280j9862j0031R876J231k4349j966J8711r658l3861N755K2872
96C1300j8085k7101K0940J6097k7810j1389K4339m424k3743Q505J3030j5556k981
109a6878J7335k966j3208P979O597j1703m936J1598L830p833J41Q545M46q854
123i907l96O990r31p035K993P180j686m101L238L687m931l402M635N01l947L852
$$ y = [0, 0, 0, 0, 0, 0, 0, 0, 0, 0, 0, 0, 0, 0, 0, -8, 8, -8, 8, -14, 16, -16, 23, -24, 31, -32, 40, -48, 52, -62, 71, -80, 88, -103, 115, -130, 147, -164, 184, -206, 228, -256, 282, -314, 347, -386, 426, -469, 517, -570, 627, -692, 761, -840, 927, -1024, 1136, -1262, 1406, -1575, 1776, -2017, 2316, -2694, 3194, -3884, 4905, -6570, 9757, -18069, 87856, 180275, 33418, 69610, 151543, 108615, 33679, 92361, 125031, 83439, 63642, 95821, 88584, 65960, 65302, 72582, 52720, 42689, 52565, 53796, 29447, 27481, 46192, 36534, 2673, 8428, 31300, 13215, -13886, 7054, 23151, -4659, -16048, 8291, 3867, -19876, -11371, 1659, -13897, -16878, 457, -2509, -15717, -7738, -1141, -12844, -17780, -6182, -2352, -10185, -10044, -1499, -1053, -9907, -10303, -3313, -4244, -11279, -8286, -1106, -2792, -6893, -3655, 32, -4899, -8301, -3666, -3165, -7112, -3260]
139c260N305m872k582O154p20o478L631O209k781l842M567K499l212j883L256
154A991K064k076j052L379J350j864J37J313o15j173R90L53q89O30K383j439k691
171B791K040J659m220k216M500nn112J132M187k300m397K252J924l646j320K866
187A35O60k675l09K633j596k853K581K134l174j027L961J9l766J476L270k237
203g68l462L459K277l826m25L992l89m256J369L246k323k854L308J927l543j265
219c533L446J330m186m64M777r88m607K413M610k770m055M214L206n206j315N375
235B247j82m857J578L939k064l099L241J504l661p53L443m53l111J089K376j894
251f57k131K079J519k422j513L024N75l034o49M191o91m631K116M513l770l429
$$ y = [-3260, 2045, -2827, -5409, 745, 25, -6453, -2822, 3387, 606, -3236, 1331, 3830, 618, -1265, 1991, 4055, 1979, 927, 4306, 5656, 3792, 3929, 5242, 4627, 3454, 4444, 4797, 3908, 4538, 6921, 5482, 2791, 4831, 6490, 2270, 54, 4554, 4549, -563, 569, 4756, 2456, -1941, 311, 2235, -1411, -2731, 135, 795, -1880, -2189, 444, -1152, -4005, -1424, 710, -2464, -3491, 470, 489, -3277, -1801, 1469, -768, -4230, -771, 1506, -2320, -2745, 1247, 858, -3398, -2029, 1217, -1106, -3960, -652, 1275, -2268, -3533, -87, 1243, -2943, -3407, 1370, 382, -4225, -1812, 2798, 28, -4027, 187, 3393, -1813, -3128, 2247, 2065, -2792, -1214, 2725, 661, -2438, 803, 2307, -1354, -2107, 1336, 883, -2228, -1139, 1237, -657, -2788, -709, 810, -1612, -3125, -101, 474, -2560, -3209, 982, 291, -4340, -2224, 2289, -1481, -4910]
267d910M946K232n389o06N568p90m682K090L807k987k346L039J349k411j014K334
283B30O26k034l28J740j58j982L38K292j309j867J953J083k526l89K684q28k631
300c106J980J995k721r75L106J46l093N13K641j508j350J834J250j815m47J920
316C70J98j355J94J170n31m99N06J021o19l15P94J81o26k05J186k78j313O18J085
335A582q57q26J166R22k255j98K054m17k029J065K008j683j392K072L39k104M65
352h8J508r07p77J595l27r40Q06M70j388P6J264o32p54P78O14o07n90N06Q1l91
372B97m99M00P49o57j176J257R49j938p00K030l10j965J368J526j852m75J686
389F90m57j479R64P42j051m49J714o21r56P63L26n85l47M66L55j00p50P22M57
$$ y = [-4910, 36, 2268, -3121, -3727, 1841, 1051, -3631, -1541, 2266, -721, -3067, -28, 1321, -1090, -2104, 230, 856, -1178, -1506, 234, 76, -1906, -1568, 724, -585, -2452, -499, 584, -1942, -2331, 353, -475, -3106, -1126, 869, -1852, -2827, 279, 425, -2668, -2155, 486, -1022, -2372, -538, 712, -1103, -1550, 370, 568, -787, -593, 577, 46, -453, 53, 1074, 455, 140, 934, 1115, 489, 284, 1470, 1192, -121, 497, 1582, 725, -101, 1065, 1987, -268, -466, 1588, 1171, -858, 207, 2215, 532, -860, 1212, 1551, -553, -88, 1420, 513, -264, 1331, 1004, 64, 870, 1340, -48, 28, 1292, 660, -94, 684, 1298, 691, 101, 607, 688, 297, -202, 198, 947, 290, -886, 371, 1320, -618, -1318, 712, 402, -1563, -195, 1331, -521, -996, 690, 233, -1246, -282, 460, -591, -1040, 674, 53, -903, -140, 186, -399, -746, -280, 75, -25, -775, -53, 404]
408D04r33n91J289J43j605L82J747j139j551J887Q41k374j76K322n33j866P10
425a043K009j084j546J395J021j264n73J224O63j100k71J666m88j260N80J199
441A128o54p15R44Q65j468l58J667m44j598Q28J490j468j126J710Q40k016q3J504
459A046m76j905R32J533j364j234J399P07j649l58J630k17j102K12R06j13p76
476h29K65Q52o02r35J147L48j094J16R34q6j033P77N83n72m58Q78l75l13M21K98
496C22m58k50J96M56m64l81R17J91q18p9Q40j98o55k2R77n87j87J92L85m23m2
517h8N35m67j10K22R7l66N85M3n33J54QN02l00K29QK72n47J03M07K72p61k25J012
540A052M8r16K05M70l03o21N42J13r8k23J72k14j26J2m8k29L35Rn17J00O45n91
$$ y = [404, -529, -1120, 169, 312, -1293, -911, 836, -303, -1854, 33, 874, -1500, -1676, 646, 113, -1753, -1043, 966, -118, -1664, -269, 752, -512, -1085, 139, 802, -298, -569, 1097, 609, -651, -71, 1128, 474, -241, 703, 1568, 100, -258, 1409, 965, -633, 195, 1685, 217, -909, 801, 1641, -375, -458, 1046, 570, -1335, -403, 1130, -234, -1468, -69, 638, -1011, -1369, 261, 44, -1058, -846, 60, -53, -829, -564, 288, -314, -1249, -102, 246, -848, -732, 202, 116, -917, -140, 443, -129, -587, 291, -84, -397, 24, 322, -136, -386, -190, 266, -198, -579, 338, 529, -289, -368, 472, 274, -381, -403, 574, -13, -200, -8, 377, -46, -88, 447, -20, -130, 92, 189, -177, 408, 451, -82, 72, 80, 582, 282, 511, 519, 791, 244, 347, 754, 1026, 265, 40, 1052, 1100, 184, 389, 859, 556, -65, 477, 590, 492, 269, 441, 227, 101, 113, 65, -164, 171, 180, -337, -237, 408, -183]
562a83l25M42Q3m24m00O70P2m07k49O30q6l54K16K11K8m49K07L58l08l77M45N77
584C77q01l74J029j35o35N09O48n34m51O76J66o54J22M06j72k21M53K1m35N40
604E35o4J31m28m7M78L5n55J48O45j00p44M52N32o03o35O34N48j053J49R59q09
625B08l00M15L11l00l54L82K41p13l20R54m78n5J75K63k07n24M66K63n54m6M37
646B64l04j71j2P70m08o12L76J93l63k42K31L48o06L63J95k73j72mL25k57m90
667h49N47J14k58J0J44k84l8K30O5K11k39j35N31r1l50K22J52k20k9K90J75j74
689B4K61K6k36l7M69k66l23N6O92n48j35K62K54k55pQ1m8j06L09j19lj12j34J54
713B59J07p6j35o2J36k41K13K1O6j32k41R8R6j41P8O3l9q6j47J92K60l82j26m3
$$ y = [-183, -508, -66, 17, -407, -807, -137, -65, -472, -721, -91, -177, -531, -315, -104, -76, -525, -318, 40, -268, -645, -200, 377, -424, -798, 231, 96, -539, -30, 618, 84, -367, 309, 475, -179, -57, 349, 177, -44, 409, 430, -5, 535, 471, 602, 174, 127, 605, 640, 85, 233, 878, 778, 34, 486, 1018, 415, -220, 414, 962, -91, 58, 1017, 208, -92, 323, 634, 334, -20, 362, 603, -110, -430, 524, 46, -9, 166, 429, 222, -302, 164, 427, -127, -173, 264, -40, -211, -223, 547, 139, -473, -97, 96, -267, -509, -278, 70, -536, -173, 22, -251, -423, -427, -102, -359, -849, -302, -188, -446, -436, -292, -576, -614, -384, -319, -108, -347, -482, 49, -42, -392, -170, -18, -238, -267, 23, 198, 24, 285, 311, 75, 38, 507, 241, -82, -26, 666, 118, -17, 245, 499, 244, 237, 318, 270, 164, 473, 354, 351, 239, 105, 259, 366, 290, 155, 93, 229, -12, 201, 222, 288, 156, -85, 13, 109, -32, 46, 109, 70, -16, -163, 29, 289, -93, -219, -262]
737b62M51j7l30J02J72k54L19k39j75L05j09k28K53Q9o94M52j58J80Pk90L28M14
759C16l40l33K10M9l18j05P3K79j96n7N34j02k98p8M87j15O7j97L02k32k13M13
781A46P2k33L5p2K53j87q5K54j74j32M83p4j77m0J09Rm29K16K36M7k43j03J55
804F6J13j31K42k39l2p9K10L34n59J79K26l11J4O5J10l64J51Rm1j59K14N46n62
827Bl32L27L5O1M4j3q8j85J10K34j98k00J20L6j3j40J86j34J80l91O82m54L28
850A97l82L56k84J21j50M53k55k50K54l1O2n22N72k8q3j46P8j46R5J77lj52k97
873c64L93R8K30j79o6j65JJ31K64m70J88J45j71j25j15M43j46O5j80o2j22J33
895g4R6P6k98Q4J54Rj02R5p9l7r3J84l04L89q7m4J70j36r1J82J5M6l67J81K46
$$ y = [-262, 189, 172, -158, -56, 116, -138, 181, -58, -233, 72, -37, -265, -12, 77, -617, -165, -323, -143, -136, -426, -98, 316, -24, -357, -147, -98, -416, -521, -448, -169, -365, -422, 112, 10, -288, -366, 121, 6, 73, -124, 178, -54, -267, 146, 218, -15, 20, -52, 201, 14, -71, 183, 9, -123, 360, 286, 109, 69, 178, 187, -242, -26, 210, 257, 14, -89, 66, 179, 48, 290, 51, 19, -60, 150, 484, -75, 104, 330, 19, 33, 98, 208, -156, -5, 4, -37, -196, 18, 564, 2, -330, -3, 32, 93, 137, 124, 36, -149, -39, 195, -3, -203, -83, -47, -60, -200, -14, -148, 32, -359, 323, -131, 197, -185, 171, -113, 8, -142, 311, 56, -194, 60, 29, 91, -431, 141, 113, 30, -116, -38, -184, -89, 88, 85, -67, -364, 29, 127, 357, 178, 112, -53, -52, 79, 343, -127, 61, 206, 35, -90, -205, 238, 92, 157, -23, -85, -207, -74, 22, 98, -200, -116, 38, 47, -55, 40, -39, -76, -169, 15, -289, 100, 13, -31, 139, 3, -88, 94, 109, 155, -212, -31, 215]
920B15k82j4q9M4L82k70n98N09J46K0j96J66p3k6l1M7k64L55k08K09j75Q4J14
943F5k50K19j2j05j16J11J85k44L25J87l15j22J46K06n22L56k32o4J58J64j56
964a6J7L13m21J83K73m02M4J95L9k1j31M26m73nK06l87J70J54J21j92n6j70P2
987f1K01R7Nj11j21j57J56q6J79m1J29R8l81j9L07k02k63M39k2q7k07J66N4j58
1011h5j1K24k53rM9K01j28N7Q0l3l1j62Q4lK90n50J58J54k40K07j5J37q2j95K10
1036E4l47M09l6L7j31J46j48j0j12J28J74k20K58n3r4j85R8J95Jm64K64M42m22
1059a6r7K07J23l03N1O2k74L54j48p4K46r3r9N5Q6k68J05J14k8o2L5j24K28K3
1083A03Q7k7j9k91R5L91m69J47J10j80m2j9R9J29P2j56j41j36J09M1J03m3Q7j66
$$ y = [215, -67, -81, -170, -126, 256, -14, -612, -103, 43, 63, -133, 33, -40, -66, -97, -50, -314, 41, -167, 42, -133, -49, 65, -185, 34, 22, -83, -199, -88, 97, -147, 178, 365, 50, -72, 74, 280, -242, 114, -118, -182, -24, 140, -16, 1, 314, -107, 76, 349, -53, -9, 186, 225, 204, 73, 499, 26, 21, 227, -160, 10, 164, 285, 93, 37, -133, -61, 140, 237, 242, 131, 10, -147, 9, -77, 102, 61, 190, 288, -93, -112, 195, -7, -270, 169, 147, 60, -147, 19, 73, -85, -96, 128, -125, -134, -85, 116, -12, 45, 125, 92, 61, -101, -17, -20, 270, -280, -122, 32, -208, -1, -16, 121, 39, -156, 54, -293, 116, 80, 117, -14, 132, -16, -26, -138, -10, 164, -56, 202, 149, 55, -130, -32, 163, 164, -300, -36, 406, -16, -113, 94, 217, -86, -35, 27, -247, 107, -41, -115, 131, 38, -61, -6, 80, -188, -83, 31, 3, -59, -24, -148, 80, 103, 190, 163, 144, -147, -52, 339, -130, 17, 127, -53, -95, -114, -15, 114, 186, 30, -111, -247, -138, -97, 6, -37, 50, -116]
1107a16j08R9N6m4j82P0J98R4m36J98L76k33j28K11N1m64%L34j31J39j28R6J34
1130H6j27K06j33J79m83M84l31m2K30r1J55j26n3q1J33L5j37K63j98k40J75J84
1152H8k5N7m8j86K01q7P7l09K62J37j34J21k76L06l77J29K96l78J26m3m5K30Q9
1175B11k89J23M1j76l9L0O5K0p9pj08J33jj12Q5N9P9N4P5k24J18o6r0J97J05k07
1201cj67K45P3j72j38P7J17P4Ql54K61J9j69K87j64K31l5l46k7J96k58K92P9m8
1225G8j22K58k31J06j33j0J10k80J95K44j83j1P2l61J55j1K96k73Q1L5j73J63
1247Em8k26M78l0j73o0K55k62o0M7K75n9lk9j70q8K99k33k4J93j38J55k9j08K63
1272B30k83o1n0N0J4J03O1k7j89K62l04J12N0J3P9k75M03j49j18K20p8k45K16
$$ y = [-116, -224, -125, -69, -113, -295, -225, -27, 67, -369, -171, 205, -28, -156, 55, 106, -358, -358, -24, -155, -16, -144, -48, 86, -41, 165, 32, 211, -272, 212, -119, -161, 69, -22, 133, 7, -46, -127, 6, 41, -96, 167, -31, -271, -96, 88, 63, 120, 72, -114, 87, 0, 77, -232, 30, 167, 33, 154, -122, 184, -193, -64, 232, -146, -20, -63, -108, 122, 211, -78, 45, 86, -90, -129, -99, -34, -14, -93, -100, -208, -75, -76, -188, -103, -44, 35, 89, 164, -60, 58, -8, -98, 99, 204, -3, -170, 75, 148, -24, -162, -85, 32, 106, 114, -240, 21, 40, -129, 158, -6, 225, 190, -156, -183, 13, -245, 47, 126, 78, -44, 214, -17, 89, -44, -54, 56, -224, -29, 215, 32, 21, 93, -268, -113, -124, 172, -101, -20, 15, -158, 5, -43, -269, 209, 179, 6, -54, 201, -61, -121, -74, 201, 142, 139, 110, -60, -148, 151, -82, -106, 87, -51, 104, 75, -33, 230, -53, -114, -164, -114, -100, 3, 64, 37, -152, 110, -194, -82, -32, -19, 60, -215, 188, 39, -79, 141, 63, -182, 34]
1295C4q4L61l51J98n0j3N0j35Q1k48J1P4LJ29N8k20j51M55k18J07j94K7M1m8J87
1320A04l35L13j85K10o3L8n6J43j93J2J18m7QJ27j31R0j35j6K85j96j53K06j59
1343a5j17l9L25j73j37M05q7p4P4j24K11l14j38J39J36k40J90O9j82K76q7J84
1365B82j41l01K74J55k14j81K45j89R7o9q9K77j82j48L49m01P5J94L4J84l07j
1387e7j83K31K00j02k51K35k7J28k31J12Mk88K47j05K29k37k6r2L38m2k3k1P9
1410A18J79m66P2K24p3j69k85L89L74m69J09LJ07j56L25k25P5j80J00j43J30j25
1432h6RN2p0K84l50k4L01j18j36Q0J9q7J57N4J42m47M99l85J20J2l9o2O0j73J67
1457b1K95k15RJo6K7j04R4O4j02J00j23Q8k26L23m01J00K32p4L7r0NN2L5J69k07
$$ y = [34, -50, 311, -40, 158, 108, 95, 145, 10, 91, -157, -146, -72, -69, 60, 118, -102, -253, 202, -16, 91, -103, -76, -35, -83, 104, -231, 82, -103, 107, 44, 82, 26, 169, -24, -12, 106, 59, 67, 194, 63, 153, 18, 2, 287, 91, -62, 144, -15, -132, -171, 154, -19, -156, 249, 162, 88, 162, 38, 249, -65, -203, -64, 72, -168, 22, 91, -91, 185, 98, 282, 141, -160, 114, 269, 55, -126, 119, -70, 27, -42, -131, 146, -36, -184, 165, -236, -161, 33, 67, 251, -56, -57, -240, -9, 191, 89, -162, 73, 46, 174, -57, 55, 59, -229, 18, -87, 142, -95, -121, -213, 125, 83, 60, 39, 118, 297, -169, -97, 127, 54, -115, -400, -11, 363, -106, 3, 6, 113, -43, 282, 57, 132, -48, 52, -91, 39, -86, -77, -25, -95, 189, -161, -185, 116, -2, -138, -58, -39, -126, 31, 85, 227, -220, 279, -106, 14, 26, -13, -75, -15, -188, -21, 274, 59, 68, 69, 3, 30, -74, 20, 84, -18, 82, -41, 47, -179, 144, -257, -157, 75, 1, 38, -52, -47, 5, 40, 209, 2]
1483BP8l9j04J8Q8k8R4J66m92K71j95j9N7O3k15K09r7L84l12K10J04m40K39J06
1507A48j35n1j0j00K21O2k3j32p3L65n81K54K06m05L15n9K4q2K07k09p6K58n0
1530G4r8J73N8J9pl23J36J70pk22R8k59K83j29J01q2K70j57j44O4j37oM8j2R1
1555BJ19q0p8L05l31jJ8N3j17n6L8K01j29n2J58q1J19m9k0p9J20Nk64L0K12P6
1581A19L2k38m7L23j86P9k69J58k8L63j08l7q8J0J82k54L6j63J72k28J06K56j49
1604D1q7o5M6j07J63p3J52j43J42Q5k04K75m04K23J29j35J61l02j99Q8L67j01
1626E2k06M3J27j07N2L7J9J4L4j33j51R7k0K18m8P6k22j02K2J23o2K96k90J10
1650b1lj41J81J14j56L5o4J27jk01j05nJ80L50J27j96k30j70J27K6J51k79K15
$$ y = [2, 80, 41, -63, -45, 43, 15, 109, 275, -217, 54, -141, -160, -103, -40, -255, -46, -143, 241, -71, 139, 243, -197, 42, 148, 13, -38, -48, -148, 73, 135, 112, -20, -93, 272, -309, -55, 151, -254, 61, 2, 26, -56, 151, -58, -134, 124, 74, -24, 149, 207, 226, 219, -104, 32, 202, 195, -27, 71, -188, 95, -34, 67, -15, 255, 98, -46, 18, -119, -125, -77, -89, 2, 121, 41, -37, 268, -63, -64, -46, 7, -110, -166, -128, 73, -56, -108, 50, -31, 88, 39, 19, -60, 60, 65, -199, -169, 43, 119, 151, -87, -134, 189, 3, 82, -187, -29, -57, 306, 198, 161, 73, 83, 265, 11, 47, -116, 56, -172, -66, 190, 41, -46, -111, -65, -172, -9, -82, 70, -73, 69, 154, -50, 225, -179, 44, 173, 38, 199, -103, -302, -214, 153, 52, -154, -111, 16, -91, -39, -2, 17, 31, 65, -68, -219, -122, -142, 76, 28, 104, -118, -220, -198, -75, -137, 159, -131, -21, -24, -165, 16, 130, -26, 9, -55, 72, 71, -130, -235, -240, -60, 290, 417, 221, -9, -179, -52, -26, 125, -154, 61]
1673F1k14J49Q0j03P6j00J58J53k86o9j4O1N2j22K01k59J54j12PJ34l20L20N3
1696F0o8M1P0j27n3J80j15l17N95l92J05j50L97j72k08Q7L0K03l66J07J05Pq6
1719f7P8O6o8o6J89j48J49j2l45L11l40K70L8r5K37l09J18K4q4L6M7k08L18Pl97
1744b51J87lj07K05o0k4M7J36J42l79N4J04j24K59n1l12K69j73K55j87j26K98
1766A59k68J15j19K22J07j57Q6l40J97M9J47l16K65l37L37Q0j96PQ4j19l6J58
1788A25n1J69m19N1K7J21J76k62j61M08q8k35QkL40o56O17l41L4K34k49J08J45
1811I9k3j72J12J30r5ol5J62k27l1K95k66q3J85j00k8M9K60m19L07k17K6K16n87
1835d48K67LJ60l05N45m90L27J29l6Oo0j10R9Lm7j97J86m1J6R4l48L27r2k6q8
$$ y = [61, -153, -4, 76, -27, 49, -51, 107, 260, -26, -95, -109, -48, 4, -118, 83, -176, -22, -134, -127, 7, -313, 7, 60, -8, 33, 103, -24, -77, 103, -12, -329, 266, -126, -21, -171, 226, 54, -154, -67, -37, 166, -200, -93, 12, 19, -67, 11, 77, 9, -57, 132, -16, 133, 121, -224, 87, -253, 17, 55, -40, 197, -112, 6, 30, -54, -18, 29, -179, 139, 146, -251, -64, -67, -174, 31, -29, -53, -6, 130, 272, -107, -53, 51, -73, 186, 135, -177, 92, -81, 174, -13, -139, 159, -109, 6, -113, 109, 216, 59, 145, -195, 2, 51, 198, -118, 147, -190, 147, 227, 31, 38, 122, 3, -33, 125, 74, 243, -176, -125, -98, 23, 199, -63, -224, 184, 96, -139, -131, -133, 207, -449, 168, -173, -139, 95, -154, -46, 99, 76, -96, 16, 146, 51, 45, 10, 172, -55, -86, 209, -57, -140, 45, -55, -83, -34, 226, -193, 114, -103, -77, 139, -448, -181, -178, -18, -323, 222, -268, 59, 188, 152, 158, 98, -12, 87, 90, 43, -154, 32, -9, 7, 101, -247, 80, -12, -38, -126]
1860a26K87j3j6J4j72M6l8j65J10j19J71l0R9j62M3K60k7k07J67k40N8o4r4L21
1884A03r8K5l4P8J1O5k15j0M4L09r1j41r0l3K53j56k03L13j79L58l24L8q2n4L15
1909B02j15R5j96oJ85o5j13m3m6K68l50J74P7P1J34Oj63r1j0J0O7k2n3J10j43
1934a7J30N7k61K60k24K33j00j50J94p5r4j42N0N5oJ10j2J23k49J27J62o8j70
1957f7r3J78j02O2o2J51l39Q8L30j85j15K12r8k21L01P6j44p3K29%j50K73l73
1980a22K53j29J47k14J17J24k00lNL1J14k17K00O7k94J22o1p7Rp1K4K68j33j74
2004b14J65j60K33o1k07M35l00K4J54J43j70J97m14M76k15O6%j75J10j91J0Q1
2026a3j9k25N69j52J61n32J83J01j30MJ30p7K21k7k51K99l69J14k56J32J40k22
$$ y = [-126, 161, 148, 132, 146, -26, 20, -18, -183, -73, -192, -21, -51, 48, -114, -71, 189, 162, -45, 122, -118, -60, -124, -218, 103, 5, 30, -4, 74, 85, 150, -65, -75, -31, 278, 187, 46, -44, -77, 176, 20, -183, 130, -49, 309, -15, 23, -59, -113, 202, 87, 182, -14, -20, 165, 100, -13, -56, -102, 166, -184, -10, 67, 138, 272, 278, 115, 24, 14, 24, 91, 69, 16, 126, -17, 113, 170, -91, 169, -55, 178, 78, -72, 122, 47, -47, -189, -139, -84, -90, 20, 8, 131, -118, 9, 171, 103, -67, -160, 18, -84, -22, -84, 67, -272, -184, 146, -39, -154, 58, -40, -261, 40, 116, -28, -101, 128, 128, -22, 251, -122, 131, 2, 149, -65, 52, 176, -24, -27, -22, 9, 123, -94, 106, 173, -121, 1, -60, -137, -128, -199, -175, 93, -40, -214, -49, -209, 24, -37, -244, 191, -109, -85, 69, 212, 42, 239, -175, 301, 86, 152, 152, -23, 87, -104, -94, -13, -32, -257, 312, 160, 321, -211, -28, 73, -57, -53, 77, 0, 221, 194, -57, 242, -127, -13, -269, -137, 3, -219]
2048b19OK30l8K00m39J92J72k27K33k96L4J09M0J94l17J56j28k08M68q1J86n30
2070b63L63j37p1Q4L19l77K39k60j8J54l15J53J73O9j88J0J03n1j83L92k58n8
2092a20J23lj87J86K89k70j44K61k11m7M03j32k08K65j45k37k5J84j7J06n9l90
2114c78N02n3n16K43K27j61l5J59k7J73j8j68L4P8J55k46MQ9j61J02K73p1j62
2137D3J05j89K05l84M08r4k33K35l02K03K0L9K2R9n0k50k17L77P5k16K22j4l7
2160F7k22Q9R4J28k70J51J67l69K17Pj66K63k41M72l68J46o6j21Q3o3P8n0K45
2183B71l98O8O9p8L2J33k5O5l7l33K99Kj60K8kJ33K0J10k63Q1j81K87J18k69j42
2208a72L40p3rj97K45k41J81J67j19j25k75L50k23P2J46k70L78Q2l31K43J5P5
$$ y = [-219, -213, 17, -21, 179, -260, -68, 104, -123, 110, -186, -152, -43, -3, 191, -126, 30, -98, -306, 162, 81, 267, -263, 100, -37, -108, -24, 295, -82, 157, -103, -121, 33, -282, -129, 44, 113, -75, -65, 38, -13, -196, 196, -62, -120, 3, 0, -187, -1, 288, 18, -126, 135, -76, -123, 280, 148, -60, 205, 60, -177, -202, -18, -35, 71, 12, -378, 124, 71, -445, -202, 25, -136, -171, -12, -39, 134, 116, -52, -18, 60, 215, -31, -27, 62, -99, 3, 276, 205, 43, 148, -41, 164, -220, 188, 94, -139, 96, -206, -3, 17, 56, 78, 177, 127, -123, -340, 37, 112, -104, 118, 104, 67, -155, -66, 28, 156, -114, 37, 204, -165, 52, 59, -107, 156, -85, 387, 19, 165, 99, -22, 61, -2, 76, 26, 271, -127, -59, 10, -68, -36, 97, 72, 137, 100, -233, 66, 68, -92, -64, -66, 67, 87, 197, -66, 15, -166, 121, 239, -30, -172, 168, 95, 86, -111, 134, -107, 74, 241, 122, -3, -278, 72, -151, -79, 67, -203, 175, 257, -74, 169, 184, 259]
2230B59k66K42k55j49P2K7J44l5k26N6Q8RQ8j01k1L7k41J95L46k16l19J77M9k47
2254b87J19Q8K62j85J04n6j69K93r3J49k73q1M0j50K59j31mJ50J49l1k09J60k22
2277a18M6J21k71L69r1j06L1j49J23K0L9k2N9J72l84J13l2J23k69K47lk9k9J51
2301A11M2j46N7l34K39j9j44M37j27m87N51j2l2j00j6K68l27N5j22O9J40o0j37
2324i4J27j83L56o4r2j28K81j12j07p3Q4m2j9K9Q6p0Q0j62J90j97j78N51k15k4
2348B4p7l08L45r2L43m19L01o0m2k77M1L89k43L6k15N18j85J8j59L7J02n3j05
2371h1K28k7l72K10k0l6J11l5n5j29J93J89%l56j06L31k09J46R7K3M6l1k22Rk0
2396a16P4J37j58n5J10K9r8M6K41k06K21j54K6j70O2k6J97k21K13k91J13L3k35
$$ y = [259, -7, 235, -20, -169, -97, -70, 74, 39, -187, -131, -43, -34, 54, -47, -68, -31, -272, -77, 269, 53, -266, -89, -40, -287, -168, -80, 182, -3, 101, 45, -124, 169, 76, 225, -48, -129, -89, -239, 20, -111, -115, 35, 184, 153, -56, 104, -118, -72, 49, -222, 147, 56, -50, -19, -168, -45, -25, 14, -8, 51, 223, -161, -48, -80, 43, -226, 21, 18, -11, -40, 111, 153, 7, 64, -270, -31, -50, -194, 243, 116, -371, 180, 168, 136, 36, 20, 288, -39, 16, -106, -37, 103, 43, -94, 33, -150, 206, 142, 50, -78, 203, 91, -16, -89, -5, -47, -66, -37, 49, -21, 59, -103, 87, -110, -288, 263, 48, 24, -53, -361, -16, -108, 235, -184, 117, 57, 15, -262, -221, 168, -75, -39, -254, 264, 79, 97, -62, -25, 77, 24, -81, 147, 120, -252, -42, -62, -98, 13, -22, -77, -206, -13, 176, 176, -180, -286, 45, -164, -18, 79, 102, 148, 117, -105, -96, -116, -42, 95, -63, -118, -8, 21, -77, -31, 210, 4, 225, 71, 97, -73, -11, -37, 160, -61, 152, -139, -26, 7, -228]
2419b28K78J00l20pJ12k2L20l54K70Qk33R7n0J09p9p3K12k08j68J51K88m38J02
2442a33J05O1J71j31p1k6J61o8J96k12j44L4k12L23J42k43R9Q1k12K63k07R5r8
2465b6j22J08J26j41J08J00l48K27M5J46m27P0L58j76K12k95j21L10q9nn8j70
2487a68J59m6K21L6k66j01N5K8L6k44Q4L12k61J38J57N7l22Pj85N44m39M16j26
2510I2p6L0j08q7L72rm37M67l14R7j2K62k92J10k10O7o1K05l27J19m9J27K09j0
2534A65j35k36J04K22j29J61O0j01k79J70j95M3M89l98J28k08R3O3r6J23k77M78
2556B45k46Q5j07J38j02j2k3J08k37J59J81q1j78K63j62k97L82k38J79J07l69
2577b05K76j8J99j28q1k15L52o5j06L22k79J84k55O9j35M9J49r6k25K74l7JQ6
$$ y = [-228, 50, 150, -170, -177, -65, -87, 233, -121, 149, 157, -76, 21, -29, 80, 1, -72, 140, -68, -236, -85, 203, -235, -133, -28, 33, 204, 73, 2, -24, 137, 69, 265, 53, -91, -57, -269, 54, 196, -47, 52, 133, -79, 184, -23, 72, -26, -148, -40, 86, -55, 53, 153, -195, 32, 77, 223, -204, -134, 224, 48, 260, -35, -156, 154, 65, 60, 2, -168, -9, -55, 166, 202, -64, -165, -110, -82, -46, -290, -206, 106, -155, -17, 140, 197, -125, -118, -303, 241, -198, 218, 92, 16, 46, -62, -149, 223, 214, -223, 244, -70, 27, 15, 277, -15, 95, -115, -48, -109, 96, -231, -112, -161, -34, 175, 165, 30, -206, -102, 120, -9, 152, 212, 111, -168, 2, -193, -150, 339, -59, 69, -139, -46, 17, -79, 44, -233, 245, -1, 84, -23, 115, 13, 1, -22, 86, -151, 8, 189, 108, -70, 193, 31, -266, 116, -122, 57, 164, -205, 71, 53, 252, 124, 43, -172, 180, 115, 9, 331, 52, 236, -19, 50, -85, -36, 113, 17, -208, 66, 29, 30, 116]
2600A16P7k25K28k64j14L31k40pm6K80j28k47M29k49L2k05N2K99k66L62m56KN9
2623a80M13k24j30K14j12J07k24o6J67n4r2K33J28l13l4K93N4k54R4O8N3O6r2
2646A15k33K56j43L4J03j18mR5k72J07L2J78j20q6J59k77K39M1l32J09J64J5J22
2669A84k11Q3J67l71J14j34K98o6j30N9p9o0K32j13K35j97j12j91J04L09k43J88
2691F6j59K29k96K03Mj39J8K51l2r2j07J08l3j20j21K77j66J66q7L5N1l22L56
2714I0k2J72k63N6N2J47O6k32k3j91K03M12l87J31k43j75K92m1mo3k82M53j82
2737c4j70J49L0Oj08J18R0k83J62k4J51M0k79K11j54O8j11l8K24P7l42M82j67
2760I8j06Q4j69K86j71K9l7n0K02j54Pk2j12J17K39p0k59J76L2R6j84l15L38k32
$$ y = [116, 193, -32, 196, -68, -182, 149, -91, -98, -144, 136, 8, -239, 190, -59, -27, -232, -180, 119, -147, 215, -241, -239, -180, 233, 9, -121, 93, -19, 88, -136, -202, -35, -89, -181, 52, 180, -133, -167, 126, 180, -74, 20, 88, 141, 207, 115, -118, 138, -5, 29, 132, 14, 10, 105, -167, -60, -28, 150, 30, -56, 103, -174, 65, 106, -226, -117, 47, 62, 184, -27, 56, 223, -148, -34, -168, 130, 64, -66, -7, -86, -146, 86, -27, 208, 11, -101, -292, -188, 121, -122, 66, -93, 136, -160, 43, 47, -92, -74, 177, 145, 53, -54, 54, 21, -99, -220, 57, -109, 57, -30, 5, 56, -266, 90, 68, 240, -23, 33, 85, 232, 298, 66, 43, -148, 55, 467, 80, 211, -32, -207, 85, 44, 40, -23, -305, 148, -34, -204, -55, -25, -19, -127, -9, 81, -202, -40, -64, 87, 127, -152, 59, -95, -27, -138, -176, 48, 125, -217, 265, 98, -8, 76, -93, 193, 22, 51, 14, -36, 166, 12, 19, -3, -115, 2, 241, 171, -88, 88, 120, 216, 32, -283, 55, -177]
2784a77L96l07L23k43J7k7r9J31j55K06J35j32m56L60J63Q2k67j67J07N9M01l86
2806c6k6K55j85k04lJ56K29j23k09J62J00l01J53j1P7J50j45m1NQ2k18o2J06N6
2830c3n1qj19K23j23M1O7L39K2l56l28L96J3Ll78M59j66R1j33P1k02M5K68M6j88
2855aj38j72K82J66l3K6j97K5j6K52k34j15K20J9q7Oj65L36j39j99M15j52m4k34
2879a79K91k77M56l52L9j00J94n3Jqj2Q1l12J60j13J62L2Q9m10q7K88J21j35M46
2903C22l48JJ03k8k84l6Q2Kn4K29J0J42r0j20n8K16Om6j88L18M9j44n8r9Q6k36
2929b23J07L71l37l2L02l94J11R9L1K7j11j21J16L17l70j22J74K1rN3Pn1N2m0
2953b2o0L0L9k20L73k20Q1J0L14j64n2k47j05K13J61j40J52j8m5L4k48L59k76
$$ y = [-177, 219, -88, 235, -8, 9, -18, -117, 14, -141, 65, 200, 68, -388, -28, 135, 217, -50, -217, -110, -51, 350, -36, -62, 193, 8, -196, -199, -43, 186, 63, -146, 16, 116, -185, -32, -43, 34, 184, 39, -2, 3, 85, -133, -195, -89, -33, -84, -92, -211, 12, -111, -70, -3, 336, 358, 2, -326, 70, 83, 86, -292, 167, 1, 92, -41, 30, -172, -127, 141, 187, -1, -139, -311, -29, 137, 104, 130, -67, -42, -58, 194, -40, -155, 65, 84, -3, 3, -162, 174, 35, -164, 251, 99, 55, -179, 112, -165, 291, -61, -22, -122, 72, 19, 20, 12, 0, 81, -231, -71, -184, -22, 10, 99, -311, -398, -110, 11, -124, 322, -26, -25, 78, 50, -234, -270, -188, -186, -240, -11, -1, 141, 51, -69, -127, 89, 95, 49, -139, 179, 228, 84, 26, -73, 13, -223, -116, 255, -82, -114, 188, -206, -95, 4, 35, 62, -49, -170, -54, 263, -107, -229, -55, -34, -43, 10, 17, -34, 18, -22, -82, -52, -13, -233, 140, -80, 1, 11, 325, 161, 109, -138, -243, -30, 131, -9, 143, 125, 80, 114, -134, 225, -51]
2976e1RO8k3J4J79j48M8k70J43J73j73K69l23k6J74l2n9M3J74j23j63M0J19j38
3000g6J97j06o6J93k14L36j73R3j13r0j1j55J73k4L62n60M06j86j49J13J89q2
3022E7k24K93k47Q3R0k68J05M20m06K77k30P0L2j15K66j78j62oP4J95j17L61m74
3045a04P1n6J83k07M5R4J28N7j47j77J17m5m3L49k68m6l2k1q5K08OK03rk94M5
3070b8q3r1L58l3o6j29J23j79K79k73L45j51n2J18k6Q9k76K92j8n2k44K01o8J8
3094E4N3p7k20J61r7K84l06J36J09L3j79K54k71o0J31j09p4K11J3J01k03Q2j18
3117i2j34J83O2J06j87K97k41o8NJ38J5j24J59j70N6K02j91K43k54J21m84J29
3139b29K90P4j99K82k90J3J24p9Q0r8k4j04J91MM2K0j89L6j21M73j25L2M4j16
$$ y = [-51, -42, 26, 3, 17, 196, 48, 96, -174, -31, 142, -31, 238, -85, -111, 63, 31, -28, 15, 189, 66, -97, -57, 62, -76, 121, 15, -51, 142, -72, 264, 91, 184, 71, -19, -30, -185, -12, -36, 326, -234, 172, -14, -163, -50, 139, 57, -167, 126, -121, -38, 52, -216, -111, 309, -97, 180, -50, 20, 52, -63, 203, 25, -137, -143, -69, 126, 9, 370, -104, -33, -89, 94, -113, -68, 26, 154, 211, 64, -113, 4, -41, -84, 265, -3, -49, -81, -102, -187, 21, 27, 230, 221, -73, -28, -111, -202, 156, 123, 57, -72, 51, -128, 151, -122, 223, 72, 20, 138, 112, 201, -75, 217, 199, 147, -97, 104, 36, 54, 107, 30, -190, -29, -126, 158, -148, -12, 97, 130, -49, 205, -66, -126, 5, -104, -178, 33, 46, 147, -56, 26, -92, -226, -43, 19, 125, -62, 235, -6, -74, -69, 69, 84, -40, 119, -51, 5, 207, 16, 259, 5, 126, -358, -229, 61, 135, -64, 218, -72, -59, 65, -14, 66, -32, -56, -160, 31, 35, 77, 97, -92, -56, -177, 296, 171, 203, 247, 131]
3163A31l6k64J74j84L1L2M3L53l00k81o0K42l6J33j52K00L3q3J9L6j84K88k51
3186a16J45J88l80J08R5k0j46M40m91L90j14J6R9l74j42L19J14m32L29j7NJ90
3208B06k94R2q8r1K31j63j36K68K44l37L62l98j39L18j02J51l11L62k46L33j52
3229A10o9j44K28j13J00Nr2J23l6r3l38K73M2R4p8K29k30N9l8j36L84m46K34J34
3253B02k01QK8k32L28p2m34L00q8J95j0P5J3q8J74j52J96m86J97K12l17L63j59
3276E2j74j37K57j89J72PQ5K06j64p7k4pj49K42q9O1l36K80P6P4K5j8l99K88p5
3301a3n9r5L40jj15k55K11j55j36Q8K57J72q8j04k71J77j0K63k69Q8o9M0p2K29
3325A53m16K24K81j05j25k01M04l52K57j11M18l03j38N1J84j82r7p0j2J34L71
$$ y = [131, 95, -169, 5, -179, -148, -116, -73, 280, -20, -301, -361, -119, -155, -22, -174, 26, 59, -24, -5, 31, -153, 135, -116, 29, 217, -163, -55, 40, 20, -126, 314, -177, 213, 99, 115, 214, -160, -302, 17, 131, -301, 28, 11, 16, 206, -88, 4, -84, -175, 56, -107, -243, 25, 269, -68, 294, -104, -243, 75, -27, 124, -187, 175, -71, 262, 110, 41, -103, 125, 12, 112, 117, 25, 148, 112, 19, -319, -46, -4, 90, 12, 241, 11, 70, 32, -104, 280, -166, 68, 202, 1, 9, 37, -195, 133, 61, -373, -73, -161, 34, 24, 99, 112, 24, 198, 46, 242, -244, -47, 165, -152, 211, 52, -122, -259, -2, -191, -19, -12, 73, 279, 115, 38, 14, 7, -142, 100, 11, 72, -264, 16, 92, 166, 191, 173, -226, 62, -13, -72, -167, 173, 172, 57, -198, 13, -142, -278, -190, 67, 239, 151, 47, -224, -47, -57, 206, -63, 25, -44, -4, -76, 153, -263, -39, 242, 137, 12, -189, 215, -137, 120, 9, 427, 124, -14, 37, 221, 39, -58, -128, -140, -6, 365]
3346C65m10P1j45J37l7K5K15j88P3q0J92n30J52K21P2J7j46j26K50j52J13m3j89
3369a43J71m2n3j1L1l0NlP0p7k2j8j09L32l55K24oK44l56J16l2J30M6k59K30j41
3395e8K55m6l64K98j18K43k21J31l11K09m2Or1q0K94j5l4j74P9o9L40p5n9j80
3419h2J3K76j22o1p9j98J70K23k04k78M04l2j60P1q3K62k94Q4M8q7J46q8J65k38
3443a44P2J86J03p3l88J00J05j77Q4P7J78j11l1K06j96J6j96J67J41L7k44J14
3465B6r6r8K61O5o9m1Qo3k25K90j80l4K12j42J15j11P9Q4j33JN0P0j31j43K08
3490Cn7J66l0J17k67J91o2QO0mk59M1N9l1j08J89J92l74L57k02j55M00o8k66r9
3515a99L20l24j27N34j28j12p3p3k1N71m43N6J73j19J0On6j28k9K72j81K38J27
$$ y = [365, -45, 26, -119, 18, -19, 6, 221, 33, 106, 26, 218, -312, -160, 61, 133, 150, 4, -122, 128, -24, 89, 46, -143, 28, -14, -67, -78, -47, -77, -72, -75, -5, -82, -104, -122, -231, 101, -254, -30, -36, 208, -148, -32, -64, 66, 112, -147, 83, -58, 197, 151, -213, 85, -33, 210, -11, 120, -191, 18, -24, -18, -109, -189, 105, 90, 56, -118, -39, -108, 232, 157, 98, -82, -69, 207, 85, 24, -55, -253, -83, 140, -64, -342, 62, 30, -130, -59, -142, 120, -174, -90, -42, -129, 17, -71, 94, -144, -72, 114, 217, 144, -244, -144, -39, -216, -132, -55, 123, 12, -19, 187, -9, 7, -189, -22, 119, 156, -88, 26, -70, -168, 93, 158, 89, 48, 56, -7, -232, 58, -122, -156, 56, -86, 29, -82, -3, 81, -52, -51, -1, 69, -62, -205, 3, -54, 112, 82, 199, -68, 123, 61, 69, 129, 125, -134, -93, -34, -65, -173, 16, 208, -166, 191, -11, -166, 234, 166, -100, -199, 121, -203, -330, 204, 76, -36, -109, -182, -203, 368, -75, -19, 154, 35, 45, 51, -5, -133, -162, 110, -71, 167, 294]
3538B94j41p3j77L85o2k26j3Qn6J31p2Po7N1J19j75J76K5j33j1j03J61q8k33K33
3563d0j86K54J19k70L6l6K72k64QJ36J02k4j20Q5L04j89l02J05r2J21K7m2J2J37
3587A53r4p5M4k0l3K90j57j88NP4J02k29K1L31L9k04Kj17J4p4m8J77j4l9L6K73
3613B69l27J41j43L54m35j05J4K35j23L0J5M47j50k08%j39J62k20L21j41j7j19
3635a39J58j76K47p4K51j25k1j79Q1k2J14j32j2K21J03m04J63NL1k96L03k13L93
3658B77j74k15L49k73q2L28q0k28L19l88K38j61j43J01q4J17K0J92k8j10J28K49
3680C52k20P3k76Q7j09J66n4k63J68j03J13J63r6Jj57J56R5j40R0j25J70Kj28
3703c5m0j6K65j51K18j47R4k31l5K22l19J77l29L18J3P8n7K65j70kMm52L39l6
$$ y = [294, 153, 80, -97, 288, 226, 0, -13, -5, -61, 70, -2, 5, -62, -11, 108, -67, 109, 134, 1, -10, -113, 48, -40, -273, -40, -226, 28, 147, -123, -87, -123, 149, -115, -107, 29, 131, 107, -13, 72, 376, 187, -115, -10, -102, 19, 46, 4, 16, 153, 59, -16, 28, 8, -25, 265, 108, -80, -75, -1, 101, -128, -107, 224, 263, 59, 61, -56, -42, -116, -164, 13, -1, -40, -4, 269, -58, 83, -60, 294, -141, -246, -232, 3, -120, -90, -75, 372, 222, 14, 14, -125, 37, -183, 138, -3, -20, -139, 19, -157, 90, 16, 267, 142, 121, -58, 23, 1, 115, -17, -29, 192, 295, -109, 54, 59, 90, -206, 97, -116, 277, 103, -112, 237, -36, -118, 210, 130, -98, 221, -167, 71, -90, -233, -132, -216, -99, -79, 113, 85, -25, 103, 352, 132, 205, -71, 16, -93, 73, 19, -244, -76, -179, -66, 97, 1, 2, -155, 1, 96, -44, 46, -79, 91, 93, -35, -75, -91, 174, 23, 241, 94, 188, -43, -78, 144, -175, 2, -327, -9, 4, 82, 25, 290, 120, 118, 122, -330, 9, -27]
3727b7o4j14J47J98j0m9k87R9J73J89j77k29J41K24m07K62MN2J36j20j73j78K9
3750a81K01p1j15L03k12j44J84O0J66n8m54L09k12J87J6o2p0J21R4P1r2k28J0
3773a77M95k32p6pl7J73j76K95l84L4K34l4j64J10l5K4O8j98R7P6p1J31j3R3j28
3798I8j03J59k69K01l47K29j54q7L74L5l6O3l18N4P8M2R1j77k30K55j21p9K26
3821a6R2J32r9o6L03l87M5j04J69k49J15M62l11l7j0L5l6J35k63J81n9o9J58o4
3845E7R0j17j41J44k25L31j2j98L43j26M5n3k65M55k08j70J37k92K07j63K46j0
3867G5j90R4%O5l5J6l61K07M9j0k51L61o1P1O5k61J52r5O0kj04M2M9j6P0J62j96
3894d4j49J12o1K13n7K51j4Q1m18Q8J14q5p1J70l2KM5K66k70J20k08k99J81Q0
$$ y = [-27, -91, -205, -58, 140, 130, 81, -206, -107, 66, 255, 78, -151, -10, 214, -193, 69, 73, 125, 261, 141, -32, -210, -181, 20, -51, -166, 137, -75, -219, -35, 25, 191, 133, -321, -12, -224, -37, -21, -83, -153, -32, 62, 133, 41, -187, -177, 318, 86, 10, 3, -34, 139, -37, 258, -126, -92, 142, 108, -56, 54, 19, 43, 111, -87, 10, 86, 15, 146, 133, 226, 98, -5, 154, -115, 86, -261, -32, -186, -273, 101, 136, 100, 163, -155, -101, -23, 19, 110, -67, -297, -42, -163, -242, -16, 76, 208, 109, 43, 346, -41, 4, -100, 69, -180, -65, 397, 86, 49, 39, 74, 38, 173, -90, 91, 32, -37, 121, 57, 147, 30, -111, 33, -192, 139, 127, -71, 272, 146, 191, 138, -127, 328, 120, -50, 87, -205, 2, -161, 85, 75, -115, -21, -21, 44, 9, 25, -336, -129, -80, -90, -341, 20, -41, 30, 95, -166, -14, -109, -49, -51, -155, -113, -64, -80, -10, 152, -44, -193, -81, -142, 71, 14, 265, 251, 332, -86, 2, 116, 31, -40, 130, 98, 100, 145, 411, 141, 261, 53, -246, -65, 15]
3918A5j2l5J80k87M1R6M2O3n0k02L95j97j27kK38k6l28J61p0N6J37l21N15k41
3942D1k01J25K83j10k75K06j26Q1OJ74p2J4r2k5j8J60j53n8j03L94l31J98j38
3965b0j22J60j03Nn1o4K94k10N5p1K41J09k91k35K14K30l33J90O7j74J13J0J01
3988A15j02K05l84R4R4J43j31J51l38K23j58K7K13l79L74K8j29r0n7j22K77kn2
4011@L3L6l69N52m70J11K1J96j10J36j63J5n1J0J08J6K1l50L43j79J31j08k28
4034b99K68Q0p1L14k28j82q7K76r9j22J72J64j83j59J03J4Q5n5J53l21M17j63
4056G7j24R9j59k9N3M2j3k4K53k45O1J44j59j93J24J93j98J13J4P6o9j88M01j96
4080E3L5k28L8j79J56K53l67J45J90q6j23J94j66J01j08j03J57J63j55j4j24J58
$$ y = [15, 3, -32, 148, -139, -98, -2, 40, 103, 53, -149, 246, 49, -78, -80, 158, 132, -196, -35, -105, -49, 88, -233, 282, 41, -160, -35, 248, 138, -137, 69, -57, 24, 30, 204, 132, 146, 54, 29, 11, 171, 18, -40, -143, 251, -80, 118, -20, -142, 18, -85, -80, -131, -195, 99, -111, -56, -127, 114, 223, -68, -303, -89, 141, -192, -2, 65, -109, 4, 14, 115, 13, 218, -166, -72, 22, 165, 34, 185, -153, 70, -88, -61, 152, -227, 147, 175, 46, -44, -101, -223, 54, 52, 0, 33, 69, -300, 252, -218, -107, -86, 110, 0, 136, -27, -12, -63, -53, 55, 71, 92, -258, 85, -94, 37, -71, -299, -31, 49, -22, 292, 64, -118, -205, 71, -28, -150, 22, 186, 3, -156, -53, -39, 46, -9, 144, -177, 240, 77, -47, 52, -107, -136, -83, -41, -54, -78, 175, -70, -9, 135, -24, -217, -93, 100, -98, 15, 29, 105, 36, -152, 249, 53, 88, -140, -102, -281, -125, 128, -239, -94, 96, 10, -113, 81, -85, 16, -92, -195, -38, 125, -30, -44, -168, -10]
4102a0J33j27J4j25jK76j52Q8k42J62k9N2q7K3r9R1J26j96K7l4Q2j43k07L98J47
4127A67j39l7j03J72J77n4K9o8j97K16k3k05j76K84J4j00q1J47P7K7l6p0J71m24
4151b32M48j47J07l31N0J11r0K97k53R7m1r2Q6j73J72k9j26L89l31j0N4P5%R5
4175A26k28J38R0k30j17J30P6q7n0L67o0L4k4j09j28q5M09l00j44L01Q1j38j06
4198e4N3K76j42k06M01k07l08L66R9m88L33l13K89r9k9L05j9k0k87K00j78J11
4220H3j58K06k1r6p0M9p9J01n7K16P8k82K87J0j47j53j11K4L6N6OP1L9Q1k9k81
4246a41Q0J40L3j7pJ77l4l52K30K8k52J60J06k7k04J93l45M17k28M4K07k57J9
4269c0L4j28O4K14j35p1K0j24o6L82k00J09j22J24P5j43J10N8O4m77J84N7j41
$$ y = [-10, 123, -4, 10, -115, -116, 160, 8, 96, -146, 16, -13, 39, -48, -25, -124, -33, 93, -103, -76, -110, -28, -171, -378, 20, 167, 28, -9, -112, 60, 237, 183, 212, 144, -53, 163, 140, -65, -241, 43, 57, -43, -124, 23, 100, 127, 91, 21, 192, -232, 216, 69, 176, -155, -105, 6, -84, 213, -40, 57, 16, -76, 10, -163, 9, -20, -146, 243, -88, -98, -44, 31, 31, 126, -102, 36, 126, -104, -221, -91, -15, -102, -152, 215, 155, 189, 165, 56, -72, -157, 252, -48, -192, 109, 190, 52, -54, -1, 275, 133, -73, 328, 121, -187, 179, 278, -210, 123, -190, 99, 0, -29, 276, 257, 237, -50, 150, -28, 83, -75, 131, 110, 14, -56, -7, -86, 15, -42, 174, 252, -30, 257, 267, 120, -33, -144, -120, -84, -28, -22, 49, 88, 169, 140, -141, -61, 79, 112, 95, 88, 265, 231, -121, 109, 137, -115, 45, 151, 124, -80, 113, -232, 185, -43, 1, 208, -49, -30, 4, -124, -60, 154, 19, -52, -32, -156, -222, 160, -40, 69, -53, 71, 146, 3, 113, 171, 235, -242, -58, -1, -142]
4292a42K09L5l53M73l77J41P7l6J48k49j2l4O7r5K6P3J28p5n1j98J6N6L35k75
4316a13q6J7J08k65J11L32j50R0j3jl28J62K20J18lj91J38j77J0K4j82M3J09J27
4340A00k51K59j48k6K57j32n8j43j2N4k8L69q7j83j4n3O9j00J52J27l6j55J08
4363F9n1J67j26J21k99K00P3M8j78M8j22j55Q3q0K69j9k39J36J8K16j3l60J49
4386d5j3L74l11m4K44l03K24m0o3P9j24K08k96K07j11J2j5Q7q9n8l5k2L15j40
4410D1J34l06K57j63K45l23J77o2k84M89n18M09L6m2m2J91q8Ll17J75O8r4J49
4433A35j11j47K78j87L0K28m2k92L7J14j87J21l3L9q2K30o5j80M64m11R4Lj26
4456i0q0R3J85L3k50k5L10k27j05n6L43N5n9l4k18o9J77o2N9N8n8J01j64Q4K5
$$ y = [-142, 67, 102, -251, 222, -155, -14, 63, 27, 175, -74, -86, -120, -53, -148, -122, -49, 79, 4, -47, -245, -229, -173, 162, -113, -199, -182, -74, -339, -228, 104, -46, 44, 31, 30, -298, -136, 84, 202, 199, 8, 146, -31, -21, 3, -179, -136, -27, 100, -151, 108, -40, -66, 191, 59, 1, -142, -154, -100, -128, 241, 154, -29, -43, -96, -27, -127, 25, 152, 116, -39, 69, 18, 185, 59, 180, -119, 81, 154, 202, 24, 72, -50, -205, -122, -202, 67, 48, -191, -55, -37, 179, 166, -194, -45, -58, 316, 5, -39, 205, -98, 126, 86, 23, 102, -22, 186, -110, 97, -14, -2, -17, 70, -19, -77, -112, -134, 181, 41, 175, -131, 126, -37, 208, -115, 62, 0, -284, 205, -313, 96, 132, 90, 48, 239, 151, 154, -163, 12, 80, -14, 135, 24, -123, 155, -32, -2, 226, 184, -108, -71, 43, -144, -23, -56, -17, -99, 131, 66, -114, 350, -61, 33, 36, -90, -170, -77, 108, 141, -109, -134, 176, -51, -156, -212, 131, 186, 127, 93, -125, -194, -17, -79, -20, 38, -20, 81, -83, 1, 26]
4481B6j91J99R9q9J13j00k89K57N1j78L62l79K79j25J24l46K68J4p7j45J33J12
4503A18l64J99p6M27j92o7j56J54j94j48K21R5L7j15K24J6j40j04r4K52j85M1
4525e1k57K67j22J00O3Mq0k4J93j32j20r4J23k23L85n3J12k92J68K20J3n8k19
4548g7j53O1J18j7J67n5j11J58k46m7J39J09o7j62J22n0OQ6L5j75J46N1j5j09
4572h6o1L22N0j35j64L6Q0J36l64J93j72K55J33j29j02r6K32j41J24k18J93J18
4594B04k08k65M10j42r6L56l12J09k48N6K8K05o9j94L70j27j8k31J18L19l54k03
4616b92L16p3j2J4O7j56K90k34pl5K71j68O1K6R1k99Q6m2K11k72L05j59j45J26
4640c0J86j47l2N4J68k44J03Rl9j12P5o1k6L1j70L88K9R1l83K59l53J54K4K6M4
$$ y = [26, -165, 34, 133, 44, 157, 57, -232, 25, 76, -102, 260, -119, 160, 35, 159, -187, 81, 95, 18, -127, 6, 118, -246, -47, -123, 304, 112, 45, -111, 43, -151, -299, -78, 17, 54, -61, 163, 179, 39, -65, -159, 93, -92, -51, -308, -41, -163, -63, 0, 4, -76, -100, 93, -39, -159, -253, -130, -353, 32, -21, 91, -201, -33, 187, 200, 142, -77, -230, -169, -51, -68, 99, 44, -67, 91, -155, -202, -63, 46, -21, -183, -61, -111, -105, -19, 16, -159, -13, 38, 23, -86, -147, 175, 225, 90, -74, -38, 42, 178, -186, 7, -165, 90, 223, 94, -8, -104, 128, -13, 111, -107, 86, 204, -4, -269, 141, -1, -97, 259, -53, 56, -192, -136, -108, 97, 28, -166, 204, 77, 59, -172, -54, 265, -89, -292, 24, -49, -61, -47, 20, -136, 154, -80, -87, -122, 149, -19, 42, 68, 159, -140, -54, -96, 115, -157, 148, -11, -156, -30, 156, 9, -23, 31, 199, -45, 58, 67, 28, -84, -9, -70, -96, -65, -235, 153, 182, 273, -110, 149, -204, -50, -26, 0, 44]
4665D4r9N2q4J55J77r2j37l94M39q7J99j62J42j11j54K90l36J76M8l40L69k0l1
4688D4Kk9M4j25O7L1K9l25q0L81R2n1j27m4K23k86J33J12l79L53k90J60J17O1
4712A13J18k61M4K0l57M72j59R5lJ58j56j43L40l93J02q5J12k9M5k04J8K5P4J22
4736F8J39m28K71K49m58m5Q9j47K49j40L03j51N7m8j3L5K5R9l33M36n2O2k88m85
4760e06L50J72j25l6J94L5k40L0O2K6k01K10p4J12q7J11J41k25j68J22J90j83
4782i0p8K76m59J52J93o6O1J23q1j40P0j19L05j59m4n2J26j01O4N8j80J13R3k28
4806a63j1J98j76K15l19K46K06j72k0m4J17j34M8K33k18Ln2K81j04j58Q1K88m79
4829a34M6J29k17J30j3k3M2j62L2K25J34l63J37m0J72K2j37k8QLJ23o3r4M5R8
$$ y = [44, -55, -3, -87, 68, 245, 153, 16, -378, 61, -26, 173, 11, 153, 42, -112, 178, -158, 18, 66, -274, 95, 75, 44, 46, 17, 61, -64, 3, 34, 63, -262, -342, 39, 131, 80, -47, -91, 132, -154, -21, 91, -288, 65, -225, -65, 52, 113, 231, -30, 14, 34, -323, 149, -10, 85, 82, 240, 84, -59, 281, -112, -10, -95, 17, -12, 33, -171, -153, -128, -54, 68, 207, -221, 50, 299, -159, -204, -115, -262, -13, -153, 150, -1, 56, 8, -5, 30, 55, 154, -179, 257, 205, 267, -21, -506, -156, 16, -109, -145, 49, 84, -156, -126, -64, -38, -239, -29, -103, 9, -78, 33, 174, -51, -219, -97, 93, -90, -168, 108, -351, -199, -6, -72, -11, 112, 31, -109, -39, -158, 147, -12, -56, -108, 18, -83, -19, 39, -141, -28, 65, -163, -174, 24, -152, 63, -256, -10, 196, 24, 4, -40, 77, -57, -9, 224, 6, 9, -43, 238, 134, -24, 57, 345, -134, -88, 41, -176, -46, -59, -82, -40, -202, -170, 55, 189, -174, -37, -77, 95, 117, -20, -48, -40, -37, 86, 23, -71, -26, 72]
4854G2j56mq4J97Jk35K56k50J95N4j69K50m6j41m5J77qJO8j50J57n9l27K60Mp6
4880e8k05K95n5J37j41k14L17k15N8J26J82k19j2j47J65j20O5j17Q9K35l62K80
4902H4l0o2j3L7j55K30k19J00J86k38jJ33m6j43P9m1J63j66J54p2j4j22M11k68
4926a3J42k40O8K21r7Q6j22K4K22j93J50l44j96K10L4j29j35M11o9k69M14k89
4948a14O2J25j11r2K29j85j18K14j14k5L03k11Q9j54J26k25K96j27L5K12j8j04
4970I3J20l09j98M07R9j86k72J59K74l15M1K18j05j02N5l4L19k56j17J15j67J21
4992d0k5j1K39J10k51P3j62k3O1N8J47j99Q3k71J78o5K77l88Q6L8L34j07l6q5
5016B1j32J87r9R0l39K99j69J51K84k63J06k30m8K26m6p2K09k37R9OJ56k36J9
$$ y = [72, -84, -88, -172, 25, 26, -209, 47, -203, -8, 46, -123, 127, 81, -60, -105, 72, 64, 65, 133, -17, 140, 81, -246, 14, 18, -58, -263, 32, -23, 114, -27, -241, 76, -139, -81, 45, 227, 8, -4, -151, 14, -106, -41, -158, -69, 166, -196, 84, 54, -8, -21, 16, -139, 91, -128, -28, 158, -80, -81, 52, 6, -137, -58, -99, 64, -102, 52, -20, -34, -156, 255, -13, 129, -111, -43, 178, 81, 167, 45, 69, 291, 98, 248, -96, -292, -82, -48, -177, -312, 99, 30, -239, 175, -114, -52, 73, -38, -130, 99, -86, -204, 10, -104, -129, 174, -37, 52, -102, 24, -201, 95, -32, 3, 215, 197, 93, 213, -96, -294, 113, 212, 26, -246, -87, 187, -128, -87, 131, 26, -76, -21, -55, 264, 8, -109, 6, -161, -40, -65, -76, 163, 273, 22, 95, -67, -90, -29, 29, 176, -23, 60, -211, -33, -98, 179, -209, -123, -85, 249, 142, 106, 21, -111, 76, -23, 67, -272, 27, -142, 9, 293, 30, 136, -94, -142, 84, 38, -34, 175, -62, 37, 43, 199, -37, -18]
5039a8J46L8l11j66M10n7J03k23on8K07k34K4J07r3K61k48J05K65l55%Q9K61l86
5063a39o1K66j64J33J07j19n4O7N3k59L9J01L5J43k12KL5J4M7L5k02J16J8j62
5087a61K45j32O4r5m6K32j65q7n2K93k6JK71j96k83P0J46O6J9j73J5J80k9l1J1
5112A37j55M6l38K51m6J28K9k45J84J8mL9pl35M74l01J99k0jkL87l17j06n8k60
5137c03L02M8R5O5j14j82K87j02k61J55N1J09l64r2L56P8j18k59J35K56L4l69
5159a93L53k26n1Q7J53rk6m0j67J33m5qJ84J00k19L5J46r0k86K67P2j29l67M15
5183H9j8j64Q3J10p4j51p7L53J06k12j47Q9K17j9j88k19J3J52K02k79J98j96M7
5206h5J76k72P0n5J7J90M6J40r9l08R4J96j30k21J21L40l02m8L7J56k55J79J7
$$ y = [-18, 128, 166, -145, -311, 99, 42, 145, -78, -84, -142, 65, -169, -145, -38, -131, 130, -118, -13, 252, -103, -103, -14, 247, -139, -200, 66, -98, 35, 142, 23, -31, 36, 89, -170, -131, -30, 5, 148, -64, -62, -27, -13, 34, 69, -133, -17, 1, -161, 84, -48, 16, -79, -125, 107, -58, -145, -197, 96, 70, 71, 342, 146, -137, -67, 79, 145, 164, -9, 6, 186, 157, 126, 137, -18, 28, -310, -59, -105, 23, 52, -193, -9, 9, 5, 44, 37, -298, 176, -125, 74, 54, 53, 51, 438, 121, 15, -43, -303, -1, 47, 142, 207, 93, -89, 198, 96, -165, -10, 41, 150, -214, -306, 50, 128, 10, -249, -114, 142, 176, -193, 160, -66, -117, -30, 123, 114, 88, 48, -119, 14, -31, -39, 145, 245, 26, 61, 207, 117, -169, 98, 170, 41, -326, 89, 71, -93, -10, 100, 26, -125, -202, 151, 257, 45, -102, -13, 204, 185, -3, -222, -209, -57, 145, -134, 64, -132, -85, 91, -181, -111, -166, -149, 41, 87, 227, 128, -180, -86, 110, -20, -241, -120, 220, -82, -130, -93, 63, -192, -13, 4]
5229Do7m4K41j9j61J64j44R1j07R8r0K00j63J20J02l37J0q1K05j24J40K31l29
5252f0N1j97L76j15j19J97j5j36l6J71j00l3k7m9p1K47%l01J82K0K7N0K4l3J02
5277A55J1l60K26J70n2o08N32l17L12l85L94n7K48l59R1M0mj11P9J46j66j27J44
5300BL3j77J33j88J16J04m6MR9n6Kj2J28k27J35j86K44j68N5O4k25J49l3J2o8
5325a06J38k3j22K14J8j03j33J03J01J2r1k05J28J74j3j59m2L68m03m7K73m6N3
5348H9ol7q7M6J93N5l62L25j90J07n7J86k63R0j18L33m84N7R3P8j26J30M1j43
5372e0j0kK04j04J9k44L37k09J12mk66L9J82j0k73L88ll86K74o3J67j10J51j94
5396e5l6J67j79nr3K65L57m53l53M67RJ37nk86R7j66J73J85j26J69n35M56j1j91
$$ y = [4, -63, -107, 134, 115, -46, 118, -26, 65, -42, 56, -34, 166, 3, 123, 225, -112, -102, -183, 22, -102, 38, 269, -60, -9, -206, 170, 55, -64, 133, 118, -18, -54, 117, 17, -16, -43, -92, -163, 84, 84, -217, -35, -15, 12, 62, 86, 53, 155, 166, -194, 32, 202, 150, -458, 74, -243, 69, -316, 78, 21, 269, -90, 1, 41, 37, -74, 5, 151, -15, -142, 2, 35, -142, -9, -197, -81, 23, -23, -19, 80, 24, 26, 14, 142, -85, 50, -136, 108, -60, -5, 59, -166, -17, -50, -38, -106, 32, 9, -113, 101, 119, 16, -117, -14, 87, 99, 8, -197, -69, 105, 92, -67, -109, 259, -144, -191, 82, 36, 89, 83, 46, -41, 5, 198, 253, -109, 216, 26, 133, 76, 262, -1, 89, -29, 304, -180, -123, -30, 48, -78, 52, 93, -50, -60, -62, 142, 38, 57, -187, 150, -59, 53, 49, -217, -178, 4, -6, -279, 109, 106, -280, -6, -69, 98, -12, 139, -55, -91, 76, -103, -108, -201, 64, 421, -32, -385, 82, 91, 228, 223, -63, 34, -132, 41, 226, 100, 269, -266, 190, 179, -12]
5420a2n5JM3qk13K55Q5P5p3L3k02K66M1k00j5N3j42j3j01L1K20m2J92k62J98O8
5446B23k87j01L05m4j03J60l33K01q0k9K99l40j58L55K0l11K82k9l40L63q8j98
5468b33L44j86M49n78J79L1k4K78l56J78J3j0j03P1J97r0k7J52l31M1J97m33R9
5491a42J1k12k4J82J77J88n6j22J82l0L5j43r7J14k02K94m24L64l11L24J86k33
5513F1j09M5K53j81j46J33J78k18j78L1J63j50J72l36N23k89J5r0K10nk07J76
5535E1j57N7jj58K94j16J8P1j52J19O7mj33K00j76J4r1J88j72o8Q2r7R6P0j06
5560a04M0J96k2Q9k66PJ37j32K65k94J67j81pJ99NK15j17nk34npL0J15j56K70
5585B05j20nk51Q8j00M0J99J22j33k55P6J77N2K9k3J48k10Kq2o7j24K04N4P4r7
$$ y = [-12, -67, -66, -23, -31, -244, 11, 96, 171, 98, 131, -71, 195, 236, 36, 21, 74, -68, -81, -182, -151, 69, 27, 219, -43, 155, 223, -64, -165, 140, 96, -7, 153, -180, 21, -59, -88, 211, -129, -287, 68, 88, -223, 59, 30, -310, 53, -35, -233, 111, -75, 374, -204, -25, 6, -18, 260, -96, 82, 95, 85, -18, 53, 250, 160, 133, 285, -46, -5, 192, -241, -142, -131, -343, -367, -185, -8, 180, 124, 2, 184, 154, 189, 46, -51, 63, -139, 155, -269, 95, -216, 108, 294, 61, -48, -3, 250, 69, -77, 56, 234, 16, -162, -131, 32, -118, 54, -282, 241, -48, -33, -123, 87, 82, -125, 51, -106, -49, -50, -208, 86, -30, -12, 59, -93, 26, 93, 89, -44, 156, -20, -6, -97, 91, -81, -149, -67, -164, -68, 2, -104, -64, 132, 110, 199, -67, -60, 77, -55, 210, -84, 83, -98, -105, 94, 99, 314, 197, 192, -42, -47, -54, -24, 91, -65, 205, 85, 80, -171, -83, -183, -143, 56, 178, 45, -210, -134, 43, 95, 124, 101, 249, 39, 41, -41, -108, -232, -28, 26, 100, 3]
5610Cm3K47j66k25Q1J61o1j25O4j72J47l8L09k97J85l41q1K11M3K03j79R3L67
5633C86l76K1k8k15K45K51m54m0J39j85L05j84L13j07Km05J00M22j86o8J14j55
5655a05P3M1J57j44q2J30k28L37o6Lk53K11K0p4j56K93q4j0k27L36m75M04j65
5678f4J09j84j4M79m56K30J4q2j11K20n11L69l8L3JQ3K7k3J36J39k01k3j14l68
5702c49M64j19RJ23k73J60j75J33K46k09J69m14J20J10j91J09K72k77j92J58J46
5723B0R0j57L12k03Rj58J1l9N6P0j91M30j34J05l89K72j24P1NJ27k13N5j50j6
5747a41K91l17M7l1k5K57j07J92J0k74k5J03p3J27l96L90j10K74j80J44k17j09
5769a70J47J16M5l51L93k40m9K1O9j30J22Q6J41l48L59j86Q4j10l5J63J55j62
$$ y = [3, -40, 207, 41, -184, -103, 58, -3, -128, -64, -236, -89, -127, 182, -115, 70, -271, -352, -141, -98, 105, -74, 19, 386, 10, 31, 3, -212, 33, 284, -170, -210, -71, -256, 49, -135, 178, 71, 73, -332, -232, 190, 4, -64, 50, -105, -32, 9, 166, 22, -60, 70, -158, 179, 113, 116, -137, 74, 94, 20, -136, 157, 73, 63, -164, 172, -303, 101, -64, 45, -139, -153, 326, -130, 100, 114, 32, -79, 141, -370, -1, -39, -6, -5, 78, 105, 82, 218, 357, 156, 133, 19, -349, 115, -4, 5, 128, -145, 15, -160, -27, 219, 10, 179, -235, -115, -5, -196, -87, 185, -92, -284, -126, 20, 110, -47, 265, 62, 71, -87, -76, -115, -59, 11, -180, 250, 116, 221, -168, 104, -20, 51, 56, 183, -30, 25, -125, -141, 150, -167, -120, -151, -176, 81, -26, 166, 176, -98, -123, -20, -93, 34, -362, 28, -82, 192, 12, 156, -61, -170, -23, 93, 138, -213, 180, -60, -109, -88, -19, -149, -27, 59, 200, -148, 211, 25, 109, -1, -36, 127, 282, 120]
5791A20k95M48l90L30r5j99K00N9j23J37r2j61K45j25pJ5M7J5k16J66Q1k19J65
5814A06j42L1Q7J77m30J30J41k86K78k68J52K27j47j35K00l24L21k61nL24q2j08
5836a4K60O5m14J5K1P1p7J26k22O6K53Rk31n2N0J23k01K96o1O3j53L1k54K19J18
5861A07Nj94J28j83P7Q8j53J87J16j24J51l13J86j06l2J13k04L51o5J08j07q9
5883D7n9L05l02J02l14M73l03K48o2j93j0J14J66l28J4q8J67o6J54j46J31k42
5905a92L25k06L52k08p2j20JJ81j00qj23L69m59j27K11J29O9j72L32m9j85J64
5927A12k04K07q2j13L1l0J39N1p1M7j83N9j28J55k45M56k52K57l10m4J73j89L15
5950A51k72N5J11J80J9k82n0M1N0K0NN8p3J07p6J58j21n0M3j78K21j16q3j22K01
$$ y = [120, -175, 273, -117, 213, 118, -81, 119, 178, 55, 192, 100, -61, 184, 59, 52, 67, 114, 129, -87, 79, 160, -59, 106, -36, -5, 82, 259, -171, -41, 100, -186, 92, -176, -24, 203, 56, -79, 121, -203, 118, -143, -148, 176, 94, -14, 246, 311, -103, -88, -67, 4, -73, 53, -169, -103, 150, 159, -72, -124, -74, 49, -152, 144, 83, 146, -7, 24, -230, -11, 107, 112, -82, 46, -137, -60, 28, -125, 62, 178, 54, 205, -108, 78, -28, -60, 53, -151, 200, 135, 243, 136, 47, -12, 293, -9, 93, -221, 252, -51, 197, 135, -58, -68, 46, 212, -116, -102, -190, -23, -89, 65, -81, 50, -192, 133, -73, 279, 71, -1, -121, -120, 61, -39, -47, -170, 199, -260, -387, -176, -47, 22, -150, 182, 133, -52, 112, -92, 115, 33, -80, -49, -79, 60, 111, 40, 87, -96, -37, -165, -10, -255, 201, -51, 206, -104, -148, 25, -164, 151, -121, -66, 45, 225, 244, -38, -88, -47, 3, 23, 28, 86, 13, 120, 44, 202, 81, 31, 74, -104, 117, 1, -82, -204, -3]
5975cK2j86K97j69J21k16K47J66l28J10l8J07p8M7r4R9j7q5j05J63L4j61N9j98
5999b06O0o7K71Q5N2l82K08m7J10m4j07n8K51J58j01l14j83m6J77L95l75K78j27
6022a2m0j42M85p2k78J84k32J83L9j51J76k50P6Jk31J95n1P3j66L77Q2O7j19l41
6046a47J70j49J9J18k24J98j35L31k7o4J25k02M3K22k15j06N1N8J19l25J37o9
6068g2l5L81l0o5o1j64R6K04k69LK24k66K27l56P1K3J49k73L49%q7k38J25r0K6
6093a28J66k36N9NK39k14L72l04l1R5l31K00m0J35k6r1J89K51j74p8o4L7O6j64
6117f7J35k42L01k06L64l39J43k89M82l28M2o3P8j9J0j19R8O9J4p5j59K00j44
6140a14P9j58j1L51l03K39k15l3K47k4j13K61j80j19K24o3j13o8o7J13J43j39
$$ y = [-3, 19, -167, 130, -39, 82, -134, 113, 279, -49, 61, 23, 130, 52, 99, 5, 104, 87, 2, -103, 60, 94, -67, -8, -206, -146, -213, 58, 143, 195, -187, 21, -26, 84, 40, -67, -125, 126, 284, 183, -131, -314, -360, -183, 212, -163, 115, -12, -52, -194, 291, 219, -59, 125, -107, 76, 115, -36, 140, -110, -34, -33, -264, -69, -120, -47, -213, 164, 246, 313, 194, -147, 23, -126, -107, 11, -213, -15, -150, 181, 154, 90, 215, 13, 56, 278, 63, -43, 8, 66, 185, -140, -3, -72, -107, 274, 244, 179, 118, -46, 50, 254, -15, -12, 212, -54, 173, -183, -112, -89, 60, -213, 136, 136, 49, -189, -64, -154, -128, 38, -198, -139, -134, 105, -109, 263, -41, -72, 23, -308, -108, -148, -13, -39, -130, 59, 310, 136, 58, -6, 31, 97, -67, 68, -174, 127, -79, 285, -54, 89, -200, 282, -46, -4, -67, 11, -8, 2, -117, -19, 50, 64, -11, -170, 30, -114, -35, -193, -204, 147, -156, 83, -132, -165, 82, 58, -55, 206, 26, -93, 131, 68, -45, -113, -180, -67, 76, -63]
6162f3P8k38K45j57M55m26L45j92k38K88mM0o6J92k0l89Q0mK9r8j21L10k41K09
6186A4J9P4o5R3q0k37K24j14K98l16MR6j89r3L47j23P3j36R3j24K83J81l79N8
6210AJ83M7K1l02J49j97j88K13M9k10J96R0o8R1r7pj07J00j44L90j73L1j09p3
6234a14J79j99K22j06j8J14n7j17R1q1Pl1K66j84j02N2j9K5J77K01k37J37o5J30
6258B71l65N4K64k28q4K37j07K48j51r7k2o2J91m40K48R8J99l40j49J40K02k74
6280a67J13J92j42J37l43L98j64k09J29J06j73R7R3J32j95Qq6j18P7k08M80k46
6302h9KJK02k4k60R4j7K02m84K86J64R3k22Q9j27j34J03o6K46j36m5LR9j0j63
6327a93L43j9M9m21M05J26k16o1m6J59j15J39r4R7k75K41K08l30N7M1j75M1J03
$$ y = [-63, 15, -223, 22, -135, 320, -106, 239, 47, -191, 97, 93, 133, 67, 259, 239, -150, -70, -74, -45, -143, -264, 46, -195, 14, 33, 107, 42, 135, 55, -182, 42, -72, 226, -90, -86, 10, -179, -272, 75, -48, 25, -111, -18, -142, 141, 322, -57, 1, 184, 231, 252, -50, 99, -98, -286, -73, -24, -234, -38, 52, -16, 75, -22, -29, -136, -36, -180, 210, 37, 68, -41, -114, 65, -134, 88, -18, -36, 78, 21, -96, -5, -86, -79, -110, 156, -28, -130, -78, -97, -72, 105, 306, 69, 206, 141, 271, -94, -40, 224, -4, -88, 149, 42, 290, 139, 42, 20, -42, 149, -291, -43, 55, 254, -86, -235, -95, 107, -167, -54, 138, -4, 133, -210, 188, 24, -185, -56, 50, -123, -26, 67, 199, 4, 12, -74, -192, -115, -323, 157, -89, -87, -86, 116, 92, -168, -74, -91, 111, -373, -87, 77, 170, -52, 37, -90, -224, -121, -187, 59, -77, -122, -119, -20, -30, -193, 150, 131, 180, -241, 164, 290, 74, 13, -33, 126, 11, 150, 56, 153, -122, 119, 327, -3, 54, 95, -80, -39, 64]
6350F4j14q1nJ29j06R0o8M2p2R4Q6k35K43l6j08N8J84j73K0K0p4N3J49r2l23K54
6376aJ39j51p5J32m40L40P0J83j41R5k54J60l9Q5k93J54J68j4j20j30O0J92M0
6399A60k4P6j9k70j01P8P1P2K15k25mj40k95O37l55K96j90M9j40J10J91l19L09
6422A82q7k78M55l26K4M9L6m6p8J09K0R4j86J70k59L4m8J9J05k07K13M0K6l55
6446b94J44J21L15l63l2K40j13M2Q6l32K66j68P3J03k37M0L08k22J02j83P0p8
6468a12O1J74m76K77K61j68NJ61j62K44K3j38k63J56j9j77l7K53j88J58q2m5L
6491i1M3P2J80l83K91kM0j81l43L98k9j4L4M5M8n2J8K8j32J6kJ41L4k46J56n9
6517A0j01N0k12K11J04j25j55K50m7O8P2k35K63l01J93j88J23p2p3Q1K76k80K71
$$ y = [64, -50, -131, -136, -7, -113, -23, -91, -49, -121, -27, 59, -176, 67, 31, -77, -19, 165, -8, 12, 32, -42, 11, 160, 68, -255, -1, 138, -13, -88, 44, -396, -56, 14, 197, 56, 151, -103, 57, 18, 103, -190, -36, 132, 118, -2, -132, -72, 120, 160, 136, 212, 193, -77, -178, -100, -29, 43, 258, 33, 29, -111, -406, 231, -124, 172, -18, 31, -109, 1, 192, -127, 182, 95, -183, 272, -54, -30, 19, 55, 9, -69, 40, 60, 154, -32, 138, -121, -87, -135, -116, -11, -218, -5, 35, 61, -294, -150, -29, 286, -77, -109, 131, 18, 60, 146, -186, 80, -88, -15, 88, -149, -109, 199, -23, 79, -104, -34, -112, -51, 123, -353, -76, 185, 17, 22, 183, 21, 265, 288, 150, -113, 43, 24, -153, -190, 63, -125, 33, -49, -94, -91, -48, 24, 204, -179, 112, 110, 150, -31, -374, 24, -5, -19, 15, 60, 108, 56, 74, 102, -30, -14, -16, 125, 159, -87, 69, 10, -91, -41, -253, -42, 62, -63, -218, 32, -15, 53, 125, -110, 153, -148, 45, -143, -20, -92, -165, -84, 192, -88, 183]
6540A83m14L10l16J94J9J76p2k19N9p6mJ75P9o8J27k12o9J49J30L5J06k58j53
6563a19p5j7J86L8j46K81r9k05K95k73J44r7N1m9O8K1j24K40j99o8R2J49j9J00
6587A75j55K02l07J17J50j32l75J45M45j03k82K18J42n5j20o6P8N9j77k8K12k6
6609A17j51P8j2K5l3k37L13j63j46K34J96k55J4m0r8m2P6K36o2M5pm7J77j88R4
6634A24j73K21m04K95j08j6l0P5J2P0l44P9J79J7K45j42j22qJ54j80L8M2l6J9
6658GP4q1j45K17p7J84L6l13p5J14J20q5O3L5j26j04J36j08J55r6R2Kj67L17j06
6683F9j16J74k22m5J49P2k49J56p3J66k74K23p8k15M11n6o4j88J34K23m47Q7K10
6706D7j97K7N16l68j62J09L46m80M15k32k5O3k43K17J3k78L90N4k38N4l71K11
$$ y = [183, -231, 79, -237, -43, -24, 152, 80, -139, -80, -156, -160, 15, 94, 26, 153, -59, -128, 21, 151, 186, 292, 34, -119, -194, -211, -25, 13, -133, 148, 49, -156, 139, -134, 10, -87, -36, -85, -17, 4, -120, 120, -79, -147, -55, 94, 75, 175, 20, 222, -85, 32, 182, 50, -325, -180, 265, 162, -120, 98, 240, 185, 65, -1, 77, 136, -41, -69, 143, 117, -34, 44, 32, 57, 24, -213, 100, -63, -209, 25, 221, -34, -20, -60, -158, -200, -124, 112, 50, 95, 88, 41, 218, 30, 124, -49, 172, -232, 63, -45, -61, -91, -16, -4, 66, -278, -199, -20, -3, 242, 100, -22, -30, 124, -56, -18, 24, -12, 7, 81, 0, -145, 72, -5, 179, 215, -98, -173, -59, 61, -24, 39, 74, -52, -156, -20, -128, 27, -69, 23, 25, -142, 175, 69, -47, 127, -95, -140, 9, 81, -168, -12, -85, 81, -193, 30, -48, -263, 148, 92, 28, -160, -26, 197, -250, -163, 47, -150, -123, 393, 25, -137, -28, 318, -162, 253, 21, -4, 59, -184, 33, 46, -232, 158, 212, -26, 28, -343, -132]
6728a32K24k07R6k5j16P2K23J84m68j59M55k40k4K05k54J66j54J97p5K96k90r1
6750a17R6n5L27j19k32K84O0l28J11J04j78JJ89j7j39J25k38K00J3j34j20L57
6772A90k31N9m8LJ67j30Q1j5j49K6%M4J35l07K11q9m2J76l45L34j01J47j17k47
6796b48J01J4L1J44k4j20K60j91k01L64l18M52l83J69m1M9k94L53j01j59J30J31
6818A18l02K39N2k47J40j4j17K79p2N2k16j47J11J53J39m04m1M17p6J67j30nj05
6841ir8K48j8K01m53J43K3J78m50J78J33j57O1n0J10p5K50j30m3p7k95M05J48
6864B23j12l05O4j39K68j8J67l9j94K14P7m47K32l0j1M1j00k0J6J09j37l1L13
6887A41o5j37q9K30j96K05J11j81K92k24O8j78J10j5j04J27k79L11j57mj13K61
$$ y = [-132, 92, -115, -19, -44, -160, -88, 135, 319, -149, -308, 147, -93, -117, 88, -166, 0, -154, 43, -32, 264, -26, -117, -21, -76, 251, 132, -100, 184, 244, -84, 27, 131, -47, -46, 143, 126, -13, 112, -126, 74, 87, -47, -167, 190, -41, 18, -30, -27, 140, 10, 91, 76, -73, -47, -47, -3, 132, -175, 36, -53, -95, 81, -264, 70, -31, 116, -1, -248, -147, -133, -102, 42, 18, -102, 158, -33, -234, 130, -188, 264, -119, 50, 9, 58, -236, 117, 16, -143, -13, 118, -184, 55, 107, -140, 0, -14, -131, 148, 76, 128, -88, -235, -124, 29, 168, -236, -277, 140, 64, 231, 101, 96, -9, -107, 141, 123, 324, -129, 14, 37, 215, -235, -57, 76, -81, -20, -70, 40, -35, 215, 85, 42, -35, -330, 75, 223, 111, -194, -130, -269, -1, -19, 148, 109, -85, 129, 206, -241, -9, -39, -50, -9, -109, -129, -113, -4, -141, -172, 141, 76, -61, -150, 80, -116, 89, 200, 19, 311, 87, 155, -23, 87, 72, -32, 95, -184, 127, -30, -34, -147, 114]
6909A14j60p7J03r9J63p3M9J07K03l38j09K70L38l51k15L88l13J6L8R2o5J0Q7
6932A78l52J67l5J11o6J38k06l3K06N7j25j75J96j74N01k92o2k98M72m26L45j98
6954g1K51J82l97p8j89K70k26J20j1k9L87j30j4Nl8j84J13J70R7k90J64j0k00
6977a08K52k23J73m1j02J22Kj9o0P5J78j32Q4k37J43j21Q4j15K4J75j90k48J24
7000a60L01o9j95L07j75N2j30QL6k46J99JR1Rq7J22l8M8k00k34L55K27m53K36
7024Eq4J16k7J58q6k17oJ18K19l3k19j57M23m42P6J05qJ04j05j6J76k54K14J17
7048A77j22k81L75J24j44j15j31j91L78K22k18JO0j47k11N6n6J93O8j14L8p9k0
7071a37j07M43l08M6k9K63k72Q5L97k83L1j95J51P2p3l16L09q9K91j15j53J01
$$ y = [114, -46, -123, -20, -119, 44, -29, 20, 127, 330, -8, -117, 153, 491, 140, -75, 313, 0, 16, 54, 146, 81, 91, 178, -174, -7, -42, 69, 3, 141, -65, -98, 108, 165, 40, -135, 61, -113, 388, 96, 34, -264, 208, -218, 127, -71, 180, 362, -35, -113, -302, -32, -258, -138, -149, -178, 209, 79, 65, 70, 32, -152, -39, 131, 228, -62, 102, 92, -108, 144, -79, 94, 53, -49, 73, 75, 56, -4, 71, 249, 117, 201, -36, 107, -14, 70, -45, -21, 154, -36, -284, -160, 141, 72, -123, 184, 9, 61, -69, -61, -25, -271, -72, -71, 20, 29, -58, 64, 26, 74, -126, -360, -5, 222, -231, 5, -79, 37, 10, 168, 82, -135, -141, -23, 196, 163, -56, -213, 210, -232, -156, -51, -59, 45, -60, -76, 100, -154, 60, 177, 55, -226, 149, 273, 129, 14, -117, -308, 70, 292, 74, 75, 135, -12, -223, -167, -223, -30, 38, -76, -38, -117, -137, -244, 199, -109, -63, -92, 171, -101, -16, 381, 98, 129, -66, 85, 157, 84, -232, 77, -12, 279, 164, 11, 112]
7093A12K1r0j66K62j13j38L5O8JJ29o6J48k81R3K7J0k21O3J82O2k17l2L0p1M2
7118a10J80j99J63J6J00k82J47PqJ44r2l3j80J20P6n2j36K06J51k57Rp5j04L11
7142A02k51P2L53j47j46m6K84k44Pk27L01l17J90L22O1m13O5J21P0O7l40J78k6
7165C6k85K48n5j2K73PN1j61m8j32K43l33L35j85j24K50K3r5M4n3j58J79p0k1
7189d3j8J8j72M67k91rO1M4J05j56R7k36J05K38p9l4K0k7K9Q3k69J1M0L71k02
7214A53j75J87r3K0p3k6j01J43j09J11k32K30O8j2j36J01J5q0R5j07K4P9r7j49
7238a64m4K26J57k57J72NJ33j23k36J83j36j37N08j63k08Q8Pl0r3L19k78j2K69
7261A86m43L17k53K63p0j42K41j14j53L77r1j46K7L2q2p7k19J58K54l13K09N2
$$ y = [112, 133, 43, -123, 139, 26, -112, -77, -9, -8, 121, 55, 203, -78, 15, 42, 52, -169, -106, 76, 138, -79, -111, -81, -152, -110, 70, -129, 34, 50, 150, -132, 15, 22, 14, 158, 66, 33, -147, -27, 49, -3, -139, 67, 218, -39, -30, -105, -209, 102, -149, -77, 276, 129, -17, -63, 221, -23, -16, -243, 58, -259, -69, 253, 314, -99, -34, 87, 157, 224, -116, 62, 36, -249, -1, -56, -68, 205, 212, 263, 102, 54, -78, 165, -168, 167, -18, -142, 108, 131, 36, 80, 27, -131, 48, -22, -43, -61, -43, -215, 252, -39, -48, 13, 57, 162, 6, 103, -133, -28, 210, 131, 97, 117, 90, 119, 202, -67, -56, -16, 355, 153, -22, 165, 72, 92, 19, -7, -108, 35, -74, 37, -195, 35, 103, 91, -45, 56, 71, -9, 86, -21, 3, 82, -15, -164, -208, 18, 175, -82, 90, 95, 228, 105, -131, 52, -84, -221, 287, 124, -84, 4, 11, -19, -112, 207, -71, -83, 186, -257, 60, -193, 70, 0, -142, 99, -15, -168, 209, 118, -28, -1, 31, -51, -128, -347, -189, 65, -248, -39, 13]
7283A3j13J22j10M9J15k82J94j95J57J35j1j15N9j68K77r4j06J92J34l79k7K85
7305A32k6n0k03jK74k03J65j25j77r4K32J28j73j69M9K93n8J17k16j2J6K61m6
7328A14k42K56k38J21l1m6k51M40j52O0k00j56J84J04K04J35r2k20J24r7N9j66
7350i0K7k51K33J01M9K1m1m6J1J04O9m33O5K34l89M03k8j11J11J4j42KL58j37
7374A34m6N8j25k02L4J57k83J15J45k76K73J49O6j74rj6r0K14k2k05P5l09K96
7397d1N6k46L01j43j3Q6l3r0J75pp4J18l09N6j1O8O6J09M7J7j4j62K5J48j31R5
7423I3k25j40K37K9J29j41J10l2J93m15J70j18L3r6L5l1J76j99o3L36J19j25J52
7446B27k31J47l30N4J43m4P9k25L24Lk86J22j23K00Q5j85K52k57j05J26q0O8J72
$$ y = [13, -100, 22, -88, -39, 76, -206, -12, -207, -50, 85, 74, -41, 18, -150, 127, 33, -73, 119, 253, -126, -153, 132, 106, 56, -147, -148, 126, -77, 88, -37, -214, -308, -76, 52, -121, -290, -241, 52, -6, 111, -105, -117, -101, 160, 114, -128, 128, -110, 11, -20, -66, -317, 123, -29, 31, -169, -325, -141, -37, 167, 302, 210, -10, 114, 17, 76, -90, -63, -314, -81, 20, 69, 90, 49, 3, 14, 118, 187, -246, -181, 53, -336, 67, 39, -72, 39, 53, -89, -87, 271, 134, 88, 146, 21, -181, -147, 10, -273, -158, -13, -289, -16, 133, 199, 25, 16, 0, -90, 124, 102, -103, -28, -337, -41, 15, -231, 70, -73, -86, 0, -33, -123, 52, 45, -29, 89, -220, -164, -175, -107, -41, 68, 115, 132, 118, -44, -19, 129, -2, 93, -132, -272, -35, -6, 123, -18, 92, 60, 253, -162, 8, -110, -77, -173, -138, -169, 7, -192, -255, 81, 200, 75, 227, -4, 143, -187, -133, 10, -34, 45, -180, 144, 147, -139, -17, -140, 60, 145, -40, 212, -45, -150, -24, -104, -36, 136]
7469A36k68J26J20J21k66M4j11O5L5J75k16o5P7J16j0q3P6k1j96J3J30j28l5J80
7493A5N4k18K99k93K88n8O6N4o8j01K05k80P4l0K64k19p6j8N9j00P9j5k3K66k80
7518e6j1j18M84m12K29J22l5n7k07k02L46p5qk86J79M9M08k12r0J7R6l0j98J73
7542A06l13j4L86p0k09K51L8j75j52J83r5k84J44K82j23j78J54K85j36j14j18
7563a52K07j63K48L6j35j14J60p7Q5j19%j62L34k80k3N4J86j32K21j37k77L72
7585A32k44K56j46j39q4P6J6L46l75q4M83m22K80k8j72K50l74K38p2k40L44r5
7607e4L35k18J22j47L1n8j04J40Q6j55m8%j4p3J06m3pN1q7j04L60Rm9J00k5k24
7633g0L72k99O4j18K22j41Q8j41oJ07K3k4r3m7J34k07K32M2k58K00k1j13J05Q
$$ y = [136, -132, -6, 114, 235, -31, 13, -98, -33, 2, 177, -39, -104, -27, 89, 79, -4, 72, 51, -145, -132, -2, -130, -165, 15, 69, -149, 150, -143, 145, 87, 153, 207, 139, 38, 243, -37, 37, 7, 271, 52, -24, -42, 17, -83, -4, -19, -42, 224, -56, -67, -185, 299, -113, 116, 238, 203, 146, -61, -263, 83, 8, 0, -286, -107, -58, 350, 138, 48, 65, 161, 131, -67, 106, -207, -221, 165, 95, -114, 137, 175, 0, -152, 31, -64, -348, -204, 78, -45, -223, -69, 216, 80, -34, -152, 55, -108, 140, 176, 41, -73, 87, 10, 95, -24, -24, -186, 148, -132, -155, -101, 85, -47, 174, 37, -240, 132, -112, 144, -2, -141, -225, -149, -133, 213, -162, -246, 237, -185, 95, 67, -105, 145, -229, 9, -63, -303, 41, -54, 281, 63, 185, 38, 69, 11, -93, 47, 133, -22, -70, -70, -84, -157, -51, -94, -101, -50, -137, -241, 119, 128, 79, 179, 154, -70, 302, 3, 67, -51, 171, 30, 118, -23, -29, 78, 101, 77, -16, -63, 71, -136, 96, 138, -120, 80, 59, -54, 51, 59]
7657E9p4k10L82l17K49j48k13L64j0N6j45j46k2L09j21J32j38N1M2r3j14J75J81
7680B49j3k44n9K0q2j07k9L68j90M06l37m1KLN7j63K86l8m8L6rk51J54J11j3j70
7706a02R1J01r8j3P8n2J7R7j57J45l46L39j1r8r4j87L61P1k30k7J26K53q0j63
7730B1j43J71q3K5N2o9q7J69j08Mj45J33l8J5J82j63j8jJ53j1j99J55o0n2N2j10
7756a55n9K59N5k61O3p3J67k5J05q1P8q6q6J67l94M37l08J48P6r3J31k99K91k26
7780a69M97k13o4o7k36J33K64k05o0K38l06J37j5m0N0K2R0P4m4j81O0r0K1K53
7804A49J9l33k2K0J30q8J72j79K8L37n01L67km4J28l57K68k43K69j1n5J13l4r2
7828C9k06K53n6K22j90J05j22j95J69L5k20P6j70K53o5J2K39k45K17R3l66j93
$$ y = [59, -15, -225, 157, -160, 89, -59, -272, 92, 82, 138, -7, -153, -175, 134, 13, 145, 7, 58, 100, 7, -107, 68, 249, 236, -8, -67, -47, -129, -236, -265, 103, -87, 319, -18, -59, -57, -54, 3, -160, 126, 88, 40, 76, 67, -184, -30, 81, 68, -102, -11, 90, -8, -21, 57, 5, 22, 119, -38, 107, -239, 100, 89, -9, -103, -290, 71, 142, -88, -115, 11, 264, 184, 21, -122, 49, -34, -9, 43, -26, -113, 56, -52, -48, -193, -60, -98, -83, 99, -64, -82, -83, 70, 59, -140, 15, -45, -97, -45, -155, -214, 45, 100, -161, -98, -171, -4, -29, 76, -5, 73, -13, -99, 68, -326, 111, -197, -49, 27, -66, 65, -234, 57, -169, 328, 115, 51, -16, -252, -119, 145, -60, -120, 118, -188, -51, -66, -106, -56, -34, 56, 130, 86, -95, -35, -125, -104, 149, 168, -165, -187, -167, -37, -125, 47, -132, -104, 233, -268, 99, 97, 53, 181, -176, 92, -151, 118, 107, 52, 165, 131, 39, -167, 86, 30, 252, 62, 167, 45, -150, 19, 54, -166, -90, -260, -7, -72, -60, 179, -66, 151, 244, -122, -315]
7850c15M36j86j74O12m28oP4m9n2L63m00L08j41Lj30J08K77m09J96k84J50J30
7872H3j2k52K53O9L2o6n4j62M6O9r2J6O4j30Q7o3J52k53K97K3k41J68J96q9k16
7897g5K25J0j39j21K98k46J66k4N3l76K68J9r1J96j69O2r1R9L2l0J26k06L2O2
7921H0l9k31J50l07L91J2j01J66j84J68k30L82k19j92K46l2j40q0L41j53j27q8
7943a87J58j11R5K4n8NK1k7M3K10q6P0k58J17m7J2K61m32Q5Q1L5k06J17K61j81
7968BJ04j55l2J22K04j42o7J64r8K4l7j22j32J89k31P2J86r4J34j70J47k13K29
7991H4qJ4q0P2j09p3K50k43l0j25K86k6j08J02L3N1j11k14L86qj36O5j3q0J53
8016A32l42K13j56K52m1j30J30J37k88J59K01j74k61P6J06J6J56j88n8j69K09
$$ y = [-315, 121, -65, -239, 373, -55, -61, 13, -36, -88, 275, -125, 183, 42, 45, -85, 23, 300, -109, 87, -197, -47, 83, 71, -181, 72, 141, 173, 107, 53, -109, -63, 6, -86, -70, -6, -136, -49, -112, 40, -213, 84, 107, -134, 34, 230, 141, -75, 150, 160, 21, -100, 198, -48, 118, 94, 147, -229, 39, 58, -33, 163, -6, 56, -35, 64, 96, 66, 192, -14, 18, 80, 41, -190, -40, -347, 44, 56, -45, 121, -63, 105, -125, 257, 38, -154, 92, 60, -80, -160, 181, 28, -99, -187, -29, -140, -45, -21, -79, -74, -53, -80, -37, 173, 87, 157, -101, 16, -31, -19, 242, -190, -105, -24, 11, -195, -78, 183, 2, 106, -49, -81, 41, 245, 103, 36, 200, 102, 126, 89, -33, -165, 24, -207, -135, 51, -43, 91, -79, 68, -145, 84, 76, 90, 10, 82, -27, -100, 150, -93, -123, -248, 38, 12, -96, 6, 39, 90, -21, -235, 151, 143, 7, 72, 59, -21, 132, -210, 3, -153, 99, 58, -72, 58, 195, -93, 66, 267, 93, -168, -92, 14, 30, 186, -2, -60, -229, -20]
8037b0j14J91l5q3J64k47JR4J30J51k91k4J47j4j4%m3K4R5J44j44n3p6k02l3J44
8063a08K22j48j3Mk39M13k72QJ23J22j31p5J67kQ2l32M5J55R5k88k1J64O0N8k7
8088F2m40J47K35k6P1J6k62L59l40L84j09J09q1J06j04j44J10k40K52k17J01j47
8110a58K76k30J38J21j25j65J63l32K53K16j62j02K0l10K84j3R8j78K44J4O2j83
8132f9K8j2J2R8k12R9Jl2K68j80l5M1q6j9K15r0k10lK43K1j44O4j02n9L83k91
8158g1o7J89N4k52o3L32n4p9L5j70L25k80M0j02K20K0q6Jk20K50k3P8oJ12k58
8183g5J27%j81K09J24k50L10l33
$$ y = [-20, -134, 57, 22, -61, 103, -144, -143, -49, 81, 232, -59, -83, 64, 50, 36, 36, -7, 17, 112, 256, 112, 59, -17, -219, -252, -108, 114, -34, -47, -43, -282, 131, -141, -133, -10, 112, -19, -94, 73, 71, 153, -179, -134, 21, 116, -172, -193, -29, 31, 89, 62, -378, -231, 4, -22, 49, 65, -197, 162, -178, 206, 97, 206, 125, 231, 127, -17, 93, -147, 105, -112, -11, -158, 118, -112, 26, 147, 22, -143, 20, -312, -59, 157, -5, -107, -87, -397, -113, -126, -28, -206, 38, 52, 114, -69, -41, -53, -41, 57, -155, -56, -55, -87, 181, 1, -34, 7, -79, -98, 117, 27, -183, -186, 57, 78, -66, -2, -104, -163, 220, -71, -138, 51, 105, -147, -210, 122, 68, -11, 24, -146, 179, -101, -61, -163, 57, 77, -9, -8, -228, 22, -1, 77, 71, 183, -75, 52, 52, -129, 80, 204, -46, 264, -69]
8191f9
$$ Imaginary data points
##PAGE= N=2
##DATA TABLE= (X++(I..I)), XYDATA
0@%%%%%%%%%%%%%%qJ6j6J6j6K4l2L7m5N3o1P2q8J01j13J31j51J69j93K21k49K80
36A48l13L53l97M41m92N46o04O73p45Q24r12J006j108J222j348J482j632J800
54I44j988K199k436K706l020L386l819M347m999N831o941Q502j0872J4968k4057
69a5249Q3895j7599l0876J17502n8547q0092L8579N1300o4718l0686K4298k91
81A7516l8476r97O641j2783j4721J3415J540j8479n070K1278o305k6258P405L1231
95b4063j0831k2973K1857K4472k3276j1823K8254N713k3374R034K1165j0487o417
108b2749J9012N58j4960O544J0289r924l832J2885M749q534j256Q048n5r261J93
123h293Q289L20o650K585P715j849n404K177L590l466l871N337K808l910K275
$$ y = [0, 0, 0, 0, 0, 0, 0, 0, 0, 0, 0, 0, 0, 0, 0, -8, 8, -8, 8, -8, 16, -16, 21, -24, 29, -32, 40, -48, 53, -60, 71, -80, 89, -104, 117, -132, 148, -165, 188, -209, 232, -260, 286, -318, 355, -390, 434, -478, 528, -580, 642, -706, 776, -856, 944, -1044, 1155, -1281, 1425, -1595, 1791, -2028, 2319, -2680, 3151, -3790, 4712, -6160, 8808, -15249, 68646, 51047, 20171, 137673, 79126, -966, 37613, 88913, 24195, -6491, 17807, 17516, -20960, -21957, -15316, -28099, -42820, -29405, -27865, -46344, -51414, -30136, -36441, -62699, -55294, -24063, -34894, -57867, -36010, -11538, -34814, -46637, -18383, -12670, -36044, -27010, -5845, -16332, -22749, -3737, -3179, -18139, -11595, -1306, -11230, -15062, -2177, 2572, -5962, -7218, 830, 775, -8486, -8293, -4, 316, -6334, -3749, 3966, 2117, -3287, -1110, 2480, -986, -4857, 480, 3288, -622, 1653]
138A653N204m236m712N492J303o055K294O840l182m809L540K801l899k768L525
153B991K122l222j907K663J380l136j564J856q73j803N11J012j334J11J186j541
169a548k616J317J953l552j962M487J271n269O48N021k041m546K693K560k655
184d239j412L637J063k813m42L087j014k423J836K731k206j711L759P40l862N62
200b707L817k087l202L151L093l984j213M235k15m047J105L485j678k812K990
215f9K398l101j644L635P43l745o72M283J64m559J468M448k437m631L876L305
231C462m985k282N530K93n138Q22M837k361l653K555K240l253j066L556j78k981
247b602P17K585j474j777J802J670k134j430K606J313l353k52M047k71m399J436
$$ y = [1653, 6857, 2621, -2091, 3401, 4704, -1351, 943, 7783, 4601, -208, 3332, 6133, 2234, -534, 2991, 5113, 1891, -16, 2647, 4027, 891, -673, 1183, 310, -1493, -982, 30, -1304, -1193, -7, -1548, -4164, -2847, -894, -4446, -6408, -1921, -650, -5919, -5271, -250, -2291, -6837, -4144, -1584, -4239, -5651, -2014, -951, -3764, -4206, -1119, -2133, -4556, -2720, 11, -2195, -3906, -147, 593, -3269, -2707, 1110, -977, -4179, -1028, 2065, -1919, -3132, 1103, 888, -3159, -2054, 1431, -247, -3059, -69, 2329, -772, -2416, 1219, 1962, -1783, -2455, 1828, 1992, -2567, -1099, 3349, 912, -3719, 157, 3462, -1523, -3805, 1725, 2018, -3120, -2298, 2539, 178, -3475, -920, 1320, -1933, -2999, 557, 379, -2602, -1885, 700, -774, -2551, -749, 921, -1213, -2643, -37, 1276, -2077, -2329, 1718, 1447, -2952, -1516]
263a516M824l059l911M306K906n036j375N478J57n271J563M229k690l034L086
278F57K105l002j211K484O96k142n89J980K91k200M3K030n90k044J665J225k172
295g74o43K541j49k637J704K376k171j891K914Q10l396R32K686j095k084J928
311A051J569j832o84J861K84j713J22J060m16m56K87N13m95n97N28j5n60k51P93
330A049r6p36P7Q77q86r58J161Q40j820p29K143n1j984N20K338j548j636J956
348E17Q32k327K52J861q05q29Q37J94j210M69P28r68k73J297m55q17M39O99q71
367d30m72M32M05j63n13J89J008n40j257J017J155k116k72J617N26k001P28K061
385A374j643j353J793L81j932J090J351j257l98R31P2j147L00P39o88r3N73J29
$$ y = [-1516, 3308, 249, -3662, 644, 3550, -1486, -2861, 2617, 2774, -2497, -934, 3295, 605, -2429, 657, 2762, -240, -1451, 1033, 1729, -413, -1002, 978, 1269, -931, -888, 1142, 552, -1492, 173, 1398, -774, -1417, 1124, 975, -1662, 42, 2418, 247, -1644, 1270, 2080, -1316, -384, 2302, 1207, -877, 1051, 2620, 788, 104, 1965, 2249, 536, 658, 1718, 1302, 846, 1133, 1646, 1151, 554, 1082, 1067, 507, 256, 1049, 953, 217, 294, 1171, 285, -673, 488, 1328, -492, -1221, 922, 871, -1113, -593, 1745, 197, -1439, 517, 1349, -978, -726, 1135, 330, -499, 338, 532, -678, -209, 519, -449, -722, 575, 120, -697, -258, 441, -430, -902, -470, -65, -228, -741, -552, 456, -84, -1341, -324, 831, -1285, -1557, 60, 586, -1415, -687, 1374, -269, -1622, 171, 552, -1380, -290, 1061, -196, -594, 337, 409, -738, -438, 301, -387, -480, 93, 222]
403B22n01m22O66M89q50m33R65M32j462K52J665q73j734J656J520k325o68K585
421A184J04k504R34K098j345j405J330Q43j109q79J446J013j652l73J386k50j023
438b02K37J138m76j211P44J226j508p84J520O4j656L64J471r18j328J630N52k023
456a160p3J906p64j561R97J559j133j218J362P45j392m24J250N68j464K80J338
473H16l91q64L00J433r33p70J034O50j099q4R71l36n84J08M00m11k85P91L6r15
493a33L13O72o44k83L17L58l67o40R61Q0m29k98M82o1r02N80N81l58n98O60K86
514E77m08k86N82j18m9L7p2l5o7M60l08k67L53l8k40o0L82J19o58K88q9K53p62
537d06j40M85K46o46O6O02l88k35L3k1J87k84J06L41k93p9k10K10R7J69n88J62
$$ y = [222, -279, -701, -35, 454, -396, -829, 136, 568, -894, -642, 1023, 150, -1584, 72, 1592, -733, -1401, 1184, 1288, -1216, -282, 1816, 471, -934, 396, 1239, 130, -749, 697, 1710, 58, -315, 1071, 821, -202, 35, 1173, 697, -514, 230, 1456, -52, -836, 684, 748, -908, -544, 927, 9, -1319, 311, 863, -1160, -1233, 673, -91, -1652, -655, 904, -229, -1447, -85, 660, -732, -1156, 94, 662, -802, -522, 816, 425, -439, -139, 1294, 361, -409, 625, 1275, 176, 92, 1063, 727, 143, 251, 651, 240, -45, 746, 782, -133, 180, 852, 208, -75, 242, 600, 233, -407, 554, 634, 205, -93, 389, 328, -574, 6, 587, 229, -369, 291, 577, 169, -117, 465, 347, 298, 335, 263, 228, 161, 621, 313, 46, 399, 361, 121, 61, 443, 562, -96, 192, 103, 356, -406, -546, -61, 185, -461, -395, 207, -181, -416, -383, -404, -217, -501, -395, -54, -347, -426, -636, -426, -329, -160, -748, -586]
559e86M61r5o21N87L74n27j38N99L43o70J2L49P9l34N8M40n0o24N62O12l38m67
581B6M33J28n01j09P44l37n34M07Q13o80o34Q03M48r22n1N44l87j87L02N03o80
602A29j30K71o0m60L20M85k08j77l71M23l55l97N18O31q43o55J231j87o65k21
622g21J009k1q10J42K98k46l96N15L62o63j34P69k15o73K15K82j27m43O42J68
642d7m04k83M50J57m20m8M04j36n08L52K77k05R1L40r5l43k63Q15j95o38N01O89
664D91p71J12K75P4k26K36l8q5PK03k7J39k74L54O8j85r3K38j25%NK32k81r5K1
689B55K80j47J78j71j7l00r2M70k40J19j73Q2k48J71r9J75j87j75J71J0k81K03
711a6k94M92k27j08Q4J64l72J43M1K63l24r3j98M04J41m25L02n9j86J3j78K56
$$ y = [-586, -125, -220, -841, -254, 120, -407, -545, 54, 397, -273, -261, 88, 167, -167, -109, 331, 281, -343, 219, 831, 493, 26, 459, 587, 86, -23, 721, 384, -150, 257, 1070, 390, -244, 559, 1007, 85, 34, 578, 191, 4, 306, 809, 129, -1, 270, 210, -250, 70, 555, 347, 170, -201, 222, -133, -530, -12, 619, -224, -879, 352, 165, -500, -721, 288, 267, -543, -401, -103, -349, -745, -230, 132, -531, -665, 104, -111, -784, -569, -287, -414, -857, -215, -47, -451, -734, -284, -127, -547, -595, -191, -327, -835, -483, -206, -411, -320, 20, -75, -418, -681, 134, -61, -699, -198, 491, -280, -168, 107, 181, -45, 191, 153, 68, 75, 278, 251, 390, 116, 470, 538, 353, 260, 498, 373, 373, 378, 610, 329, 234, 255, 535, 388, 566, 395, 378, 78, -14, 456, 216, 335, 162, 244, -4, 167, 68, 243, 56, -119, 52, 62, -219, -16, -310, 182, -45, -153, -69, 95, -277, -134, -93, 170, -154, -247, -445, -41, 100, -325, -23, -82, -268, -255, -433, -177]
733a77l6j46J52N9L46m21K49j35p4j89J69L19k28j21j18K31k79N9L8J47M50j82
755A13m03N2L50l03LO5M47m65KK17R1j85L5J89J39m46M26m1k46M3n7K09J10j72
779A73j37K60l9j51J99j92J00j30J71p7l36K77l7k95L93r1P0n01Q8L89m8k63K42
802F5l4q1m7L37j53l05K8J62Q0j45j09J15K61m79M72j35r5j55J36Q8k60J66K23
825A35l08k30L38M25m40k94J34K1o6P2R3J93k78M30j39j64k76K70L90m96J07r
847i2K11m22L72k57L36n28N33O8m05M3K22J07l7j87J72K2j18N3l3q8J12R6N5k75
871d0J39k27J56J03k72L11j81j55L32j50KL5O5j23L37k78m0l2j50L75q7j86L4
894c2N2Q3k02j25K58k65J1L91o7j83n6O4j51J60oJ05j24J2J28j4m7q4k5j48L95
$$ y = [-177, -213, -359, -207, -148, 198, -223, 26, -109, -183, -372, -203, 116, -112, -233, -351, -120, -399, -340, -302, -155, 295, 113, -290, -238, 112, -191, -188, -123, 324, -141, -139, 78, 169, -16, 19, 208, 347, -99, 327, 286, 40, 83, 26, 235, 345, 173, 36, 296, 257, 106, 305, 113, 213, 83, 254, 177, -159, 118, 81, -214, 179, 88, 158, -343, -255, 134, 86, -177, 65, 31, -50, -97, 240, 87, -218, -190, -28, 52, -93, -202, -87, 174, -305, 167, 32, -63, -218, -82, 6, -254, -88, 135, -173, -403, -65, 360, -80, -374, -240, -219, -285, -213, -120, 73, -205, 225, 86, -78, -354, -84, 306, -190, -83, -92, 119, -303, 69, -188, 148, -380, 153, 221, -184, -141, 81, 188, 151, -36, 136, 158, 40, 93, 60, -28, 84, 180, 235, -40, 99, -128, 28, 131, -141, 170, -11, -166, 166, 16, 18, 53, 118, -5, 332, 54, 14, -18, -168, 207, 120, -66, -32, 20, 103, -99, -224, 34, -231, -220, 171, 104, -79, -135, -71, -222, -62, -68, 37, -87, -75, 53, 39, -8, -92, -117, -265, 130]
919A30j90K91l20K1J97j78M6l7j46J55m1J21l4Qj44L28m61R6J57J41j63k1L67
942C23j76p9R9j37k42L56j50J06j53K94j30J40J5J25l36p0l1L66k94J9q2M9K49
965B61l03K07j73L1q2L37k48l6M9m6J08k87M59j26l4j65p6O0J64k31K18j57Q6
988A6n0P5Q6m51M93r5j92O3J75k48Q3N6j0J56k12pJ20l15J55J50j3n3j9J69k50
1013a18k9J92L2j23j9J58k69J69J29k98O0N8K78k77j54J84K15j29j42qJ07p9P5
1036A2n5J39pq4k5r0J89k1m2J71j92r4J17q4Q2K3J36j88m5J70n0Lj32m3r2J04
1062i8K09j59J93k54oJ65J9l6n8K49k72N6j9j57J59l38L17J53j45q5N0M48n39
1085a48J18j18L04j22k14j33L09m4L61m92J98k53L09q0j39J38k01K30j5pJ69l26
$$ y = [130, -60, 231, -89, -68, 129, -49, -3, -40, -186, -31, -72, 49, 15, 23, -121, 207, -254, -158, -1, 140, -23, -44, 323, 147, 68, 167, 30, -212, 144, -6, 100, -53, 241, 111, 251, 266, 391, 55, -15, -46, 320, 26, 45, -37, 12, 261, -42, 165, -8, 23, -59, 278, 30, -6, 43, -3, 105, -182, 277, 151, 117, -48, -124, -64, 100, -131, 87, -70, 16, -34, 41, 127, -324, 169, 74, -118, -55, 120, -128, -45, 11, 1, 157, -55, -62, 58, -257, -102, 48, 35, -18, -37, 132, -118, -147, 45, 77, -46, -65, 93, -176, -7, 122, -176, -116, -58, 220, -57, -211, -27, 188, 59, -83, -91, 16, -63, 12, -43, 96, 89, 5, -20, -110, 79, 58, 16, 187, -5, -99, 18, -66, 16, 39, 175, -13, -58, 112, 62, 65, -67, -110, -202, -98, 111, -48, 145, -109, -115, 50, 69, 33, -25, 224, -48, 8, -11, -168, -9, -347, -30, 123, -22, -107, -57, 391, -148, -30, -148, 156, 34, -180, -313, -4, -48, 313, -179, 19, -234, 75, -5, -144, -6, -207, 23, 8, 1, 170, -156]
1107a56J84K25m06L11k95L59j51K7j70J45k55K22k59L93j15j2j29R6q6k8K60q9
1129G1J26l31Q5J33p5K42k74l0j95K73J02n9l6J48o9n2M5o7j2j98N7J31J05jJ3
1154A32k03k14J80J41j5Lj16L6K33l92R0L29j72J5j93K56j67P7P2j28J33k53L6
1177a20K32j21j39n3K7L5l4P5R9j02PJ00N1N6j5j42R4k59l8K46J60kk60l4p4J20
1203i1J21Q6j87O8Q4j42J80q9j0kR8k68K19p0L13l84N8J54K0j98Q1r7K0j58M32
1228B38l12J06J9P4J7r1Oj03n3k08K91K09k07k32K30P8k3l9NJ16R4m96K93O7l85
1253c06L53n3j6J41k29J65j18K3j2m0L66j65k43M00l81R1L50l03r0j21L51k32
1275f9J2P1J04j47K24l95K78j9n3LK96o3l02J3j63K65k09L50j75j02K49m3n3j02
$$ y = [-156, 28, 253, -153, 158, -137, 222, 71, 98, -72, 73, -182, 40, -219, 174, 59, 47, -82, 14, -72, -100, 160, 71, 197, -134, -49, 84, 9, 251, -23, -53, -248, 25, 127, 68, 32, 180, 111, 59, 104, 37, 25, -173, -116, 15, 120, 119, 132, -71, -285, -105, 36, 21, 24, -92, -56, 177, -215, -125, 204, 32, 47, -146, 110, -57, 20, 92, -36, 97, -156, -120, 112, -9, -148, -201, -174, -139, -173, -98, 1, -101, -94, 6, 57, 113, 98, -44, 50, -209, -247, -1, 159, 157, -103, -137, -211, -91, 30, 116, -71, -3, 81, -61, 119, 30, 20, 18, 116, -152, 67, -3, 310, -74, -16, 138, 158, -40, 41, -56, -36, -194, 238, -74, 32, 51, 125, 142, 51, 57, -46, -99, -307, -16, 193, -14, -246, -16, 62, 39, 0, 5, 121, 215, -281, 12, 79, -306, 47, -6, -22, 119, -110, 55, -63, -40, -52, -92, 274, 109, -134, 266, -115, -24, 326, 23, -67, -188, 163, -69, -57, 14, 118, -29, 195, -200, 78, 59, 6, 9, 305, 242, -60, -47, -210, 55, -154, 196, 21, -81, 168, 125, 72, -30]
1299c0K24r8j92lJ50j56J99j04jJ32q2O6j65j22K9J50Mn1O6j45jK23k56J18L3
1324a2K8n2R7n0N7j73L23k44r7J34J52j69j99J91J81k12M3J32l04L60j87k62L18
1347E5n8k81J63K89k88R7r9Q6K7NP6j36j22K75l70R0K48j18J96l07L36k64lk52
1371c55P9Q7L45j87j60J47J52Mq2PP0k82J38Kj14J87o2j28J87k82K76j64J87J62
1395B14k9k21M2j2j46N00m85K47m6k58K98j26J81j09J6k09R3q2J02N36l37l28
1417a59M4J16k8pj94L23l72M99l2j49j6J09j84J57pj43J09j04K77m24J25K72k42
1440c0n7L01k44O8J73m38Q3k8K25n1J06k76K72L9J23l36R6J11q6o2j05J43p7j30
1464a80K8q2l7M35k36J11m9n6P2j21L6j64N7j26K88ok08R1N9M3J77O4l58O6P6
$$ y = [-30, 194, 96, -96, -99, 51, -105, 94, -10, -11, 121, 39, 105, -60, -182, -153, -3, 1, -50, 16, -129, -130, 93, -163, -45, -12, 16, -36, 61, 11, 68, -105, 218, -26, -123, 11, 163, -6, -205, -14, 167, -45, -2, 130, -174, 186, -1, -263, 55, -3, -284, -121, 168, -120, -23, -122, -36, -9, -4, 72, -64, -186, 89, -281, -191, 57, -61, 135, -172, 164, -100, -103, -355, -276, -189, 156, -31, -191, -44, 108, 112, 30, 37, 107, -175, -37, -35, -149, 38, -24, -152, 35, -247, 29, -135, 52, 214, 185, -36, 6, -6, -152, 348, -137, 110, 64, -194, 104, -22, 159, 50, 66, -143, -50, -132, -30, 506, 169, -159, -115, 1, -27, -34, -228, 95, -277, 222, 190, 41, 25, 134, -50, 107, 100, -43, 66, -38, 239, -185, -60, 212, -30, -87, 214, -30, 38, 211, -227, -144, -172, 53, 2, 108, -168, 104, 143, 266, -70, 26, 137, 51, -11, -116, 27, -50, -180, -152, -234, -271, 164, -72, 39, -10, -66, 6, -115, -79, -243, -186, -312, -24, -30, -238, -147, -88, -45, 132, 196, -162, -96, -20]
1489b0J15Nk3l83M7J96R8k2J3M7k65L40m6j74J24p6P9j72J73q2J12N2k44lJ14
1514Enk7m2K42k3j15J8k21R1J74O1k02k9j17J11K49l65J27kp9M54k80k3q8l3L06
1540A87j68j13R2k25K92k8P8n7j87J11K03k68j22K91J17j09j41j92J63J26j17
1561f7J97k84K55k68K56K5j5j32j25Q7k7J83j73o0K9K39j0Kj07P6j92l1K78m54
1585c18M90J84j57m16J11JK14j30J0L2j94L94j89L1j03K16j64p8J15j61k0j11
1607b43K62j12J72L5l44K51J82k22j31m8P1J12PJ40k01J06m1k5Pj41n9J77J4J09
1631G8l80M81j31j9k70J16K88n17K18j22L10k60J43j42J91m4K80k47K2L29j67
1652A57j04j29L85m46L03j41k69K17O2k46L20q7J89j56k06K15j72J12j5L8P7P1
$$ y = [-20, 95, 100, 77, -306, -259, -63, 35, 13, 26, 73, -192, 148, 102, -72, 52, -24, 55, -117, 56, -26, 86, 138, -106, -109, 5, 0, -27, -69, 173, 150, 35, 53, -168, -77, 97, 158, -44, -73, -190, -79, 170, -195, -68, -70, -149, 305, 25, 2, -86, -119, 187, 19, -94, -2, -227, 65, 37, 115, 58, -129, -18, 185, -83, -205, 86, 203, 94, -47, -239, -76, 50, -67, 130, -154, 101, -167, 89, 114, 99, -33, -158, -71, -98, 85, -88, -148, -119, 120, 110, 112, 5, 81, -111, -142, 136, -318, 172, 356, 199, -217, -106, -105, 109, -21, -11, 21, -173, 221, 32, 63, -40, 176, 12, -66, 49, -112, -132, -243, 19, -93, 79, 114, -230, 21, 203, -19, -150, -198, -127, -15, -8, 132, -69, 37, -4, -29, -22, -163, -222, -45, -31, 78, -302, 179, 48, 29, -241, -125, 163, -354, -136, -258, 52, -208, -65, -207, -16, -60, 220, -27, -5, 324, 157, 53, -76, 309, -137, 166, 25, -244, -27, 35, -211, 109, 22, 211, 55, -151, 64, -108, 4, -11, 27, 104, 175]
1674A75k21N1p7J07J39k05J55M0j99J5n9J9J4J88K1j8l8L6q7K06l30j85O2J83
1698hK89j99k6p1k51J87l5L49k61R0mj09J24j05OLK84j12j65J87k46l9P4k0L03
1723B45l23Qm7P6M37l82j74L59k66K08r7J37l09K23l37L06n7j7K72%l53L3j8M6
1747c0r6J15j5r2o4J95k64O5K45J05j47m8O6j31L17J2l16r5L07j1q4J12l36J59
1771c1O3J3o3K51p0k08J2J29l27K81j21P4l5k1K83k83J63j21j87M65m17J90k2
1794A8qK45n19K06j29L63m43L95l13K40K4j68K86m0l19L38p2j4o3m3r8o5J45J5
1818a9J14n9l00J66K57k30r3J51k23R4K6jJ96j70J73l55L74j46K32j80j14l9K63
1841A17q7J18l31K53L4M5j0k34J23O3j42j34L74Jl08K51k4p0j25J93k42L62k44
$$ y = [175, -46, 5, -72, 35, 174, -31, 124, 164, -35, -20, -79, -60, -46, 142, 163, 145, 107, 143, 56, 262, -68, -253, -191, -8, 281, 82, 56, -15, -266, -79, -114, 235, -26, 64, 60, -49, 75, -30, -24, -21, 263, 151, -14, 173, -73, -112, -38, -58, 245, -78, -70, -117, -41, 396, 14, -160, 199, -67, 141, 44, 181, -128, 95, -242, 64, 7, -10, 262, 262, -91, -58, -76, -30, -126, -11, -26, -118, -182, 13, -251, -186, 59, 164, 17, -31, 35, -96, 221, 233, -83, -178, 129, 118, 34, 146, -190, -31, 32, 45, -18, 233, 163, -45, -33, 96, -231, 50, -71, 3, -32, -53, 230, -53, 110, -11, -198, 267, -150, 40, 18, 10, 255, -264, -58, -187, 176, -267, 128, -185, 55, 79, -89, 197, 157, -162, 176, 104, 90, 27, -16, -114, -179, -34, -19, 95, 36, -264, -98, 159, -71, -164, -13, -236, -142, -116, -117, 79, -91, 82, -273, 101, -45, 187, 7, -107, -146, 117, 30, 148, -183, 70, 104, 149, 139, -95, 28, 91, -51, -185, 189, 190, -118, 133, 109, 39, -86, 107, -135, 227, -17]
1864a7J66j26K08l16P5n1k0J71k19L82k72K52l86J22J75n9j9p0jl1J57q4j79l8
1888a80J19K31%j20l47L27O2J10j58q3Q2j75J44qm5j68P6K88k05J4L1k03O7J37
1912dK34m23K34J00k54J55J39l58K70o4j94J70q9L06j34R1r5Rj37O4j46J38j97
1935a85NO2L48k40k39K46k59M45j42J41k24j26J16K09l72J42P0J96j26q8K02m04
1957b23K2J28J56l7J43j86r8p0J90jR0l32L62j91K9O5k7J94l99J47K4NJ58q9k7
1982C3n2j21rJ71J66k36K3k2m0J85j61J70j04J9J3j27M1Q1qK34k61K04k09KNJ15
2008A12o4L1R6k35R8j26Nk4P6k09K31o3J70J25j08J3k95J98K09j63j61o7J5L64
2032B28l39R3k9Q2j22J45j43k8J79k6p3M8K21j43K7p0J3j08J63o2J3J19j36l5
$$ y = [-17, 149, 23, 231, -85, -10, -61, -81, 90, -129, 253, -19, 233, -153, -31, 144, 85, 66, -4, -5, -36, 121, 37, -142, -180, -61, 170, 170, 50, -297, 30, 92, 202, 44, -39, 43, -132, 12, 4, -41, -209, -133, 155, -50, -36, -5, -208, -141, -4, 230, -193, 41, 141, -113, 42, 181, -177, 93, 29, -165, 5, -84, 222, 88, 179, 84, 93, -44, 20, -126, 12, -185, -180, -118, 230, -10, -249, -3, -262, 183, 41, 182, -42, -168, -52, 157, -215, -73, -3, 193, 67, -21, 181, -223, -201, -73, 83, 46, 189, 3, -95, -165, 25, 24, 114, -218, 144, -47, -18, 47, 20, 214, -185, -38, -14, -9, 149, 60, 33, -19, -140, -149, 22, 188, -48, -25, -47, -87, 98, -63, 107, 3, 22, 35, -92, -51, 30, 22, 256, -5, 199, -10, -8, -3, 112, 48, 79, 175, -60, 38, -88, -83, -107, -31, -240, -9, -72, 98, 223, 115, 128, -167, 31, 240, 77, -84, -151, -136, 228, -111, -18, -47, 35, -87, 58, -85, -113, 66, 40, -33, 15, 236, 93, 120, 50, 63, -45, 118, 56, 69, 188, 52, 17]
2056A7Q5l38L48j20kj14J05m9J53k32j77j9K30L95m26J98Q8j47j34J93m6J71L
2079A82j48Q5j51K86j30k58%K09k17Q5n0LK59l45J64J92R9j62j72N7m9J6j28L70
2103A97l74J56QJ59j88L13k49j38J31l4J18k7k8m5K52k25P0l6J36j68pP2J52k06
2127C9o4L53l70O7j4j1J13k20J39l39N31j31j08OJ15j03J74l93J33J46J00k55
2149i2L9j02k30M36j91J13P4r9kj58K69N2j32k4R5p4j3k8J49l51M42q1j91K47
2173A48m6Oj97L8P0o7j25J43J82k34K21n9R2m7k69J99j99J36R1p6J96k89J75N
2197I4Pj38J09M6m9L8j41R3KJ73o68N44j26k33K15J3o0J18l7J86k55k1J9k2M6
2222d7n6J75r9J26l6J58k43r5J70P2k58K98K30m39q3k3K66l55L05N8rQ5m53J30
$$ y = [17, 102, -236, 112, -8, -10, -124, -19, -68, 85, -147, -324, -343, -113, 282, -144, 54, 142, -5, -139, 54, 8, 179, 182, 34, 119, -32, 254, 124, -134, -134, 75, -142, -57, -107, -104, 155, -190, -26, 166, 265, 103, -69, -12, -61, -45, -173, 197, -177, -21, -13, 146, -42, 271, 22, -116, 15, -19, 99, 72, 44, -1, 251, 26, 96, 60, 196, 28, 21, 93, 245, 39, -25, 328, -42, 25, 11, 0, 113, -107, 32, -307, 224, 93, -15, -9, 106, 3, 177, -216, -83, 63, 163, -92, -53, -155, -385, 51, -140, -27, 47, -52, -54, -212, 57, 109, -23, -47, 48, -26, -39, -67, 82, -269, 173, 92, -99, 148, 102, 108, -89, -51, 19, -48, -173, -30, 152, -82, 139, 80, 172, 125, -144, 55, -144, -8, 83, 7, 203, -86, 89, 94, 101, -37, 72, 118, 69, 107, -34, 59, 61, 234, -434, 110, -16, -249, -34, -21, -81, 37, 0, 186, -69, -90, -71, -93, -47, -103, 72, -27, 99, 63, 221, -22, -117, 53, 125, -133, 165, 395, -44, -127, -150, 116, -239, 66, 124, 115, 200, -253, -123]
2246a23J91%j66k61N42k15J07j84o8P6K18n11M56P3j77J45j21K5J37j16K51l41
2268f2J89o2K45n8l66R9o7R7Q2Qk27J03P5k51J42J44L21j89m00L21MR0k31R0j19
2293b2J59r8OJ26j40LM7k27K71p9n9J02k42L94j73J59j06l03L71k00L7l4P6j09
2317d1Q8j75J02j83J0L72o1l8j14K0J6J2j23J59l56M04J77l29M9j5k49L31N4j97
2341h7L4LJ54l6j44r6J36K12l08J58k10K27J9J39k30O2Op1k17O97n01L8Q1j07
2365d1k47Q1K29m06K31j0K79k07RK33m8k3j4No0M6O2l3m0j43l9j43K22J43k54
2390a68K43n7np6K31j21M6j46O0N3m8N9k34J92j30K03j89L32k59k16Q7MK18l22
2414b43K38L06j96k36j96qL03K47K1Ql02J36k31J63k22L08m3n2j7j12M7l0J58
$$ y = [-123, 68, 68, -98, -359, 183, -32, 75, -109, -177, -101, 117, -394, 62, 135, -42, 103, -18, 7, 144, 28, 279, -62, 127, 65, 310, 252, -114, -15, -82, 15, 97, 105, -122, -19, 56, -195, -53, 91, 412, 223, -177, 144, 148, 238, 7, 97, -22, 137, 39, 45, 171, 31, 34, 81, -146, 125, 46, -13, 89, -153, 241, 68, 227, 121, -182, 189, -11, 26, -8, 68, -41, 47, -128, -26, -209, -199, 173, 112, 74, -40, -20, -4, 8, -115, 44, -312, 92, 269, -60, -11, -26, -275, 56, 110, -87, -53, -50, 104, 68, -76, -172, -36, 176, -132, 26, -184, 43, 62, 201, -29, 33, 39, -32, -249, 448, -53, -15, 66, -41, -288, -207, 22, -384, -153, -163, 116, -91, -82, 151, 103, 80, 66, 71, 11, 57, 119, 86, 46, -97, -136, -279, -57, 86, -168, 75, 18, 13, -63, 168, 47, 93, -53, 7, 60, 12, 71, -163, 29, -101, 102, -87, 245, -14, -230, -143, -139, 79, -243, -5, 301, 105, -131, -327, -335, -32, 215, 236, 244, -58, 78, -153, 10, -212, 96, 53, 1, -16, -128, -81, -111, 47]
2437D7p5R3j28J63k07r0J38Q3j51J04r3J62M9p2l68L03K87j00j39j1M7J51k72
2460g9j05J19no2P7m6J63j91R8K56l67N11m25Q1j6j59K87j74j82o5N49%j57Q1
2484A89l66J97l75K47q8K72j74J94k00J40j00Q9J9k83K19o7J61J43r4k12K30k72
2506a31L61k30q9K0J37j16O7K4n9m4J69j58J57k51K31L04m54k07M51j07L6j52
2528d1j48L63j35K20l11n6K33j19p7lJ31p6q8mL33l49L67o5j32r4M0l0J01p3j43
2553a56K86J7k23O2j15J09j71j4K45J29j58L1J5j38n5K08j5j66N8L5J79j44L6
2576E5j93J50l6j16J16L4J27J3m75J04Q2K5K68j54J30P9j27KL8J1m00J86K28k54
2600a07J7l7K56k56k0L13j04j53N8J33l45K22r6O8O5M7l51K07J03n5k6J16P7j15
$$ y = [47, -28, 65, -63, 100, -107, -197, -59, 24, -127, -23, -116, 46, 95, 23, -345, -42, 245, 145, 6, -5, 42, 193, -79, -184, -65, -70, -132, -55, -101, 62, -129, -31, 225, -142, 369, -56, 25, 9, -150, 137, -37, -219, -284, 265, 265, 108, 189, -177, 20, -355, -108, -196, 76, -98, 96, -104, 36, -64, 25, 44, -239, -20, -87, 74, 217, 123, -89, 141, -131, 230, 0, -89, -69, 68, -48, 19, 43, -16, -60, 109, -49, 108, -143, 88, 392, -62, -269, 182, 75, 111, -41, -189, 174, 39, 259, -52, -108, 125, 6, -71, -74, 57, -19, -107, -111, 222, -127, 240, 175, 43, -51, -11, -41, 60, -13, -156, 130, 147, -76, -14, -129, -20, -191, -205, 40, 169, 11, 42, 57, -81, -136, 72, 57, -109, -51, -16, 163, 19, 55, -138, 12, -24, -140, -24, 10, 137, 150, -325, -221, -139, -114, 154, 0, 130, 209, 82, 84, 122, 133, -267, -81, 147, -107, -90, -127, 129, -127, -147, 166, 62, -91, -33, 100, -245, -23, -119, -51, 14, 61, -290, -83, 20, -35, -61, 55, 132, 17]
2624A7j02J06q2n1R0k95K57J77j99K80l73K34r5l1K05j05j3K32k75j20J54J57
2646A68p0l10J68j9J32j69R0k02M24k09m7j92L89k05J40K38j30j21k06L57l60
2667a34M0N0O9r6J04M2K4J04k99J6J78J53l41M4P7j3L2j67J07J82j17j20O1j46
2691a50L59J31n74K81Kr8J57j47k70L83J31k35O9j61K54m2p7o8ll5N2L5J59k86
2715a33j31K49J06r9j83N13k09p3j65n2R5K41j89rk3J6K42q5j24J22Q4k39o5O6
2739d5J54o4P7m7k2J80k15j4P5k5nj58K34k5k56K23J74k71n6j83R5L89k47J34
2763A02j72L34k38j09K56J4k35J79M4j33n4o6L13j21j55J27j91J23K0j02n2L77
2785B61l19K34j12P8j57L5R7j74j28K32k24J55Q0lk21M1J47j88L17l26O2K1J92
$$ y = [17, -85, 21, -61, -112, -22, -317, -60, 117, -82, 198, -175, 59, -36, -67, 138, 33, 20, 252, -23, -143, 11, 168, 98, -212, -44, -63, 69, -100, -10, -212, 212, 3, -44, -236, 153, -52, 88, 326, 196, 75, -131, 226, -134, -94, -44, 25, -71, 33, 75, 99, 203, -96, -80, 98, 251, -90, -46, 31, 18, 50, -117, -10, 172, 55, -65, -4, -150, 209, 340, -234, 47, 49, -49, 108, -39, -309, 74, 205, -30, 39, -122, 132, 90, 13, -55, -58, -93, -41, -6, 153, -133, -264, -15, 91, -8, -191, 322, 113, 40, -125, -177, -82, 159, -30, -39, -62, -46, 196, 111, -13, 109, 193, -46, -111, -45, 109, 45, 122, 75, 53, 233, 18, 4, 79, 54, 49, -109, 125, 100, -156, 67, 241, -30, -86, -269, -174, 215, -32, 102, -70, 264, 26, -83, 173, 187, -48, 131, 175, 42, -12, -78, 235, 114, -41, 86, -105, 18, 38, -64, -116, 261, -58, 176, 64, 142, -15, 20, 117, -57, -185, 47, -177, -22, 58, 55, -166, -125, 22, -166, 151, -175, -113, -92, 100]
2808A00k2M7l5k91J58j46K57m4n8J60kk51R5J09k83K13k60m2M01j40j69K00j60
2831a63K99j7n8k1K9j88K74J14l73J36o2ql7K50k08J20l1l6lm1j3q3R1k2K62q4
2857A27P6o1K7m15J37J29l2JlJ37j17j41J71O7n4k75K01L22l6j39k62n7N12n70
2881b55L79j04J82m95K50p8J84j03N1K40k52P5j1m8k87K64k14L03n1j69J97O9
2903A27j3j54K74o8l71jJ99qj48m63P46k5n3j19j36J45m6K58j03k5o1L15k93j52
2927a75J6L46O8j63o3l7L3Q7n5k20K64m55N19j58n9O5R5j80j28J85k21L39o7k56
2951b20K01LP3K3k0j8q2J41P9j14k29J15j07O9l5j80M13r5k49J31J51m6r7J99
2975A06j37J11j56n6J03j31K64J9k45M4J30k6K4k72K13l1m0J13p4Lp4K16j96J88
$$ y = [100, 78, 125, 90, -201, -43, -189, 68, 24, -34, 126, 124, -127, -32, 77, -206, 7, -253, -295, 106, -34, -203, -3, -163, 136, 119, 61, 40, 69, -119, 155, 269, -104, 32, -30, -38, -75, 175, -33, 87, 56, 20, 17, -24, -37, -120, -29, -51, 211, 127, 203, 142, 169, -246, -109, 20, -12, -11, -14, 123, 6, -135, 36, 103, 49, -226, -25, 297, 261, 122, -140, -197, 315, -255, 124, 20, 202, -293, -43, -121, 63, -40, 11, 251, -1, 74, 63, 15, -272, -8, -222, 81, 30, -139, 58, 127, 114, -40, 234, 166, -205, -206, -7, -15, -163, -626, 120, 95, 42, -77, -213, -68, -114, 144, 41, 16, -45, 270, -23, -175, -159, 187, 255, 92, 29, -8, 25, 112, 57, -163, 101, -354, 165, 7, -52, 13, 108, -72, -200, -15, -236, 103, 36, -220, -19, -16, 57, 80, 60, 42, -40, 101, 180, 66, -163, -48, -155, -86, -121, -301, 112, 17, -232, -101, 50, 4, -93, 106, -31, 80, -76, -132, -29, -160, 104, 123, -122, -78, 52, 26, 50, -222, -9, -40, -80, 33, -41, -38, -112, 104, -92, 96]
2999I6o4o4Q3q0j45J4J19j12J87j24K0OJ33j08M3J4k6N3O3m04J15L97j75k11M22
3024B52k82L2n9J54p4j28J27q9J75j58j44J43pJ63n0j1j87K47q7j68J74O9K36
3047C28o16P4K97m1j95J79n6R0J54k68J28l6J00o7k58M26l07J82k3R0k72P8Q4
3070G1l2n4N6r3J60k58L27p2l46K19r0J88j50N2J8J94k79l5L84m68M43k57R7J07
3094A82j65l02N56j52R6j88J61kk80J25o1j96K62K3J7K7pPNj77J50j14l44J78
3118a99J00l9L23k47R8r2M8M3Lm4r9J26J3K46l40l04L42L9k1J7Jp4J98j92j57
3143b11L73l60J14q7J98K72n03M9p0L73J04j81j00m3K61j66j82K21r7j49J28m8
3165a04J43J92k79O1j21j02K64j12K30k32J92L2j62q4J04P3J6n6j05O3j5K37k51
$$ y = [96, 32, -32, 51, -29, -174, -160, -41, -153, 34, -90, -70, -64, 69, -39, 4, 18, -8, 45, 108, -296, -181, 216, 41, -170, 252, -30, 2, -57, 97, 23, -105, 22, -67, 108, -50, -194, -51, -58, 105, 55, 44, -143, 104, 17, -151, 23, 92, 328, -288, -214, 83, 42, -153, 26, -30, 60, 214, -54, 74, 38, 138, 71, -187, 239, -68, 114, 91, 181, -91, -13, 71, 39, -15, 41, -52, 108, -150, 177, 105, -241, -22, -112, 76, -74, -22, -4, 190, -89, -124, 260, -208, 235, -22, 75, 182, 17, -285, 271, 119, 215, 27, 188, 186, -94, 31, -30, -226, 36, 59, 76, 103, 96, 103, 108, -69, 81, -33, -377, -199, -99, -138, 185, -62, 36, -56, -8, 35, 38, -6, -105, 21, 34, 280, -60, -364, -22, 17, -4, 13, 14, -60, 138, -54, -211, 162, -198, -84, -171, 27, 299, -204, -155, -225, 148, 252, 71, -29, -72, 189, 23, -159, 62, -35, -184, -56, -104, 39, 231, -48, 13, -108, -210, 54, -58, 172, -60, 132, 164, 2, -82, 22, 95, 111, 55, -50, 13, -2, 235, -16]
3188a6k9k81J54N8K65r9q8K69m58L65Om01K80j59O1J29j02R1J68k88L2K75l7j71
3212B4R0K6k8k07pR5j89K91r2P2p8j01J25J03k10K62k66J96l3j34M9Qk40M05p1
3237I0k76J62j36J81p4J53j66m0k9M18l16k9N2L37m04j04R5r3L20j11n8Q0r7o3
3261a08k0K01j24K46k14j12M24l57O5Q9j27q7N1j33L05J82k50j71J44j10J74N6
3283A24j70K5k95K02M06m86R3P1k5K45j48J13j38K1K07j88o8Rk18J67K42l60J58
3306a3L88k97j61J10L6l6m04N88l35K3K60j80J69L9k37mK43k37o9P5k04O4M14
3329B32k24Q8p8K20k27K4K59l36K9j89L09k45L46j74k02J37o9L1J79j90K04j76
3351e2q0M14l99K22j32j19l0R7L9k82L33M0p8M7r9J54p9n6J56n9OR3k03J7J38
$$ y = [-16, -45, -326, -172, -114, 151, 52, -36, 233, -225, 140, 146, -255, 25, -134, -73, 56, -46, 45, 213, -75, -43, 232, 195, 24, 114, 140, 112, -95, -102, -7, -196, 95, 3, 75, -3, -104, 21, 124, -86, 176, -90, 106, 73, -61, -12, -4, -244, 161, 90, -186, -24, -160, 21, -53, 100, -66, -106, -135, 283, -33, -62, -10, 327, -77, -181, -86, -179, 141, 30, -28, 52, -45, -108, -128, 73, -51, 195, -19, -131, 293, -64, 1, 90, -37, -124, -73, -206, 99, 281, 31, -140, 4, -106, 68, 124, -46, -21, -316, -114, 292, -194, -101, -30, -55, 190, 42, 155, 17, 38, 245, 57, -11, -2, -220, -53, 189, -171, -13, 375, 78, -83, 27, 63, 27, -377, 211, -124, -101, 159, -21, 148, 187, -50, -54, 189, -48, -117, -42, -246, -182, 232, 8, 96, 18, 238, 11, 35, 294, -42, -13, -202, 107, -138, 208, 34, -168, -31, -100, -69, 110, -80, 124, -52, -132, 282, -117, 105, -27, -146, -176, -79, -40, -322, 11, 51, -27, 20, -79, 75, -4, -60, 96, 37, 43, 136, -67, -50, 88]
3376H8p3N5k50n9K41O1n2K3n4J72j67k58J18J93N6j12P0n7J95l07NJ26n8j1J39
3401H4j68O3rK57m06K36J4k23J70J73j23p0j10O5R3QN4j68K7lN8j73J31J3o4k5
3427i6K75l6kk9j30q6K67j91j06J34R0Qj16R1j36J2K19k46J9l9p1J83N8k1k36
3452a85N26o09K67O3j56J5P8j30k9Q6J39Q4m68L24N0k45Q4J51j15j23J29QL33
3475B77r7k17O7r6J31J98k31J04r0k90M08r2r6k8N7k3k1P8J00j26Q8j80J7L36
3499B74k81Q1j94J36J3K46k68PK59n12J95k75N44k61k19J75j07J77k9k5N7L3m3
3522a7P9K4j49L1O9j61K72j96q8K18o7j89M75l15K10k39N2J76j21J39n9p5M8j73
3546e6K65n58L93J29Lk28O4J16j54rN7P2l13K30j19m3P9j7J62o1j74J46k4J35
$$ y = [88, 15, 70, -180, -239, 2, 63, 11, 34, -20, 152, -15, -273, -155, 38, 94, -18, 52, -5, 190, -117, -112, 14, -44, -55, 84, -84, -21, -30, 227, -179, 57, 71, -152, 18, 191, 68, -2, -112, -47, 46, 54, 108, -60, -33, -36, 22, -151, -20, -7, -71, -96, 179, 143, 141, 112, -18, -104, 163, -28, -134, 0, 90, 98, -18, 73, -63, -51, 168, -78, -59, -98, -169, 14, 72, 51, -185, 341, -268, -1, 62, -94, -79, -1, -131, -160, -74, 65, 149, -319, 5, 55, -190, -106, 45, -70, -193, -64, -56, 277, 180, -37, 30, -66, 65, 263, 32, 136, 46, -244, 164, 72, -24, -52, 5, -18, -39, 39, 139, 13, 101, -79, -62, 274, -7, 74, -120, 16, 29, 275, 7, 14, 273, -239, -44, -319, 225, -36, -255, -80, -187, -10, -39, -64, -7, 26, -17, 62, 86, -63, -32, 37, -124, 148, -48, -136, 82, 15, -174, 301, -14, 196, -43, 9, 185, 64, 203, 144, 69, 117, -56, 209, -349, 44, 173, 176, -52, 12, 128, -26, -35, 22, 94, -219, 11, -108, -151, -72, -89, 73, 12, -162, -16, -40, 95]
3570I5m1j59k10K99O2P3N5J3j4l69J60m0N5P4k49K67M9M7k48o7J61J72l06K23
3594A02k83J22O5j89L0K94j7k04J93j41J28m9n5R8L4k5j36J70k36J20J5k90J12
3617a42J25L5R1k9j09n7ooJ23q4n8P4j36M00j25k92K36J3J00j85K7J17q3Q2M3
3642A54n78L97o1k0o7J39K39j42L0l8Rrm8j29K18J9P7j22j87J64l12J31o3J72
3666b7R9q1r1m2n7L07L2m07K74j76L1L48l15J03n9R7j5o1J4j68K70k9j36R4M9
3691E4M9j62n0J56J12p5k69J52j51J19p7L5L46k61K10m57J9L01J04k47L5l0j25
3714b12K43j79J84lk52J97J13j05p7J59J52j52j10O6N0pr9K7L6j62N0K56k88J16
3738CJ25p0M2j26q8lp2K19j93K55j22j88K96m5j50J26J20l20K18j43L3K08j94
$$ y = [95, 54, -105, -315, -16, 46, 119, 174, 187, 173, -196, -36, -76, -21, 53, -196, 71, 120, 167, -81, -148, 13, 185, -121, 102, -181, -59, 6, -183, -153, 141, 124, -80, 113, -28, 100, 51, -4, 94, 128, 103, -33, 137, -99, 21, 36, -254, -142, -17, 18, 109, 80, -29, -86, -92, -98, 25, -59, -117, -43, -179, 221, 96, -196, 40, 53, 153, -32, -5, 112, 29, 111, 154, -424, -27, -88, -108, -175, -36, 203, 61, 91, 53, 62, 53, 5, -124, 94, 113, 190, 68, -119, 45, -267, -136, -199, -27, 72, -9, -100, -142, -199, 108, 140, -267, 7, -169, -138, 210, -105, -2, -61, 36, 21, -40, -26, -194, 76, 47, -89, 5, 54, 103, -59, -109, 47, 159, 84, -185, -33, -184, -65, -142, -107, 239, -22, 188, -269, -250, 51, 155, -92, -57, -87, -212, 31, -148, 36, 33, -219, -22, 91, -14, -91, 68, 220, 68, -42, 24, 74, 67, -32, -5, 31, -131, -81, 175, -113, 3, 128, 58, 100, -26, -114, -117, -189, 30, -163, 92, -30, -218, 78, 33, -117, 9, 129, -191, 27, -116, -83, 125, -69]
3761f9J1q0m1L70k92Q9J20j2j6P1k57P9M04m29o9j90M75o5j29J47P5k91K32j04
3785B9L1k94K1O4K34k45M09j97k58J32M1k66J87K90k48k5on1P2k8r2J87l81N58
3809A64j87P9q6j19L67l79j89M29P8l17K5K96Jk43K29j48q5N4J21n5Q8M2R5m61
3833b01K71k69J91mQ0N5j08k5M5p6J66j91r2J99NM7k36R6J61P5j87J69n1j9k28
3858a27K84j68L42k57j79K91m3j47r5J73K0j99k7K55j78k26J27J2Q0J62j09l5
3880d4p2J2J49j13J15J19j76L64m34M8k7M1j74K34k0L0k40L86l27J52O5j20K76
3903B44p2j44K40r0k55K20l04K77q0l09M42n3k72L85j92qm2J50j97J94l84K16
3925c4K61m1k13l6LpJ37l03K12k73K96k03Q8o2M41k53K18N2l92o6J36J20j56K9
$$ y = [-69, -58, -138, -179, 191, -101, -12, 108, 96, 80, 151, -106, -27, 377, -52, -121, -311, 164, 99, -30, 117, 192, -99, 133, 29, 60, -234, -213, -149, 85, -160, 249, 52, -206, -74, -33, -299, -112, 178, -70, -95, -101, -152, -80, -108, -200, -13, -394, 164, -23, 56, -30, -149, 218, -161, -350, 79, 157, -160, -135, 161, 162, -81, 148, 0, -85, -31, 90, 35, 123, 165, 260, -201, 70, -199, -8, -12, 68, 123, 15, -10, 35, -41, 125, -66, -158, 41, 46, 93, -143, -47, 114, 189, 2, 171, 120, 101, -127, 157, -11, 331, 74, -105, 186, 143, -4, -99, 74, 94, -105, -132, 123, -55, -281, -154, -142, -62, 100, -9, -44, -116, -104, 45, -68, 47, 166, -10, 354, -80, -32, -59, -18, -192, 42, 22, 52, -188, 198, -129, 23, 88, -32, 244, 172, 28, 268, 178, -77, 143, -161, 116, 36, -273, 169, 116, -156, 229, 37, 29, -13, 137, -60, 134, -250, -34, 227, 186, -27, -63, -60, -67, 70, -233, -21, -294, 2, -201, -113, -175, 266, 13, 231, 283, -109, -175, -39, 81, -75, -46]
3949d6j06P0J20j01J54J20k15J10Rj85n3K34k53K52Pj35J31j40j7N6J73q2l11
3972b08K85K16m22J92k03J59j84J53l5q4Q8o4K42oJ86j00k10j53l6L14l4m7K2
3995G1k20lJ16J9j42P9M6K64k67N5O3j54l6J44j0j81J19P3R2j8j37k8q7r6L65
4020A27n1R0j05N0l57J93k3K2L21m63K89m0k14K80p8P5n5p7j08L71l90K28J6r7
4044Dl7k2J97j30l3K99n01K79k89K47j56m4J00M21l81J46p8J52k48NN4m7K05j55
4068a2Q4k29K42m27N17l63J34k5K6j83O5K31m8J58j57r7j30M14m17L06k7KQ6j66
4092a6K74k08J25m83M50k44J04L0j77K25j29J78j14j27J60J64k78J99j22j69J79
4113B1J48l26L31lk64J35j27L6J5K21l40R9L4l09J93J31N3l0q9P1J69o8j05l89
$$ y = [-46, -152, -82, 38, -63, 91, 211, -4, 106, 115, -70, -123, 111, -142, 110, 117, -18, 113, -27, -44, 12, 185, 103, -208, 77, 293, -129, 63, -140, 19, -165, -12, -47, -131, -43, -107, 135, 129, 315, 215, 5, -148, -184, 130, 96, 49, 71, -149, -152, -36, -17, -159, -80, -34, 230, -37, 18, 81, -73, -109, 35, 25, -156, -37, 36, 128, 110, -27, -55, -142, -238, 127, 76, 166, 61, 111, -246, -53, -76, -54, 267, -196, 93, 53, -161, 119, 41, 116, 61, -16, -124, 247, -143, 85, 101, 4, -33, -55, 142, 12, -21, 278, -223, 56, -233, 14, -142, -186, -86, 335, -46, 100, 22, 174, -74, -69, -15, -62, 143, -12, 72, -157, 85, -342, 175, -188, -54, -79, -53, -236, -171, 60, 12, 170, 13, -84, -214, 200, -217, 89, 62, 64, 150, -16, 258, 50, 175, -308, 142, -102, 2, 32, -145, 80, -49, 129, 15, -112, 48, 212, -66, 133, 11, -158, 21, 169, -157, 174, 171, -93, 42, -85, -49, -34, 187, -153, -54, -20, -329, -136, -5, 48, 18, -71, 0, 169, 101, -4, -393]
4137c93L34j16J91Q5j1l9J05k02j67L01p7J8r2J70m0J1n1m8l5j19J97K49k8k96
4161e3p5OJ84K0l7p7P5Q5q1Ql29R2L87j76j78J95Q3J9k10J4N9k07Q7mQ3j29P4
4188h5r9L91k45j78J39M5K45k21p0p8Q4kj21K99n6l41L20j08P6R7k89L64j38j64
4212a35J3K74k03K06k91M3K57m15K66j14k7L90j17n7P3k5J12l32K4N4J97j25N0
4235A18j21J0P0J40j88j62P3J31n4J60j97J23j22p2J91J5j16K10j78r1k9n6K99
4258A54l26R0L5o8K4J54r3k45J94j2j08K33j16M27m38j04N5L81pk20Pm7J77k18
4282g1J39j37n3P5K1J30n4qMj11M6j21K05n1K1m4j98J81Q7k15j2J41l8J49j12
4307b6j43m1J56j51K04Q7L7j40k24K85Ll11J06L1NK30k0m8k69K06J12j22p3L9
$$ y = [-393, -59, -175, 16, 101, 90, 51, 156, -46, -213, 88, 11, 29, -63, 107, 67, 78, 27, -21, -56, -175, 22, 271, 243, -53, -128, -122, 62, 82, 45, -32, 43, 128, 47, 55, -274, -182, 205, 29, -149, 46, 129, 148, -62, -48, 11, -196, -109, -113, -30, -159, -85, -184, 207, -38, -216, -77, -32, 213, -8, -78, -156, -72, -74, -195, 104, 48, -293, 27, -81, -5, 92, -197, 167, 29, -135, -122, 152, -51, 155, -136, -93, 164, -251, 15, -99, -126, 264, 147, 90, 163, 138, 250, -82, -58, -4, 193, 68, 118, -3, 7, 77, 217, 29, -133, -60, 71, 17, 177, -20, 103, -19, -91, 100, 115, -1, 209, 31, -60, -89, -145, 154, -172, -82, -47, -115, -91, 63, -30, -275, -81, -93, -201, 32, -84, 343, -95, -199, -144, 237, 230, 10, 17, -30, 147, -71, 68, -69, -122, -47, -26, 104, 50, 42, 46, -65, -19, -140, 65, 14, 35, -9, -207, -26, 61, -154, -166, -25, -63, 86, -26, -169, -210, -54, -205, -1, 86, 123, -17, -241, 44, 47, -264, -158, -127, -122, 108, 88, 40, -229, -23, 89, -33, -106, -67]
4331f7j7J51L4j16M8J9J24k34j0o1L2k4L3K01o5k23L64j76j18J02n2j15K40r8
4355b8j68O0J51q4J98j51N0K9m5j74K48M3j94K35O6k17J0L5M6j67J28j05K5k27
4379b36K39K00j40P7k05J7RR8l12J33Q7NJ09L4j0P6l05J37o0k46M43n0JJ53n50
4404b96J48L74l92K41J27mj80O6j6l3n9j74J01j17l3qL75j27J60l83L1J90K35
4427B26n37K21m9O3nL07k06K11j17j61R2l2J71p2K5j15k5q1j9jJ77%O6m7R3k79
4453i4L7R4K60k71K0o2j8j79K16J63k76R1M2k60M55l16J33k9j96L85k52m8K9L30
4477B54j66r6k6r5J87mj81J18j82M4j81K92J52j79k4K32J6k57J08L6R5q0k82K9
4501a90N11j12k35j56K18R5j66J57m60O20m33O3R7k19L27j91j31K66j3j07K12
$$ y = [-67, -84, 67, 101, -15, 33, 52, 176, -58, -68, -129, -97, -121, -88, 113, 48, -175, 189, 13, -105, -3, -55, -170, 70, -28, -196, -136, 15, -69, 129, -22, 28, 57, 12, -162, 86, 129, -65, 170, 236, 19, 29, 64, 110, -57, 71, -34, -9, -236, 3, 203, 63, 140, -65, -48, -39, 59, -253, -120, -33, -28, 81, 115, 105, 181, -124, 13, -47, -293, 150, 100, 101, 254, -296, -148, 226, -166, 75, 202, 198, 18, 84, 68, 35, -24, -198, -97, -214, -247, -255, 120, -7, 153, -230, -199, -9, 226, -311, -90, -139, -76, -81, 226, 20, 231, 114, -47, 45, 13, 184, 112, 137, 22, -3, -84, -103, -104, 73, 73, 139, 92, 185, -94, -57, 37, 297, 26, 46, -16, -34, -213, 3, 166, -110, -19, 23, -237, 218, -98, 35, 6, -190, 195, -57, -105, -76, 254, 88, -8, -34, -129, 58, 54, -127, -9, -191, -147, -328, -36, 116, -63, -87, 145, 161, -96, 12, 48, 143, 63, -219, -190, 321, 209, -26, -182, 36, 131, -35, 122, -338, 282, -151, -88, 9, -210, 117, -74, -205, 61, 48, -59, 153]
4522A53K5k13J25l54K99l5k14R1P0Mj48O7J88r5j1L99k38k61K70k62J54r6m3K65
$$ y = [153, 178, -35, 90, -264, 35, 0, -214, -123, -53, -49, -197, -130, 58, -37, -48, 351, 113, -148, 122, -140, 14, -82, -125, 140]
$$ [...]
8191a1
##END NTUPLES=NMR FID
##END=
