##TITLE=1H_LR-733-R2A
 CDCl3,8 sc, 
 1.03.2021
##JCAMPDX= 6.0         $$ Bruker NMR JCAMP-DX V2.0
##DATA TYPE= NMR FID
##DATA CLASS= NTUPLES
##ORIGIN= UXNMR, Bruker Analytische Messtechnik GmbH
##OWNER= root
$$ XWIN-NMR		Version 3.5
$$ Mon Mar  1 13:09:41 2021 Russian Standard Time (UT+4h)  she@DPX200
##.OBSERVE FREQUENCY= 200.1315066352
##.OBSERVE NUCLEUS= ^1H
##.DELAY= (6, 6)
##.ACQUISITION MODE= SIMULTANEOUS
##.ACQUISITION SCHEME= undefined
##.AVERAGES= 8
##.DIGITISER RES= 18
##SPECTROMETER/DATA SYSTEM= spect
##.PULSE SEQUENCE= zg30
##.SOLVENT NAME= CDCl3
##.SHIFT REFERENCE= (INTERNAL, CDCl3, 0, 15.7039)
##AUDIT TRAIL= $$ (NUMBER, WHEN, WHO, WHERE, WHAT)
$$ ##TITLE= Audit trail, XWIN-NMR		Version 3.5
$$ ##JCAMPDX= 5.01
$$ ##ORIGIN= Bruker BioSpin GmbH
$$ ##OWNER= she
$$ F:/spectra/data/she/nmr/H-F/1/audita.txt
$$ ##AUDIT TRAIL=  $$ (NUMBER, WHEN, WHO, WHERE, WHAT)
(   1,<2021-03-01 13:08:24.09 +0400>,<she>,<DPX200>,
      <created by zg, POWCHK disabled, PULCHK disabled
       configuration hash MD5:
       00 E9 B6 7A A2 85 ED C7 34 08 36 98 17 FE 4E 26
       data hash MD5: 16K
       CA FD 0F 69 B6 50 9F BA 9A 03 A7 09 7E CD 15 A0>)
$$ ##END=
$$ 
$$ hash MD5
$$ 20 86 D1 79 78 78 DF 32 63 55 F1 A9 6B 3F BB 13
##$RELAX= 
##$RELAX= 
##$RELAX= 
##$RELAX= 
##$RELAX= 
##$RELAX= 
$$ Bruker specific parameters
$$ --------------------------
##$DU= <F:/spectra>
##$EXPNO= 1
##$NAME= <H-F>
##$PROCNO= 1
##$TYPE= <nmr>
##$USER= <she>
##$AMP= (0..31)
100 100 100 100 100 100 100 100 100 100 100 100 100 100 100 100 100 100 
100 100 100 100 100 100 100 100 100 100 100 100 100 100 
##$AQSEQ= 0
##$AQ_mod= 1
##$AUNM= <au_zg>
##$AUTOPOS= <>
##$BF1= 200.13
##$BF2= 200.13
##$BF3= 200.13
##$BF4= 200.13
##$BF5= 200.13
##$BF6= 200.13
##$BF7= 200.13
##$BF8= 200.13
##$BYTORDA= 1
##$CFDGTYP= 0
##$CFRGTYP= 5
##$CHEMSTR= <none>
##$CNST= (0..31)
1 1 145 1 1 1 1 1 1 1 1 1 1 1 1 1 1 1 1 1 1 1 1 1 1 1 1 1 1 1 1 1 
##$CPDPRG= <>
##$CPDPRG1= <>
##$CPDPRG2= <>
##$CPDPRG3= <>
##$CPDPRG4= <mlev>
##$CPDPRG5= <mlev>
##$CPDPRG6= <mlev>
##$CPDPRG7= <mlev>
##$CPDPRG8= <mlev>
##$CPDPRGB= <>
##$CPDPRGT= <>
##$D= (0..31)
0 1.2 0 0 0 0 0 0 0 0.06 0 0.03 0 0 0 0 0.0002 0 0 0 0 0 0 0 0 0 0 0 0 
0 0 0 
##$DATE= 1614589703
##$DBL= (0..7)
120 120 120 120 120 120 120 120 
##$DBP= (0..7)
150 150 150 150 150 150 150 150 
##$DBP07= 0
##$DBPNAM0= <>
##$DBPNAM1= <>
##$DBPNAM2= <>
##$DBPNAM3= <>
##$DBPNAM4= <>
##$DBPNAM5= <>
##$DBPNAM6= <>
##$DBPNAM7= <>
##$DBPOAL= (0..7)
0.5 0.5 0.5 0.5 0.5 0.5 0.5 0.5 
##$DBPOFFS= (0..7)
0 0 0 0 0 0 0 0 
##$DE= 6
##$DECBNUC= <off>
##$DECIM= 32
##$DECNUC= <off>
##$DECSTAT= 4
##$DIGMOD= 1
##$DIGTYP= 9
##$DL= (0..7)
0 120 120 120 120 120 120 120 
##$DP= (0..7)
150 150 150 150 150 150 150 150 
##$DP07= 0
##$DPNAME0= <>
##$DPNAME1= <>
##$DPNAME2= <>
##$DPNAME3= <>
##$DPNAME4= <>
##$DPNAME5= <>
##$DPNAME6= <>
##$DPNAME7= <>
##$DPOAL= (0..7)
0.5 0.5 0.5 0.5 0.5 0.5 0.5 0.5 
##$DPOFFS= (0..7)
0 0 0 0 0 0 0 0 
##$DQDMODE= 0
##$DR= 18
##$DS= 0
##$DSLIST= <SSSSSSSSSSSSSSS>
$$ [...]
##$SUBNAM2= <"">
##$SUBNAM3= <"">
##$SUBNAM4= <"">
##$SUBNAM5= <"">
##$SUBNAM6= <"">
##$SUBNAM7= <"">
##$SUBNAM8= <"">
##$SUBNAM9= <"">
##$SW= 16.9725356469052
##$SWIBOX= (0..15)
0 0 2 0 0 0 0 0 0 0 0 0 0 0 0 0 
##$SW_h= 3396.73913043478
##$TD= 16384
##$TD0= 1
##$TE= 0
##$TE2= 300
##$TE3= 300
##$TEG= 300
##$TL= (0..7)
0 120 120 120 120 120 120 120 
##$TP= (0..7)
150 150 150 150 150 150 150 150 
##$TP07= 0
##$TPNAME0= <>
##$TPNAME1= <>
##$TPNAME2= <>
##$TPNAME3= <>
##$TPNAME4= <>
##$TPNAME5= <>
##$TPNAME6= <>
##$TPNAME7= <>
##$TPOAL= (0..7)
0.5 0.5 0.5 0.5 0.5 0.5 0.5 0.5 
##$TPOFFS= (0..7)
0 0 0 0 0 0 0 0 
##$TUNHIN= 0
##$TUNHOUT= 0
##$TUNXOUT= 0
##$USERA1= <user>
##$USERA2= <user>
##$USERA3= <user>
##$USERA4= <user>
##$USERA5= <user>
##$V9= 5
##$VALIST= <valist>
##$VCLIST= <CCCCCCCCCCCCCCC>
##$VD= 0
##$VDLIST= <DDDDDDDDDDDDDDD>
##$VPLIST= <PPPPPPPPPPPPPPP>
##$VTLIST= <TTTTTTTTTTTTTTT>
##$WBST= 1024
##$WBSW= 4
##$XGAIN= (0..3)
0 0 0 0 
##$XL= 0
##$YL= 0
##$YMAX_a= 904855
##$YMIN_a= -821023
##$ZGOPTNS= <>
##$ZL1= 120
##$ZL2= 120
##$ZL3= 120
##$ZL4= 120
##$ABSF1= 10
##$ABSF2= 0
##$ABSG= 5
##$ABSL= 3
##$ALPHA= 0
##$AQORDER= 0
##$ASSFAC= 0
##$ASSFACI= 0
##$ASSFACX= 0
##$ASSWID= 0
##$AUNMP= <proc_1d>
##$AZFE= 0.1
##$AZFW= 0.1
##$BCFW= 1
##$BC_mod= 2
##$BYTORDP= 1
##$COROFFS= 0
##$CY= 11.3945322036743
##$DATMOD= 1
##$DC= 2
##$DFILT= <>
##$DTYPP= 0
##$F1P= 15.9154993809931
##$F2P= -4.1035820241983
##$FCOR= 0.5
##$FTSIZE= 0
##$FT_mod= 4
##$GAMMA= 1
##$GB= 0.15
##$INTBC= 1
##$INTSCL= 1
##$ISEN= 128
##$LB= 0.24
##$LEV0= 0
##$LPBIN= 0
##$MAXI= 10000
##$MC2= 0
##$MEAN= 0
##$ME_mod= 0
##$MI= 1.114404
##$NCOEF= 0
##$NC_proc= 0
##$NLEV= 6
##$NOISF1= 3.799351
##$NOISF2= 2.8
##$NSP= 1
##$NTH_PI= 0
##$NZP= 0
##$OFFSET= 15.70392
##$PC= 1
##$PHC0= -10761.19
##$PHC1= 10.80094
##$PH_mod= 1
##$PKNL= yes
##$PPARMOD= 0
##$PSCAL= 0
##$PSIGN= 0
##$REVERSE= no
##$SF= 200.130013532006
##$SI= 16384
##$SIGF1= 3
##$SIGF2= 2
##$SINO= 400
##$SIOLD= 16384
##$SREGLST= <1H.CDCl3>
##$SSB= 0
##$STSI= 0
##$STSR= 0
##$SW_p= 3612.71676300578
##$SYMM= 0
##$S_DEV= 0
##$TDeff= 0
##$TDoff= 0
##$TI= <>
##$TILT= no
##$TM1= 0
##$TM2= 0
##$TOPLEV= 0
##$USERP1= <user>
##$USERP2= <user>
##$USERP3= <user>
##$USERP4= <user>
##$USERP5= <user>
##$WDW= 1
##$XDIM= 8192
##$YMAX_p= 0
##$YMIN_p= 0
$$ End of Bruker specific parameters
$$ ---------------------------------
##NTUPLES= NMR FID
##VAR_NAME=  TIME,          FID/REAL,        FID/IMAG
##SYMBOL=    X,             R,               I
##VAR_TYPE=  INDEPENDENT,   DEPENDENT,       DEPENDENT
##VAR_FORM=  AFFN,          ASDF,            ASDF
##VAR_DIM=   8192,          8192,            8192
##UNITS=     SECONDS,       ARBITRARY UNITS, ARBITRARY UNITS
##FACTOR=    0.0002944,     1,               1
##FIRST=     0,             0,               0
##LAST=      2.4114304,     0,               0
##MIN=       0,             -821023,         0
##MAX=       2.4114304,     904855,          0
$$ Real data points
##PAGE= N=1
##DATA TABLE= (X++(R..R)), XYDATA
0@%%%%%%qJ6j6J6j6J8k6M0n6O4q0J03j19J44j76K07k43K88l37L89m50N21o00O90
30C69p88Q94j014J145j289J451j628J822k034K265k517K796l100L430l789M181
46B194m612N084n598O163o789P480q247R102j0059J1141j2379J3805j5468J7440
60I257j9817K2746k6457L1322l7995M7714o3157R1294j57855N90166M17637j115456
72b10601P87344m8436k52132M66698l90002p1713K31377j35351L77601l08104
82D46681l31120K81078r5857K21781k25195n90081P59617j03865o68431O26189
92C20797l25341n05826O60112k36346k69731K03177k46219K85127R2763m49891
102d71378K02922L7755j22159J24237j21030J29078o3700j65964M96280k67149
$$ y = [0, 0, 0, 0, 0, 0, 0, -8, 8, -8, 8, -8, 10, -16, 24, -32, 32, -48, 55, -64, 80, -96, 111, -132, 156, -181, 208, -242, 279, -321, 369, -419, 475, -539, 606, -683, 768, -860, 962, -1072, 1193, -1324, 1472, -1628, 1802, -1987, 2194, -2418, 2666, -2932, 3231, -3558, 3922, -4325, 4777, -5282, 5859, -6520, 7285, -8183, 9257, -10560, 12186, -14271, 17051, -20944, 26770, -36387, 54907, -102948, 487218, 904855, -210601, 576743, 528307, 276175, 742873, 352871, 281158, 512535, 377184, 754785, 446681, 115561, 396639, 300782, 522563, 297368, -292713, 466904, 363039, -305392, 320797, -4544, -510370, 149742, -86604, -356335, -153158, -399377, -114250, -21487, -471378, -268456, -230701, -352860, -228623, -349653, -220575, -284275, -450239, 46041, -221108]
112b21108m21516N95560j15026k73044M37204j61453l8439L04945k07107Q6918
122a3066J00000k26877K16782R7674j39503N9769j4809J23783l1023k26273K43814
133A90271l3507k27140L39317n2528k22082K52332o2668n1728R3850k20127J12863
144A18853J09832k39004J28029L1024j75847J13603n3076q0531L4681j06748J21452
155B268K8541j73955J65831m192j36337J33463j10033m3694J44280j45311O3056
166g6083J07235j90553R3719M5892j45640J03086k0316j5237J24183r0104P8231
177A4413Q7139j57531J04249K9219j18680J30195l9118m4579J18756r9781K3310
188D7592N2448j41975Q5077P983r6810J31851n1276l9372J28438j09143j1799
$$ y = [-221108, -642624, -47064, -162090, -435134, 2070, -159383, -197822, 107123, -99984, -13066, 86934, -139943, 76839, 174513, 35010, 94779, 79970, 203753, 172730, -53543, 190271, 156764, -70376, 268941, 216413, -5669, 246663, 183995, 132267, 226117, 5990, 118853, 228685, -10319, 117710, 148734, -27113, 86490, 33414, -47117, -12436, -119184, 2268, 30809, -143146, 22685, 18493, -117844, 15619, -94414, -138108, 6172, -139139, -76083, 31152, -159401, -65682, -19790, -165430, -62344, -82660, -97897, 26286, -63818, 14413, 101552, -55979, 48270, 77489, -41191, 89004, 49886, 5307, 124063, 24282, 47592, 100040, -41935, 43142, 51125, -45685, 86166, 34890, -4482, 123956, 14813, 3014]
199C014O1878j18096N1733J5078q1103Q3461m1407l2981O3296j02413J7027M6863
211c3650q2997Q7837J7659n7938J01938m0898l8795P4397p2496J0519N0735n8572
223d2261N8275O787n1941N6778m1140j9393N7980m8829K7800M7310l5756N2727
235F8337k352m5247M4259l5404k3943M0315l6428J2146K5777l9237J2954j2348
247H829k8944K3112k4114O396L8961k3070K3676J7710m5479J2047l047l5193J6452
260a2664m022o768J8925j3956o368Q34j6511j044k571J0277J8994k905K4143J2260
274A8624k9669J1051O509l4703O011J6389q473R075Q172o283j228m421p260M888
288a1318J0430O289J4427K1902l397j0092J1449j0103k5673O626P870j0546N676
$$ y = [3014, 64892, -53204, -1471, 13607, -67496, 15965, -25442, -58423, 4873, -97540, -80513, -33650, -116647, -28810, -11151, -69089, 32849, -8049, -46844, 27553, -44943, -34424, 16311, -42261, 16014, 22801, -29140, 27638, -13502, -32895, 25085, -23744, 4056, 51366, 15610, 68337, 65985, 20738, 64997, 29593, 5650, 45965, 9537, 21683, 47460, 8223, 21177, 8829, -20115, 2997, -21117, -14721, 24240, 1170, 24846, 42556, -2923, 9124, 6077, -29116, -12664, -16686, -23454, -4529, -18485, -24853, -24019, -40530, -41574, -44145, -33868, -14874, -17779, 6364, 18624, -11045, 6, 6515, -28188, -22177, -5788, -14261, -5186, 2986, -3297, -4525, -8946, -16206, -11318, -888, 5401, 19828, 41730, 38333, 28241, 39690, 29587, 3914, 10540, 18410, 7864, 13540]
301A3540R829q734p212j660p080n057M145O561J1376Q703j821R66q09j7206j3483
316g942L9o479m570Q208L038o090k548k424r923n725M461R044O227O908J2088
331D312m55j1828n3p105j6126N853Q088k273O032N677J926m053p181Q296M974
346c916j141J7194J2937M361J875l302O945j3451k3146K1248P87k0537K3027L869
360B6750j5167P567p882q05R64j9431K5761J7460k5470J1801R031j9130j4289
373b840j1842J2170j4989k5004M7573k094m7876L5191J153l0005J7141q945J1944
386a8423K0319k3912K9076O924m8234K7087N243k3998Q729j5125L1168J8807n0640
399c2979L7835J6319n1584M2374R267k8164K6701n758K7435R303o4581M4650J5633
$$ y = [13540, 23369, 14635, 7423, 5763, -1317, -6374, -2229, 4332, 15708, 24411, 22590, 23556, 22747, 5541, -7942, -7903, -14382, -18952, -10744, -7706, -13796, -16344, -18768, -28691, -34416, -29955, -20911, -14684, -7776, 4312, 3857, -7971, -8024, -15129, -31255, -25402, -17314, -19587, -13555, -7878, -5952, -10005, -17186, -8890, -3916, -5057, 12137, 25074, 29435, 31310, 28008, 34953, 21502, -1644, 19604, 20391, -146, 22881, 26750, 11583, 19150, 11268, 10463, 11427, -8004, 17757, 35217, 9747, 21548, 30579, 11449, -2840, -14682, -2512, -17501, -42505, 5068, 2974, -44902, -9711, -8558, -38563, -21422, -30367, -18423, 1896, -22016, 7060, 13984, -34250, -7163, -1920, -25918, -17189, -32314, -1146, 17661, -32979, 4856, 21175, -30409, 11965, 21232, -6932, 19769, 14011, 41446, 50749, -13832, 30818, 46451]
412D6451o8055M0840j92l0573M5984k2183J817J6242n8928M6350K2894p0966M2808
425A2489Q482j9716L8094m9235j923K5251o4740M4624J0454p2618O3006n105k9938
438d0875N0959o9256J4024O6480q8705M1949M6931q5186O0719J6563n9675L9173
450f899l1260J0457L5239o3643O0032J0181o1137R6327m0547m5720J04720p6801
462i051N483R7260r6685M1375M7726r2815O5822o465n6835O7550n1882R375O1122
475H1980p8032M1973k796o4988R7987n6783m9124R9343q6572J9883P2651j34843
487e9321M6068L6504r8170Q7938l2195q0486J05862k6407k5964K8228n8814N5561
499b1196j106m6313P9921p5684q552J29720j04109j5251P4150r0193O6354L6100
$$ y = [46451, -21604, 19236, 19044, -11529, 34455, 12272, 14089, 30331, -28597, 17753, 40647, -30319, 12489, 20971, 1255, 39349, -9886, -11809, 13442, -51298, -6674, 3780, -68838, -5832, -10937, -40875, 10084, -59172, -45148, 21332, -67373, -25424, 21507, -63679, -2960, 13603, -46072, -6899, -38159, -27702, 7537, -56106, 3926, 14107, -47030, 49297, 8750, -36970, 67750, -9051, -3568, 93692, -2993, 38382, 86108, -6707, 59115, 52650, -4185, 63365, 11483, 20858, 81980, 3948, 45921, 43125, -21863, 76124, 19341, -29783, 69560, -17012, 2871, 75522, -59321, -13253, 23251, -74919, 13019, -19176, -99662, 6200, -20207, -46171, -17943, -76757, -21196, -22302, -68615, 11306, -64378, -72930, 56790, -47319, -62570, 11580, -78613, -12259, 23841]
511B3841j04934Q0973J0977m8793Q3757m9039l0115O4043l1047L5665o792n7316
523b8780R4362k7568n4629Q0438o7995p232Q0057p6653L1512K3709p7047R8970
535F9144j8841r7542J00730k4116m1265O8536n8133J1645K9370o1037O0663l3368
547E786o2569R9180m7319k8121O9995p7851M0523M3624j06442P0729Q406q0420
559f4479R6039l2003n0321P3070n3948K1081K6808r4108P6073J0734p2586R3250
571B9610m1789m0848R2099o2224J0512L8431q4810P9055J2934p8967Q4562m3284
583d719l1950R1166q2908R891N6212q5867P5048J1641q7291Q7523l2690l0775
595b4719Q1378q6275J9991O0246q7711O6692k108p9467R3112m2566l0344P9374
$$ y = [23841, -81093, -120, 10857, -37936, 45821, -3218, -33333, 30710, -337, 35328, 28536, -28780, 65582, 38014, -16615, 63823, -4172, -11404, 68653, -8000, 23512, 47221, -29826, 69144, 50303, -47239, 53491, 29375, -11890, 56646, -1487, 10158, 39528, -21509, 39154, 5786, -56783, 42397, -4922, -33043, 36952, -40899, -376, 43248, -63194, 7535, 15941, -64479, 31560, -443, -50764, 22306, -31642, -10561, 16247, -77861, -1788, 8946, -63640, 29610, -12179, -53027, 39072, -23152, -12640, 25791, -59019, 20036, 32970, -45997, 38565, -4719, -36669, 54497, -28411, -18520, 37692, -48175, 26873, 38514, -48777, 38746, 6056, -24719, 56659, -29616, -9625, 50621, -37090, 29602, 27494, -51973, 41139, -1427, -31771, 47603]
607D7603q3846K9895N7377q7177O4106n091o4120R1909n2028k4808Q2164p9199
619b3215K3003M7625q0368N1622o302m8824P3654n2080p734P0486p6103K4179
631d057L8162o9942M9739q976m0854O6284m7442q557N7955o6725J8770K9753n5540
644d1430M2700j1556k6409O0789m5095p134N5658n4036J2917L0559m2941K9474
656C496l932j6040M2968l9963j905M2845m3127J3277K0511l1641L2406o087j8904
669f096L9980l0371q831M0320l3614J55K5051k1318J1482n711j3470K4420k1327
682F70l644K1963k4357Q030J4212k2041J6228r020j4520K9835k1421j4850L1470
695A2555j9603p782K0424j7284r92N970q705R125q188k115J5309j1200K198N690
$$ y = [47603, -36243, -6348, 51029, -36148, 27958, 22867, -41253, 50656, -1372, -26180, 55984, -23215, -212, 47413, -32955, 18667, 12365, -36459, 37195, -14885, -22619, 47867, -28236, -4057, 34105, -35837, 13902, 4926, -35928, 30356, -17086, -25643, 32312, -34413, -15643, 14110, -41430, 1270, -10286, -36695, 24094, -21001, -28135, 27523, -26513, -13596, 16963, -25978, 3496, -436, -16476, 26492, -13471, -15376, 27469, -15658, -2381, 18130, -13511, 18895, 12808, -6096, 33884, 3513, -5318, 35002, 1388, 1543, 26594, 5276, 16758, 11047, -2423, 21997, 670, -2974, 18989, -5368, 2662, 16874, -5167, 11061, 2041, -12479, 17356, -4065, -18915, 12555, -7048, -14830, 5594, -11690, -12682, -6712, -15417, -6292, -14480, -16595, -1286, -12486, -10288, -4598]
709d598j3033J2878k771j3326K1807r547j0633K6042j2942j0319J8577j0035L59
722g541J1149p765O596L043l301O568m441J714M427p015R926j422r426J5467n622
737A2357r719J5071q200m852J2476q611j03P965p208M47K471m554j015j916J663
752F272j377n666O364k687q138N830l034n176M923l665j58L918n486M35K866o142
768a0921k96K621j994j000J035J294j844j179K335j095j374L492N19J04J856o
784f453K329Q01j652K918J567k682K371M320j976n67M661R77l935K135N102k775
800G141j808O866J012m829J669L637k874l566K598L650m961k984N674p80o670
815C775K63M583l183m722J929M057m251o651N992R02p648m51L900O1r038K14J0490
$$ y = [-4598, -17631, -4753, -7524, -20850, 957, -8590, -19223, 6819, -6123, -16442, 2135, -7900, -7541, 3608, -4157, 2439, 5482, 2181, 8749, 4308, 6022, 10449, 3434, 13360, 11938, 2512, 17979, 12357, 2638, 17709, 9509, 4657, 17133, 8522, 8419, 16384, 9176, 9623, 12094, 7540, 6525, 4609, 6272, 4895, -771, 5593, 2906, -5232, 598, -2436, -7612, -2689, -6354, -6512, -2594, -8080, -7645, -4779, -10921, -11217, -8596, -10590, -11590, -10555, -9261, -11105, -12284, -9949, -11044, -12418, -8926, -8407, -8303, -6447, -6453, -4124, -3323, -4975, -2057, -490, -3172, -801, 3519, 1543, 976, 5637, 6614, 2679, 4814, 9916, 7141, 5333, 12199, 13211, 8382, 10051, 13688, 10814, 7248, 9846, 13496, 8535, 5551, 11225, 10445, 3775, 4038, 8621, 5438, 716, 2645, 6702, 2451, -4200, 1792, 2694, -4954, -5405, -1505, -1444, -10482, -10268, 222]
832B22p322j0553J2295K854j4117M112P502l689n633L610J0933r034q020J3613
846c227J863j2285N855N246J100l489l427J3801m589j0973J6576N074j6359P571
860B737O617J002m892n262J3521J588j7974J6168M863j8893O816O140P45o964
874F212j0086K0416m058k2176K1379m36k1222J5892O51p630K47j0533J4993Q03
888D452k4693J8475M705j7236J0510n319O03N345j6515K0219K766l1224K5858
901b054P422k3184J3995l198J900Q759j9881J8125P412l0118K7773N243k6260
914a4066K1273l831o50J0646k3769J9885J0404l1356K6175j362k3006K8014j2298
927F059m751J7353k9498J9907J5031l8819K2032K644j9413K4434j6438m646J7939
$$ y = [222, -7100, -17653, -5358, -2504, -16621, -12509, -5007, -8696, -14329, -10719, 214, -8820, -16840, -3227, -1364, -13649, -7794, -2548, -1448, -4937, -8364, 5437, 848, -10125, 6451, 11525, -4834, 2737, 9354, 10356, 5464, 202, 13723, 15311, -2663, 13505, 18368, -525, 6291, 12431, 13176, 6212, -3874, 16542, 12484, -9692, 11687, 11251, -9971, 5921, 6572, -1058, -811, -11344, 3649, 4452, -20241, -1766, 2939, -14297, -3787, -9106, -8503, -3158, -19673, 546, 3312, -27912, -2054, 5368, -17816, -3821, -7019, -5119, 3640, -16241, 1884, 9296, -20822, 6951, 12194, -14066, 7207, 3376, 2726, 13372, -10397, 9488, 19892, -11464, 14711, 13349, -9657, 18357, 6059, 1308, 18661, -10837, 9070, 24101, -14718, 7314, 9958, -9455, 14979, -1459, -6105, 11834]
940A1834k9392K2501R183m3012L0907M972k4039K5593k1095l702K8437k9039J4316
953b536Q154l5866L6540J185k8274K8846k0627J178L3249l7783J0596J7027l1560
966a9871L4203l543k9430L3462j8072K1K9962m2110J4820K2626l5224K9366m802
979A1408k9915L8946j6928q425K6894l7112J7054K0780m0193K7280k507k8542
991b1260M2264k2038j5650L4946l3468J0895K1300m1245K8420J439k9306L8873
1003A5170k2315j1312L8864l9081J0903K5661m1522L1647j84l3187M4511k0454
1015a299j3224L8227m0337J4845K5477m4785L2825m97l2336M5614k3238j4188
1027a2916L7317l7760J4109K1276m3029L2592k341l0284M2931k5868j1876L7369
$$ y = [11834, -17558, 4943, 14126, -28886, 2021, 6993, -17046, 8547, -12548, -16250, 12187, -16852, -2536, 5618, -30248, 6292, 7477, -20797, 8049, -12578, -11400, 21849, -15934, -5338, 11689, -19871, 14332, 10789, -18641, 14821, -3251, -3230, 26732, -15378, -558, 22068, -13156, 16210, 11408, -18507, 20439, 3511, -4914, 21980, -15132, 1922, 22702, -17491, 9789, 7282, -21260, 21004, -1034, -16684, 18262, -15206, -4311, 16989, -24256, 4164, 5603, -23703, 15170, -7145, -18457, 20407, -18674, -7771, 17890, -23632, 8015, 7831, -25356, 19155, -1299, -14523, 23704, -16633, -1788, 23689, -21096, 11729, 11232, -21104, 24510, 1272, -12916, 24401, -13359, 750, 22026, -21003, 11589, 9248, -21036, 21895, -3973, -15849, 21520]
1039B1520l9534J4809K1965m3310K9468J524k8296L7766k3312j0018L4756l4592
1051a7254J3256J9137m0330K9760L076k6473L3240k1070q426L4620l2062J0734
1063a792J9221l7647K8214N676k7244K8686j6586o250L2924l1964N932K1575l2720
1076a1975K2803L718k6978K8091j2511p325K7427l3433O919K5324l3621J6185
1088D624N483k5778K7441j1314j2139K4716k8290O502K5070l4334J1176R554k1003
1101a8292K4672j1920j4752K7919k1394L545K1302l3521J4057J6497k1298J7087
1113C902j2421q892L3870k3244l684K2469k6576J7923J4074k8775J7033l267n561
1126c149K7480k7275k763K6784k2941J1857N971k5347K3101m109r963K1930k6987
$$ y = [21520, -18014, -3205, 18760, -24550, 4918, 6442, -21854, 15912, -7400, -17418, 17338, -17254, -3998, 15139, -25191, 4569, 7645, -18828, 14412, -6658, -15084, 19536, -12526, -1792, 17429, -20218, 7996, 13672, -13572, 15114, -1472, -7722, 25202, -6762, -830, 20745, -11975, 10828, 14546, -12432, 15659, 3148, -4177, 23250, -10183, -3264, 22060, -11561, 4624, 10107, -15671, 11770, 456, -11683, 13033, -15257, -8755, 16315, -18019, -6843, 2711, -18292, 6380, -5540, -20292, 7627, -13767, -10222, 11080, -22441, -8384, 8113, -13185, 3902, -8519, -17411, 16459, -6785, -10469, 12000, -14576, 3347, 17421, -11354, 5679, 2412, -3149, 24331, -2944, -5707, 21077, -1864, 9993, 15964, -9383, 13718, 9609, -354, 21576, -5411]
1139e411L431K6867k7671P198O185j9819K2327o953j3769J8752j9410N114J7939
1152A4780k7504P500O539j4135J8022j1840r235K0931j6907L485J3060k3638J1343
1165g599Q280j4352J2453p095l910J5709j4400L118R829j5400J2031L802j1639
1178i173J2291n179j512J2840j3325L264J0693j2427P824L632r549Q091j513k276
1192C681O286q487M246N393q937O376M33o584O994m150k713O157p737K145N528
1207H631j0075K283M150p254R20P07j716P61k682L428j103n349M554j97m932L922
1223c952j626p81L709m506J001M035n799P08N030l426n39M150O75j603J161K311
1239E48o84j471K582P33p13J496p88J368J002l627J917L138m301N06M944k813
$$ y = [-5411, -1980, 24887, -2784, 4414, 10599, -9220, 13107, 6154, -7615, 11137, -8273, -3159, 14780, -12724, -5224, 1315, -12820, 5202, -6638, -15873, 5058, -11849, -8364, 4696, -18942, -7599, 681, -13671, -1218, -8313, -12223, 3486, -10914, -7796, 2033, -13367, -1336, 2466, -9173, 3118, -2061, -3573, 9267, -4058, -794, 9899, -2528, 5296, 8928, -621, 7470, 5957, 3681, 9967, 1480, 5726, 11119, 2182, 8558, 8991, 2407, 9401, 5251, 2538, 8695, 958, 3103, 8631, -1444, 839, 4989, -2265, -1345, -638, -2354, -1593, -4275, -847, -1950, -7299, -2745, -2942, -7874, -3952, -5578, -6359, -2650, -7156, -6155, -2120, -7919, -7211, -2181, -5607, -6146, -1996, -1321, -2924, -1763, 548, -136, -1607, 975, 1708, 995, 2491, 1703, 3071, 4073, 446, 2363, 5501, 1200, 1706, 6650, 3837]
1255C837j164L394j271k524J892k60j857R95K97j684O30J15k780K49J082k923
1271a972P93K681k178m93K160j899j072J356j551p04J031k90r8L74m73q94j67
1288c396M80o78K94J530J9M87J019n96O14o75j765L437p75k485M109o40k570K467
1306H76q91k71K65p48K616l68q38L435j897m71P35j998K522j641k862N954k836
1323A582l135N704m085j905L770l759L269J436n073O485q36n987N135j603k349
1338a351J607j922M450l401l688Q624o291m137R543p383Q41O823p805N100K582
1353C592q949Q167r63p531O578k301M4K708m945N654k797n656J0739n973m680
1368f313J1214p496K219P473j2329O394L303j1629J0250j166q921J1118l324l069
$$ y = [3837, 2673, 6067, 4796, 2272, 4164, 3904, 2047, 3042, 3339, 1655, 2285, 2400, -380, -131, 951, -1972, -1179, 1502, -676, -1169, 991, -908, -1980, -624, -2175, -2879, -1848, -2138, -2236, -1862, -2335, -3229, -3396, -2916, -3594, -3300, -1770, -1751, -1264, -245, -841, -227, -902, -2667, 770, -5, -2490, 1619, 979, -1591, 876, -15, -286, -21, -769, 1847, 1479, 641, 4076, 2179, 1708, 2443, 445, 2967, 1326, -1536, 4418, 1582, -1553, 4151, 66, -1839, 1931, -1828, 1441, 2877, -2196, 4289, 3453, -2534, 2601, 998, -1351, 256, -1666, 2784, -617, -4305, 4319, -1972, -6109, 3434, -3949, -3108, 3715, -4090, 1010, 3592, -5357, 2810, 1847, -5684, 894, -1407, -1363, 1345, -3600, 2054, -743, -6399, 4340, -1633, -6313, 4901, -2595, -376, 7097, -5232, 1162, 4465, -7164, 3086, 1920, -7001, 4117, 793, -2276]
1382b276N174p618N392J648p928J0276m058m242J3297j1064l74J0772j6214P720
1396E05P801j7015J1729J893j1758J3654p367m205J0822j1895P070N531j2874
1409f109J2637l572r251J6909j4345k733J6421j9598R020J0635k1335J3866J65
1422B710j4506J9669j1180m415J7212j6274P766P902j9024J4499l144j0532J9802
1435A0485j8642j73K2198k3965R042R390k3931K0442l88j6212K1284j4160M38
1448d192K0646k3537P303P309j8691J9801p023j3031K4180j8036J370J9468k6907
1461a1340R929J1993k0785J8712m844j2043K3364j6141l215J7724k3558J0518
1473C14R811k2516J8701n213j0090K3482k0759l409K0596k1257J1745Q121k3218
$$ y = [-2276, 2898, -4720, 672, 2320, -5608, 4668, 610, -3632, 9665, -1399, -1773, 8999, -7215, 505, 8306, -8709, 3020, 4913, -6845, 6809, -558, -4763, 6059, -5836, 1234, 6765, -6109, 6528, 2956, -6295, 10614, -3731, -6464, 9957, -9641, -621, 10014, -11321, 2545, 2710, -11796, 7873, -3307, -7722, 9490, -6784, 982, 8884, -10140, 4359, 1215, -9317, 10485, -8157, -8330, 13868, -10097, -1055, 8335, -15596, 4846, 4458, -11754, 9530, -4630, -4192, 16454, -7083, 220, 7529, -11162, 8639, 1616, -11415, 12765, -5271, -3901, 15567, -11340, -1411, 10582, -10203, 8509, 3665, -8378, 14986, -1155, -4370, 13354, -10204, 314, 10125, -12391, 6310, 1097, -8993, 14489, -6270, -9679, 10917, -10340, 1405, 9526, -13692]
1486a3692K0354k568j4523K1608j9098j880K0849k1453P750P408j7982J9897n220
1499A450j3459K0265j5330M87K0811k3821Q701J0705j8020J7571p155j5383K1925
1512H747j1157j220J5830k1951J0241J0031j9336J5438m153j1862K3671j2874
1524A405n299J8010k0150P829J0261k2775J4655K14j3920K1411j3468p580K0519
1537A1112j9333O807R782k0715J7360r2j4207K0698j3437o693J9213k0575O111
1550c969J2130k2652J7585R97j5827K0547j1337o099J8237j8069P140J1329k0788
1563a0776J6626k39j5622J9722j3222n017J8363j8957Q052J0203k0334J5984r7
1576D686j5092J8855j0168m355J7606j6312N856Q547j7823J2169j241j1654J5925
$$ y = [-13692, 6662, 4094, -10429, 11179, -7919, -9799, 11050, -10403, -2653, 4755, -13227, 6670, 1450, -12009, 8256, -7074, -6587, 14224, -9597, -896, 9809, -8211, 9360, 2205, -13178, 8747, -2410, -3630, 12200, -9751, 490, 10521, -8815, 6623, 2470, -9392, 14279, 1405, -3894, 14116, -6034, 1795, 12056, -10719, 3936, 4150, -9770, 11641, -1827, -9407, 11112, -8221, -1414, 8368, -12347, 5013, 4921, -9286, 11412, -2025, -8718, 10495, -10080, -3969, 8161, -14491, 3094, 4091, -11736, 8811, -2526, -8625, 9612, -8457, -1317, 10012, -10776, 5850, 5611, -10011, 9711, -3511, -8528, 9835, -9122, -1070, 9133, -11201, 4783, 4686, -10406, 8449, -1719, -6074, 11532, -4780, 1076, 9623, -8200, 3969, 2728, -8926, 6999]
1589F999r974k674J5335j6395P548P230j8002J5065q52j2762J6484p702l705J3114
1603I709j3309L294N147j3006J1006q89q910J2982p515l63R873j4377O165N762
1617E569j2948J1790r62r450J3386o576n574Q599q629J260N564q810Q105k69n639
1632d584Q323n982r13P004p961M223L884r467R919j428r055Q977l238n017P566
1647B251m503J008L973m565M210r23n114O504j255j370L075m086M191J916q752
1662c440O102j056o247O645j246l880O427j637l48J648m156K113J502l590L313
1677B150j067j991L499k747N09j020m973N410J6n054N888J00l496L556j689j322
1693b231J520j723K257J072k556J908N8j696j31j767J856K43k150M833K35l326
$$ y = [6999, -2975, -5649, 9686, -6709, 839, 8069, -9933, 5132, 4280, -8482, 8002, 300, -3405, 9709, -3600, -306, 4841, -8165, 2841, 1952, -6958, 6024, -1491, -1854, 8019, -6358, -193, 5569, -7379, 4411, 3449, -6001, 7385, 809, -4765, 3834, -4795, -3535, 2029, -6781, 1324, 1055, -4584, 3739, -2243, -3156, 3848, -4113, 110, 3994, -5473, 4446, 3018, -6037, 2940, -298, -5315, 2251, -2252, -1244, 2729, -1836, 2374, 1451, -3663, 2841, 1586, 216, 3291, -795, 3396, 5312, -3440, 2662, 1606, -4641, 2004, 758, -3122, 3305, 1668, 1320, 2968, -1188, 925, 2427, -1163, 2150, 1083, -908, 2591, -156, 353, -667, -5640, -230, -214, -5268, 620, 720, -2776, 780, -909, -2231, -711, -2434, -177, 895, -1661, 247, 305, -1391, -1522, -3289, -1433, -1190, -3340, 1493, 1728, -1598]
1709a598L587O09k743J044M5P11O25p28J397l19k237L89m46j259K52Q06J781l33
1727A583o92J496J69k785J150j78q20J168J76J78p56j192J24j153j091p88K022
1744a389M08l21P03L64k56j053N81j92q97Q04Q92n20J4l90k19r18r05Q30P40J03
1764a621J488J015l23K87k36M2L4k14O69O19R1j13l58l08n08j158J091M63q45
1783A15K183R44j501J523q53j212P39p34KP11m73o7j95j417K93j733K85R29j493
1802a954J980J145k138K089j91k972K066q49j715K967j564o56J738k235P9J65
1818b045j811J985q70Q12K996k791J758J709m647L407K55m197N498j319k872M961
1834B829l653r68K974l656J643J346j677M396k062p93L833n387K239K773p029
$$ y = [-1598, 1989, 2598, -145, 899, 944, 1655, 2280, 1552, 2949, 2630, 393, 782, 336, -923, -671, 135, 1916, 1583, 891, 2387, 2556, -229, 921, 743, -77, 1091, 1267, 1445, 689, -503, -379, -1532, -2623, -3411, -1389, -981, -1302, -599, -235, -491, -1544, -963, -1155, -2052, -1248, -356, -876, -862, -1252, -1471, -2389, -3294, -2464, -1724, -1621, -133, 882, 559, 846, 610, 652, 686, 472, 1141, 1760, 1851, 1738, 1380, 1072, 564, -594, 497, 960, 115, 2298, 3242, 1741, 3264, 2411, 1199, 1938, 1204, 1206, 1917, 1444, 1377, 1182, -235, 58, -1675, -1390, -461, -1954, 26, 1171, -967, 1122, 931, -2041, 25, -824, -2539, 428, -1136, -1792, -54, -2289, -2210, -2045, -3856, -1871, -2741, -1929, 1067, -1724, 34, 1743, -2904, 503, 758, -3439, 2059, 740, -2132, 2829, -824, -1792, 1182, -2474, -831, 515, -1162, 3234, 1172, 379, 4212, -1175, 1064, 3837, -3192]
1849c192N591K43m971O491k905m240N637m812K24M377m568L570J124m097N735
1864D207m258j807N800p030K928L563p756O523K05p474P831m662l390Q681n903
1879b542P21N611o436M613O4o709P543m532j606P830q183K965M782j0340O981
1894G62N19o940Q695l750l182R726o513Q95M694r106N687M25n947Q091n042k492
1910c478Q899q438K190M247j0790Q593J659q096R900m051l561R962q475r7N244
1925C708q497P268J081p808P867m509k342Q389j0210K179O793q524Q202M35j0314
1940f282J0530l097m578Q974r993J485Q478r191N437m93q437J1368l810m881Q516
1955D026q893L855Q937j2234N464J804q166J1073n416p034J1363p080J456O608
$$ y = [-3192, 2399, 2642, -2329, 4162, 1257, -2983, 2654, -2158, -1934, 2443, -2125, 1445, 2569, -1528, 4207, -51, -1858, 3942, -3088, -160, 3403, -4353, 2170, 2375, -5099, 2732, -1930, -5320, 3361, -2542, -1821, 3790, -2646, 1967, 2031, -4678, 2865, -1667, -3273, 4557, -3626, -661, 4121, -6219, 762, 1281, -5659, 3036, -714, -3896, 5830, -683, 212, 4906, -4200, 1487, 1912, -4035, 4056, -986, -3478, 5421, -3017, -827, 3420, -7370, 1223, 2882, -5214, 4686, 635, -2926, 7036, -1439, -1536, 3708, -4789, 2479, 3560, -4248, 3619, -890, -3232, 5157, -5053, -2874, 3919, -4605, 3597, 4032, -6282, 4248, 1151, -3427, 5547, -4446, -2961, 5517, -3674, 1763, 1270, -7167, 4201, 391, -4490, 4026, -4867, -1012, 7925, -4309, 1155, 2959, -5207, 5866, 450, -6584, 4779, -2301, -845, 5763]
1969E763j2361O368L524p886R202n903k891J1105o887l83N756j1975R777J773
1983D982j1918J0410m321k267J1465j1675r32Q386q759P362N81j1423J3162k864
1997B189l938Q165j1240J510J0919j0955M629q2p982J3127m431p042Q111p703
2011d723M479P515j2674N335L584o822J0638o700p757J0799m625Q51M819j1712
2025f993O880M613p325N606o456j258J0487o515N46K930q224J0340N28j1147P219
2040A231k263k099R527j0293M7O546n827N444q31p855P251L27k061M910p666L117
2056d95N373p625M024q72o043R936l024n383P372n192P84N834p839K083M052m028
2072a043M321k225l380N663l786k39K879n945M677J994o448O010k309l577P483
$$ y = [5763, -6598, -230, 3294, -4592, 4610, -1293, -4184, 6921, 34, -349, 5407, -6568, 3209, 4982, -6936, 3474, -847, -3114, 8351, -3324, -4256, 4130, -4629, 2733, 3314, -8109, 5053, 2189, -1749, 6416, -4824, -3314, 7605, -3350, 1279, 1197, -6785, 6342, 1911, -5131, 2980, -4723, -244, 7271, -5403, -68, 3516, -3306, 7332, 632, -7125, 3674, -951, -100, 4719, -6993, -113, 4500, -2825, 2781, -3675, -4933, 5554, -961, -415, 2515, -5709, 4631, 5159, -5988, 1231, -1032, -3131, 6396, -3897, -3850, 2696, -3131, 2313, 1482, -6373, 878, 1205, -856, 4054, -3612, -495, 4878, -2747, 1277, 405, -5638, 4298, 1274, -4109, 3263, -1929, -1145, 4689, -3150, -1067, 2985, -1043, 3278, 1053, -2327, 3336, -450, -689, 2190, -3755, 922, 2916, -3532, 2478, 169, -3408, 4075]
2087D075n374j520O155n034K325K949n958M213n65l675M486m166J46M335n042
2102b650K974J117m986N228j830l159O203m454N94M957o136J945K677n257L869
2117A092j422k477N040l871N32L429l834J576J461l400K771p78j832M463l334
2132e84j95K769l853K049K84k863K919o63j754L421k191o74K307k346J485N69
2148F80j927K387j375j43K123k974P57J224k546J959M64j387J358o30j023K058
2164A005j025m10J529j198L34J046q60L59n94q25J708j225L36J027j896J393n21
2181A83n47J067j326M87R45j214OJ147l59m01J46j039Mo5l19M01j01n7M83o6j56
2202g81N0k24K84K33j04O05o3o06K87l22o3r7M09j16N31j46N92m04K20j06L99
$$ y = [4075, -1299, -2819, 3336, -1698, 627, 3576, -2382, 1831, 1266, -2409, 2077, -2089, -1943, 2392, -2650, 324, 1441, -3545, 1683, -147, -3306, 2897, -1557, -963, 3994, -2142, -197, 2480, -2777, 1092, -330, -2807, 2233, -1638, -1106, 2323, -1511, 65, 1526, -1874, 897, 119, -1713, 2750, -584, -779, 1990, -1863, 186, 470, -2393, 526, -137, -1891, 1530, -661, -1335, 972, -1374, 111, 680, -1247, 1140, -235, -378, 1745, -1229, -472, 752, -1794, 165, 629, -758, 600, -30, -1053, 1005, -20, -430, 1099, -99, 235, 1281, 421, 780, 186, -639, 1069, -156, 180, 1207, -689, 704, 183, -364, 703, -623, -136, 809, -405, -399, 748, 389, -12, 134, -905, -901, -966, -1285, -884, -985, -1042, -559, -625, -781, -731, -955, -671, -438, -542, 63, 0, -606, -319, -641, -704, -801, -392, -508, 23, -123, 469, 65, 285, 179, 578]
2223E78j34M19R3K06P55q28q3n54n86j42J017m69Q5j22N44j29R6J35j061K77Q95
2244I92q35J8M77K27j454J065j078o7L77o11M12q9Q38j78j86n11R3l10O47r67
2264a140O56Q67m69o29M13j050M38L82m21M83L64op2P2K55Ml83P71l68j17J395
2285A445j086k10P07j348K88P57j266R56L36q05Q38o15k2O14o23L91P7j045J851
2304A240j142p46J405j600J71J488k117Q05Q06j281J470J30j560J911p64p25P14
2321B05j354P97M33r51J532j416m78K132j432l95J841j847J258J228k214J330
2337F69o05o76K190j295p95J669j867J690o47j954J993m68r91K556k120k24L273
2354B398k666l02J708l117K573L69j762K219j551l62J666l054M94K118k285K233
$$ y = [578, 444, 863, 956, 1162, 1917, 1089, 1006, 452, -134, -276, 741, 272, 357, 235, 779, 650, 746, 881, -180, 97, 992, 157, 175, 652, 879, -575, 490, -588, -655, -278, -889, -477, -566, 272, 94, -92, -603, -510, -820, -173, -1140, -484, 383, -86, -715, -302, -1352, -914, -532, -953, -470, -106, -112, -184, -112, 143, 147, -236, 535, 167, 50, 1445, 359, 149, 856, -492, -204, 553, -713, 243, 579, -226, 612, -3, -25, 589, -34, 357, 434, -611, 1240, 98, -648, 757, -843, -672, 816, -1301, -496, 310, -971, 499, 629, -931, 980, 216, -509, 205, -1149, -352, 81, -870, 662, -754, -1232, 900, -532, -927, 914, -933, 325, 1553, -661, 669, 64, -612, 1578, 283, -512, 1157, -710, 980, 333, -1621, 372, -96, -1087, 1469, -651, -875, 2398, -268, -570, 1138, -1979, 594, 963, -799, 1420, -131, -493, 1173, -1881, -1387, 731, -1554, 679]
2370F79J84k686L695k016j190L405l618R28K602l662K257N28l444M026j960j805
2386b077L687l151R17K458m309L293K1l211M642k511j771M462m004J177K938n289
2402b728L358N87l851M820k588j679N087m457J472K676n594M249j99l701N274
2417B726l293j092N171m900J640K033n761M425K04m194N329l872j020O364n626
2432a866J333K754n412N412k5n651M727j118k910N604m932J163K830m841N767
2447B835j098n084N926l068p29M392o056J835L778n414N049j748m049O712k728
2462E53k509L275m341K166L705o372L945O87l781O736m000k748M621l867K427
2477D97J930n803M237O27l967N050l800j735O050l766J060J194m683M381M40m330
$$ y = [679, 863, -1823, 1872, -144, -1334, 2071, -1547, -619, 1983, -1679, 578, 1106, -2338, 1688, -272, -2077, 1610, -1541, -624, 1834, -2475, 818, 839, -2372, 2270, -241, -2012, 2450, -1554, -377, 2561, -2728, 630, 1217, -2634, 2186, -402, -2081, 3006, -1451, 21, 2697, -2897, 1352, 1153, -2548, 2726, -567, -1659, 3512, -1388, 252, 2285, -3476, 949, 1153, -3041, 2288, -1584, -2604, 3760, -1866, -533, 2221, -3191, 2221, 2196, -3455, 1272, 154, -2756, 2848, -2084, -921, 1909, -2932, 2835, 1737, -3347, 2579, -489, -1218, 3174, -2882, -1047, 2731, -2683, 2366, 618, -3431, 3281, 553, -1956, 1319, -3022, -856, 2849, -3523, 422, 1109, -2672, 4064, 64, -2684, 1937, -1930, 497, 2427, -3376, 861, 1488, -2479, 2571, -1229, -2964, 3086, -680, 380, 1574, -3109, 1272, 1712, -2618]
2493b618M403k355j028M927m930P44L062m906L876J40m477N028j580j857M284
2508B713m583J016L568n169L487j38l540N577k766k461M928m303J172L165n388
2523b722L685M8l130M742k951j730M820m099J044K377m854L793N79m170M490k271
2539c49j417M336l816O37K536m098L322K70l910M241j995j200L771l898P99K456
2555A685l882L134p3l483M375k039j217L513l290N81K133l331K087k2k262L605
2571A514k116n71K557k882J022J573k767K313J65k411K685j243j185L528k863
2586f81L01K284l128J863R3k138K478j028p41J554j822J067R84j727J101L53k098
2603a285K047o90j427K600j914K13J723k460J174K47j044J346o86p84J647j521
$$ y = [-2618, 1785, -570, -1598, 3329, -1601, -857, 2205, -2701, 1175, 1315, -3162, 1866, 286, -1571, 2713, -1870, -854, 2714, -2455, 1032, 894, -2646, 2931, 165, -2296, 2632, -1671, -499, 2666, -2722, 963, 1011, -2119, 2623, -328, -2058, 2762, -1337, -293, 2084, -2770, 1023, 1602, -2568, 1922, -349, -1766, 2570, -1246, -609, 1927, -2171, 1151, 1421, -2489, 1752, -243, -1443, 2328, -1570, -771, 1685, -2197, 937, 864, -2619, 1756, -283, -1500, 2013, -1277, -696, 1437, -1894, 193, 171, -2091, 1514, -602, -1173, 1384, -1498, -476, 1097, -1670, 643, 808, -1603, 1082, -161, -1346, 2182, -681, -380, 1904, -1224, 639, 732, -1406, 1072, 44, -697, 857, -965, 102, 1086, -641, 460, 813, -1285, 762, 72, -1355, 1245, -669, -456, 1267, -1193, -19, 228, -816, 530, -156, -940, 707, -814]
2619h14J75J151j358Q09L02j561J555m19q56J678j408j11J294j502J076J99j593
2636a383J641l69m55J038p66J21R55j346Q66K5j163J356k18l14R19j215L76Q73
2654I41j084N02J87p47R27m34l17Q13r10N64R4p34L37J21n12M59j02l93K59r7
2674a26k71L41l53K98J54l21L68m26R8k21J77r5K42N5o17P62r19J104o03N9O38
2695C44qp9K01o76l51O46K27p94j77R81Q58r11k8n36j56N69r8j61K50o0J40J34
2717C15k02m12K77mk45M46m27L29j99R8L3p9J27j67m4K82QJ22j34J7J4k30K12
2740A37k19k93q0K70k3P3L58j83l65J016m61n19K35l87N99l7m29O77n65O5P60
2761F29l19k37O03n18o2j44l96Q38J09j016P60K1j24N93j341N31N73o97K69k39
$$ y = [-814, -639, 512, -846, -37, 265, -1296, 259, -160, -1016, 662, -746, -857, 437, -1065, 11, 210, -1383, 258, -111, -566, 472, -294, -173, 782, -564, 302, 327, -836, 520, 302, -12, 907, -308, 68, 941, -143, 359, 546, -201, 726, 292, -25, 788, -122, 442, 536, -198, 139, 260, -252, 207, 105, -288, -29, -126, -397, -56, -409, -111, 43, -278, 90, -336, -238, -459, -282, -377, -135, -80, -697, 65, -854, 250, -353, -294, 344, 336, 257, 458, -218, -569, 77, 304, -490, -667, 314, 1172, 261, 233, -303, -459, 110, 12, -149, 101, 41, 181, 315, 113, -299, -22, -26, -271, 175, -252, 77, -122, -24, 9, -70, 57, -110, -154, 128, 136, 258, 124, 141, 155, -75, 137, -82, -375, -455, -185, -208, -135, 223, 40, -325, 691, 230, -289, -54, -441, 158, 121, -308, 369, -196, -131, 629, 310, 73, 676, 158, 96, -48, -444, 394, 503, -513, 247, 268, 144, 737, -604, -73, 500, -197, 72, -167]
2781a67m6R6L00k28O51m53N91j025l99J052o22M8J234j673m93K741j708l73J163
2800F89j719J362P47k114J568j025RJ542j808J049o2j671K336r40p99J769j306
2817c73K75J078j962R40O85j551K114p85j639K312j279l01J942k924J457J191
2833A180k245K022q26j113K261j802j81J925k539K302j98j912J560q19p32L088
2849A971l194M14J893k663K643k27k409K328o97r81K306k513N25J963k948K045
2865D56L91k825K729q17q86J994k021J48L226k740Q32L49l062L501k066o29L281
2882A861k679P09J381k611K300L25k694K262j210p25L017l398P93K392k457J528
2898G94k4k352K910j138j124J579j956P3K230j836J09J927k913K996p69j617K571
$$ y = [-167, -213, -117, 183, -45, 606, 153, 744, -281, -680, 372, -250, -202, 1032, -641, -1134, 1607, -101, -474, 689, -1030, 332, 1079, -1035, 533, -492, -483, 1059, -749, 300, 238, -1433, 903, -37, -836, 933, -373, -98, 980, -982, -42, 643, -908, 1206, 421, -1218, 1094, -185, -486, 1456, -1468, -11, 1180, -1065, 957, 131, -982, 1279, -523, -704, 1221, -1318, 984, 786, -1126, 434, -385, -1117, 1971, -1223, -809, 1084, -1579, 1064, 837, -1572, 756, 59, -922, 1384, -1129, -604, 1359, -1589, 456, 847, -1978, 751, -66, -952, 1042, -979, -831, 2395, -345, 487, 836, -2226, 1275, -791, -1420, 1861, -818, -109, 1272, -1339, 961, 1286, -1408, 854, -356, -1081, 1936, -1462, -669, 1723, -734, 794, 770, -1582, 1328, 190, -934, 645, -1311, -1238, 992, -844, -735, 1192, -1721, 1275, 506, -1111, 1460]
2915A460k787M38L170l600J093R54k757L327p21k296M562l273j51K992m337K148
2931B22J310l128K458n83k072L946l230L18L272l831J163K251l234K745j11k767
2947a271K554k068K29K595l685J452J335l256L444j140k360M253l112k16L793
2962B547n061K111K013l909L268o40k567M477l279j29L077l992K671J733m622
2977b302L587j537j984M797k642k131M278l537K014J239m225M343j882p06K700
2992B012k292l33K649l634K397N34l003L269j649j164L446l278N48K376l424K241
3008F95N50l383L447j208j591L009k671L67K140k477J531J30k204K639j130j077
3024a233K435k638P76K198k949J579K68k253K958j004j455K316j548j05K003k474
$$ y = [1460, -1327, -889, 2281, -1319, -226, 728, -2029, 1298, 577, -1719, 2843, -430, -581, 2411, -1926, 222, 1532, -1596, 862, 279, -1793, 2153, -1077, -759, 2513, -1318, -155, 2096, -1138, 1607, 1496, -1271, 1283, -785, -556, 2039, -1646, -194, 1141, -2115, 1329, 189, -2171, 2082, -1030, -1246, 2547, -2514, -403, 1610, -2299, 969, 329, -2238, 2239, -1040, -1169, 1908, -2084, 587, 2320, -2302, 1285, -252, -2236, 2561, -81, -2212, 2066, -1471, 543, 1782, -2443, 1900, 18, -688, 2012, -280, -613, 2036, -1598, 799, 1333, -1670, 1599, -50, -1214, 2232, -1046, -498, 1878, -1546, 695, 1245, -2138, 1309, 101, -1490, 1519, -1152, -785, 1355, -1122, 409, 539, -1665, 974, -156, -1233, 1202, -1436, -660, 1538, -1411, 168, 436, -1817, 1141, 137, -1318, 998, -550, -655, 1348, -1126]
3040a126J142Q78j703J865j106r86K468j438l51J480k522J868Q43k599K194p19
3056A88j029K316j719r5J397j847J282M01j930J659m61o86J709j902J65J629j694
3073f17P21O01k216K347l52j418J436j161N3J554j801L99P45j378J273m56j074
3090a344J489p24N41K84j042R13N33j097J045o14o89J251l25l96O54j082Q53K49
3108D99p99N78J08l0P33q70l63O70p80K95J36l91O03R2j088Q55m64Q72n87m66
3128c97Q91k69n96Q65j5j038R08l0J79m49j197J239o1k36L42k49j020P11J80l10
3148e52N92k02K60N2p31O48l9l74N67p77O82J39r50J012m27k61Q12r87P89k84
3168c1Oj60k26M34J95j50l06L89j39M54j39q8J15j99J61l19j81J61P2K25p4M4
$$ y = [-1126, 16, 894, -809, 1056, -50, -1036, 1432, -6, -357, 1123, -1399, 469, 1312, -1287, 907, 188, -841, 1475, -244, -339, 1058, -789, 493, 894, -1036, 623, 162, -524, 1185, -717, -552, 1077, -617, 104, 705, -1511, 836, 484, -934, 502, -659, -606, 948, -853, -454, 291, -1087, 186, -270, -1344, 145, -579, -38, 246, -796, 117, 650, -447, 598, -16, -705, 546, 221, -175, 479, -603, 250, 499, -300, 278, 386, 356, 1089, 219, -144, 526, -254, 41, 177, -214, 389, 481, -607, 248, -216, 656, 69, -397, 494, 225, -371, 494, 479, -559, 349, 319, 498, 49, -1148, 91, 30, -206, 136, -113, -1133, -422, -242, -552, 40, -162, 98, 150, -581, 67, 28, -346, 221, -556, 126, 265, -685, 327, -100, -361, 451, -536, 253, -31, -25, -185, -411, 23, 218, 68, -238, 151, 12, 466, 327, 239, 354, 155, 316, -3, -184, -23, 49, 274, 200, 244]
3190B44j36L3J53l13R4Q6l08K32k61Po8k18K19J0j74K0J37K1K52N4k29R4j03j63
3214c17J99rN0K48k65J34J04n20N92k09n7K83r8k84L98j90K90l58l9L11m52K82
3236I3j3J72j99K44o35K16J26l64N86k09J71j20j1j3k1l07O06n45JL01l39K80
3258B0J66m00J74N7n78Q33l42j70N33q2k38M81q30J98M17n20P03m66l21Q05o67
3279b27J73N28j035P55L20j049P55q7m67J009p50J28L09p83P16M17r23O65j23
3298C31r44R10o77K41P29j005O99J09q29Q66k31o84Q62m89m65J049j283R84O37
3317H10j646R62n7r15J518q61j45J239j707R55N26j732J409k75j246J802o45n15
3335e23J441j734P31P85j928J783k33j227J844j453J61J673k383J175N21j861
$$ y = [244, 108, 141, 294, -19, 75, 161, -147, 85, -176, -169, -237, -455, -236, -226, -400, -380, -243, -222, 30, 84, -145, -51, -154, -317, -118, -127, -77, 171, -94, 40, 144, -376, 216, 7, -50, 233, 135, -149, 249, 59, 349, -9, -48, 263, -189, 93, 80, 252, 53, 297, -338, -122, 4, -360, 226, 17, 188, 68, 57, 44, 23, -284, 322, -223, -222, 79, -260, 20, 186, -214, -40, 17, -561, 272, -70, -240, 293, 211, -27, 454, -376, -178, 239, -281, 422, -44, -365, 440, -227, -54, 474, -561, 194, 514, -535, 220, 133, -334, 675, -75, 53, 362, -421, 295, 712, -211, 454, 331, -613, 297, -380, -139, 590, -415, 284, 393, -436, 430, 199, -485, 377, -112, -577, 472, -811, 173, 810, -836, 126, 69, -846, 672, -189, -334, 905, -802, 153, 679, -1053, 356, 81, -1165, 637, -8, -523, 918, -816, -85, 700, -1228, 555, 322, -905, 939, -514, -353, 1320, -1063, 112, 633, -1228]
3351a228J870k81j462K321j933n1J820j863R20O79j921K032n82j139K168k037
3367f87N4J715k060J097M49k113K721o82j696K175j652K77J985k574J076P80k022
3384a157K521j153j684K358j573M20J390k611J552P53j944K098j194j383L003
3399A396j762J54J493k633J666P87k325J840j018n91K178j580j37J209j745J748
3415F80J12k337K320p05n64K074k304J11J723j928J033L89j967K296n59j163J614
3432H25j437M57J252j616Q08L20j524K024o71j388J845j122p3J129k042J050J059
3449H96j824J400j00j175J642j074k58J360j925J141O27j516J297r0j500J900
3465H01j181o70K071j792M81J053j997J324K53j514J897p70n39J678j542K60J043
$$ y = [-1228, 642, 361, -1101, 1220, -713, -764, 1056, -807, 113, 792, -1129, 903, 321, -818, 1350, -687, -633, 1082, -978, 119, 568, -1545, 1176, 494, -1202, 973, -679, -402, 1583, -991, 85, 865, -1157, 1364, 211, -1473, 885, -688, -268, 1122, -1489, 63, 816, -1128, 970, -224, -1607, 1396, -366, -212, 1281, -1352, 314, 1101, -1224, 616, -402, -993, 1185, -395, -532, 677, -1068, 680, 792, -1545, 775, 70, -494, 1580, -724, -613, 1110, -818, 215, 604, -1363, 933, 374, -789, 825, -612, -155, 1097, -519, 289, 609, -915, 1109, 438, -950, 895, -227, -300, 829, -1213, -163, 896, -928, 472, 372, -803, 839, -235, -493, 867, -1058, 83, 710, -806, 491, 401, -1099, 801, -380, -1050, 1021, -771, -290, 763, -1234, 90, 343, -1171, 726, -44, -583, 1095, -447, -187, 856]
3482H56k067J501K5j061J685j009o63J957k080Q08J191k292J614M60j690K041
3498A276j365q61K222j755L52Q08j774J560J34j311J757j261l88J691j606L67
3514a54J186j796J450j21j401J442p12n72J735j817M63J027j442J159l89j125
3530a067J720r20j63J251j525J029L29j642J136k73r28J639q80k65R41j072P27
3547C7L86j006N18J95p84J345j016j08J077r43K38L10j315J256o4o85J120p62
3565b01j47J007p23K60K47q74Q10k40k77M99l15j52O78p85L87n5l58M64M2l72
3585a05M45k80k43O76o37K89K45m78L87j46k20L75l86j42K57j96J4K48m40L20
3605a7k77j73N51k09j81L07k52Q6M02o96K62J88m37NK56k10L91j69o6L66k06j1
$$ y = [856, -1211, 290, 315, -746, 939, -70, -733, 1224, -856, -48, 1143, -1149, 465, 925, -765, 1276, -89, -950, 1272, -483, -131, 677, -1097, 463, 597, -714, 1043, -218, -606, 1085, -521, -154, 1032, -764, 686, 565, -836, 606, -106, -678, 1057, -760, -297, 730, -712, 447, 58, -1067, 653, -267, -430, 821, -704, 325, 654, -988, 148, -125, -1053, 586, -294, -559, 382, -690, 37, 423, -583, -65, 130, -654, 691, -325, -433, 644, -299, -61, 249, -1066, 190, 126, -559, 561, -201, -348, 659, -64, 196, 443, -431, 379, 139, -138, 361, 46, -106, 572, -213, 174, 119, -239, 225, 267, -105, 340, 60, -183, 493, -144, 145, 390, -88, 299, 153, -67, 308, -78, -220, 37, -159, -145, 103, -337, -17, -294, -467, 84, -125, -306, 1, -251, -165, 237, -459, -197, -9, -446, -441, -185, -395, -4, -173, -239, 127, -79, -90]
3627i0P3j71M36M8m98M40j11k85K00j08L6K56Lj55J94l67J93P2J15j51R2K1o7
3650A76k64N22m08j16M47k54k27o3M07m03J23P9j08J59o0k2K61l14j61K45j07
3671h8o3J9l91K96m0q0P6K5K32j55K17k04q3J10J29j04K24k81M2J24k39K52Q6
3694A04l15K96k79J87M66o22O39l66J9M8k76m7J37J48r9L2K2j65J71k42K77j33
3716Bk86M46N9l55L05k42O3j34K89j56j97L18n1J51l13j88J52K0l5k01L19K51
3738B17k27K77o27R0K47r0j48K23l29N49rl84K10j88o6M17m89K44L03k75L12L0
3760B87n88N19j89k26M56m68M17K8n48N49L3l54K74n0m54N51k03J12K34p16O06
3781B70o1o71P33n6l91O43m76J17K20q85N01K90m69N35p31K33P27p54M40l4o39
$$ y = [-90, -17, -188, 248, 296, -202, 238, 127, -158, 42, -66, -30, 226, 229, 74, 268, -99, 94, 166, 281, 130, 222, 243, 176, -88, 434, 26, -90, 357, 103, -124, -187, 220, -183, -60, 19, -89, 70, 10, -12, 249, -65, -226, 19, -88, -151, -132, -523, -227, -267, -347, -271, -246, -14, -169, 48, -156, -239, -129, 0, -104, 120, -161, -119, 5, -234, 18, 104, -211, 85, -194, -7, 459, -163, 476, 110, 129, 177, -99, -146, -9, 139, 40, 72, 94, -71, 100, -142, 135, 2, -284, 162, 221, -134, 171, -71, -8, -142, 147, -9, -206, 112, 61, 212, -101, -289, -137, -117, -152, -353, -34, 217, -10, 267, -360, -270, -23, -113, -261, -38, -367, 182, 173, -211, -1, -189, -255, 162, -327, -83, 220, -55, 257, 287, -301, 218, 29, -197, 259, -209, 208, 236, -312, 237, 270, -84, 190, 140, -314, 237, 34, 146, 380, -336, 270, 209, -462, 271, 215, -176, 467, -9, 108, 328, -557, -56, 234, -235, 300, -431, -198, 529, -225, 215, 181, -458]
3802d58N62J33q08P23k89M4O37r90L69M50p90N83J3p07R48l98j82L97r29M96N85
3823C89n88L96K0r20R33p8n81R12r74L32Q96j094M93K03q79P73j94n97R57p91
3843c92K75N33j017M09N71r03R85o77j77J121p39m6N10j282P31O38j160Q43l4
3862A89m38Q35o92j04N47q59M12M96j023J017j3q28J331j271J05J176j515P64
3880A29K52j423J860m29j093J298j098K30J081j469N59P88j177J196p55j077J913
3897G85j237L58R65j741N00Q08j421J795j012j155K457j939J282K91j561J027
3913B02L36j254J061o56m06J481j257j4J071j187J081j1j429J523m48l03R35j301
3931e76M22P78j400J205pj312J355l15o86J307r95j5R90j179N56M9n04R97o47
$$ y = [-458, 104, 237, -571, 152, -137, -93, 544, -446, -77, 373, -417, 166, 179, -528, 420, 22, -160, 237, -692, -196, 389, -199, 197, 217, -703, 230, 152, -429, 483, -491, -159, 737, -357, 136, 339, -540, 233, 39, -558, 399, -392, -117, 416, -601, -192, 379, -524, 461, -216, -393, 728, -11, -57, 453, -829, -98, 540, -620, 223, 189, -249, 586, -106, -210, 337, -522, -110, 386, -637, 380, 367, -461, 870, -401, -296, 880, -635, 129, 381, -1042, 818, 389, -704, 594, -504, -274, 807, -662, -103, 685, -492, 704, -51, -1128, 785, -452, -94, 871, -870, -370, 438, -983, 812, -200, -1355, 1102, -837, 445, 736, -825, 202, 538, -716, 345, -311, -717, 764, -493, -507, 564, -623, 458, 447, -982, 541, 93, -210, 725, -576, -154, 624, -776, 429, 422, -890, 465, 150, -536, 771, -224, -239, 751, -428, 128, 177, -327, 670, 23]
3950B3p40J193n15j14N12r83P75L68o76O57q16P2P69p02j23Q01q67P29j34k67
3970c8J69m42M06M57r00p3J034j167O27M2q62J189n19k26P33q90L04O73p51o5
3990b99K32m35P57P6q93O31l35J49N84r42K48L33m94O40l5p41Q79n39K69M71r09
4011c53L16K37m91M92N7n83J011n74j93M50o13M62Nm01L85j04k40N47p05K20N18
4032D43m56J80R6n98L80L55r22R28m99j86O85o77L11L19n81L40j67l52N95k10
4052a6k70M29k07P4K05n39M59m12K1O61l85l72O34n89M29K3o25O68k51k20O20
4073C37m31o3M60p16L20J97m57L94q4j56K31j98N4K82l67J66J06j58N33j89l17
4094e6M12m66J04J98M8j91L3j8J73j9j03J36j29j62K1j07P2O0k59N85n02J04K45
$$ y = [23, -717, 476, -39, -153, 359, -624, 151, 519, -157, 500, -316, -244, 525, -177, -300, 501, -366, 363, 229, -38, 131, -311, 95, 552, -348, -421, 613, -554, 73, 115, -747, 442, -77, -303, 430, -460, -156, 517, -234, -299, -67, -502, 255, 331, -562, 69, -266, -117, 467, -475, -227, 106, -388, 252, 217, -524, 355, -184, 85, 556, -353, -37, 200, -291, 201, 258, -325, 686, 112, -81, 369, -244, 218, 223, -178, 207, 103, -137, 410, -295, -75, 443, -13, 167, 263, -335, 45, 400, -522, 406, -93, -279, 406, -271, 40, 359, -222, 118, -49, -401, 194, -16, -286, 143, -64, 10, 215, -324, 135, -277, -256, 405, 20, -352, 282, -307, 122, 145, -480, 188, -63, -283, 337, -94, -157, 303, -413, -93, 104, -353, 41, -43, -199, 32, -166, -112, 170, -197, -31, 75, -83, 450, 261, -56, 356, -110, -6, 192, 240, 49, 82, 64, 237, 218, 115, 251, 122, -40, -19, -126, -54, 6, -253, 332, -170, -66, 179]
4117A79j05pL3k0K11j46J42l42j00o0J59j42j18J85M8J27m2o2j83J01K51k47q
4140a46L68k76o2M9J70k35J29kP1oj47J23k5K61l07J14O0k61L46l06M11J10m46
4163gQ5J67m69R8l0M83p8k66Q29n68o26M91k70L55l54J02N79j76n82J38O29r40
4185d10O35k92j71M88j99N3l3n05L36O3j17K01k3k98J96l23K18J09o7J14j74j7
4207b16J92j80J61J98Rl36J39L5J69m0l50L02j16N1J94k80K81Ll92M06m8p6K66
4230C72m30J9J59j77K60Jl33M54m56M54R7m38k7J50k44J51K18j44J09j69k97M24
4252A53l02P9J50k51oj3l28Q29l81k94M52j5l15K00l92O05Nj85M94p30n21J053
4274B87l01j6O53j696J242n98J2O22l0p79J75p2j61J92L27K21n93n33J922k67
$$ y = [179, 74, 67, 100, 80, 291, 145, 287, -55, -155, -215, -56, -198, -316, -131, -83, 44, 2, -60, -243, -142, 109, -138, -146, 222, -54, -116, -67, 103, -132, -3, -5, 66, 60, -87, 36, 11, 272, -35, 79, 139, -122, 224, -82, 329, 439, -7, 78, 245, -224, -126, -156, 327, 249, -17, 812, 244, -382, 109, -161, 194, -160, -58, 521, 345, -237, -99, 530, -410, 225, -67, -238, 250, 51, 104, 71, -434, -98, -35, -152, 49, 26, -272, -76, -399, -181, -72, -139, -25, -199, -216, -24, -204, -43, 155, 164, -172, -33, 2, 171, 131, -219, 83, -33, 18, 212, -68, 213, 216, -176, 230, 182, 106, 372, -58, -39, 120, -57, 203, 204, -129, 325, -131, 323, 420, -18, -45, 105, -139, 12, 230, 86, 195, 26, -271, 153, -149, -70, 80, -171, -177, -190, -518, 311, -70, -364, 88, 73, -242, -42, -434, 171, 176, -9, 485, -245, -766, 287, -14, -30, 623, -1073, 169, -429, -417, 205, 175, -604, -429, -501, -662, -470, -143, 78, -515, -1048, 874, 607]
4294F07l84n32M82K09K64n26k24K91k23P00o07l99R53m63j49K55L6N9k80o43P32
4315A58j99k60R29j171N79J18l98N32k5q03P70l48n47J056m81r0L96n46M20l6
4335E4m53P54n22j56R04j171L8J137o12M1L3l08J46m7l14J375j658O68K2q90J167
4356B08K69j165Q69k06j86J350j732K30J749j329M69k21m63P03q62M35N18p03
4374f7L44J08j164R22n22n7N36l96l45J406j444Q49L28p15J006o8p99L04L59j291
4394g06J234n52R5O3j140J405k17j013J219p09q9J036p36j40Q89j255N05L25n04
4413b90M45r2k85Q00j049J16Q14p90N45l5p42J197r33m21J207m17k97K52r06J083
4433B02Q9l28J63j98P7N47k27l80R35j493J066k8p46N92L2o77O18n34O02L35p56
$$ y = [607, 223, -309, 173, 382, 646, 120, -104, 187, -36, 664, 57, -342, 611, 148, -1, 254, 290, 349, 69, -574, 158, -41, -301, 628, -543, 36, 154, -244, 288, 263, -540, 230, -118, -665, 391, -90, -180, 216, -330, 90, 54, -399, 355, -167, -323, 581, -590, -552, 585, -27, 14, 47, -261, -115, -162, -476, 899, -759, -91, -69, -959, 208, 477, -688, 181, -25, -211, 1139, -593, -363, 1386, 57, 526, 305, -158, 545, -317, 118, 636, -67, 277, 385, -779, 143, -379, -436, 100, -296, -641, 765, -679, 170, 498, -217, 789, 721, -78, 226, 585, -706, 528, -24, 71, 134, -1006, 399, 182, -831, 388, -321, -410, 626, -110, -250, 639, -616, -111, 214, -290, 155, 63, -222, 578, -471, -355, 459, -331, 214, 179, -563, 634, -299, -720, 487, 70, -227, 25, -881, 202, 291, -37, 126, -72, 5, 552, 325, -55, 880, -613, 453, 425, -321, 271, 303, -374, 244, -290, 312, 647, -109]
4454a09N64o03m53Q14j47p36R45n38j74Q89m85j25O39r09K87J46Q8K16q97M50
4474a38J028j680K20J245j637J854j247N98K82n83J39L9k66O91K11j121N89J49
4492C73o61o6K72J11J63p59N19O69q28M16k55o39J183r95O3O76J78J47j324K89
4512d68P59K36j51M85j942P37N08n82L03J70m63N70M60j012k7N55k47M39l00n2
4532b2j52l68J30R80j374N58JO11r13M15K4k86O26o46Q6k2m67j11Q24N75m68o1
4554f0k51L17O77r94n1K25J70j80P1L73n68L03l3m3k56L25k40j17J38J64n12l56
4576h98M93K45%Nm5M79n20k7M78n17Q19k8p86R0R4k17j42J018m86m27k72Q52n9
4599A49J89L00k25n10L22o38Q59r53M03m6O10p22m8K75M99k08p62j98R66n11l18
$$ y = [-109, 455, -148, -601, 213, 66, -670, 275, -263, -437, 452, -33, -158, 481, -428, -141, 5, 93, 309, -588, -138, 890, -790, -570, 675, -962, 892, -355, 243, 525, -58, 81, 120, -146, 545, 756, -365, 224, 373, -288, -354, -82, 29, 192, -567, -48, 621, -207, 209, -46, -685, 498, -497, -434, 242, 420, 567, -757, -468, 291, 527, 376, 861, -1081, -344, 164, -418, -115, 55, -408, 162, 622, -390, -417, 138, -109, 330, 30, -22, -174, -542, -412, 568, -806, -248, -247, 364, -549, -134, -110, -396, 230, -416, -330, -352, -819, -930, -106, 469, 1, -60, -311, 6, 683, -311, -362, -137, 33, -147, -76, 297, -271, 32, -1, -44, -300, 25, -215, -332, -194, -30, -542, -898, -405, -160, -160, -155, -200, 279, -241, -268, 210, -307, 512, 484, -302, -212, -118, -335, -477, 541, 55, -372, -644, 208, 149, 338, 638, 413, -97, 225, -413, 446, -507, -104, -150, 460, -262, -310, -35, 464, 256, -506, -704, 262, -249, -567]
4620e67O66k0K58M49p57M2l29k53L98m14N91l11L60L54q19J96K16l76P9J65j00
4641a72j87N31o12L04j2j11J06J10P0J37k40L16n96K12M9p2J53k1Rl0K43j64j18
4664i5M41m12pJ92k21J72J06k2l43P7K19j0k63J86K23l04J96j78J91j08mj0R7
4687A23k03OM23l54Kj46J11K0R8QJ1j43K81k64j72K07mlJ05k55K70k07K7Ql5M3
4713d3J55l78J67M7j36J36J78k94K21J4l72M47j91j76L89k65Q8K63l94L5R3N4
4735C8j14N8M5J32j70K62j96l45M43K5l39M31m23n9N17n33L48P1j85K83j61r6
4757C2P5k85J66K80p48M68K3k60N92m79k44N62k87l0O51q99L64J34o53O82j79
4778c5j31J89l72K52J50j93N59k80n10N40k61k26N08k26k47N65q30N21M2j93M17
$$ y = [-567, 99, 79, 337, 786, 29, 71, -258, -511, -113, -527, 64, -247, 113, 467, -352, -156, 60, -316, -237, -72, -172, -359, 172, -440, -136, -148, -259, -153, -43, 27, 164, -76, 240, -356, -144, -95, -167, -14, -35, -26, -56, 187, 23, -95, 346, -66, -73, 119, -102, 70, 176, 154, -189, -112, 107, 97, -166, 20, 243, -61, 135, -43, 148, 40, 36, 26, 123, -80, -74, 349, -5, -3, -149, -38, -18, 80, 88, 99, -44, 237, -27, -199, 8, 4, 1, 106, -149, 121, -86, -59, -51, -86, -43, 112, -266, -99, -52, -188, -52, 126, -168, 53, 67, -305, 142, -49, -225, 164, -101, -13, 250, -144, -109, -16, 38, -76, -18, 27, 159, -11, 251, 55, -290, 153, 178, -161, 270, -153, -212, 305, -228, 120, 191, 6, 289, 128, 32, 107, -178, -12, 268, -480, -12, 11, -249, 343, -136, -380, 182, -105, -135, 516, -383, -19, 115, -538, 144, -35, -166, 23, -349, -97, 53, -140, 419, 139, -371, 169, -92, -318, 190, -36, -283, 282, -548, -27, 15, -178, 239]
4799B39k38p2J89j68m0L33l43K77K04p23O69j75n61O64m40J83P55q17L8K31n04
4820b99P57m69j27M17m71J38K78n06M11O6n28N47l23n22J121n90k2N32p50J36
4840b04L56l53M48m91r3O09n51K54L16o21M19Q3o96P65k42k37N76n25j61O07o83
4861d24O50O3p44O71r9k75N30n95J73K71n52M57J56n47K89J16k75N72n77K0P28
4882F08q81M49P8o23P97k72m30Q59q84N2N67p01L17J59n40O44k70k05M38K7k07
4903a8K26o68O19j52j38L64l41j64N64m84J64L71p00N96R0n24M65k68j18K39l35
4924b12P7M24m40Q4L01o71P29m22N6P8j77M7M81n44J83m5m61P87j41q0P8l36J51
4947e3J03k35L56o3n11N36j37l53N17j41j76M87n09%J53k52L71o1k95P20m30J2
$$ y = [239, 1, -71, 118, -50, -90, 243, -100, 177, 381, -342, 327, 152, -409, 255, -185, -2, 753, -64, -26, 205, -299, 458, -11, -138, 279, -192, -54, 224, -282, 129, 195, -333, 214, -109, -631, 490, -100, -122, 410, -340, -204, 152, -201, 247, -244, -337, 272, -279, -25, 291, -330, 89, 172, -524, 241, -1, -238, 338, -187, -348, 259, -424, 226, 289, -455, 216, 117, -158, 372, -223, -50, 221, -331, 126, 282, -265, 24, 140, -135, 437, -140, -120, 608, -273, 176, 254, -369, 428, 156, -274, 585, -299, -247, 320, -381, -64, 95, -445, 199, -71, -276, 162, 189, -18, 208, -460, 159, 7, -131, 233, -108, -272, 292, -192, -28, 343, -357, 239, 329, -195, 270, 2, -116, 123, -212, -135, 289, -151, -67, 234, -437, 292, -130, -74, 4, -173, -126, 355, -189, -6, -51, -512, 275, 134, 54, 132, -204, -53, 50, -185, 171, 108, -403, 133, -4, -357, 160, 19, -157, 330, -179, -179, -26, -278, 93, 32, -263, 457, 27, 39]
4969C9K42k40R6k58K04m7R6j69L35j64p1L36l78m20N81l66M51l52m28Q50n21M0
4991a44L78l50n2M23l73K52j56jL82m59j70M01m52K36k16K51Q2J70k37P3k55L18
5013A01J63l50K50j65k65M88m01o9PM7K8K27k41J25L25k33J69m82j0N43m0j84
5035C3q8j5K09M7l13J77j53J33Ok47J27J93P9M3J04m93K77k8k52Q9k7J36j38k04
5059c05J60Q6j54L25j67p0J34o4j20K66l44J20K69j63k71L02k48M95m24J59J38
5080A24l52K50r1J13N1L7l36J23Q9j23J11q8J07P3Q0j38j4P2j09M9k43K12J85
5103A82J57k90K74j35k57J93j65n3K50l96L9J71k74L17n3j47K19K94j84m0j48
5124d6J21r5J70l20J44L3K47j65K15k98j36J92q8J48J8j66k31N6J95K5j54Q3K54
$$ y = [39, 281, 41, 137, -121, 83, 36, 132, -37, 298, 134, 63, 399, 21, -399, 182, -184, 267, -85, -513, 337, -184, -144, 234, -116, -168, 255, -118, 134, -22, -23, 359, -100, -270, 131, -321, -85, -301, -50, 32, 202, -35, 38, -217, 101, 264, -86, 164, -1, -266, 222, -179, -248, -241, -194, -166, 61, -180, -55, 270, 37, 206, -276, -286, 257, 217, 33, -55, -70, 139, 186, -127, 50, -103, 30, 36, -211, -84, 109, 188, 231, 335, -158, 119, 91, -161, -72, -99, 37, -101, -305, -145, -59, -213, 112, -55, -125, 9, -55, -175, 91, -253, -133, 136, -27, -298, 4, -244, 251, -173, -14, 124, -228, 22, -69, 44, 95, 132, -204, -81, 8, -115, -4, -92, 15, 88, 168, 30, 16, 88, -21, 28, -215, -3, 182, 339, 49, 323, 188, -69, 124, -41, -94, 156, -240, -201, -30, -304, 13, -40, -187, 32, 326, 142, 102, -46, 75, -20, 150, -170, -26, 7, 254, 89, 304, 6, -130, 62, -26, 122, 140, -26, -257, -201, -6, 19, -135, -52, 202]
5147B02o5P4k93l9K04kq5k0k38M37k05l4K34m93J87J60M5Q4k82L8K28o4k26J06
5171d7P7k3j6k35J49M2r2L51l75J87K08m61M40l05N9J03OR6l68Q5J6J44k6R2o4
5196D3K09n2q7k40K51j44l30L38m9o8J07PK35j46l87L11L5J36k08o9n4R5n6j47
5220b70K52k40K34j88K62lj51Q0J67j86J38l64L04N9l8j47J53l01J68j64J07L8
5242i0j25Q0J51L3j58mk0K27mj17J78j17p3K5jR0q6r7K72j97j12K86j19J11J93
5267C26k27k42K60j15q3L8j83J38L29j92k37N5R7M9jj27O9j73K66k8J48q3k92
5290b08J98J49k87K55j18k69M45k87J7O0k00J12K43j83J34Q7o4K13l70J50K9j98
5312i2J21n2j89K80o4k64L45k31q0J13j8K15Q1j80J04j5k07K50J10l45J62l6j5
$$ y = [202, 137, 211, -82, -121, 83, 81, -4, -24, -262, 175, -30, -64, 170, -323, -136, 24, 69, 153, -129, -91, 137, 73, -153, -47, 30, 7, -9, -244, -95, -53, -145, 206, -169, 18, 226, -235, 205, -100, -41, 62, 68, 164, -204, -119, -103, 41, 15, 107, 43, 252, 200, 113, -127, 124, -20, -350, -12, -61, -129, -22, -15, 220, 74, -313, -2, 33, 169, -39, -108, -162, -67, -123, -270, -18, -258, -24, -212, 50, 47, -104, -24, 143, -43, 95, -269, 35, 94, 56, -91, 62, -239, -71, -235, -128, -90, -215, -135, 16, 49, -109, -113, -133, 94, 90, -27, 151, 34, -39, -14, -15, 75, -11, -108, 164, -33, -145, 141, 22, 133, 326, 99, -143, 117, 2, -81, -43, -226, -88, 241, 49, -188, -133, -36, 13, 12, -115, -46, -219, 47, 19, 167, 84, -208, -10, 139, -148, 107, -11, -280, 165, -122, -105, -45, -245, -133, 110, -73, 61, 148, 84, 297, -73, 77, 106, -92, 29, -23, -212, 68, 4, -260, 85, -146, -226, -113, -131, 84, 165, -15, 89, 74, -133, 117, 227, -118, 44, 8, -7]
5335gJ97r4P1l2k96J41j68J62P9q8r5L10l59Q6J41o4J72j72j6L50m03l8J5k16
5359c24L69j38K5M19m66j33L21j07L34k04l07J77K39l92L28l66J55K13m32J26
5379a63Q0n3n1K83j54J56j18J26R8m74K05n2j22O56n17j58N10j44n2K36j99m9
5401D4J66l98M52N0k35K70k66M9J20l51K84q8m6L2K44n43J80M0j69K69k21O8L97
5424C48p09P4J14J31K69r3r8j6Rj67K7m7L45j51j73J98j32j30K90m86M97K0k81
5447a61J82Mk04L50o8j83M58m34J38k2K6J4q0j59J38l6N4J32j64N2j70J10J01
5470G8k8l0r6o0J57j88K61l01L91j38J37k97P4J07l6QJ16j08j7J74K3k27K8j83
5494a55K68j28N4j2j0j89K12l2j11lP1J07j38n3P1m9k7J10p6K31o7J50j88j56
$$ y = [-7, 190, 96, 167, 135, -161, -20, -188, -26, 53, -35, -130, 180, -179, -93, 48, -16, 156, -16, -32, 318, -85, -123, -108, -324, 45, -93, -68, 351, -115, -248, 73, -34, 300, 96, -211, -34, 205, -187, 141, -225, -70, 143, -289, -163, -83, -136, -187, 96, -58, 98, -20, 106, 204, -270, -65, -117, -239, 417, -100, -258, 252, 108, 56, 292, 93, 44, 210, -188, 264, 314, 79, 349, 83, 132, 252, -99, 185, 97, 51, 83, 327, -216, -36, 4, -165, 104, -117, -49, 348, -361, -287, -173, -42, 227, 134, 36, 20, 29, -138, -111, -158, 187, 36, -137, 61, -71, -201, 89, -397, 100, 120, -161, 21, 25, -179, 171, 103, -80, 378, -56, 82, 60, 86, 100, 20, -139, -1, -37, 17, 149, -15, 37, -133, -23, 78, 50, 20, -76, -136, 21, -167, 94, -207, 184, 46, 183, -114, -40, 67, 31, 39, 155, 47, 30, 204, 227, 0, 28, -155, 113, -15, 39, 27, 17, -172, 40, 8, -103, -106, -35, 72, -66, -119, -48, -97, -124, -14, -90, 141, 74, 224, 36, -120]
5518a20K01k0k80J92j20R6K01k45j22L73j27p8J34n1P6l3j91m0K65q0J29j57k
5541Aj77J62m7P5k28J09J27k27M48j93m32L23K1K34p5O5l64J21l7K76j22j74K8
5564h6M8N1k33L71l03J49J00j05J10j75K07J28k22j01M5p3j51K49m4R4r5j0N7
5587A1k95J37K46J76m67K16O0p3J04j10m4j88L44l92K94kl3j03JJp3K61j42K17
5611A46k44K32r6Q9j87R4n8k9J93j31k4R9j33j34J73j54L37l82J83oMp7l8L47
5635B04k02l9j45J77j75K41j44N3K14l67q5J44L5J95o2j24Q1n0j29K87J0k20J34
5658C3P9m22M98l49K44Jj5j0k37Q7P9J36q3j27L5k1M5l5Q7m8P7k21j33K03o6L56
5684A93j19j57K6J83l54J92P1j89R4L98n75M20l95K47K3j49J27j41J37l3p5j17
$$ y = [-120, 81, 61, -219, -27, -147, -51, 150, -95, -217, 156, 29, -49, 85, 34, 110, 77, -114, -154, 111, 31, 160, 3, 1, -176, -14, -61, 14, -214, -105, 22, -205, 243, 50, -382, -59, -38, 196, 121, 186, -178, -57, -94, 182, 60, -114, -86, -38, 13, -220, 151, -152, -3, 97, -8, 102, -73, 134, 262, 40, -61, -16, -89, -240, 9, -35, 59, -36, -46, 11, -284, -147, 99, 275, -192, 24, 84, 11, 115, 5, -39, -227, 117, -275, 19, 17, -16, -119, -118, -117, -190, 71, -71, 146, -98, 134, 38, 127, -60, 34, -24, -53, 140, 9, -15, 84, -49, -183, -10, -164, 173, -209, -26, -32, -28, -105, -143, 204, 2, -37, -182, -5, -180, 61, -83, -30, 184, -183, -268, -124, -89, 106, 44, -80, 1, -49, -178, 109, 119, -101, 33, 112, -310, 188, -161, 83, 84, 69, 59, -178, -91, -12, 124, 41, -86, -51, -72, -27, -62, 25, -23, 54, -167, -300, -97, -163, 193, 74, -83, -57, 126, -228, -36, 35, -154, -60, 338, -237, 183, -212, 35, 58, -91, 36, -105, 32, -1, -76, -193]
5706a93L24k88L36R8l00%M71o68J84K09l32qL48l31L53l50K12j55J38k1K66l75
5728h2J97n6k43M1J30jj23O1J20J6oL4k0j91L12l26P1J13k38L58l28J09o4p9K02
5753GJ62j88J10j48j54L81j50O0J0j61j37M34k23Q3k40M4K73o6J03p0j68K15j09
5776F8m67N72j86r6K43J94m76L69m23J69K00j05M13p18K31L58j72l84J19j64L39
5797H4L04n14r7M16o35J88L32lQ5l57K39k13J84J41j42k88M25j03r8r4L4K51j20
5820A9k41k3o4J40L20k31k46J49L13j37J12j95J10o8p6M31N3l66J50l54k48L49
5842a03j47N00j49k55N41k40o2q3n1J36q8j7J4j19o1L28k4J36j11m68N17r6k39
5865a41Q10m7m53ml72k03J33p6M63k8N99n6n26P2q5K35n26R41o29k02M00o79L33
$$ y = [-193, 131, -157, 179, 277, -23, -23, 448, -220, -36, 173, -159, -167, 181, -150, 203, -147, 65, -90, 48, 27, 293, -82, 115, 59, -184, -143, -13, -14, -137, -76, 44, 60, 54, 88, 68, -123, 189, -137, -66, 47, -191, 167, -161, -52, -116, -195, 7, 169, -19, 91, -57, -211, 170, 20, 80, 90, -71, -208, 226, 3, 86, -154, -110, 163, 97, 200, 130, -38, 177, 68, -399, 173, -13, -109, 134, 328, -148, 221, -202, -33, 167, 62, 475, -243, -12, 346, 174, -210, -91, -255, 84, 388, -126, -223, 193, -442, -254, 78, 75, 160, -197, 42, -171, 13, 154, 12, -276, 149, 46, -52, -146, -112, 139, 19, -222, -245, -309, -169, 151, -80, -326, -177, 136, -1, 111, -84, 26, -42, -118, 313, 366, 0, 150, -204, -452, -103, -250, 250, 101, -154, 387, 147, 85, 2, -49, 87, -1, -18, -4, -123, -184, 144, 120, 256, 145, -323, 194, 98, -141, 669, 622, 169, 165, -207, -410, -277, -353, 110, 82, 681, 625, 99, 171, 86, 321, -205, 736, 107, -95, 305, -374, -41]
5888d1R5j023J652q21P9l12P08l78M62L41l54n95N46L72p74j23J84N7Q7M94J24
5909G80j62p53Q6P3rL86K8J68K00n79K13p13N31K12j41j37j240J855j14j99j49
5930C36r88Q31O78N1p97n25J142p21K91n81L37k13k2K84R8m86j9N49j46o9k34
5951b04J78l53M15M3M32o26J14L4j21K18n23N07j21L53l43L40m38J01J44M4j98
5972dO0j41K9J31M5j39Q2k1j75K5p4kP2R0J8J5M7P9k35J9J76r5P6L14k08l21O0
5999g7O7K02j41o6J72N33m71J57l1n03k89N07J06l92O3N60l73n0K08m88J24L62
6021A80K62j063J133l32k44k03M66l31M58n04M2k4J55j79M1K30p2J23k63K06j05
6042b4M19j014M50L26M2Q2k9n33%O8M27j13n99O49k78j06J57m7K56j7k41K94l02
$$ y = [-41, 54, -969, 683, -138, -59, -371, 337, -41, 421, 762, 408, -187, 359, 731, -43, -166, 18, 75, 162, 656, 780, 618, -135, -49, 24, 15, 401, 429, 597, 797, 218, 431, -282, 249, 461, 320, 183, -1057, 798, 684, 485, 336, -652, 179, 857, 908, 111, -414, 728, 7, 298, -283, 54, -159, -181, 103, 201, -285, -304, 245, 99, 30, -204, -26, -379, 36, 79, 511, -115, -1, 33, -88, 130, -393, 114, -7, 346, 3, 343, -95, 6, 150, 194, -4, 56, -85, -56, 75, 120, -19, 63, 42, -133, -108, -182, -184, -112, -22, -4, 11, 58, 137, -98, -79, 97, 2, 78, 392, 184, -137, -77, -10, 192, 51, -15, 157, 690, 219, 376, 345, -158, -447, 60, 166, -226, -163, 397, 24, -26, 182, -306, -182, 180, 442, -621, 512, 180, -64, -267, 199, -132, 326, -178, -136, -160, -5, -184, -143, 87, 15, 138, -125, 81, -24, 395, -619, -169, 157, 199, 281, 252, -281, -281, -213, 214, 101, -498, 151, -127, -233, -76, -123, 133, 116, -125, 169, -133]
6065a33L52J11l82J32k4n5j86J08J16L8J48r0O6k23l8K93k99MJ10J86m0l33L6
6088a03j80M64k04N7j12MKj27J57R3r6K23k28J3M9k34K76J61j89q1J68l44K45
6111A4k80M48n17M35n3J79k58K22k35O64j012K50j54K96j57m4L6K21m97L66L86
6132C10m8k64K40l8J38k91K72l45K10j04K05o73P34K54r07P60p47N72J7l80k92
6153c77r4L76j81q9O05k44K49r2k12N3J93l04K69k86J44M9j85J72Qj90J16K43
6175B23j58l41K98n1k02K45o01J232n27J57p48N14o6K3K97K18l71J1k25k31Q69
6196E66l81m88L12R5J57k37k49L51j00j13J17m6j7J91l30J02J65j9J6N9m64N41
6218B28j38mK43m41MM55k36j46Q4j96K47l6j01o1J15K34q1k40M0J24p1J0J95l25
$$ y = [-133, 219, 330, -52, 80, 56, 1, -185, -77, 39, 77, 225, 135, 201, -22, -60, 233, -66, -62, 48, 234, 194, -139, -103, -283, 181, -23, 34, -78, -74, -72, -199, -42, 51, -45, 178, -50, -37, 12, -222, 54, 215, 26, -55, 113, -231, 14, -266, 182, -335, 100, 47, 226, -32, 190, -45, 619, -393, -143, -297, -1, -158, -202, -166, 55, -442, -76, 310, 262, -2, 238, 200, 338, 47, 319, -26, 184, 80, 285, -388, 346, 600, -307, 453, -294, 278, 295, -85, -377, -471, -95, -276, -365, 240, -4, 245, 153, -59, -6, 187, -117, 152, -134, 10, 59, -126, 46, 54, -136, -20, 223, 65, -276, 22, -29, -231, 14, -587, 645, 118, 275, -473, 41, -25, -2, 295, 513, 142, 153, -72, -303, 566, 185, -303, 9, 104, 261, 24, -225, 126, 26, -87, 30, -16, -33, 158, -172, -70, 95, 76, 92, 151, -313, 228, 90, 86, 329, -112, -108, 347, 111, -35, 49, -147, 100, 64, -37, -98, 17, 251, 170, -70, -30, 94, 23, 33, 228, -97]
6242i7J4nj09L29M3l08q4L7J22J77o23M86J36l10M31k16N9j42Ql1K53l04K75j66
6266b5Q2j73M0o2P0n5J63K25k91L2Om11N70M8l39L98l12J0J94j03k69K36M6q8
6290hj1K2J83k29K37k46QJ38j47L40k42j36K8K65k99M1Q8p4K62K18l25J92k40
6313F5n0Nj55k2K17q3o0j19L7L81j87j87M93n89J33J98k14N2K44l29K79j76k8
6336i5M0R8r6k15K80j00n7N3J87j28j10J82K58l45K48j66P2l7j49L7o7J4R1j48
6360a53L87r9k24J73J12l97K72k2p3J6k13R1L05N0j46J77j84M4K1r0L4k98J87
6383c0K62l16J69J61m41O4J40r8J97j60J78M4j33j42P7K28k99N0M6mk44M34k76
6406i3J88P2r2j12J80j09J95j53j42J31kk11L13j2N7l0j46k92J25o0J06j33mJ53
$$ y = [-97, -83, -88, -197, 132, 175, -133, -217, -180, -58, 119, -504, -18, 118, -192, 239, 23, 82, -60, -52, -83, 170, -134, 141, -25, 57, -116, -76, -138, -68, -123, 40, 265, -26, 6, 12, -399, 171, 219, -120, 278, -34, -24, 170, 67, -202, 34, 80, -8, -19, 3, 186, -43, 194, -52, -44, 94, -53, 287, 45, -91, -63, 202, -97, -56, 32, -42, 220, 438, 113, 305, 65, 15, 20, -135, -157, 60, -23, -83, -202, -165, 216, 29, -158, 335, -254, -121, 77, -137, -85, 159, -170, 109, -67, -95, -55, 43, -53, -268, 12, -88, -145, -92, 95, -33, -143, 39, 297, -48, 200, 34, 106, 69, -80, -43, -110, -96, -5, -153, 234, 135, -89, 84, 196, -201, 71, 49, -24, -8, -221, -130, 175, 225, 79, 256, 72, 116, 137, 47, 81, -217, -30, 232, -84, 85, 246, -195, -131, 9, -89, 108, -52, 126, 170, 37, -105, -28, 200, -99, -49, -3, -7, -251, 183, -93, 95, 167, 75, -37, 143, 34, 229, 76, -66, 65, 63, -148, 165, 153, 210, 180, 34, -258, -133, -193, -87, -220, -224, -71]
6430g1%J58N7k66J82P8k47L72k68j32J98Pj06l6P2m7k3j4J52J03p8j61l2J60K8
6455H6k37L63j94p8K45l15j42K30M6K27j72n6J9k76L24q0K5K31m38J24J54j19
6477c3qK02K9k87L12k70N0j96K27k4l1M0M6J35k66o3K00j95j9R1K23J6m8n7j30
6502e6N2K71l75j5J60l40J66J0J40N1k08K89j92j6O2K0O6j77j28J86K07j68J96
6525B01k96J20M4K3j37K6Q8kpkJ57m01J11L3R9M5j48n2m9K4J28l60L37j5j6L30
6551B81k83k77L06p1j4P6J25n8j43k8j34J67K7r1J15K72k84J35j37j77K37k24
6573a80J94R2Qp4j60L90k81j34J48q4J32J45j73j02j38K36k27K02J25o6j8R3k17
6596h9Q6k5j12PJ53m3J34M0n6j58J28l2O4j06k0J63j41J13k54J79j22J77r9K99
$$ y = [-71, -71, 87, 144, -122, 60, 138, -109, 263, -5, -137, 61, 68, -38, -74, -2, -49, -72, -86, 66, 169, 91, -70, -102, 58, 86, -151, 212, 18, -60, 185, -130, -272, -42, 4, 231, 59, 3, 22, -254, 70, -10, 15, 246, -192, -68, 86, -33, -41, 161, 190, -97, 215, -55, -5, -201, 26, 2, -29, 11, 57, 192, -74, -137, 63, -132, -151, -60, 163, 179, 131, 74, -56, -4, 267, -108, -123, 37, -303, -137, -127, 13, 64, -144, 145, -47, -63, -1, 19, 85, -92, -220, -34, 173, 5, 201, -95, 25, 69, 92, -45, -19, 69, 67, 60, 58, 215, -186, -75, -42, 57, 102, -46, -98, -147, -123, 5, -355, -18, -33, -49, 281, -2, -279, 27, -44, -58, 18, 143, 85, -58, -86, -220, -53, -26, -117, -2, 270, -14, 121, -16, -193, 44, -180, 14, 106, 114, 40, -120, 270, -11, -145, 3, -81, 51, 196, 23, -79, -217, 19, -208, -6, 119, 53, 35, 128, -89, -3, -28, -140, -133, 20, -23, 111, 151, 95, -63, 65, 33, 97, -9, -29, 134, -7, 106, -148, 31, -91, 86, -13, 286]
6620B86l94M6J14K23rk26R5R0j94m46N95k00M6q0j1pj2J0J21J40n2j67j22n9J28
6645h5J99l24K83J4j25p6L5l5j18J07K96l2j90J32q0J39k38k23M06M10n21j01
6667a27M4j71K86M8J56j15L7p39N0N15l10M17j33R3n52R75r94L23L29k24j60M6
6689b06J55k6O2m65M1M54p64J442p95J8J09R2j11m12J32K14J25Mj98K57m42KL26
6712A4L2K36k96m0K1j30J57J38m53L24N3lk1j59M5J46QJ9ppn4k8K4q0J0r5M38
6739B92l10L7J52j46o2p6l7N1J29J03N8m0k48N0J17P8k6l55K58j41R5L8j71J99
6763D5jj79J46J30n86J57K72PJ29P1k31K33l98K54L1k41J78M2j71K46k17J34j51
6786a00L4L19k61J35j40K94l01K00k78J96J83o09K28J02k07j1k9L44L5j19nr0
$$ y = [286, -108, -62, 52, 275, 266, 40, 135, 225, 31, -415, 180, -20, 26, -54, -65, -72, -84, -74, 47, 187, 135, -32, -154, -213, -85, 114, -210, 73, 87, -38, -114, -79, -114, -232, -125, 171, 139, -51, 81, 1, 140, -98, -321, 85, 495, -26, -127, -83, -254, 32, 80, 236, 121, 158, -581, -531, -16, -326, 91, -42, 51, -501, 474, -520, -197, 132, -92, -252, -206, -51, -77, -15, -480, -439, 15, -749, 693, -102, -84, 25, 117, 6, -406, -274, -60, 65, 69, -129, 128, -314, -312, 14, 46, 282, -14, -54, -33, -163, -6, 132, -321, 3, 56, 53, 32, -127, -82, 64, 72, 91, 84, 77, 23, -5, 19, -61, -51, -146, 292, -18, 19, 171, 25, -37, -113, -150, -99, 30, 133, 191, 151, -97, -47, 70, 148, 122, -233, 25, -116, -21, 17, -154, 45, 44, -135, 11, 141, -445, -288, -16, -9, 120, 191, -40, 193, -205, 49, 80, -161, 17, 59, -112, 134, -83, 51, -100, -66, 253, -8, 127, -13, 281, -20, 180, -98, 98, 281, -328, -100, 2, -205, -216, -245, 99, 134, 15, 10, -80]
6808h0q8M13j02NJ56n54K08P2J6j65K82k53K22j32J1N8k52K62j1j46J15J2r8L05
6832B56m70J16K76k38R8P4l00M54j72j44J42K1k14K86l38L62k38oJ61Rq8J49l43
6855a47j5K17l04J48qK22j82Q4k52L58j15P3K1l13R4K21j39K8J27j01r3J16J57
6878A97k66j2r6K04k03Q9L37k78J16KP0p4N3l96M73k69J66l0K7M4r8k04M30k86
6902dj50J45L8J09r2j22Q7J14q9P3j54lj92M53m5j35m03J27J08K63k13p6l23P59
6926B75k99m60Q89m69p85J468K33p49r7n0n5J41J27L3j54j31N2k9N39n06P99n33
6948B39l66k83L75j51j08J77l90L24L79R87p98j90j19j21q27Q54j58pM36n23l8
6969c08J82R0j09P7jK48L9l22J63o2j52K88m5j53Q8p2q6L10l75M73j77j39l9J94
$$ y = [-80, -168, 245, 143, 148, 304, -250, -42, 30, 46, -119, 163, -90, 132, 0, 11, 69, -183, 79, 68, -78, 37, 49, -49, 256, -214, -98, 178, -60, 38, 112, -188, 266, 94, -50, 92, 113, -101, 185, -153, 209, -29, -35, 126, 135, 47, 196, -147, -162, 55, -249, -101, -109, 113, -69, 15, -237, 121, 6, 79, 100, -213, -119, 102, -37, -9, 118, 17, -76, 40, 197, -69, -81, -177, 27, -176, -87, 250, -28, 88, 90, 160, 86, 139, -257, 216, -53, 113, 83, 110, 154, 56, -148, 282, -4, -154, -9, 29, 138, 46, -76, 11, 125, 36, 109, -45, -48, -240, 213, 168, 33, -370, -243, -135, 128, -85, -161, -484, 275, -24, -484, 405, -64, -849, 619, 852, 103, 6, -44, -99, 42, 169, 202, 48, -83, -31, -60, 479, -27, 772, 239, -127, -410, -35, -186, -294, -117, -507, -183, 196, 1183, 385, 195, 76, -45, -872, -18, -176, -183, 253, -270, -308, -126, -36, -145, -68, -69, 179, 218, -104, 59, -3, -155, 133, 88, -65, 23, -49, -135, 175, -200, 273, 96, -43, -82, 112]
6993A12o1ml3j28Q0P4P7j36L7j87J54L1Pk29K07P2L6m2j3P3k45J86n1L3j76R6
7019c0Mq0K95O1n04K25K7q7M4J20r5K62k15R2j86K54k00j34J80L4J39j74r0J31
7043G3l31K21j44J48j38K48k1l38L21j21K6K33N4l19L27j70p8k10K47j17j20J27
7065h2K85r5L8j94J74l72K26j90L21m8k70J13qK50l46M2R1Q3j4j27J01O4n6j46
7089a60K15n7M5J18L6k57J07N6p8m3P4j74K54k99j40L46j7j65KJ87J22j39j38
7112a05J81j2r3j10N19k57j60p7J07j02m6lJ88j33J76k07J6J77q6P4n4j46J21
7135c2q3P5K57k79L78k54j25J87mJ9j68j17J36R8j17r2L14l56K22l66L69j03k59
7158c00K21K52M8k75j0O8k3j73K5O2J79k9j06jJ39j36K89l37J41k7M0j42L22l93
$$ y = [112, 51, 47, 14, -114, -34, 40, 117, -19, 18, -169, -15, 16, 23, -206, 1, 73, 109, 67, 54, 127, -118, 68, 17, 50, -126, -30, -26, -106, 189, 250, -254, -29, -2, -89, -45, 75, -20, 242, 27, 119, -67, 187, -13, -147, 33, 67, 206, 32, -58, 73, -258, -37, -181, -33, -171, 77, 56, -282, 39, -82, -56, 177, 231, -88, 239, 69, -9, -219, 28, -89, -209, -82, 203, 108, 146, -48, 126, -246, -20, -210, 111, 63, -207, -94, -102, 148, -198, -156, -65, 18, 4, -123, -22, 42, -14, -160, 55, -2, 43, 161, 197, -60, 47, 103, 25, -18, 56, -118, 136, -163, -303, 43, 26, -139, -137, 50, 172, 33, -105, 76, 64, -29, -139, 380, 123, -37, -114, -7, -109, -155, -158, 30, -103, 73, -134, -118, 59, -27, 47, -7, -153, -32, -115, -40, 217, -62, 316, 62, -63, 124, 120, 139, -29, -146, -10, 88, -29, -121, 193, -163, 59, -307, 62, -41, -300, -79, 173, 221, -54, -64, 4, -19, -192, -167, -105, 74, 45, -61, -62, 77, -59, 230, -107, 34, 7, 47, -95, 227, -166]
7182a66Q4m4L1J27p9M1M0J99o9l78J61O0l03L51J7j67L64k54N7m59L98J19l63
7205b33L12j61M06l37J99j08K14m48M04J57j77o23M29K45p22J116j83o21pL64
7225B26j24l93M23n44P01l17k20L15k58o4J04nQ89p11j56j56j04M29O6k19N1l8
7247a05M57L0l01K95m80l4K0K17J81k31n0m14k45J060m61k75M08L2m50M28m3L18
7269C57r35R00N8k78Q4k12n95L17N66r32K37O19m65L21n72J65n6O55j95L78j91
7290B26N4K17l04m47p5R6n38N90Q81n84n68J25N18P7o3k11M73r4j94K03o67O27
7312C42j53j11kk40J34J05k3J2j10j41K73j06K11l18N1O0K2j09j8L97m45Q4m0
7335a25J29K22j78l1J24m89M29j59K39N2m15K68k58P8J95j40j48K16J60p1o8n3
$$ y = [-166, -82, -126, -95, 32, -47, -6, 34, 233, 164, -214, -53, 7, -296, 55, 72, -95, 269, 15, 72, -387, 11, 130, -233, 79, -82, 324, -13, 186, 78, 292, -156, 248, 405, 228, -395, 34, 279, -443, 673, 490, -131, -138, 226, 102, -291, 132, -412, 289, -28, -248, 67, -191, -255, -151, -156, 733, 22, -134, -290, -394, 35, 101, -118, -67, -105, 352, 382, 81, 376, -104, -138, -118, 99, 280, 49, -1, -415, -660, 400, -61, -336, 72, 104, -346, 82, 39, 357, -578, 322, 380, 102, 186, -26, -621, -304, 262, -670, -433, 186, -279, 42, -530, -365, -421, 234, 39, 417, 226, 280, 497, 193, -254, -329, -233, -771, -181, 700, 116, -452, -327, 191, 268, 205, -6, 467, 373, 179, 382, -285, 342, 189, 78, 76, -164, -30, 75, 52, 64, -46, -187, 86, -20, 191, -127, -76, -16, 6, -103, -121, 276, -169, -85, -125, 4, 226, 48, 17, 141, -348, 81, -78, 161, 213, -202, 66, -192, -114, 81, -59, -207, 9, 169, 98, 30, -23]
7357b3J6ORN4k09K73j5j40L7j17K03j15j10QJ18j17J7O8L36l60J20k31J95J47
7381A70j66p0j35K58Lm5k44L54k53K61Q0l05P0J10L0j77J04N4J11j43j18P5j04
7404h0K04j51R3k51J99K93m63K29mo0Nk42J38M8M7K9L9J66m38K74J8k48L94P7
7428C16j18k63o0R6J75j40O9m3L4k4%j3l5J30m14J24K31O5K05l08r7J0J53r7j41
7453a45L76J60m16J9J6J02O9j29o5J39k01P2J39j31k2J16l28L74j5k72K84Mr8
7476D8l5J15kl1n2J28j59k12M03j31j70J48n2qL4L0j26p0L68l21P9M3L7l42J82
7501i6j59K56q1K62k33l4J7L0J17j31o1p0J47j5J76j69jN5j29J34j12J15Q4j60
7525e8m1J05q0Q4j41K2P1N6k57K10n7PP7q8j19J77OO2j07J49j2j39K42j83k45
$$ y = [-23, -7, -1, 8, 62, -147, 126, 111, -29, 8, -109, 94, -21, -131, -123, -5, -122, -105, -37, 299, -61, 59, -172, 23, 170, 4, -66, -201, 57, 60, 15, -229, 125, -128, 133, 213, -92, -22, 88, 118, -59, 45, 99, 210, 67, -51, 24, -80, 124, -27, 66, -185, 14, 307, -156, 73, 69, 9, 14, -228, -90, -42, 5, 34, 73, 239, -199, 75, 93, -155, 239, 316, 198, -65, -125, -29, 146, 6, 75, 32, 66, 42, 42, 29, -6, 124, -290, -166, 65, 130, 335, 27, -70, -60, 93, -4, -145, 231, 391, -25, -6, 10, 112, 181, 52, -13, 126, -75, -3, 136, 5, -17, 99, -229, 145, 130, -142, 142, 146, 48, 13, 128, 126, 95, 43, 171, 12, -200, 203, 72, -98, 50, -2, -10, 24, 54, -72, -142, 226, -95, -16, 27, 64, -278, -96, -255, 1, -80, 182, -51, -85, -68, -38, 79, -52, -113, -183, -36, -51, 125, -44, -45, 10, -119, 15, -97, 18, 102, -58, -99, 6, -74, 10, -131, -109, -38, 18, -239, -29, -86, -79, -2, -90, -209, -32, -26, 36, -71, 78, 66, -73, 169, -14, -259]
7550b59K27K62k21j02N5q7J74J10k28jJ14j25P1j1J37j74J5N7q3J98j71M9j2K56
7574B51m88Q3K08l69L99o5N2j46J81n4J34r7l9k28K31J22l10J34ON9M6l48K13
7597b5J56j53J07m0p9J99j15j75J37k16K27l6O1p5O7nJ4q7n9J00Pk35J73J3O3
7622B4L6j86O2M4j25J78k63L62N0j89O6Pk46J09kQ8l4L0o6k1J03P0j09l9p6P7
7648e0l3J81j82J17K2Q6o6k22J89mp9P8j1r2J2O0K8l11K69k2m9J52j18q7K14k3
7674E9j77L16p1J0j90Q7J12j22k26M8J18q0J00J48j58r8L49k64P3k36L10k69L60
7697A99j83L6j46j37L19o6M5k01L38k85J85J9k34M24l66M22m11j40L63j93j73
7718a85R4j61J49L6R8k06J22K8p5J29n0J91l95lM14m61O20m82J30J07j75r7K00
$$ y = [-259, -32, 230, 9, -93, -38, -125, 49, 159, -69, -70, 44, -81, -10, -21, 116, -58, -43, 14, -69, 129, -42, 7, -5, 251, -237, -154, 54, -315, 84, 19, 71, -75, 106, 52, 186, 89, 50, -178, 53, 175, -135, -1, 5, 64, 110, -238, -25, 131, -22, 85, 45, -34, 165, 50, -125, 12, -204, 23, -13, 48, -27, 40, 35, 49, -38, -97, 3, 10, -225, -52, -39, 24, 60, -126, -64, -20, -145, 33, -230, 132, 182, -7, 59, 66, -180, -71, -73, 15, -19, 11, -55, -76, 27, 97, -12, -51, -127, -50, -83, 98, -84, 33, 55, 141, 75, -147, 42, 38, -41, 37, 26, -66, -54, 6, 34, -277, -8, -30, -79, 73, -45, -132, 82, 59, -118, 198, 127, 137, -53, 34, 146, 24, -202, -154, -36, -116, -16, 132, -26, -124, 225, -39, 34, -202, 108, -161, 199, 16, 52, -94, -231, 88, 22, 67, -134, 204, -81, 104, 123, -111, 313, -53, 369, -42, -182, 181, -12, -185, -91, -252, -103, -67, 31, -175, -53, -25, -100, 29, -21, 170, -225, -228, 186, -275, 345, -137, -7, 100, -75, -172, 28]
7741B8k53K23j05M11l45J04j69K64k2k74M71k43j94O9J4J49o0l33L10R3k55L08
7763A91l64P0q8j41J91L9J19O3j95K6J58k35J49K13j50j76L13l63L05n7Mk65K15
7786B2r7K77k31K81k28j61J16%k69J96j34J57L50n86N08k75J58j2j52J21j05M7
7808a7j75P9q4K10j05J39k6N2J37j11j73J58j29Q5p3J25j58Q9k39K45O6j05p3
7831h3L69k23q0J1J07k43J72N2j7l7q7J15J40k43J02n4j11L12m21M4J09J75j21
7854a2N7j18K53n5k74J57m9N0l20M93J66m06Q6n1p0K01n2rp0M8Q0k94n1K42n3
7879e1j05J19R4L5j52k9J64L1m0lp2j6O8o7O6k23P4J95m2L7L6k16L1n4J98j48
7905g0Q6l4R1o5k11K18oL9k49J83q8J12l2q3j43J75K0J5Q2r5K91j77J01k81J70
$$ y = [28, -225, -2, -107, 304, -41, 63, -106, 158, 136, -138, 333, 90, -104, -35, -21, 128, 68, -265, 45, 138, -117, 191, -173, -103, -191, -332, -141, -102, 17, 80, -115, -89, 69, -166, -17, 196, 46, -130, 183, -180, 125, 68, 72, -193, 22, -75, 202, -29, 252, 24, -137, -21, -21, -290, -94, -228, -71, 279, -307, 201, -74, 84, 72, -80, 41, -64, -17, -192, -113, -197, 13, -92, 47, 21, 73, 210, 99, -74, 84, -45, 40, -33, 92, -66, 23, -216, 29, 95, -10, -83, 286, 63, -17, -6, 101, -142, 30, 82, 65, 28, -59, 56, 196, -47, 55, 1, -110, 202, -219, -175, -66, 109, -12, 45, -73, 180, 125, -149, 8, -41, 9, -311, 182, 348, -58, 28, -23, -93, 108, 56, 47, -23, 25, 105, -189, -240, 2, -51, -156, -37, 57, 92, -60, -89, 75, 106, 66, 63, -9, -25, 43, -24, 42, -181, -107, 88, 46, 83, 119, -97, -66, -120, 78, -70, 16, -18, 73, 8, -203, 15, 9, 48, -201, -18, -106, 6, -26, -109, -252, -77, -57, -42, 40, -55, 236, 59, 160, -121, 49]
7930D9j33J61r2J75k93l5L85n1P8j03k21K39j79q4K21j94k16J78l4J07k50L02
7952A0P6n6k57L82k22K75K1l44L68k47q2N1k2Rj13Q9P7o5p1J73J77j47j76K43
7976A49j58q4J57n9m5qQ9M8M5m42K32L64k06j41Q0O3r7K56j56j35L12l07P7j17
8000h3K3J44M2j56q2M5J5J83k03Q9M5q9NJ28J59k80n4j28L02o5o3OL56l33j5K11
8026B02j70L7r2p0j63kK41Mn6J08k6m2L8J15j82j76J81n6n6K59j40JJ05o1l02
8051c03O53l76o2J30j10J36l8O0P3j90J67J50l28R2j92J84R3l0k23L57j84N4m7
8074F6r6L01k15n1k84J61J38j38K26r0P1J32j32p9r2R1j39L0r9K75P9j67K4Kj47
8099a33J25J30l63K45k0n0O2K97j99K09l89J53M0j04j50J67j51J35J58q4O6j33
$$ y = [49, -84, 77, -15, 160, -133, -168, 217, 166, 244, 141, -80, 159, -20, -104, 117, -77, -293, -115, -149, -42, -292, 10, 86, 30, -227, 155, -67, 208, 229, -115, 253, 6, -76, -25, -47, -38, -151, -62, 15, -50, -121, 52, 229, 82, -94, 149, -9, -93, 64, 5, -40, -48, 41, 89, 134, -308, -76, 288, 82, -59, 21, 84, -13, 243, 87, -48, 264, -43, 34, -83, -60, 84, 126, -30, -112, -67, -52, 131, -72, 17, 62, -27, -22, 106, 265, -15, -69, -197, 105, 40, -23, -17, 339, 6, -9, 202, 32, 69, -23, -93, -256, -258, -17, -13, -69, 39, 13, -29, 9, 124, -58, -234, -53, -109, -165, 94, -46, -45, 60, -1, -303, 350, -26, -88, 42, -68, 68, 30, 90, 163, -27, 140, 290, -38, 54, -138, 46, 139, 109, -114, 243, 59, 113, 66, -30, 271, 56, 5, -279, -118, 20, -118, 108, 18, 89, 221, 89, 10, -82, 9, -130, -100, -199, 76, 155, -12, 12, 14, -133, -8, 122, -241, 4, -16, -66, -4, 293, 94, 303, -86, 67, 107, 3, -147, 20, -131, 4, 162, 78, 144, 11]
8121A1n9j07J13L7L96n60O5r9L5L25j74R8Pj69K91k58K66l58r8M49o1j03j51J18
8145A4l24M07nk03P2K9j87K07J02j53J79j50L3O1k09K19j1j30Q2q9Q0p8J42j78
8169i0K31q4j03m5L3k1K98j22j70K8J42On3K57o3m17L64O2k23L7j52J95
$$ y = [11, -48, -155, -42, -5, 391, -169, -104, -203, -168, 157, -17, 81, 88, -81, 210, -48, 218, -140, -238, 211, 150, 47, -104, 14, -310, 97, 92, -111, -39, -10, -197, 10, 112, -41, 138, -12, 21, 82, -127, 92, 81, -49, 33, -56, 24, -54, 88, -90, 141, 57, -46, -91, -58, -79, 219, 97, -73, -45, 97, 103, 50, 307, 244, -173, 191, 253, 30, 67, -85, 110]
8191A10
$$ Imaginary data points
##PAGE= N=2
##DATA TABLE= (X++(I..I)), XYDATA
0@%%%%%%%Qj6J6k4L2m0N6p2Q8j04J28j60J95k35K83l37M01m77N60o49P53q71J005
30E40j157J323j507J711j937K187k463K766l098L463l862M296m775N297n866O488
46C406p167P910q721R607j0583J1659j2846J4163j5629J7268j9117K1220k3637
59a2467K6448k9766L3752l8642M4815n2897O3996q0339J07217j62209M77754n68476
71a90814K63497O56857p88524M25917k56000l27577L28065j50612J6774q7507
81a09924n24286L79401L9975o3016J3070n01726N11682L37857q62353M48150J83126
92a48044o72979O08362J21675n38346L43748m3000N1245K56546m27967J11564
102c37196L08246j80832J56340J5671K3721J29633j83043L21401L756n36245N04859
$$ y = [0, 0, 0, 0, 0, 0, 0, 0, 8, -8, 8, -16, 16, -24, 32, -40, 48, -56, 72, -88, 107, -128, 155, -182, 219, -258, 302, -347, 406, -465, 540, -617, 706, -801, 910, -1027, 1160, -1303, 1463, -1635, 1828, -2034, 2262, -2513, 2784, -3082, 3406, -3761, 4149, -4572, 5035, -5548, 6111, -6735, 7428, -8201, 9067, -10050, 11170, -12467, 13981, -15785, 17967, -20675, 24140, -28757, 35239, -45100, 62117, -100092, 377662, -190814, 72683, 729540, -58984, 366933, 110933, -216644, 111421, -39191, -22417, -109924, -634210, -254809, -214834, -277850, -264780, -766506, -254824, 83033, -779320, -331170, -148044, -821023, -212661, -90986, -629332, -285584, -328584, -277339, -20793, -448760, -337196, -28950, -209782, -53442, -37771, -14050, 115583, -67460, 253941, 257697, -278548, 226311]
113B26311J77708m98236L60195L6827k86777L06734j31597j23259K12122j95996
123H4032R1518J98614k15856J7010M5648l929J3999k34846J19123J10855l05374
134g9206J95245Q1136l54405J77017N5883k04073J17924j15035j681K14149k11713
145a24759J8178J56769k01436N6224N2159j38805P1142l3485L2638J00290j80312
156a91397Q0050J07718j81446J07674L1930r7093J89019m3497l8628J74060j51921
167a3531m498J41999j56934M6692P1398q7548J03378m8889m1531J17429j46082
178a8117J2583J22758j35668P9115N4753j12431J06129m5672p5570R0328j22915
189d4707N233Q4868j30154P2098K2349j18751J11447m7677q5302J16556o5984
$$ y = [226311, 404019, -94217, 265978, 302805, 16028, 322762, 191165, 67906, 280028, 84032, 175550, 374164, 158308, 175318, 220966, 217037, 231036, -3810, 115313, 226168, -79206, 116039, 197175, -157230, 19787, 75670, -128403, -10479, -125514, -127195, 86954, -124759, -106581, 50188, -151248, -95024, -42865, -181670, -110528, -144013, -111375, -11085, -191397, -111347, -3629, -185075, -77401, -45471, -142564, 46455, 2958, -35670, 138390, -13531, -18029, 123970, -32964, 13728, 85126, -2422, 100956, 52067, 10536, 127965, -18117, -5534, 117224, -18444, 60671, 115424, 2993, 109122, 63450, -12120, 78208, -44707, -39474, 45394, -84760, -12662, 9687, -109064, 2383, -45294, -130596, -14040, -80024]
200h0024P443R6717q1692N4555K5710q1594O8515n0320l6315R6054o6892K8578
212a9265O8077r0967N9821J4998q2284Q5600j4028k7118R2535m0276J0950M2772
224A00815p8111K6732l005n9814N6894k6798k3898N8678m7171J777K2105o2875
236c4671L2559R358l7811N4580o559j5843L7197m1215j3870P151l9343J7111j722
249c3078j5581L9962j8788r157K8407m0395K670L2121k1397K3227K4582j0655
261A918J7030q097k0504L605j4151l886O686M101J6758n067M149J3924k6824L626
275f732K6995j8708Q491L4821n058j506N780j6045j2468p100j0230J458P740J709
289I147K912Q751p824j6949R003L385j6336J3811K1380p812k198N870j6012j7635
$$ y = [-80024, -72581, 24136, -57556, -3001, 22709, -58885, 9630, -40690, -77005, 19049, -47843, -19265, 48812, -42155, 17666, 32664, -49620, 35980, 21952, -5166, 87369, 47093, 58043, 100815, 22704, 49436, 46431, -13383, 43511, 16713, -7185, 51493, 4322, 6099, 28204, -34671, -2112, 7246, -30565, 24015, 17456, 1613, 38810, -2405, -16275, -9124, -48467, -31356, -33078, -48659, -8697, -27485, -36642, -8235, -48630, -45960, -13839, -35236, -12009, 12573, 1918, 18948, 10851, -9653, -6048, -20199, -24085, -17399, -13298, 3460, -1607, 2542, 16466, -10358, -6732, 20263, 1555, 10046, 44867, 39809, 38303, 44083, 28038, 15570, 8470, -1760, -302, 7438, 9147, 12059, 20810, 12986, -3963, 5040, 8425, -7911, 5900, 27280, 19468, 17270, 23140, 7128, -10507]
303a0507n603q275o248L812N417M300L041n297l133K927o326k783J4328Q805J322
318d220R100K498j1975q493m455q824l417P780J0732N827L177P000M89r168M446
333D97P818l252J3050J7427l147k072N54q968j0403j0483K553O264m216Q943J0275
348B4840n395k822l516K784j333j5262J9348J4654k5234R535P560l0745l861m147
362a3594j3110M224j2066J2316K4010k7469o77K0005j7844o548M926J4331N575
375e921k0672L2131J3784n8282J8333K3601m1576J5172J3182k805K7640j6583
387a996O754K5304m2390J6287L3191k8396R703M962O097K2603n2020K709L6558
400C9366n7725J4777L4275m3193J9906J0978k879J8002n3527J6755M9504o8141
$$ y = [-10507, -16110, -24385, -30633, -26821, -21404, -17104, -14063, -19360, -22493, -19566, -25892, -28675, -14347, -5542, -4220, 4880, 7378, -4597, -13090, -17545, -26369, -29786, -22006, -11274, -5447, -2270, 4730, 5219, -3949, 497, 8315, 5063, 18113, 35540, 32393, 30321, 30875, 21907, 11504, 1021, 3574, 9838, 5622, 14565, 24840, 19445, 16623, 13107, 15891, 14558, -704, 18644, 33298, 8064, 17599, 25159, -5586, -9447, -13594, -26704, -22480, -34546, -22230, 1780, -25689, -26366, -6361, -24205, -30753, -25827, -11496, -5921, -26593, 5538, 19322, -38960, -20627, 2974, -38602, -23430, -10248, -13053, 14587, -1996, 4758, 30062, -12328, 3959, 37150, 8754, 18457, 23419, 29516, 52119, 99, 2808, 39366, -18359, -3582, 30693, -12500, 7406, 18384, 15505, 33507, -20020, -3265, 46239, -21902]
412b1902J6358L8025m6957K8373j849l6058K3654m3222R123N2143p1101J6796
424c6617M8674m1672K6541j6215k9554N2791l8430R220N0917p3055L1418L9314
436B3332o3888L8513k3084k8659Q9364n7590j0592R0106p4370J7942O4687p4423
448h662K7143J7268k3326N2173m7084R894N0187q1912M8637J4148r3572R0709
460E5603j7971o3619J12008o3932l3409R0932r0705J2865N1253q5349N0071k989
472A4758m7119P0925o5431j9027M8509p8989N9213R844r4767J00335k2715n2575
484g7039J04977r6102j5906J08541r4847L6713M4061j05842Q8932K4762p9902
495f1652M7078k8418J7371M9043o5106N8879l994n6757J29218n1895q3233J14759
$$ y = [-21902, -5544, 32481, -14476, 13897, 12048, -24010, -356, -43578, -34455, 17688, -53413, -36617, 12057, -29615, -3074, -19289, -48843, 3948, -34482, -25262, 25655, -47400, -15982, 23332, -40556, -2043, -25127, -53786, 35578, -22012, -32604, 57502, -16868, 1074, 65761, -8662, 18481, 35749, 12423, 64596, 17512, 27406, 77593, -4319, 44318, 58466, -35106, 55603, 37632, -25987, 86021, 22089, -11320, 79612, -11093, 1772, 53025, -32324, 17747, 14758, -32361, 38564, -26867, -45894, 2615, -76374, -17161, -7317, -102084, -1749, -24464, -77039, 27938, -68164, -84070, 24471, -70376, -33663, 10398, -95444, -6512, 18250, -61652, -14574, -42992, -25621, 23422, -41684, 17195, 13201, -43556, 85662, 33767, -49466, 65293]
507F5293n1260l518Q3119j07498K9883O7791q7018M9081l310p1761P5274r115
519C6961j6219K7846o2792N7957K1605r5537O7049j0915o0166R2276m9746l3253
531b4934O5381p7193L8893L8274j22377P3083M0874q6880O6346j6026l6297O1657
543B0801n3304J7630K4138q2124Q0420P965q1631P7881l5798k4415Q0886r1869
555e9420J7717P5296r3813O0840L1877q9749P4312p135l5734O0816p4104K7677
567a1420O8679r5711N4145J9051q6597Q7246j7526n1148P3328o2287K4200O7351
579F9311j00217M8666K2770p8704Q7567l3989n3858R1152o6297Q752O3876j06292
591d7263M9467L2507p8832P8245l4265m0289R7316p0824N010N8325r7098O1281
$$ y = [65293, 14033, 10515, 93634, -13864, 16019, 83810, -3208, 45873, 42563, -29198, 46076, 36961, 20742, 48588, -14204, 43753, 65358, -30179, 36870, 25955, -34211, 58065, 8319, -24934, 40447, -36746, 2147, 40421, -81956, -8873, 32001, -54879, 11467, -4559, -40856, 20801, -32503, -14873, 9265, -72859, 7561, 15526, -66105, 11776, -24022, -48437, 32449, -59420, -41703, 33593, -60220, 620, 32497, -57252, 17060, 9925, -25809, 35007, -39097, -11420, 57259, -38452, 15693, 34744, -51853, 35393, 17867, -33281, 40047, -22240, 1960, 69311, -30906, 17760, 40530, -38174, 49393, 15404, -38454, 52698, -13599, -4847, 59029, -47263, 2204, 34711, -44121, 34124, -141, -40430, 56886, -13938, -8928, 49397, -47701, 13580]
603A3580K1719q2127Q1981l7103l4794R1755p8862N748N4172q6188O4353R479
615B3713p4730Q9348l6469l7396Q2813p0453M502M7350p0813N3571k143n6757
627d7464P9363m5516k9487P3083o3208J1395M1547o0706N2128j997m8655O9067
639B9550l7938k3188O1911n1103J1705L0185m7892M7489q928m4176O4741k9584
651B772k3451N4906l6873N719K5746l2010L2392j3534l0126N0789k7909j7563
663i142M0153l2605Q440J6547l5904K9349p253l2784M4373j5790k3130L6894j6697
676B451q369J1302j8650J5187m079k0012K6741j4853r757K5119k1898K167J0509
689d142k1920K3848j261k6656L2878l215k2402K4744p407j1417J5354p821L576
$$ y = [13580, 35299, -46828, 35153, -1950, -36744, 55011, -23851, -18103, 36069, -50119, 14234, 23713, -51017, 38331, 1862, -35534, 47279, -23174, -18672, 28678, -42135, 11436, 9293, -47464, 31899, -13617, -43104, 29979, -33229, -21834, 19713, -40993, 11135, 9138, -39517, 29550, -8388, -31576, 30335, -20768, -9063, 21122, -26770, 20719, 11791, -32385, 32356, 2772, -20679, 34227, -2646, 3073, 28819, -3191, 29201, 15667, -14459, 36330, 8421, -9142, 31011, -1594, 6846, 23393, -12511, 16838, 9585, -23199, 21174, 5384, -17746, 19148, 2451, -5918, 5384, -13266, 1921, -2158, -22170, 4571, -10282, -20039, 5080, -16818, -14651, -4142, -26062, -2214, -3475, -30131, 2747, -468, -22870, 1874, -5533, -16950, -1596, -9417, -5841]
702e841K158q255J6316n237o645J2399j0054O640R670j6198J6441M139j9009K1716
716A8240j605k0891J9163j180j0991J4612o601k299O590p090L132j303l704O764
730A2837n982K921M567j3439Q737J428j6553J1330q20j3409J2148m093q120R413
744I65o599m353N991n033q57J173P19J204n381M062J683r248M804J867p045N828
760a0220P27k774M831k732q94N592l170J30N729K04m13K537J888q61r78L028P05
777C329j383K817K015j049J722N52K56J306j445J850K200k824R05L692k342k826
793H775K600O43n674J74L972l278m051M422P26o554m01L274k818m353J748L420
809B625m213m825M424K48p626N08L524k082l838N30M609k597o336N867L357o884
$$ y = [-5841, -3683, -11938, 4378, -859, -7504, 4895, -5159, 1481, 11151, -5047, 11394, 15533, -3476, 18240, 16635, -4256, 14907, 13727, 2736, 17348, 10747, 8448, 15038, 7948, 11080, 9777, 6073, 12837, 6855, 9776, 14343, 904, 9641, 11069, -5484, 5846, 5026, -8383, 3765, -328, -8448, 965, -5634, -9987, -3996, -9029, -9886, -8713, -7994, -6790, -12171, -8109, -6426, -15674, -10870, -9003, -16048, -10220, -9493, -12267, -7436, -10168, -11062, -5470, -8640, -8510, -2781, -2577, -2990, -453, 1435, 574, -404, 2624, 3329, 1946, 4763, 6778, 5729, 7451, 8003, 8259, 9565, 8120, 9970, 12170, 9346, 10251, 13943, 11601, 8775, 11375, 12018, 6344, 6518, 10490, 7212, 3161, 7583, 8309, 1755, 1354, 4628, 1810, -2543, -795, 2625, -1588, -6413, -1989, -1741, -9367, -8859, -5335, -7417, -11255, -10725, -6116, -8713, -15049, -9182, -5825, -12709]
825a2709K46O219K11n423J080Q903j813j1234J0178P419j3210L532J0648l492
839E55m832M135Q723m146r226J3071N674j2877K747R309l072l309k433P932J211
854A3462j3656J0967R014j8546J919J1544n086m105n170P243N219j8891Q659J1247
868A3820k0849R85J2643n798n527p843J2325N249k5271J2426J3938k5603J0356
881i149J0577j5452L707k261N514R589k3178R856J8183k1026O080N902o929J0466
895A879r544P615J3806k9803J4263K3348k8493P276J2027j0504J2045j3632L745
908D028J8592l0091J3147K0775l3258J1383J1527j5372J2209j5721K911K2682
920B2812l2227R412J7540l1821J8732N205k2972K1129j6213j682K8383l6296M497
$$ y = [-12709, -12463, -6244, -6033, -11456, -10376, -1473, -3286, -14520, -4342, 3077, -10133, -6601, 4047, 555, -4277, -142, 8581, 4435, -4791, 8280, 13954, 1077, 3824, 13133, 10061, 6752, 4319, 12251, 13462, -194, 10773, 19787, 1241, 3160, 14704, 9618, 5513, 343, 7586, 12805, -6086, 2573, 13820, -7029, -6044, 6599, 801, -4726, -12569, -244, 5005, -20266, -7840, 6098, -19505, -9149, 1428, -14024, -10317, -12578, -7064, 2525, -20653, -10797, 7386, -13640, -7560, -1658, -8587, 1879, -7665, -50, 13756, -16047, -1784, 21564, -6929, 347, 12374, 1870, 13915, 283, 4028, 22620, -7471, 5676, 26451, -6807, 4576, 16103, 731, 12940, -2781, 130, 22812, -9415, -3, 17537, -14284, 4448, 9653, -13319, 7810, -8403, -10085, 18298, -17998, -13501]
933a3501K5071k8352J5232K154k0365K4739j5705r73K6765l9839J3429K9312l6159
946a8192J6587L266k0533L2976j6006r781K7582l2006J6662K3940m0582K0075
958C988M801j9681L6248k3779j4065L5551k9132J1285J8951m0582K4065O093k3332
971i589L2103k6176j0863L9680l2873N244J9686l9289K7616P046l1107L0051j9036
984g507q559L6950l6684M616K4445l7100K8970M562l6759L7146j2455j5924L7196
997A8897l3849N478K7448l7438K5241N137l3407M0650j6744j8487M2064l3782
1009h792L982K7427m2189K9134Q718l8246L9820j8757j6161M3264l8544L984K9397
1022B3037m3347K9534N921l9590M0390j6845j5855L9454l8070P099K6833m2000
$$ y = [-13501, 11570, -16782, -1550, 604, -19761, 4978, -10727, -11700, 15065, -24774, -11345, 17967, -18192, -1605, 1661, -18872, 14104, -1902, -11683, 15899, -16107, 555, 24495, -16087, 3988, 8789, -10892, 25356, 1577, -12488, 23063, -6069, 5216, 24167, -16415, 7650, 13743, -9589, 22514, -3662, -14525, 25155, -7718, -2474, 17212, -22077, 5539, 12585, -18522, 11529, -7507, -16066, 20884, -15800, -11184, 13261, -23839, 5131, 9693, -27066, 10080, -2375, -18299, 18897, -14952, -9474, 17974, -19464, 5777, 10914, -22493, 18157, 1413, -17074, 24990, -8792, -4810, 22617, -19572, 9562, 18280, -19966, 19854, 1097, -15064, 28200, -10344, -6360, 23037, -20310, 9224, 15145, -24445, 15945, -900, -16755, 22699, -15371, -8272, 18561, -23439]
1034b3439K9253K621l5140M1534j8267j5041M0000l8492O706K8137l7846K4608
1046D634L611l0633L8671j6491j3676L5483l4275P317K8430l6077K0446L894k7769
1059a6435L6975j5675j5320L4066l1810N675K7086l6475J6756O659k4754L2498
1071A9246j6509j7669L4015k6048P99K3208l3263J6336Q349k5132K6840j6485
1083f313j4351L6608k6193m897K5003k8330J4949R551k6462K4370r906j2714L3768
1096A5083k5251p329K8529k2650J0789P989k6013K6613m053j5705K8785k2434
1108e647l678L1510k3752L796P436j8766K9180p957k2978K9727j5142l584K5991
1121B6136l0198L392J6114j7716K0531j2161k0258L3714j4472r591J9123k5683
$$ y = [-23439, 5814, 8435, -26705, 14829, -3438, -18479, 21521, -16971, -10265, 17872, -19974, 4634, 8245, -22388, 16283, -208, -13884, 21599, -12676, -5359, 23071, -13006, 7440, 11334, -16435, 20540, 4865, -10455, 23611, -8199, -2524, 24562, -11913, 4843, 11502, -13252, 19246, 2737, -14932, 19083, -6965, -6166, 17042, -16221, 115, 8464, -16668, 10172, -6313, -20664, 15944, -10249, -15146, 9857, -18473, -3524, 6027, -20435, 3935, -5971, -18685, 15083, -10168, -17497, 11032, -11618, -829, 7160, -18853, 7760, 3707, -11998, 16787, -5647, -9325, 22185, -1567, 2229, 9665, -9101, 20079, 12122, -10856, 18871, 3729, 145, 26136, -4062, -670, 15444, -2272, 18259, 6098, -14160, 19554, 5082, -4509, 14614, -11069]
1133a1069J0525J3070k3376J7382j0680j3607L2781k0436j1595K1517j9546J1014
1145d020Q484k4251J7891m007j0032K4383k0539n702K1592j5715Q861K932j8019
1158a8142K1259m656j0685K0070j6402NK0423j6434N198N337j1484J5742n838
1171D393q080J6223j1319J652J2218j5264O641L876r647J2273p244o087J5109
1184A4744r969j398R448j1683L534L830p951M925m425k320P907r040J48N362r245
1199f133M182R41p129O980l275l185Q170p731j958Q037o348j131M365k340Q14
1214e741p11J213J994m856L203L630m759L524K035k116M134j573j253N319l603
1229D40j643O459k393k366M231Q13k604J36K085n82k002K033J636j399O68n89
$$ y = [-11069, -544, 12526, -10850, 6532, -4148, -17755, 15026, -5410, -17005, 4512, -15034, -4020, 4464, -19787, -1896, -5903, -15935, 8448, -12091, -17793, 3799, -11916, -3055, -123, -18142, 3117, -1539, -12224, 7846, -8556, -8551, 11872, -4562, 636, 5973, -5511, 10231, 4393, -3687, 12536, 1217, 2869, 15087, -177, 6464, 10340, 693, 12966, 5722, -365, 14744, 4775, 3377, 12825, 1142, 4676, 8506, 555, 5480, 1055, -1265, 6642, -2398, -2250, 3112, -6133, -1951, -1010, -8139, -1159, -4434, -7619, 551, -7180, -9138, -1101, -7449, -8580, -4215, -6555, -5741, -6452, -5239, -3245, -8101, -4898, -1268, -6027, -2503, -468, -2584, 1550, -23, -1276, 4043, 440, -1203, 5256, 2863, 497, 4728, 5541, 2937, 3073, 5158, 4576, 2574, 4607, 6243, 4844, 5512, 4923]
1245D923p35J013l078n81L262l420k021M360k275l359K887m96l504J849R48j765
1261a992M31J255j654j18N76k400O6J791k151m74L066j552j341K545j020j319
1277d291K248J54n61J966M49l44O33k06o67M3P59j90m80J674k47n50R50o21K97
1296A016O49j922K947J353l299K971O03l565J460J19j877R33r85J328J95k431
1312e05K266m28k646K087j001J219J164l431M138M8o152M972j134n191M891j837
1328a540n81L356n100L060K507p402M213K011l640L226p05J624K55n486O465j387
1344H76q096R456k141n535R376n778j355P509q727L568N065r344N987K641m347
1359h45M565m354J075K309q133P678M09j0189J1121j609n996R792q548o57R974
$$ y = [4923, 4188, 5201, 2123, 1542, 4804, 1384, -637, 3723, 1448, -1911, 976, 480, -3024, -1175, -227, -1992, -1561, -306, -1960, -2078, -1502, -3902, -3836, -2045, -4196, -4670, -1604, -3156, -4497, -1952, -2972, -4291, -2043, -1889, -2450, -484, -35, -379, 254, 48, -619, -576, 183, -7, -487, 1187, 940, 390, 1340, 719, 1016, 1665, -257, 2690, 4043, 744, 3715, 4318, 753, 2213, 2332, 455, 1388, 403, 1731, 1926, -505, 1761, 1333, -1313, 774, -227, 992, 2156, -1275, 2863, 2911, -3241, 1731, 597, -4594, 297, -1540, -2121, 1235, -3865, -805, 1702, -5700, -1487, 524, -3116, 110, -595, 1029, 1284, -4202, 2263, 876, -7220, 2236, 95, -5440, 3936, -1842, -3197, 4312, -4415, -847, 4218, -5126, 861, 3502, -845, 3720, -634, 441, 2750, -5383, 2295, 2704, -7485, 3636, 2027, -3969, 5823, -2725, -3382, 6592]
1374F592j0749M489P175j1757P729K670r397O173m218j018O942r011M973L301
1388C894r928J1303l623r053J4509r559k007J4762j4510K088J1717j6025P817
1401A385K578j2540J1596m756l340J2044j2665L547P066j4415J3838k747j2788
1414a1197K0794j0919n073J9351j9808J737J3184j9269J3137J431j6302K0503
1426G569p565o689J7076j8257M930J1661j7774J6230l439j4530K5263j4842q177
1439h544K0768k2363P273J4720k2731J4856J000j4382K2495j3537q409K0242j7551
1452f163R437P621k1963J9771k985j5842K3120j8073o769K5245k0634N195J1634
1465I594k2735J8640j657j7855K2919j2952m090K1390k1307N570J1292k0908J8766
$$ y = [6592, -4157, 332, 7507, -4250, 3479, 6149, -3248, 2925, -1293, -2311, 4631, -4380, 593, 3894, -6034, 5269, 1646, -7407, 7102, -2457, -4464, 10298, -4212, -2124, 9593, -6432, 1385, 3963, -8577, 3019, -1737, -5077, 6967, -5698, -2151, 4915, -9500, 4338, 1591, -11197, 9597, -1322, -6395, 12956, -6852, -5115, 8069, -11200, 1937, 3368, -12934, 7569, 4, -6685, 10391, -7866, -2936, 8725, -9049, 7181, 3742, -10788, 14475, -367, -8544, 12224, -10139, -2866, 11854, -10877, 3979, 4979, -9403, 13092, -445, -8854, 11388, -6163, 3274, 10895, -11068, 8703, 5718, -10124, 12996, -5077, -11846, 13399, -7235, -2040, 9594, -13141, 5499, 3842, -14013, 8906, -4046, -8136, 13254, -8053, -2483, 8809, -12099, 6667]
1478F667o664j7248K6499j3132n623K1333k3548Q765J3145k2631J7002k673j4683
1491a2791K6888j3872p918J9430j8753Q231P984k3484J8384P18j3813K2194j6468
1504c270m235K2053j8281M162Q842k1641K0492J577j7261J9659j3281n795K0442
1517A3463j9694K880J0660j8899J8170O54j8537J9635j0319o869K0817j9576L308
1530d307J3692j9174J3929P06j8095J8975r029p992J9294j7981N046J4786j9891
1543a0041J2844K189j8153K1734r725p580K0780j8437L364J4824k2055J2561K312
1556D617j8757K1264p369p494K0099j8142L706J3972k1593J4104J653j7038K1837
1569A0859r516p488J8835j9353L902J2367k0767J2733L490j5358J9399q670o070
$$ y = [6667, 3, -17245, 9254, -3878, -9501, 11832, -11716, -2951, 10194, -12437, 4565, 1892, -12791, 14097, 225, -7693, 11737, -7016, 1215, 9199, -14285, 4099, 4817, -8996, 13198, -3270, -7505, 14548, -3733, 429, 9271, -12370, 8122, 9699, -7562, 12097, -1184, -6979, 13463, -6231, -3351, 7309, -11590, 6580, 7234, -11303, 8332, -1987, -8856, 11961, -7615, -4307, 9385, -9789, 4140, 4846, -13249, 5726, -3303, -11295, 7999, -9982, -4936, 9850, -10041, 2803, 4992, -13161, 8573, -1152, -8732, 12048, -6389, -3025, 11799, -10256, 2305, 4617, -14140, 7124, -245, -7739, 12360, -5782, -2076, 11896, -9697, 4407, 6060, -10978, 10859, 1343, -6145, 12690, -6663, -2761, 9606, -11161, 1572, 5062, -10296, 9103, 433, -5637]
1582e637J5992j5392L162J0753j6052J0686J526j2864J6660r709o397J5773j6784
1595h283M315J1597j7000J1196L322j2057J4293p672o007J3071j0917L505P639
1608G002j4266R580N93j0212J1608q836k521J2799j2210M369Q663j3732R403K351
1622D591j1446J0101l661l971J0195q562K148N351j0102N578J52o936R673n204
1636b093j94Q170q423M081N271j1812O757L127q483P795j570m735O622m899J4
1651c72K293n911L819K012l766N084k643O70L416o600J660M046q249N227L481
1666D167q160N053J77m815L005l256N51L532l098K359J794k953J859o07j363J394
1682c61m085L889K740n757L355K647n726J950R33k826K931K49P64K413k796J308
$$ y = [-5637, 10355, -5037, -1875, 8878, -7174, 3512, 5038, -7826, 8834, -875, -7272, 8501, -8283, -3968, 7629, -9371, 1825, 5147, -6910, 7383, -289, -6296, 6775, -4142, -637, 7002, -7264, 2316, 2909, -7303, 4305, -4531, -7052, 5747, -6463, -2094, 6569, -7163, 2240, 4591, -6855, 3246, -415, -4386, 5809, -2753, -605, 4746, -5356, 222, 374, -6562, 3111, -2093, -2287, 5883, -2540, 1541, 6812, -5000, 1757, 4884, -3599, 4196, 2626, -2109, 4513, -386, -372, 1921, -3990, -171, 1841, -1925, 3159, 516, 1186, 4602, -1998, -338, 3708, -4541, 686, 4167, -3993, 1060, 1237, -3578, -573, -3829, -3278, 254, -2844, -485, 1309, -1644, 215, -392, -1755, -361, -4446, -557, 2183, -3574, -219, 2428, -3298, -1348, -415, -3241, -310, -61, 703, 3116, 320, 1628]
1698A628J315k005k39l49J110J568l176K289J322n089J693J898l766J355J973
1713A527k52J177m40L7K55k086l01O67j581R35p7N16j095j789J064L29l172K207
1731b079J424p85P44L61K89o25j050O7R16q12j115K409K4j343m10P66o42p36J446
1750a151J248n00J077J574m33k64j09M2p70l60J021Q21r38L39L27j159k73k60
1768B32j42J100M49R04N41k38k36l42j157k17p33M80M46j177R51j7k454L95P3
1787a142j388J213O45j38J493m32m90l50r04n2o51j01J234j068R2J765k611M12
1805b473J183k715K120J764j881K954N14k050K132j273j140J175j505J468M19
1820F92j243K439j721j403L207l416J086L422l847L636J895m873L573p70m063
$$ y = [1628, 2943, 938, 699, 350, 1460, 3028, -148, 2141, 3463, -1626, 67, 1965, -1801, -446, 1527, 1275, 2452, 2012, 2049, 2304, 218, -83, 584, -997, -62, -139, 377, -718, -2507, -1443, -1114, -4286, -2079, -655, -1440, -696, -335, -46, -671, -1721, -1654, -738, -1550, -2665, -256, -232, -1575, -1985, -1219, -1861, -2597, -1151, 97, -403, 674, 2248, 1815, 1551, 1442, 1484, 714, 354, 1375, 2196, 1258, 1597, 1924, 765, 492, 232, 90, 1190, 1639, 2543, 3084, 2846, 2610, 2268, 1111, 894, 161, 641, 1087, -90, 861, 844, -1610, -1215, -1142, -2530, -1317, -672, -810, 683, 251, -239, -589, -1493, -1545, -2196, -2297, -1063, -2131, -2039, -274, -2885, -2473, -1290, -4005, -1885, -121, -2002, 952, 1466, -584, 1548, 275, -865, 310, -1195, 273, 692, -551, 1888, 167, -1236, 1971, -1445, -359, 3063, -784, 2852, 4747, -126, 3447, 2677, -1386]
1835a386M011k490o09K665k483J727k25l465M232k827j450N977n305J605M400
1850D377o028L361J249p008N345j575l388N976l647q61M141n006K711M9m322O421
$$ y = [-1386, 2625, 135, -474, 2191, -292, 1435, 1210, -2255, 1977, -850, -2300, 3677, -1628, -23, 4377, -1651, 1710, 2959, -4049, 1296, -279, -3667, 2309, -1338, -2199, 1942, -3064, -353, -304, -4626, 1795]
$$ [...]
8191D1
##END NTUPLES=NMR FID
##END=
