##TITLE=1H_LR-733-CR6-C1H
 CDCl3,8 sc, 
 5.04.2021
##JCAMPDX= 6.0         $$ Bruker NMR JCAMP-DX V2.0
##DATA TYPE= NMR FID
##DATA CLASS= NTUPLES
##ORIGIN= UXNMR, Bruker Analytische Messtechnik GmbH
##OWNER= root
$$ XWIN-NMR		Version 3.5
$$ Mon Apr  5 13:36:14 2021 Russian Standard Time (UT+4h)  she@DPX200
##.OBSERVE FREQUENCY= 200.131506
##.OBSERVE NUCLEUS= ^1H
##.DELAY= (6, 6)
##.ACQUISITION MODE= SIMULTANEOUS
##.ACQUISITION SCHEME= undefined
##.AVERAGES= 8
##.DIGITISER RES= 18
##SPECTROMETER/DATA SYSTEM= spect
##.PULSE SEQUENCE= zg30
##.SOLVENT NAME= CD3CN
##.SHIFT REFERENCE= (INTERNAL, CD3CN, 0, 15.7039)
##AUDIT TRAIL= $$ (NUMBER, WHEN, WHO, WHERE, WHAT)
$$ ##TITLE= Audit trail, XWIN-NMR		Version 3.5
$$ ##JCAMPDX= 5.01
$$ ##ORIGIN= Bruker BioSpin GmbH
$$ ##OWNER= she
$$ F:/spectra/data/she/nmr/H-F/1/audita.txt
$$ ##AUDIT TRAIL=  $$ (NUMBER, WHEN, WHO, WHERE, WHAT)
(   1,<2021-04-05 13:34:45.98 +0400>,<she>,<DPX200>,
      <created by zg, POWCHK disabled, PULCHK disabled
       configuration hash MD5:
       00 E9 B6 7A A2 85 ED C7 34 08 36 98 17 FE 4E 26
       data hash MD5: 16K
       43 CF 49 30 4C 49 EC 71 37 8E 44 24 F2 EF 4D 5A>)
$$ ##END=
$$ 
$$ hash MD5
$$ 4D CA D7 2C 5F B6 93 45 FE 89 5B BA 40 35 70 0B
##$RELAX= 
##$RELAX= 
##$RELAX= 
##$RELAX= 
##$RELAX= 
##$RELAX= 
$$ Bruker specific parameters
$$ --------------------------
##$DU= <F:/spectra>
##$EXPNO= 1
##$NAME= <H-F>
##$PROCNO= 1
##$TYPE= <nmr>
##$USER= <she>
##$AMP= (0..31)
100 100 100 100 100 100 100 100 100 100 100 100 100 100 100 100 100 100 
100 100 100 100 100 100 100 100 100 100 100 100 100 100 
##$AQSEQ= 0
##$AQ_mod= 1
##$AUNM= <au_zg>
##$AUTOPOS= <>
##$BF1= 200.13
##$BF2= 200.13
##$BF3= 200.13
##$BF4= 200.13
##$BF5= 200.13
##$BF6= 200.13
##$BF7= 200.13
##$BF8= 200.13
##$BYTORDA= 1
##$CFDGTYP= 0
##$CFRGTYP= 5
##$CHEMSTR= <none>
##$CNST= (0..31)
1 1 145 1 1 1 1 1 1 1 1 1 1 1 1 1 1 1 1 1 1 1 1 1 1 1 1 1 1 1 1 1 
##$CPDPRG= <>
##$CPDPRG1= <>
##$CPDPRG2= <>
##$CPDPRG3= <>
##$CPDPRG4= <mlev>
##$CPDPRG5= <mlev>
##$CPDPRG6= <mlev>
##$CPDPRG7= <mlev>
##$CPDPRG8= <mlev>
##$CPDPRGB= <>
##$CPDPRGT= <>
##$D= (0..31)
0 1.2 0 0 0 0 0 0 0 0.06 0 0.03 0 0 0 0 0.0002 0 0 0 0 0 0 0 0 0 0 0 0 
0 0 0 
##$DATE= 1617615285
##$DBL= (0..7)
120 120 120 120 120 120 120 120 
##$DBP= (0..7)
150 150 150 150 150 150 150 150 
##$DBP07= 0
##$DBPNAM0= <>
##$DBPNAM1= <>
##$DBPNAM2= <>
##$DBPNAM3= <>
##$DBPNAM4= <>
##$DBPNAM5= <>
##$DBPNAM6= <>
##$DBPNAM7= <>
##$DBPOAL= (0..7)
0.5 0.5 0.5 0.5 0.5 0.5 0.5 0.5 
##$DBPOFFS= (0..7)
0 0 0 0 0 0 0 0 
##$DE= 6
##$DECBNUC= <off>
##$DECIM= 32
##$DECNUC= <off>
##$DECSTAT= 4
##$DIGMOD= 1
##$DIGTYP= 9
##$DL= (0..7)
0 120 120 120 120 120 120 120 
##$DP= (0..7)
150 150 150 150 150 150 150 150 
##$DP07= 0
##$DPNAME0= <>
##$DPNAME1= <>
##$DPNAME2= <>
##$DPNAME3= <>
##$DPNAME4= <>
##$DPNAME5= <>
##$DPNAME6= <>
##$DPNAME7= <>
##$DPOAL= (0..7)
0.5 0.5 0.5 0.5 0.5 0.5 0.5 0.5 
##$DPOFFS= (0..7)
0 0 0 0 0 0 0 0 
##$DQDMODE= 0
##$DR= 18
##$DS= 0
##$DSLIST= <SSSSSSSSSSSSSSS>
$$ [...]
##$SUBNAM2= <"">
##$SUBNAM3= <"">
##$SUBNAM4= <"">
##$SUBNAM5= <"">
##$SUBNAM6= <"">
##$SUBNAM7= <"">
##$SUBNAM8= <"">
##$SUBNAM9= <"">
##$SW= 16.9725357007746
##$SWIBOX= (0..15)
0 0 2 0 0 0 0 0 0 0 0 0 0 0 0 0 
##$SW_h= 3396.73913043478
##$TD= 16384
##$TD0= 1
##$TE= 0
##$TE2= 300
##$TE3= 300
##$TEG= 300
##$TL= (0..7)
0 120 120 120 120 120 120 120 
##$TP= (0..7)
150 150 150 150 150 150 150 150 
##$TP07= 0
##$TPNAME0= <>
##$TPNAME1= <>
##$TPNAME2= <>
##$TPNAME3= <>
##$TPNAME4= <>
##$TPNAME5= <>
##$TPNAME6= <>
##$TPNAME7= <>
##$TPOAL= (0..7)
0.5 0.5 0.5 0.5 0.5 0.5 0.5 0.5 
##$TPOFFS= (0..7)
0 0 0 0 0 0 0 0 
##$TUNHIN= 0
##$TUNHOUT= 0
##$TUNXOUT= 0
##$USERA1= <user>
##$USERA2= <user>
##$USERA3= <user>
##$USERA4= <user>
##$USERA5= <user>
##$V9= 5
##$VALIST= <valist>
##$VCLIST= <CCCCCCCCCCCCCCC>
##$VD= 0
##$VDLIST= <DDDDDDDDDDDDDDD>
##$VPLIST= <PPPPPPPPPPPPPPP>
##$VTLIST= <TTTTTTTTTTTTTTT>
##$WBST= 1024
##$WBSW= 4
##$XGAIN= (0..3)
0 0 0 0 
##$XL= 0
##$YL= 0
##$YMAX_a= 372192
##$YMIN_a= -276193
##$ZGOPTNS= <>
##$ZL1= 120
##$ZL2= 120
##$ZL3= 120
##$ZL4= 120
##$ABSF1= 10
##$ABSF2= 0
##$ABSG= 5
##$ABSL= 3
##$ALPHA= 0
##$AQORDER= 0
##$ASSFAC= 0
##$ASSFACI= 0
##$ASSFACX= 0
##$ASSWID= 0
##$AUNMP= <proc_1d>
##$AZFE= 0.1
##$AZFW= 0.1
##$BCFW= 1
##$BC_mod= 2
##$BYTORDP= 1
##$COROFFS= 0
##$CY= 11.3945322036743
##$DATMOD= 1
##$DC= 2
##$DFILT= <>
##$DTYPP= 0
##$F1P= 15.9154993809931
##$F2P= -4.1035820241983
##$FCOR= 0.5
##$FTSIZE= 0
##$FT_mod= 4
##$GAMMA= 1
##$GB= 0.15
##$INTBC= 1
##$INTSCL= 1
##$ISEN= 128
##$LB= 0.24
##$LEV0= 0
##$LPBIN= 0
##$MAXI= 10000
##$MC2= 0
##$MEAN= 0
##$ME_mod= 0
##$MI= 1.114404
##$NCOEF= 0
##$NC_proc= 0
##$NLEV= 6
##$NOISF1= 3.799351
##$NOISF2= 2.8
##$NSP= 1
##$NTH_PI= 0
##$NZP= 0
##$OFFSET= 15.70392
##$PC= 1
##$PHC0= -11117.38
##$PHC1= 8.60092
##$PH_mod= 1
##$PKNL= yes
##$PPARMOD= 0
##$PSCAL= 0
##$PSIGN= 0
##$REVERSE= no
##$SF= 200.130013532006
##$SI= 16384
##$SIGF1= 3
##$SIGF2= 2
##$SINO= 400
##$SIOLD= 16384
##$SREGLST= <1H.CDCl3>
##$SSB= 0
##$STSI= 0
##$STSR= 0
##$SW_p= 3612.71676300578
##$SYMM= 0
##$S_DEV= 0
##$TDeff= 0
##$TDoff= 0
##$TI= <>
##$TILT= no
##$TM1= 0
##$TM2= 0
##$TOPLEV= 0
##$USERP1= <user>
##$USERP2= <user>
##$USERP3= <user>
##$USERP4= <user>
##$USERP5= <user>
##$WDW= 1
##$XDIM= 8192
##$YMAX_p= 0
##$YMIN_p= 0
$$ End of Bruker specific parameters
$$ ---------------------------------
##NTUPLES= NMR FID
##VAR_NAME=  TIME,          FID/REAL,        FID/IMAG
##SYMBOL=    X,             R,               I
##VAR_TYPE=  INDEPENDENT,   DEPENDENT,       DEPENDENT
##VAR_FORM=  AFFN,          ASDF,            ASDF
##VAR_DIM=   8192,          8192,            8192
##UNITS=     SECONDS,       ARBITRARY UNITS, ARBITRARY UNITS
##FACTOR=    0.0002944,     1,               1
##FIRST=     0,             0,               0
##LAST=      2.4114304,     0,               0
##MIN=       0,             -276193,         0
##MAX=       2.4114304,     372192,          0
$$ Real data points
##PAGE= N=1
##DATA TABLE= (X++(R..R)), XYDATA
0 0 0 0 0 0 0 0 0 0 0 0 -8 8 -8 8 -16 16 -24 24 -32 35 -45 48 -64 72 -88 96 -113 133 -152 176 -200 225 -257
33 -257 293 -329 369 -415 464 -518 580 -645 715 -791 878 -969 1070 -1181 1302 -1433 1579
50 1579 -1739 1918 -2114 2335 -2580 2860 -3178 3544 -3970 4479 -5089 5847 -6806 8075 -9823
65 -9823 12411 -16616 24602 -45051 208540 346813 -66248 211737 372192 152623 97423
76 97423 230460 251928 242554 197409 231131 282926 276653 168879 162789 289868 193408 45130
88 45130 244152 210692 -17907 166873 231656 -51129 -4140 151783 59127 -31245 -32842
99 -32842 18186 51899 -38401 -103203 -69263 -37098 -100104 -162740 -79951 -100372 -224052 -84597
111 -84597 -36778 -249643 -186206 -40689 -153627 -192733 -131792 -122757 -115028 -142276 -136314 -88254
123 -88254 -116084 -137145 -99066 -59695 -76107 -121437 -42812 15256 -87093 -51570 45482 -40674
135 -40674 -42944 47955 19921 -3985 14306 40130 73449 30952 13283 72139 73845 52626
147 52626 54189 66378 85821 55831 62566 103274 42560 30226 98947 64635 26695 51085
159 51085 52393 56015 37088 17647 46045 28780 4292 28121 17296 1310 548 -2930 11977
172 11977 -12422 -35135 1637 -12486 -40419 -13147 -19474 -34173 -24299 -27514 -19173 -28693 -44104
185 -44104 -16934 -18619 -36149 -21807 -23687 -20736 -11776 -24447 -12614 -7200 -20466 -508 2389
198 2389 -12514 1518 6389 5737 9059 935 12015 17715 5474 16740 18371 9693 21087 18314
212 18314 14576 21800 13223 16840 22817 11171 15659 18003 9826 14862 11128 7179 11714 3252 4481
227 4481 8964 -1983 861 3045 -4992 -1069 -4038 -9687 -4436 -8854 -10377 -7765 -13554 -11389 -10067
242 -10067 -15001 -11549 -13232 -15479 -9482 -13887 -15002 -9052 -13019 -11989 -8241 -12277 -9516 -7529 -9423
257 -9423 -6405 -6175 -5997 -2969 -4269 -2679 -774 -2475 1139 1180 -235 4470 3579 1891 6779 5298
273 5298 4374 7565 6469 6875 8024 7034 8862 8346 7621 8959 8468 7859 8273 7650 8442 7417 5624 7829
291 7829 6651 4142 5948 5373 3329 3817 3192 2678 1860 582 928 758 -1170 -1149 -1104 -1935 -3227 -3793
309 -3793 -3167 -4040 -6029 -4937 -4808 -6585 -6498 -5851 -6576 -7310 -7554 -6687 -6716 -8089 -7031 -6326 -7592 -7025 -6391
328 -6391 -6105 -5931 -6199 -4933 -4138 -5202 -3698 -2367 -2743 -2462 -1423 -686 208 -246 1698 2775 1766
345 1766 2968 4500 4093 5133 5329 5864 6905 6302 7147 7848 6785 7504 8080 7259 8357 7655 7290 8265
363 8265 6434 6532 7345 5273 5864 5845 3530 4356 3502 2119 2642 1028 164 774 -2073 -1075 -1294 -4400
381 -4400 -2599 -3554 -5548 -4081 -6292 -6743 -4700 -7773 -7012 -5475 -8468 -6867 -5752 -7548 -6215 -7099
397 -7099 -5916 -3979 -7823 -5033 -2606 -5988 -2938 -1656 -4145 -526 -913 -1121 2567 -503 525 4910
413 4910 1919 3071 4986 3711 6700 5037 5151 8658 4599 6581 10347 5239 7200 8420 5377
428 5377 9287 6425 3473 9052 4647 2914 7358 1989 1688 3997 638 1911 -1117 -3158 1959
443 1959 -3390 -5102 -1760 -7599 -5356 -3725 -10006 -6153 -8130 -12230 -4965 -9522 -14019 -7574 -11046
458 -11046 -10474 -8675 -13544 -9159 -9003 -12180 -5714 -9655 -11246 -3685 -7127 -6120 -3322 -8310 -781
473 -781 781 -5116 2404 1097 -1026 7443 3445 2781 7897 4603 10083 11259 4681 11284 11786 9497
489 9497 15283 9512 10144 16092 9827 13865 15171 6689 14517 14773 7803 13060 8356 7911 13723 5780
505 5780 6703 8359 1506 7704 6134 -1460 3841 -43 -1150 3619 -5893 -4578 -159 -7708 -3136
520 -3136 -4687 -11833 -4386 -7262 -10662 -5365 -13182 -11594 -5095 -13127 -10159 -9685 -14588 -6242 -9536
535 -9536 -13856 -6796 -12430 -9526 -3658 -12687 -8388 -4985 -9995 -2180 -5377 -9488 -374 -4226 -3546
550 -3546 1916 -5880 -540 3835 -2466 3460 1576 -1949 7612 3091 1501 7350 1129 6220 9347
565 9347 1592 7192 6883 3003 10834 5535 3118 9660 4113 6905 9393 1062 6807 7458 2511 8137
581 8137 2985 1259 8208 1736 2603 5427 -1569 3346 4548 -2096 3179 164 -1552 4558 -2152
596 -2152 -1667 1826 -3828 846 1080 -5376 602 -986 -3925 1723 -4044 -3811 1729 -4332 -1416 -211
612 -211 -5572 44 -769 -4375 405 -3367 -3295 1529 -4229 -1854 -411 -4985 640 -914 -4863 746
628 746 -2664 -3061 1745 -4150 -2268 969 -4009 -347 -640 -4185 716 -1445 -2314 1076 -3215 -1106
644 -1106 1315 -3518 311 119 -3331 2116 -676 -2113 2129 -1404 -507 2751 -1666 592 1984 -861
660 -861 2416 947 -308 3353 580 1036 3508 -228 2385 3211 706 3605 2051 753 4266 1658
676 1658 1403 3991 1234 2391 3475 1039 2732 2148 682 3566 997 608 2785 426 851 1989
692 1989 -460 1425 966 -886 1567 -492 -1428 654 -1242 -1541 -236 -2393 -989 -1280 -2851 -889
708 -889 -2281 -3140 -1488 -2984 -2880 -2046 -3723 -2358 -2284 -3836 -1915 -2474 -3499 -1945 -2902 -2741 -1717
725 -1717 -3047 -1994 -1682 -2623 -1169 -1235 -2005 -632 -1093 -814 293 -1021 9 465 -44 765 1018 604
743 604 1511 1192 1213 2261 1405 2151 2605 1801 2853 2801 2209 2910 2809 2565 3233 2456 2798 3221 2310 2890
763 2890 2929 2084 2650 2476 2200 2308 1703 1732 1966 1067 1249 1215 681 905 309 169 252 -272 -85 -307 -893
784 -893 -986 -850 -1731 -1347 -1291 -1859 -1855 -1769 -2459 -2036 -2772 -2616 -2257 -2951 -2665 -2527 -2795 -2595 -2955 -2603 -2521 -2810
806 -2810 -2589 -1756 -2590 -2020 -1776 -2284 -1300 -1651 -1638 -858 -1218 -797 -428 -518 -94 -60 33 574 550 624 1572 914
828 914 1379 1820 1489 2183 2208 1892 2486 2324 2430 2803 2519 2624 2956 2368 2659 2586 2571 2928 2438 2231 2974
849 2974 1918 2030 2261 1376 1506 1828 823 1348 708 -55 879 107 -413 82 -690 -614 -642 -1514 -945 -1552
869 -1552 -2288 -1123 -2085 -2524 -1649 -2918 -2408 -1852 -3249 -2200 -2467 -3212 -1954 -2662 -2996 -1986 -2648 -2512
887 -2512 -1823 -2729 -1483 -1446 -2148 -842 -1384 -1301 39 -843 -301 374 -882 596 916 -19 1522 1027 735
906 735 2392 1514 1745 2646 1330 2344 2629 1345 3028 2241 1738 3170 1994 2068 3085 1533 2200 2309
924 2309 836 2445 1963 574 2102 384 775 1717 -222 536 827 -949 734 -261 -1335 -58 -1000
941 -1000 -1476 -199 -2247 -1610 -923 -2435 -1109 -1429 -2952 -1098 -2087 -2611 -1020 -2774 -2123 -1005 -2824
958 -2824 -1530 -1548 -2843 -463 -1570 -1892 -196 -1513 -804 395 -1672 -231 -167 -1211 885 139 -559
975 -559 1620 1 596 2056 -190 1235 2096 243 2125 1185 374 2211 1111 1238 2331 91 1685
992 1685 2121 274 2022 1293 344 2396 793 231 1785 -207 792 1358 -789 934 440 -914 1115
1009 1115 -757 -993 1054 -1003 -453 648 -1897 -282 -323 -1804 78 -1143 -1550 586 -1532 -1186
1025 -1186 230 -2185 -215 -73 -2009 48 -692 -1403 846 -1296 -795 865 -1411 258 317 -1340
1041 -1340 642 92 -638 1067 -622 -246 1467 -764 700 522 -882 1310 503 -517 1393 -34
1057 -34 -150 1429 -814 687 1085 -678 1008 266 -907 1294 -125 -551 1025 -1378 -204 601 -1082
1074 -1082 453 -145 -1318 672 -675 -938 566 -961 -143 504 -1260 108 -147 -1092 656 -283 -920
1091 -920 650 -818 -54 823 -1160 493 599 -917 1076 233 -478 1101 -433 42 1480 -299 957
1108 957 1027 -283 1475 781 222 1701 342 412 1660 -120 872 1205 -161 984 745 49 1270 109
1126 109 28 973 -474 163 554 -724 576 8 -826 478 -641 -764 582 -1074 -775 -172 -1438 -145
1144 -145 -623 -1346 -117 -731 -1195 -336 -1095 -717 -376 -1544 -832 -580 -1701 -3 -740 -1136 -55 -950
1162 -950 -698 34 -916 -75 47 -884 249 -146 -458 655 -36 75 830 -38 347 730 -83 1105 577
1181 577 199 1072 476 694 1006 308 1019 973 387 1054 620 300 1382 638 470 901 384 625 716 2
1201 2 545 443 -138 589 68 -231 316 -165 23 218 -444 25 42 -420 69 -253 -523 -40 -495 -644 -143
1222 -143 -908 -349 -364 -772 -70 -340 -709 -146 -700 -592 -415 -852 -305 -529 -451 -60 -527 -574 -151 -431 -358
1243 -358 -276 -211 -173 -34 -505 12 -171 -482 312 11 77 438 226 311 437 319 327 241 152 608 447 91 355
1266 355 4 17 624 137 491 605 132 713 469 57 463 337 429 432 195 550 441 -40 407 231 -46
1287 -46 247 65 -93 484 -97 -103 165 -176 -60 -13 -454 9 -481 -129 -45 -481 -137 -121 -547 -130 -359 -706
1309 -706 -408 -486 -510 -299 -920 -157 -357 -978 -437 -83 -858 -514 -560 -605 -220 -591 -476 -403 -380 -251 -235 -705
1331 -705 212 -230 -350 -30 -296 -336 124 -67 144 387 50 517 302 164 730 462 378 721 411 530 928
1352 928 460 709 686 524 1107 718 694 1326 579 831 887 756 956 870 349 962 582 504 720 283 573 429
1374 429 -302 494 247 -181 505 -128 -221 59 -262 -152 -176 -757 -148 -460 -1014 -444 -855 -1101 -616 -1289 -1013
1395 -1013 -541 -1474 -703 -803 -1415 -772 -1266 -1173 -776 -1152 -792 -343 -1311 -552 -472 -1052 -229 -757 -491 103
1415 103 -485 -301 177 -368 212 544 -424 706 334 66 1275 555 572 1051 545 928 1098 213 1305
1434 1305 1116 764 1458 726 828 1458 714 1054 1200 395 976 767 537 1030 448 500 918 271 300 709
1454 709 -232 540 286 -486 284 -476 -283 113 -564 -391 -370 -1028 -401 -863 -1100 -419 -899 -1257 -215 -1320
1474 -1320 -1122 -653 -1332 -818 -726 -1299 -572 -647 -1050 -376 -1194 -745 -117 -966 -340 -315 -1092 211 -89 -518
1494 -518 195 -206 -10 513 -496 495 576 67 702 352 437 1082 396 490 1047 252 959 1044 415 831 771
1515 771 394 1102 694 726 879 198 552 718 -100 550 630 292 567 63 29 716 -402 115 179 -414 57
1536 57 -33 -540 27 -653 -518 145 -564 -455 -67 -839 -589 -275 -861 -121 -507 -962 -132 -909 -989 -41 -759
1557 -759 -191 -268 -803 -103 -508 -738 -107 -490 -312 41 -733 119 -21 -236 347 -123 -19 569 -40 -100 312
1578 312 -266 132 403 -63 326 368 -156 492 69 316 553 -9 297 523 -63 336 867 -112 411 416 -28
1599 -28 283 -56 389 413 61 406 436 22 313 -38 35 303 -28 -215 331 -24 20 108 -116 388 80 -84
1621 -84 229 -105 -245 50 -502 108 -194 -479 103 -94 -489 148 -152 -390 -77 -398 -219 216 -435 6
1641 6 -75 -328 -172 -229 -269 -40 -534 -154 60 -605 -150 91 -422 -30 86 -76 367 -114 17 205 -347 192
1663 192 -78 -163 88 39 -173 228 -205 -126 296 -42 188 193 -9 386 140 13 308 10 134 195 -86 285
1685 285 191 -222 83 154 -42 362 -5 -85 148 93 -9 -53 -124 196 -99 -520 215 -138 -185 200 -367 26
1707 26 97 -388 150 -160 -286 -304 -186 -307 -176 -110 -245 -159 -417 -147 -353 -420 -62 -81 -408 88 -232 -19
1729 -19 -260 -310 -154 -29 26 -84 -325 -61 350 -351 216 42 -60 163 -2 -72 340 138 155 537 143 127
1751 127 309 11 282 203 129 256 237 110 315 291 331 483 118 452 263 296 237 267 197 168 262 -47 196 273
1775 273 -41 95 -180 276 31 -278 24 -56 -150 -164 -282 -191 -275 -452 -317 -196 -249 -154 -388 -599 -87 -395
1797 -395 -198 -123 -396 -191 -451 -438 -146 -455 -630 -106 -104 -299 -143 -357 -415 -82 -245 -362 -102 -72 33 -254
1819 -254 0 379 -191 4 222 133 404 295 219 359 212 125 351 153 274 526 223 246 557 250 266 243
1841 243 334 501 268 395 353 84 460 218 184 330 64 -165 -227 -70 1 92 -310 69 -285 -357 134 -196
1863 -196 -553 -97 -302 -436 -209 -554 -145 110 -425 -123 -582 -361 -215 -609 -333 -80 -479 -160 -293 -414
1883 -414 117 -9 -215 201 140 -26 46 -214 49 202 84 203 9 -8 327 129 64 261 -8 259 326 77
1905 77 372 379 15 194 181 -14 164 144 -24 153 -217 72 33 -74 350 -109 -147 102 -281 0 253 -153
1927 -153 110 -1 -448 -210 -7 69 198 47 -291 -90 -387 -93 -144 -228 -200 -100 -296 89 -299 -221 115 -278
1949 -278 -64 12 -97 373 67 -302 372 -245 -15 435 -409 133 120 -300 270 -71 -5 80 -1 -337 35 -132
1971 -132 4 219 -62 -27 258 -111 195 -29 -15 -74 -301 -48 -12 -332 177 -31 -146 -7 -68 -141 99 -47
1993 -47 -125 -47 -351 138 -184 -116 45 103 4 168 -139 184 135 -341 107 93 -96 168 -22 -122 259 -30 85
2016 85 291 -160 348 171 -229 121 325 -187 252 153 35 91 81 -184 14 -60 79 -46 72 42 -207 -36
2038 -36 78 9 8 -143 -259 86 -64 -249 179 -154 -248 229 -194 -114 -74 -192 143 208 -411 10 -8 -147 23
2061 23 -204 -268 11 -273 -23 -243 -148 -126 -102 -58 84 -72 -101 -20 -438 140 199 -122 22 -238 -211 1 -56 -76
2085 -76 70 -261 -8 57 -178 240 -56 -342 67 -7 -118 135 -15 70 180 17 189 -190 -24 239 194 -77
2107 -77 275 -193 371 372 52 153 171 -80 132 -110 -171 411 -51 150 138 197 59 133 212 -42 27 130 213 329
2131 329 266 -103 -327 -232 -92 -277 -71 -85 -107 87 -82 -109 38 -217 29 -140 -283 -139 67 -439 -130 -219
2153 -219 -424 -226 -202 123 124 -132 -47 -116 -226 -137 -306 -176 -149 24 -39 -113 -344 -61 -134 -161 227 -87 -116 113
2177 113 205 176 -16 29 -7 104 -19 178 -128 166 -11 55 204 229 325 331 314 280 123 211 147 272 16 127
2201 127 330 -64 341 -121 149 -28 27 -44 55 64 206 98 -18 58 -176 -265 -39 -48 -81 -83 -191 -92 -384 -348 -127
2226 -127 -133 -77 -74 -283 -339 -129 -93 -257 -24 -147 51 0 -478 -214 -146 -216 54 117 -184 287 -304 29 234 250
2250 250 271 61 -189 287 -7 172 330 90 92 84 63 253 53 65 221 17 472 204 191 165 285 25 179
2273 179 264 -82 78 194 -237 158 29 -104 271 -153 75 -66 -101 -228 294 45 -162 7 -98 -4 -429
2294 -429 -47 -211 -58 133 130 -134 -300 -111 45 -177 -84 -241 -103 -86 -197 -57 -505 126 -79 -189 57
2315 57 -297 115 -216 24 22 22 -79 54 -16 -206 180 -6 -296 51 -80 203 70 211 -15 107 187 110 37
2338 37 270 133 -249 65 117 -5 213 -5 -66 152 -30 123 171 94 -23 -123 187 7 -82 238 248 3
2360 3 -24 234 -10 198 227 13 115 190 -14 118 -69 -141 -41 -23 -143 -43 -22 -31 -25 -44 17 160 74 -222 -81
2385 -81 -289 -4 -244 -93 -172 -237 -209 -253 -166 -83 -359 -210 -156 -192 -79 -69 -169 47 -263 -153 28 -318 -27
2408 -27 67 -282 89 -121 -53 -50 3 118 160 186 -91 217 270 41 272 -138 259 44 -51 188 -194 254 0
2431 0 60 210 206 2 -58 -37 -98 -78 -61 6 224 221 139 -5 -107 -318 102 -231 99 -70 -303 45 225 -243 137
2456 137 77 183 157 -342 126 -72 -97 -117 21 -120 71 -117 225 -59 191 -140 -131 57 72 -91 -9 94 -95
2479 -95 70 -160 -349 35 132 -29 74 -217 127 -48 201 -86 134 -33 -213 -30 -178 59 -11 260 123
2500 123 56 43 -31 217 197 51 -31 65 11 -58 -50 -171 192 -81 -69 112 20 -55 -90 -119 -141 -134 -10 -40 -31 -203 -47
2527 -47 39 -182 -275 -219 47 -193 -346 -106 92 -191 -257 -174 -182 147 -34 117 -44 -43 -173 44 -224 101 -106
2550 -106 -348 -164 -475 -9 186 -115 -103 18 -67 -236 -129 -36 101 213 59 -8 71 -272 147 137 188 -216
2572 -216 -124 19 81 -125 20 135 205 76 6 9 -91 -230 216 107 -30 180 -12 184 -98 16 -80 95
2594 95 -25 -245 28 -98 104 -112 152 170 -247 122 189 217 69 -127 13 -15 -41 -2 -6 -182 -68 32 -359
2617 -359 -164 -124 -293 77 -241 -190 14 -152 -51 -83 -38 -162 -176 -20 24 66 -201 91 151 -111 -37 -163 -77
2640 -77 111 -65 141 -55 69 -91 264 67 58 227 -86 254 129 -36 160 66 676 -5 -133 -16 79 -39
2662 -39 18 2 242 156 -45 106 -28 111 93 17 -114 -24 -124 -39 -22 99 94 -32 -29 -180 -409 -52 -90 -121 -123 -41
2688 -41 115 -56 -94 -7 -180 25 -115 -138 -9 -59 -150 -15 160 -279 -259 242 -75 170 -31 -162 -224 0 -152
2711 -152 154 -60 -156 -42 234 58 170 138 266 -196 2 92 239 -57 176 22 193 37 361 60 -43
2732 -43 149 -64 -57 -105 -23 -127 171 -61 -131 47 -128 -5 178 -49 -104 102 20 -108 7 -167 -139 226 -333
2755 -333 -79 -120 -57 -184 -232 -107 -127 -166 -127 -24 -308 -46 -78 -311 -64 -207 -262 187 -199 -1 132 13 -9
2778 -9 110 -81 33 -13 239 8 -25 -30 139 -186 108 215 41 57 -1 48 171 131 -42 -58 -123 166 270 -52
2802 -52 -55 273 -15 254 -36 114 153 69 106 48 17 164 -196 128 27 -101 150 99 -206 -60 -41 -188 -95 18
2826 18 -30 -12 -85 79 125 -46 112 -160 -72 -25 -212 -96 -39 85 -76 -52 -196 -131 -190 173 -11 -27 -183 -303
2850 -303 -15 -111 218 -30 -5 74 124 -112 89 125 227 -172 166 71 -41 -20 -174 146 1 96 276 196 101
2873 101 -145 139 -26 115 84 161 -7 -31 -95 82 -150 -62 -72 88 -164 -12 -16 -17 98 -296 53 16 -20 -48
2897 -48 29 -3 8 -104 -42 -41 -102 -90 94 -21 46 -143 -64 10 -80 -46 -71 -91 54 -69 -135 -257 -207 9 -74 -17 -151
2924 -151 110 94 94 132 -29 18 121 -72 -16 153 69 -61 -190 55 -48 31 221 97 -154 152 172 33 -80
2947 -80 -182 229 -89 -111 -237 118 -153 271 -97 -2 152 43 -182 55 333 29 189 -259 -62 123 8
2968 8 63 148 26 49 187 -13 39 28 -83 -114 -218 -12 -130 75 321 -130 -429 158 -128 -106 127 -250 -66
2991 -66 102 31 -35 -65 249 12 -43 -251 -96 -12 90 -80 -6 -86 -62 -99 34 -307 -115 137 -165 -74 45 18
3015 18 4 -79 -119 71 -99 -41 -68 15 209 56 27 172 -31 52 28 233 93 51 122 -31 -18 -110 65 5 -214
3040 -214 -118 30 29 48 81 -174 83 68 -58 -188 94 -129 157 66 23 -234 46 -284 217 107 -225 12 -81
3063 -81 61 -60 -137 -278 121 -64 -36 -255 42 9 -371 -396 38 -18 -50 -198 -23 49 1 86 -264 156 -27
3086 -27 41 27 3 267 66 174 336 -32 177 150 -70 42 1 152 155 216 43 319 79 -58 98 23 70 -144
3110 -144 -246 -115 -49 147 -12 60 -74 299 -146 -5 133 -274 -14 -261 -37 -242 156 92 -18 25 16 -33
3132 -33 -249 209 -71 183 189 -88 54 -118 9 -182 -67 -253 13 -105 -152 -38 -137 -186 80 -42 138 4
3154 4 148 68 -133 11 -45 44 -27 52 113 -61 48 6 11 -71 124 84 -106 13 24 -150 -173 101 -39 187 -54
3179 -54 46 59 -107 149 -33 115 159 -155 97 83 35 126 5 336 -222 -229 -123 192 -29 130 74 127 57 102
3203 102 -66 -57 82 -10 -178 -326 1 -54 66 -79 79 -112 33 156 -120 -73 151 21 -150 -139 -36 -194
3225 -194 -111 -102 -94 165 -251 151 -137 27 145 -46 -110 159 -45 343 -36 196 183 224 3 -32 -5 -143 113
3248 113 -100 140 -290 164 166 -5 -69 83 -8 2 -224 53 127 -4 -40 -37 130 161 -63 91 -6 23 117 96 -182
3273 -182 257 47 -23 154 165 69 -10 82 85 156 -31 -99 -39 43 -5 -105 -20 -29 -242 -99 3 -294 -27 -124 43
3298 43 -49 -118 -33 -27 76 -153 16 24 -227 -4 -254 -17 25 -191 51 32 -201 66 109 -103 24 80 -55 48
3322 48 146 -165 275 77 -26 -106 288 6 180 -122 101 73 -134 78 -76 -200 -116 -72 -63 13 155 37 272
3345 272 67 193 -41 -61 143 -199 -5 -218 -266 -124 -19 -147 -191 84 -79 -81 -272 -253 106 -186 -169 47
3367 47 -4 -136 -119 22 -48 235 -142 118 42 -69 -50 -134 231 -22 2 -132 -31 -344 41 -29 -34 31 -146 407
3391 407 92 -21 38 -20 -4 155 40 217 240 213 100 160 0 169 7 65 44 96 -41 -50 -33 -9 -167 -221 -118
3416 -118 45 -149 268 -13 15 -28 150 -86 -236 18 -45 -107 -101 108 -27 -136 -26 -5 177 -152 -236 -232 -181 -94
3440 -94 -79 20 125 10 -96 -41 77 -112 135 -32 -29 23 79 -140 40 34 -131 -218 206 312 -43 213 118 58
3464 58 238 138 108 -64 -43 233 158 56 114 -65 143 178 -32 42 -68 233 -133 340 -82 4 -188 -99 -143
3487 -143 -52 -68 -173 196 86 32 84 -357 93 12 132 175 -140 -129 122 229 -50 33 -267 -132 155 -64 83
3510 83 -68 60 -213 50 -56 46 -91 -20 -36 -98 112 -100 134 -129 -226 -196 -92 -193 16 198 -81 3
3532 3 102 213 148 -106 -130 -5 37 -49 100 -191 -47 273 35 110 -77 -74 235 -48 170 -128 125 63 59 123 61
3557 61 0 -181 -101 304 163 178 171 125 -81 81 134 53 1 -173 -37 214 -149 -36 78 37 337 32 57 62 -189
3582 -189 -46 -405 -2 10 31 44 -43 98 261 -233 -91 -225 -104 -53 -277 88 -6 -75 65 161 95 -22 2
3605 2 41 -39 -4 5 -1 -106 -180 -44 67 6 -251 -203 110 13 65 46 -73 91 -200 81 -2 294 181 44 -37 -59
3631 -59 42 35 -21 46 79 80 71 71 259 -90 -53 183 -67 39 120 -161 27 -33 79 -265 -186 160 17 -71 -182 67
3657 67 46 -252 180 7 -36 35 -79 -67 126 -69 -38 54 338 11 -250 -91 53 -293 -18 -181 68 148 -196
3680 -196 -105 -173 121 202 202 -5 -146 -104 285 -86 160 -220 -128 387 -83 152 55 121 52 168 -21 -56 98 91
3704 91 -70 -43 120 -26 -28 193 114 -29 99 -149 215 -152 -174 39 -62 52 -127 29 -157 63 -87 344
3726 344 55 -21 -119 -84 149 -92 59 -128 18 13 -11 28 -200 -63 -70 15 -75 148 95 -179 -67 127 -240 -89
3750 -89 -14 -440 207 110 -165 127 -99 -254 238 -98 117 -56 24 274 115 120 45 34 -75 -56 0 -168 -13
3773 -13 124 182 -193 -121 -98 -83 91 109 -187 -70 219 -159 143 74 69 -21 59 0 -16 100 183 103 256 -17 -1
3798 -1 -90 -285 64 -148 95 29 -98 176 -30 -8 -132 20 138 -15 -19 -97 -52 -70 130 -141 99 -37 -72 -89
3822 -89 49 3 -201 -114 -28 -186 -323 193 47 -44 -108 37 -31 -58 223 -254 28 138 -52 -42 -46 229 36 146
3846 146 13 43 169 65 39 -138 205 151 -72 -11 -89 99 -111 150 48 80 -148 -109 72 -78 -185 276
3868 276 -75 218 -1 -114 -161 -6 160 -38 -80 117 119 -13 -241 -137 4 126 -47 6 11 -170 -32 -64 -34
3891 -34 -160 22 275 -81 -366 53 -209 165 87 20 40 -178 233 76 -163 -129 96 42 -74 -121 -237 184
3913 184 -103 -92 -28 -64 71 -32 -44 18 -37 -190 54 74 -143 184 321 -87 118 -54 220 -328 175 117 117
3936 117 97 9 -40 63 112 -102 156 5 -74 -29 50 12 38 -185 6 -94 -45 14 -17 -30 -133 -49 -3 216 -44
3961 -44 137 68 -54 -5 -187 -72 -335 -257 -73 53 15 95 84 -22 -122 -43 22 -436 -207 -218 124 65 -112 287
3985 287 -314 -45 -214 96 276 138 97 -54 -13 77 -74 -57 267 116 -132 159 3 28 72 -144 -132 -98 168
4008 168 161 0 89 -85 -170 67 33 -5 164 101 20 117 42 -69 172 186 -37 82 5 56 80 39 -25 -78 19 134
4034 134 -99 -136 160 30 -108 23 -83 -321 55 -218 -206 -87 -102 -115 -12 -381 37 5 -58 127 96 -53
4056 -53 129 117 -130 -74 55 -31 228 -41 -125 88 -147 32 132 1 -27 -322 32 55 158 -201 -105 49 112
4079 112 -79 -11 111 110 97 -251 49 20 2 -8 287 148 36 143 231 22 310 -230 -61 -45 26 -127 -219 -112
4103 -112 125 -9 -25 -262 -38 104 -49 -53 76 -9 -93 286 195 152 -145 -179 64 -56 -154 78 72 -176 -168 24
4127 24 51 8 -8 167 -231 100 13 -190 224 -30 224 90 52 -69 -13 139 260 239 -111 182 -53 -50 94
4150 94 24 -354 -221 -42 22 -98 -467 49 -277 -247 -17 -255 238 -141 -66 225 -211 99 242 -81 24 107
4172 107 -4 -155 69 -205 -26 33 233 69 202 -154 -103 356 -123 -132 -23 -160 63 -41 32 55 -77 -153
4194 -153 -117 -104 -21 48 98 -102 -74 -152 155 6 -22 65 139 96 -28 132 -97 190 -292 429 -194 286 29 93
4218 93 -79 -236 -46 153 139 56 -63 83 -69 96 153 -177 -47 93 54 130 98 118 40 -149 231 183 9
4241 9 44 55 245 -30 -2 126 -67 -19 1 -166 77 97 18 44 -254 -4 -154 79 -24 185 -54 53 -133
4264 -133 13 188 -268 61 -27 233 -67 -20 122 -177 68 -196 -32 5 140 74 15 -252 11 -68 -211 -58
4286 -58 -203 -46 63 -131 181 22 136 68 -24 65 -15 -87 -5 131 -56 171 -90 -231 76 -21 -7 122 29
4309 29 -146 96 122 -168 -30 -8 132 147 101 207 128 -69 -4 178 293 323 180 -158 -88 -220 37 39 -34 -182
4333 -182 56 189 116 38 -124 -28 -97 -69 102 2 56 102 -157 40 -209 98 185 137 -159 -97 -222 217 -21
4356 -21 -64 -19 57 74 13 154 -9 -312 -43 -283 51 -53 -17 -59 130 -215 85 36 -153 -99 -60 -69 -30 -150 41
4381 41 -41 -92 221 -111 -122 -183 120 143 197 24 -163 29 208 45 -101 18 70 143 -41 -52 -146 -93 99 -146
4405 -146 169 162 -77 -104 77 -85 74 -41 -267 -40 -103 81 -100 115 -245 44 -6 -14 -62 -147 102 47 -163
4428 -163 110 -43 106 -68 56 63 183 -8 -34 131 14 -3 -105 4 -36 -46 68 -84 146 149 74 -78 -85 -181
4452 -181 145 -19 -189 150 23 83 248 76 60 -232 255 -40 141 -250 -21 -26 53 38 175 19 -69 -104 -80
4475 -80 6 -41 140 -2 162 -45 109 -109 -3 187 -385 -80 105 65 55 105 176 -378 -5 -145 0 73 39
4498 39 143 129 237 51 102 -164 -59 88 -92 221 192 -140 -113 168 150 75 -125 29 122 -47 195 -147 -26
4521 -26 357 72 -31 49 35 47 -135 13 119 188 -139 -158 -164 -92 351 -76 113 115 -72 4 -123 66 2 -25 103
4546 103 -65 9 13 -53 -9 -91 -205 -222 71 6 -97 58 -69 75 -59 58 -117 -238 63 84 -129 22 -125
4569 -125 -179 132 39 -164 -65 -26 -87 -63 -51 233 -154 -115 62 107 220 204 -40 -22 71 -184 -20 67 13 178 20
4594 20 -60 -36 -31 75 42 68 -47 -32 135 -203 153 -89 -73 90 -66 149 108 -34 -111 216 7 171 -4 66
4618 66 156 69 -54 -49 -100 176 -50 -78 111 32 -293 -76 223 18 32 92 -39 -25 -9 183 -87 -148 79 305
4642 305 -54 52 -2 128 14 -55 -17 102 -61 99 73 79 -69 189 -70 259 -79 21 -227 -206 147 208 62
4665 62 37 -27 12 57 59 -81 -91 -32 -169 -203 -20 411 -7 302 7 -34 -5 132 93 -102 16 -95 53 51 7
4690 7 -34 156 191 41 -67 16 2 -29 -52 -29 74 -14 12 97 208 -141 17 -13 78 24 -147 -212 150 98 -121 -141
4716 -141 -146 2 -128 87 -56 127 79 76 66 -158 -44 22 80 -69 36 -14 -33 69 0 -127 -69 -29 -73 61 -178
4741 -178 -52 -21 -230 -102 -51 -271 -6 -76 -114 61 109 227 81 35 -234 85 121 -140 239 -43 -259 -1
4763 -1 -63 -82 0 159 120 1 -148 38 -101 -84 78 72 -245 -49 176 -56 -21 -88 -154 -164 -127 2 -102 -266 -166
4788 -166 -206 28 -90 53 -184 -121 -354 -28 -83 -100 109 -70 -105 110 -228 -114 -43 132 -117 42 -193 193
4810 193 -35 115 -157 49 97 -88 42 -85 276 -41 248 -45 57 -43 -84 -167 187 -96 42 95 131 -124
4832 -124 156 -201 -23 83 -99 -89 -46 -202 55 27 264 -148 140 -43 -14 77 -129 106 229 -108 -192 -115
4854 -115 37 188 202 -116 93 347 136 -130 198 55 54 63 -103 104 32 -219 -164 174 -66 73 48 -26 -97
4877 -97 0 50 49 116 -85 -150 70 113 127 -18 -61 -45 -78 -13 -174 26 20 -169 -143 71 -110 -234 -42 309 -135
4902 -135 -63 58 16 4 78 -129 -4 68 -2 9 209 49 45 185 -5 -60 59 92 -145 -99 31 -153 -99 17
4926 17 -32 171 -29 -81 115 -88 -9 46 99 -5 210 -80 72 -45 75 102 39 146 60 91 -102 30 -188
4949 -188 -1 -138 74 167 149 137 -72 21 189 -181 66 -105 79 26 -45 -40 69 -210 -187 -26 -53 35 -143 141
4973 141 -5 237 -81 -38 87 78 73 -67 13 237 100 -24 162 42 256 71 -45 -151 -68 17 -75 -71 366 1
4997 1 -48 93 -41 229 -16 -76 -163 81 61 -63 125 -195 169 -74 -186 -228 56 -174 69 -41 -78 263 -118
5020 -118 236 25 -74 48 72 -111 10 43 10 -123 93 -79 -122 -59 -147 43 343 34 20 11 -65 -129 -237 -193
5044 -193 73 367 98 221 8 -134 -6 79 -95 -22 79 141 25 47 50 90 -148 -27 42 -126 -103 75 -38
5067 -38 -3 -103 32 55 -29 -5 97 416 -81 113 -215 37 -69 -6 -275 60 11 -30 103 -328 0 -134 4
5090 4 -143 -35 -80 118 -83 -238 -7 -16 69 -195 -274 201 99 216 51 -279 19 21 121 5 -138 25 96
5113 96 10 243 15 136 -180 67 -114 -167 40 -268 -106 59 7 -14 7 -102 25 -137 -316 -63 -60 15 -54
5136 -54 51 159 -185 -207 64 -81 39 95 177 208 83 24 29 -84 -96 184 -32 -97 -164 -165 -12 60 -182 -157 8
5161 8 -59 -162 -57 5 -226 11 -92 83 160 124 99 -225 23 2 121 157 -23 -122 2 73 -109 -81 105 120
5185 120 -314 -113 -62 128 92 208 22 249 -42 -61 147 -203 -128 21 5 21 91 60 -4 2 80 -2 -3 12 -103
5210 -103 22 192 33 -61 -42 -49 -21 49 160 -79 -82 -83 50 -125 -14 -115 -117 76 37 -181 -10 -35 -13 -112 6
5235 6 63 -127 -63 -225 -106 -20 154 -72 -1 -35 -245 41 129 70 -8 106 22 28 -195 -317 58 70 -62 -15 61
5260 61 -177 95 233 -57 -14 -227 65 34 59 159 -50 78 160 19 199 -115 -28 -24 39 -115 -211 25 -32 254
5284 254 43 -5 -35 99 30 68 141 -8 -323 -5 58 54 58 -88 51 177 -55 13 132 168 -52 19 22 -119 222
5309 222 -203 7 -129 -167 59 264 -292 -125 -140 -121 82 4 148 19 -127 44 49 19 -23 235 -171 -153 -28
5332 -28 -99 77 49 163 58 77 190 -289 -240 77 -72 88 45 53 -28 -187 117 -45 -285 48 107 122 138 143 -236
5357 -236 -146 2 5 -36 47 57 18 248 94 176 -69 -83 122 -41 196 155 185 53 59 -214 118 77 -113 -5 102
5382 102 20 -426 163 -29 186 28 -111 -127 -126 -101 36 -85 80 11 18 -137 -11 -100 86 3 191 -361 -4
5405 -4 -125 -89 125 136 -10 -91 -29 -45 216 89 -117 -87 -137 -75 232 -42 110 195 178 -24 176 -39 284 -156
5429 -156 -104 7 -74 -99 103 146 -40 -133 200 -190 34 140 -98 28 23 132 69 212 -85 23 42 -87 0
5452 0 268 176 130 -8 -96 -72 -13 320 91 -48 77 -200 -54 107 -49 -41 4 132 13 10 -147 -201 70 142 159
5477 159 -134 -218 19 216 46 -95 -84 143 -218 -208 -80 152 205 -61 134 -297 -23 -122 7 -62 213 88
5499 88 191 -389 172 -128 126 79 4 -207 29 222 16 304 -290 -112 -137 -115 108 -195 -41 64 14 63
5521 63 -150 -12 -84 -132 171 22 126 -22 -74 126 -7 -91 146 48 70 95 -49 -109 106 -118 -13 210 -5
5544 -5 -108 -35 74 66 161 -1 -5 232 -6 -33 -53 -19 -192 113 -25 113 144 204 -179 90 3 -196 50 -217 -70
5569 -70 -203 47 52 24 4 -115 -45 7 -97 -33 38 -141 -12 -8 69 142 -95 -44 -10 8 -77 145 -82 -4 56 57 -114
5596 -114 -52 99 27 -68 -344 -220 101 -15 176 101 -171 155 68 -73 54 9 -68 85 114 54 162 92 31 175
5620 175 -94 -125 314 28 169 265 -134 -76 292 -195 -25 -76 -64 -10 -141 99 -53 -62 -135 181 -188 136 -5
5643 -5 -39 -54 -220 -1 -60 -39 -9 94 93 -165 184 -40 -152 -34 45 -5 -162 -152 97 34 -60 -193 -48 103 30
5668 30 66 108 -129 97 80 -39 22 89 21 279 203 -71 -16 61 -199 -72 -56 45 -84 101 185 -76 130 -230
5692 -230 -34 -153 78 -43 -14 -66 -13 -116 187 -93 -81 96 -9 56 -60 126 233 19 64 -140 20 -100
5714 -100 194 -179 -171 -128 -119 -120 -6 228 -16 122 161 -230 126 -46 111 -13 134 176 -144 -3 84 -11 -142 179
5738 179 96 20 12 205 85 3 -201 -29 -64 116 353 -84 -153 -132 -2 -188 -44 36 -58 138 -3 70 45 -153
5762 -153 -50 182 163 -17 157 201 38 39 -183 3 -20 -73 -110 16 -220 148 -51 85 41 -2 -94 -85 113 -12
5786 -12 84 -245 13 -58 -299 -5 -122 -34 185 71 -90 13 -94 -1 267 182 175 162 -8 26 -132 26 -59 -94
5810 -94 -152 38 63 23 145 43 -146 234 -115 25 -26 157 -57 209 50 -55 -13 -43 76 -146 41 111 -95
5833 -95 206 69 -57 -174 63 24 -183 -92 -126 145 72 -55 55 26 73 -218 118 165 -91 -33 71 124 -52
5856 -52 -21 254 -85 -5 27 -11 174 -128 22 36 -143 -66 -236 93 -9 211 130 81 -185 -42 -5 254 141
5879 141 -96 68 94 109 -8 22 98 313 64 -223 98 63 36 160 227 14 -150 -95 138 -103 -6 75 -31
5902 -31 -122 -39 37 -49 -308 -76 12 401 -78 -26 12 -111 18 24 91 -2 77 -4 -232 89 69 79 -40 423 -51
5927 -51 -3 130 359 48 65 96 -2 172 -61 -62 54 -154 311 7 74 -54 65 -122 159 24 230 -129 -175
5950 -175 24 14 203 -176 -51 -118 96 147 129 23 -194 54 27 246 -15 93 -45 -54 114 199 102 121 -113
5973 -113 -108 280 172 -102 -20 168 -52 5 -207 -237 343 -32 78 124 -116 28 -43 207 208 -83 -123 -37 -217 -30
5997 -30 -44 15 151 -89 -63 -156 64 163 186 40 -232 -226 -177 47 -80 55 -85 57 61 62 -4 110 133 46 -36 -227
6023 -227 -132 -115 -160 -57 -180 69 -40 308 126 249 53 -49 -100 36 168 60 240 153 21 62 -348 -69
6045 -69 208 4 358 -76 -196 101 43 72 65 108 188 -139 -140 95 -79 -1 -33 181 89 -115 -27 -200 -301 -252 -65
6070 -65 -122 99 -134 0 -146 -68 67 -257 -35 -57 -16 24 -260 -75 -136 33 -105 -54 6 -78 -64 97 -127 -252
6094 -252 -93 -94 222 38 105 77 -114 61 118 57 179 -105 -257 -79 -42 -131 76 -53 49 -2 -16 31 18 38
6118 38 20 233 261 0 -167 143 -112 15 122 131 -203 8 67 -41 41 -192 50 -240 -242 -36 -2 -44 9 30
6142 30 110 -105 45 -122 60 -40 141 -127 -48 4 -127 -119 -16 -218 75 33 -43 -158 -45 42 -213 85 76 -54
6166 -54 -56 90 23 42 -109 133 70 109 -55 11 54 11 -12 -178 54 -99 -44 -46 27 213 -12 -72 -2 162 392 -114
6192 -114 169 -89 -54 110 -89 -10 89 60 21 245 -60 93 -215 257 55 32 77 -103 36 -73 -78 21 -88
6215 -88 38 -144 -77 -195 -82 -106 -89 -91 -186 97 -15 77 175 -184 106 -35 -6 -98 -25 -65 -291 -162 -148 81 -7
6240 -7 -118 -142 187 106 -78 128 86 -30 -1 -129 65 -107 -23 -47 -56 93 -19 357 109 96 -21 27 17 199
6264 199 -281 116 -248 -113 77 83 198 35 -209 -64 18 -69 -45 -113 -193 -4 3 22 -273 -268 114 -70 132 -159
6288 -159 -172 -123 -125 -212 15 -141 -205 -23 -17 -416 -211 122 -32 120 19 141 -82 -165 124 288 -190 159 -124
6311 -124 219 39 -33 -69 -82 157 -265 -175 -275 24 -60 118 -162 27 160 294 97 51 -118 215 -175 -69
6333 -69 -112 141 -5 307 -20 1 26 90 108 -16 138 48 79 94 288 14 140 -204 -16 230 113 -27 18
6356 18 204 177 -86 71 9 155 -61 379 -144 48 -180 -137 -31 -2 -18 -98 104 -146 44 -18 195 204 8
6379 8 246 28 208 148 200 117 -20 127 -205 -64 100 -283 208 -230 117 -20 -10 -172 240 49 -99 231
6401 231 -1 -173 -124 94 -29 -122 12 34 -6 114 -32 -26 38 -108 -48 65 -190 -154 -64 116 -22 -130 253
6424 253 -7 -120 127 82 28 -134 31 30 -278 16 -184 -301 -183 162 -56 -188 73 131 -64 6 -80 203
6446 203 -199 82 40 -214 187 -10 -27 -46 102 -19 111 153 -43 -236 -42 175 -36 -183 2 -49 67 -149
6468 -149 -94 47 -108 127 -144 2 92 -109 166 -239 -14 81 -21 81 -56 316 185 136 -146 48 -159
6489 -159 -44 -40 42 39 47 255 314 -71 -132 138 53 280 -11 -18 -116 42 96 -18 77 229 50 284 -28 264 -79
6514 -79 124 -5 -247 130 -146 -141 83 2 -149 -120 -134 -185 -165 -21 63 -202 -258 150 -16 -187 -99 -215 227 112
6538 112 73 -64 28 74 -244 -91 -60 -81 90 -33 -182 -52 -154 -168 75 194 -100 77 4 41 -165 46 -56
6561 -56 -56 92 97 163 -191 81 -16 -88 -75 161 84 4 -201 0 101 93 193 197 246 -129 8 -79 105 -121 16 316
6587 316 221 -220 372 148 -209 -65 -34 11 -104 23 79 -132 -152 47 82 -117 -22 -156 120 99 -160 91 -213
6610 -213 66 -142 139 36 -121 -45 12 -267 150 -15 61 -57 -67 83 -46 -49 95 -106 94 109 123 -74 71
6633 71 81 -44 183 237 29 -12 5 -359 -19 -31 49 201 133 -141 79 135 90 95 88 7 184 -78 -155 -208 74 -17
6659 -17 -162 -183 -45 -113 -71 273 -341 147 179 -208 305 -178 -96 132 1 -5 -349 61 -91 -191 -111 -373 144
6682 144 -128 282 -54 217 195 82 -119 -70 85 42 120 140 83 81 177 -107 -6 -38 -100 133 38 -307 -117 -201
6706 -201 -83 -87 -21 19 14 -118 53 185 224 167 -107 -86 161 -132 -6 -106 66 80 238 -331 -33 -141 12
6729 12 38 -75 126 60 232 -229 -138 -8 -76 204 -297 -112 42 -198 17 -196 -39 -241 248 151 -26 -124
6751 -124 -43 199 -230 206 -99 -192 59 113 -80 86 31 -254 -19 -31 -31 -249 -59 -110 168 83 -93 21 175
6774 175 78 -134 80 118 149 -35 -135 -23 -140 66 135 -71 -29 -33 43 -19 286 -160 42 107 114 -218 66 135
6798 135 -152 29 -110 19 -10 -47 -260 156 90 -146 171 -34 63 -17 -137 -33 -63 -26 243 63 105 -69 62
6821 62 -48 63 62 49 163 104 -30 118 90 145 -97 184 159 -154 8 -141 -175 -118 45 144 204 14 95 100 119
6846 119 66 -104 57 -232 23 30 39 184 99 0 -142 -182 195 240 30 -105 110 -12 12 85 22 152 20 83
6870 83 82 56 269 154 104 -127 -108 163 67 -269 -32 -152 102 14 -27 16 -161 12 -38 60 -112 38 -43 -116 49
6895 49 64 88 37 -27 33 -132 3 -33 19 109 86 2 189 -107 14 5 -33 166 -129 -43 -59 -15 -47 -166 127 -100
6921 -100 -118 142 76 72 26 -69 -4 -93 115 66 -74 31 137 262 -51 100 8 70 -75 148 53 99 97 185 32
6946 32 60 -73 -128 75 -47 -230 -73 -80 153 -88 199 72 -294 187 -118 -96 -178 -56 114 14 -160 31
6968 31 124 251 27 35 206 82 -48 -16 23 170 -77 -31 71 16 -97 9 -249 -4 -80 65 171 -74 106
6991 106 69 26 48 -338 13 104 -69 -281 171 -46 84 51 -52 -99 -118 22 -12 128 -57 27 -86 24 -23
7014 -23 -69 66 34 -157 31 -81 168 -195 148 124 -183 349 -60 -15 -69 -78 -70 27 193 35 24 -43 215 -171
7038 -171 134 45 -222 135 14 -108 -184 124 -152 154 17 106 6 117 183 -248 147 -100 177 80 115 -187
7060 -187 43 -262 -71 -184 -12 -128 -4 117 111 -70 51 -79 -32 269 186 -115 39 -101 222 63 7 70
7082 70 69 74 -24 209 82 -105 -11 -86 -23 124 -38 62 -122 18 -67 -128 82 -114 75 -107 -9 -26 -65 -11 -106
7107 -106 7 277 13 -307 -155 -43 83 -32 -195 -81 -48 -87 -57 55 239 -118 99 -188 -115 54 117 -92
7129 -92 5 81 31 94 33 61 -330 -2 -421 -270 66 -151 8 39 44 75 104 1 -32 -48 93 -164 -213 -230 -25
7154 -25 265 -61 -51 141 -36 142 0 -216 90 125 -73 -83 -103 27 99 137 89 112 121 -5 -68 40 109 -365
7178 -365 -32 142 162 -26 -71 107 -103 -264 262 165 -168 130 -181 165 54 25 -67 -130 68 -101 33 134
7200 134 -170 -77 -28 -29 172 2 -92 -142 -200 -126 134 47 -189 -81 112 383 147 54 -114 54 -27 -32 89 -125
7224 -125 -107 238 266 -141 -21 -52 89 -44 -54 -63 111 -218 -45 -113 -128 21 20 30 -177 -244 -1 -167 162 72
7248 72 -178 -158 58 -35 -130 -52 111 204 95 150 139 -142 181 -121 -34 -97 -16 -163 -91 -36 89 -70 131 -197
7272 -197 54 56 180 -39 148 -2 103 -166 56 -80 -22 250 -40 -85 107 -287 158 214 138 260 16 89
7294 89 191 7 -91 -60 -25 217 -91 -130 -268 113 -98 -117 67 -102 -33 -45 180 -55 -95 64 119 123 -84 188
7318 188 14 -64 64 -67 80 -167 -76 41 22 -242 63 -113 58 -15 326 110 -67 -30 159 -12 -3 -167
7340 -167 79 -36 -360 56 -288 -9 49 51 -185 223 211 -155 136 45 46 143 110 287 -53 29 -219 350 135
7363 135 -105 -133 -230 69 231 16 -194 146 116 196 -201 66 -124 56 -137 165 -64 -147 -9 117 -4 -84
7385 -84 113 151 137 200 79 -84 -51 -32 -81 -174 87 37 -110 -61 -48 47 246 -143 474 -80 -47 -183 47 -168
7409 -168 33 -157 -89 -252 120 33 137 -84 -108 -54 -107 -201 -191 171 16 -44 161 89 -90 105 -88 -6 -225
7432 -225 81 -162 17 216 -59 -222 -16 -265 48 26 90 -65 97 195 -54 17 268 -153 -119 -56 12 106 85
7455 85 104 -19 12 -120 126 48 65 103 250 -237 98 -26 -76 -13 -147 151 56 251 -113 -103 -307 22 239
7478 239 -138 -102 278 1 -236 126 23 -47 -20 -117 -149 -170 116 -91 -128 240 37 -69 85 5 -87 -85 -170 149
7502 149 -117 1 -36 29 164 212 -107 8 89 2 302 -136 13 24 86 -154 -20 82 -49 135 193 29 -24
7525 -24 -87 62 -32 -15 -88 -286 -21 16 34 -195 -196 150 -15 -41 -89 -72 27 121 -80 159 150 -211 53 59 74 247
7551 247 43 15 -11 145 -10 42 31 -255 -98 67 -140 -110 -85 -33 -186 70 -209 -9 -76 1 -119 35 -12
7574 -12 154 -25 -64 250 -68 13 -38 -27 89 -75 34 -20 -57 148 132 155 25 3 -50 -39 172 -175 100 50
7598 50 25 39 -55 70 -8 78 -130 24 -158 51 -184 -201 134 83 -68 267 54 63 187 0 52 -193 250 195
7622 195 7 84 9 -233 178 -47 56 85 43 -235 12 -62 232 154 293 219 113 95 -40 205 43 31 -47
7645 -47 -38 84 34 28 -405 33 297 -155 -153 58 89 -172 -300 -96 -97 -8 -42 -91 -32 -162 78 84 -187 -37 -75 -64
7671 -64 114 -13 -86 -93 -82 57 -18 -151 130 74 129 132 -58 -28 -211 17 -64 7 167 98 -100 99 -210 50 -32
7696 -32 -126 151 32 92 -121 -60 -311 -69 159 195 18 78 -30 57 -51 -150 13 30 -17 197 -107 97 129 222
7720 222 36 -58 4 19 -6 14 36 -12 230 -127 52 -117 116 -72 -218 -137 38 31 -3 117 -134 36 121 -103
7744 -103 17 175 99 69 -122 -71 -35 -246 -121 165 176 -14 83 -83 -21 200 -96 128 -286 101 234 127
7766 127 -88 -74 73 -108 -83 -117 -28 -296 -21 -75 -120 -56 -167 281 -104 -196 -137 -47 156 125 -119 -232 -74 -117
7790 -117 -77 5 -32 106 -159 30 58 -114 126 124 -172 171 41 -296 -234 -5 312 91 88 -9 -39 192 -217 -9
7814 -9 165 -126 355 61 -43 99 5 -70 -224 -125 42 92 -6 -5 53 240 35 -110 19 349 -177 60 -10 121
7838 121 -18 -116 54 63 -150 124 94 1 26 -31 -62 -28 121 -39 0 -130 -24 205 -76 -62 154 -52 37 46 -79
7863 -79 68 -401 51 175 -90 -188 26 -64 -13 -144 -10 -24 144 36 -69 49 -225 -223 -20 235 54 54 -130
7886 -130 -176 -51 42 -21 148 -448 -191 1 94 -213 137 14 107 -26 -115 -86 -111 53 -20 9 45 -290 115 144
7910 144 -24 151 53 -45 -46 222 -52 104 103 -48 37 -215 -171 -91 -59 -36 -125 -109 87 3 -27 -96 -103 -35 -152 -113 8
7937 8 8 -77 -2 -28 249 59 47 15 35 133 52 -58 -373 36 -43 6 93 -36 161 179 -55 177 73 241 -51
7962 -51 -74 -172 17 87 131 33 122 -197 39 113 -71 -12 86 137 122 -41 -109 5 64 -98 -73 -18 -135 0 -117
7987 -117 -86 -177 124 -38 -73 -36 -68 -102 -83 -1 33 202 142 -44 -121 -98 -178 23 7 192 302 2 -312 145 -146
8012 -146 44 -114 -71 123 -43 44 -171 131 -108 70 48 26 6 64 -94 24 76 -142 -28 -179 1 -100
8034 -100 115 -202 -103 -87 27 70 212 85 -80 -201 13 -2 -90 191 42 191 -170 94 -42 9 93 -150
8056 -150 -247 -196 -271 -140 78 404 311 87 -24 17 -206 100 -26 -111 7 120 -125 123 -125 54 -101 -58
8078 -58 -105 40 59 11 47 31 -58 -86 107 0 -7 -145 242 35 44 200 -148 213 -4 -77 302 61 167 35
8102 35 194 -67 -195 63 -50 -20 194 162 74 -45 180 -173 198 22 283 -216 -76 -55 207 130 69 -79
8124 -79 103 233 267 -103 -109 -311 -30 -97 -88 110 -167 39 -158 69 -35 56 224 -193 178 -33 119 3 -154
8147 -154 129 -23 162 247 76 18 40 -14 -126 -186 167 69 148 -213 -25 76 33 93 174 56 -121 42 103 199
8171 199 -60 -153 15 61 6 104 -51 81 129 -90 133 -62 85 -72 40 102 -7 78 -66 -157
8191a57
$$ Imaginary data points
##PAGE= N=2
##DATA TABLE= (X++(I..I)), XYDATA
0 0 0 0 0 0 0 0 0 0 0 0 -8 8 -8 8 -16 16 -24 26 -32 40 -48 56 -71 80 -96 112 -129 152 -176 203 -230 263
32 263 -300 340 -381 433 -484 544 -608 679 -755 841 -932 1033 -1141 1262 -1394 1536 -1693
49 -1693 1866 -2055 2264 -2493 2753 -3040 3363 -3731 4153 -4641 5214 -5901 6737 -7785 9140
64 9140 -10970 13595 -17703 25110 -42820 184480 108269 35638 288178 77966 80756 146690
76 146690 50465 -19635 54925 60416 -2411 -104659 -107566 -52761 19606 -116404 -263924 -39178
88 -39178 48639 -276193 -219694 -27598 -231204 -267396 -108893 -201941 -252189 -177464 -159905
99 -159905 -170719 -204540 -202722 -142698 -140383 -180327 -179511 -80271 -74015 -210698 -105461 39300
111 39300 -148542 -165122 31152 -26367 -81446 6960 6705 11011 35315 35736 60109 39302 31524
124 31524 90892 106964 67793 35485 102779 168873 57175 33950 160696 108387 48762 131672
136 131672 111722 68393 98901 98112 95751 66727 40448 85715 75775 29096 39524 49673 46491
149 46491 15681 4387 47764 4919 -40929 24900 13751 -43992 -19503 -15365 -25576 -28616
161 -28616 -50489 -33722 -34097 -59688 -31779 -30888 -57496 -44853 -36331 -27791 -39018 -63569 -24199
174 -24199 -13860 -51245 -27830 -14543 -31717 -15920 -13938 -13745 -7543 -17369 3984 11993 -10088
187 -10088 6624 16605 8037 17049 10300 14345 26394 9916 19628 31860 12320 18428 27599 18792
201 18792 21929 15438 15785 24152 10454 13057 18840 3507 8998 12297 597 4556 -509 -3736
215 -3736 5166 -6447 -9412 -1838 -10481 -8996 -8497 -16189 -10449 -13206 -17139 -10442 -17864 -18533 -10432
230 -10432 -17649 -16360 -12168 -17438 -11810 -11178 -14821 -8390 -10337 -10602 -5311 -8430 -5573 -2787 -6238
245 -6238 -217 290 -2624 3792 2456 1200 7477 4916 4616 8947 6776 8367 9433 7526 10183 10037
261 10037 8966 11062 9015 10428 10984 7823 10603 10351 7001 9977 9401 5819 7791 7050 4898 5640
277 5640 4196 3807 3639 1333 1869 1170 -368 -517 -1380 -1344 -2049 -4252 -3195 -3150 -6400 -4982 -4348 -6817
295 -6817 -6709 -6066 -6688 -6851 -7663 -7116 -6530 -8018 -7714 -6624 -6973 -7082 -6730 -5939 -5647 -6895 -5337 -4117
313 -4117 -5269 -4713 -2869 -3038 -3018 -2500 -959 -384 -971 315 1976 1502 1634 3051 3821 3755 3951 4924 6111
332 6111 5375 5809 7403 6778 6699 7464 7578 7906 6939 7689 8616 6624 6842 7903 6224 6179 6519 5379 4961
351 4961 4408 3704 4287 2466 1726 2439 491 142 24 -1787 -1399 -2634 -3600 -2835 -4689 -5037 -4305 -6470
369 -6470 -6362 -5769 -7648 -6927 -7243 -8019 -6722 -8170 -7799 -6047 -8279 -7069 -5231 -7315 -5427 -4785 -5587
386 -5587 -2825 -4099 -3875 -750 -2257 -1434 1222 -62 855 2115 2030 4570 2081 2918 6659 3639 4808
403 4808 7602 4311 6306 7752 5176 8126 6302 4576 9278 6231 4264 7130 4966 5149 5115 2343
419 2343 5006 2254 229 4458 -515 -2111 1561 -2611 -1609 -1963 -6774 -2293 -3753 -8843 -4074
434 -4074 -6603 -10373 -5324 -8111 -8487 -7980 -10877 -6188 -7431 -11607 -6219 -8509 -9573 -4065 -9053 -7275
450 -7275 -3418 -8135 -1980 -1073 -7677 -69 1119 -1815 2938 -11 2201 6737 2253 6875 7510 3294
466 3294 10940 10333 6813 12041 8207 11088 15949 7937 11493 14979 8391 14670 13437 7492 12894
481 12894 10544 9719 13045 4600 7141 10840 3937 7120 4432 -115 6322 1040 -1489 3072 -6080
496 -6080 -2856 1552 -8421 -5511 -5299 -10149 -3796 -9156 -12886 -6909 -12752 -10830 -7206 -16537 -11755
511 -11755 -9678 -14645 -8526 -13328 -15771 -6827 -11953 -11653 -7279 -14410 -8050 -4686 -11383 -4980 -6948
526 -6948 -9085 778 -4916 -6049 474 -4338 1143 3492 -3680 3456 3317 920 9334 2503 1873 10156
542 10156 4229 7817 9915 2737 10361 10488 5388 11922 6333 6176 14036 6322 7620 10455 3876
557 3876 10750 9819 2808 9119 5235 4366 10027 1690 2545 7151 527 5011 3820 -3131 4234 1257
573 1257 -1840 3320 -4082 -2766 2691 -4682 -1766 -1656 -7085 391 -2847 -6909 -1021 -6254 -4742
588 -4742 283 -7629 -4553 -2518 -6918 -1024 -3531 -7481 -537 -4768 -3937 161 -6864 -2829 142
603 142 -5564 -203 -1933 -5703 1816 -2314 -3348 1197 -4190 -1108 2296 -4269 299 75 -3153 2672
619 2672 -888 -2631 2372 -2048 316 2850 -3344 1400 1651 -2290 2910 -308 -1860 3761 -642
634 -642 -144 3210 -1845 1698 2645 -966 3097 632 -215 4251 89 727 3859 -560 3011 3385 -1071
651 -1071 3427 2314 304 4673 981 872 4220 671 2394 3115 -338 3181 1979 56 3616 224
667 224 508 3146 -571 1072 2016 -1208 1611 1034 -1974 1538 -622 -1742 1015 -1896 -1220 3
683 3 -2826 -733 -941 -3234 -532 -2133 -3052 -1000 -2931 -2464 -1462 -3812 -1979 -1848 -3884 -1453 -2315
700 -2315 -3604 -1710 -3188 -2626 -1303 -3065 -1680 -1148 -2958 -813 -1218 -2382 -155 -1175 -838 935
716 935 -1168 194 1050 -470 1097 1363 343 1880 1296 1379 2595 1351 2337 2736 1810 2767 2857 2025
734 2025 3414 2571 2605 3548 2403 2601 3139 2238 2947 2631 1835 2945 2193 1825 2388 1540 1328 2096 925
753 925 1262 1125 303 933 200 -221 220 -636 -980 -370 -1455 -1340 -1124 -1893 -1601 -1859 -2247 -2022 -2307 -2446
773 -2446 -2363 -2930 -2553 -2659 -3036 -2614 -2619 -3044 -2476 -2845 -2773 -2128 -2578 -2645 -1751 -2436 -1940 -1797 -2042 -1414 -1492 -1516
795 -1516 -620 -1111 -700 -126 -343 4 196 349 818 622 844 1740 1015 1352 2179 1474 1999 2368 1890 2536
815 2536 2699 2298 2828 2685 2586 2785 2513 2850 2766 2536 2829 2094 2174 2935 2079 1892 2406 1312 1727 1563 667
836 667 1327 768 193 931 283 9 -80 -689 -611 -786 -1243 -883 -1461 -1970 -1294 -2015 -2398 -2065 -2635 -2097 -1986
857 -1986 -3152 -2513 -2511 -3180 -2425 -2641 -2946 -2225 -2762 -2069 -2096 -2789 -1775 -1881 -2435 -1072 -1517 -1502 -307 -1325
877 -1325 -532 102 -779 281 652 -225 1026 939 876 2063 1178 1823 2488 1374 2356 2645 1804 3087 2581
896 2581 2050 3466 2260 2600 3400 1726 2544 2792 1305 2843 2023 1151 2393 1087 1073 2014 47 868
914 868 947 -342 992 -70 -919 536 -1153 -1160 -152 -1859 -1248 -722 -2595 -1362 -1614 -2759 -980 -2557
932 -2557 -2780 -1359 -2989 -2238 -1191 -3213 -1588 -2062 -2481 -762 -1958 -2319 -487 -1770 -1222 -408 -2332
949 -2332 -97 -23 -1510 386 -619 -767 1350 -228 278 1568 -87 1619 1994 171 2201 1215 460
966 460 2711 1042 1285 2641 693 2153 2435 318 2559 1730 686 2513 691 969 2437 436
982 436 1144 1224 -669 1399 687 -957 1235 -326 -318 1124 -1164 -675 330 -1754 149 -591 -2158 -14
1000 -14 -966 -1746 -63 -2104 -1358 -206 -2212 -613 -853 -2464 167 -985 -1808 212 -1818 -1027 305
1017 305 -1763 -320 68 -1650 1048 -262 -1189 1015 -506 -160 1347 -1262 334 798 -758 1147
1033 1147 421 -420 1605 -76 353 1448 -756 736 1620 -658 1222 378 -435 1896 117 -251 1323
1050 1323 -530 267 952 -1195 848 387 -887 953 -428 -615 901 -805 12 742 -1314 430
1066 430 239 -1218 766 -389 -858 777 -1073 -605 720 -1536 71 380 -1242 800 -118 -601 1028
1083 1028 -427 -262 957 -687 571 764 -537 1242 527 -462 1251 -204 220 1325 -301 744
1099 744 1265 -572 1089 622 -314 1383 35 -210 1260 -722 356 933 -1040 386 191 -1163 777
1116 777 -459 -698 714 -858 -439 320 -1340 -34 -399 -1495 147 -864 -1262 270 -1297 -963 -94
1133 -94 -1487 -427 -419 -1487 -200 -1029 -988 69 -1308 -583 278 -1299 59 73 -1071 315 -6 -672
1151 -672 733 -99 -88 780 -263 819 993 -108 917 931 20 1100 534 429 1416 195 899 1279
1169 1279 205 1432 906 338 1239 583 587 1585 293 866 865 -167 643 593 10 881 157 56 780 -419
1189 -419 -107 183 -668 197 37 -995 -90 -485 -705 -249 -840 -655 -254 -986 -530 -521 -980 -179 -718 -580
1209 -580 -345 -1056 -377 -148 -717 -141 -265 -947 -147 -231 -687 1 -260 -369 8 -467 -144 64 -318 110
1229 110 76 -233 317 -293 97 551 -169 92 677 -139 310 442 51 798 331 357 632 317 603 693 -13
1250 -13 511 543 26 528 277 232 555 202 166 485 -147 461 376 219 323 299 -20 193 -76 33 252 -386
1272 -386 145 43 -333 7 29 -337 73 -283 -393 -65 -470 -377 -390 -525 -93 -209 -361 -280 -586 -521 -281 -631
1294 -631 -314 -281 -466 -237 -281 -599 -327 -444 -583 -419 -672 -262 -228 -337 -204 -65 -221 -284 -127 22 20 3
1316 3 -160 102 -152 292 459 25 219 207 360 481 223 458 703 495 754 651 401 690 633 517 826
1337 826 443 609 670 391 518 742 96 777 682 171 721 393 460 828 228 262 451 -57 255 198 -20 265
1359 265 -373 -68 -40 -661 -222 -76 -631 -280 -596 -572 -460 -725 -851 -210 -874 -700 -423 -1157 -657 -688 -1081
1380 -1081 -416 -980 -1229 -729 -1004 -825 -442 -1126 -534 -716 -974 -242 -414 -830 72 -315 -370 178 -296 491
1400 491 334 -269 748 201 178 792 509 647 1007 214 832 910 667 1314 887 900 1268 851 921 1514 832
1421 832 1139 1373 519 1440 1019 453 1032 500 660 883 132 181 750 -138 300 142 -355 368 -133 -410
1441 -410 -86 -651 -214 -84 -605 -138 -716 -906 -337 -831 -925 -362 -1379 -794 -677 -1122 -838 -676 -1230 -928
1461 -928 -874 -1049 -269 -916 -824 -621 -935 -361 -485 -713 22 -631 -477 208 -324 -202 410 -255 301 721 82
1482 82 435 404 -28 976 446 273 1104 292 705 1305 187 1143 1057 383 938 531 380 1104 559 713
1502 713 833 208 764 614 12 795 122 -70 601 -109 221 305 -337 233 -56 -379 332 -289 -570 -120
1522 -120 -684 -612 -352 -812 -500 -132 -833 -301 -891 -707 -152 -943 -608 -186 -1147 -470 -477 -1030 -77 -376 -954
1543 -954 -69 -564 -555 -91 -708 -73 -162 -388 35 -213 -341 423 79 -55 349 -61 407 575 -27 742 337
1564 337 -6 677 250 330 944 208 394 761 32 712 477 137 860 295 -33 673 59 476 595 -283
1584 -283 352 359 -43 584 -5 -76 240 -183 106 263 -311 93 -49 -420 224 -82 -373 243 -198 -156 246
1605 246 -533 -229 73 -224 29 -190 -534 103 -342 -209 13 -560 -162 76 -440 -58 -417 -414 154 -522 -268
1626 -268 -61 -87 -56 -316 -526 127 -164 -476 255 -117 -118 138 -111 8 -14 -214 237 -34 -74 533 90 -8
1648 -8 361 7 315 501 -39 64 436 -46 287 -62 -59 721 -223 139 213 -214 275 136 -226 308 72 -153
1670 -153 153 -189 19 432 -57 138 275 -132 223 -86 -132 97 -232 -194 17 -296 -201 99 -272 126 -26
1691 -26 -30 -31 -261 -673 -69 -484 -92 -51 -510 -145 -466 -346 146 -19 -79 229 -202 -11 -26 -458 -151 -58 -273
1714 -273 46 -85 -191 62 -90 -14 288 -215 97 351 -19 234 266 40 293 198 242 436 158 521 172
1735 172 0 251 412 425 576 144 55 111 92 359 425 14 324 239 231 106 -6 76 28 -149 237 -17 73 247
1759 247 106 -110 -46 -195 91 -9 -357 71 -198 -319 -29 -261 -428 -81 -196 -577 -270 -407 -372 -178 -341
1780 -341 -89 -460 -493 -79 -121 -415 -40 -523 -419 -250 -366 -229 -4 -284 -109 -205 -308 109 -135 -356 15
1801 15 -168 287 105 -130 217 259 335 585 -63 242 538 423 473 272 340 579 515 186 498 708 165 501
1823 501 353 164 415 165 247 135 43 150 -66 241 486 -52 299 222 -219 22 -7 -478 -34 -102 -409 -130
1845 -130 -117 -280 -86 -263 -371 -316 -473 -137 -318 -525 -124 -186 -424 -175 -448 -501 -102 -576 -139 -36 -362
1866 -362 -170 -227 -173 16 -19 -171 -63 -18 350 169 120 232 38 60 640 -49 507 425 -12 215 251 164 370
1889 370 262 6 198 284 348 459 -96 510 168 7 237 -86 -235 14 -133 -170 79 -270 24 19 -356 23
1911 23 86 -79 -7 -159 -83 176 -359 -105 -220 -419 14 -250 -292 15 -99 -88 -50 -452 -187 -78 -316 11
1933 11 -282 -82 254 -95 -167 173 -156 35 196 -186 275 158 1 253 14 -28 163 238 290 113 -168 107
1955 107 151 -105 -108 5 260 168 -30 -71 159 -47 257 94 4 192 -93 -44 348 -223 -59 82 -398 -6
1977 -6 -3 -271 44 -198 -166 155 -15 -137 -197 -330 -19 49 -236 359 63 -17 155 -148 -187 93 -79 109 223
2000 223 -29 263 -28 93 172 -142 259 131 -58 205 518 208 139 42 -214 244 -167 -248 125 29 92 138
2022 138 -52 -10 -64 75 104 68 -259 222 -208 78 43 -111 124 106 -261 -51 -251 -271 126 -46 8 232 -19
2045 -19 45 -189 -377 264 37 -234 15 -1 199 162 -194 -14 -17 -137 -71 247 -84 293 -260 155 155 -200 138
2068 138 -14 -218 94 384 74 195 -95 184 19 231 85 -78 -41 142 140 124 237 61 197 194 30 45
2090 45 118 29 34 313 16 199 245 158 156 -254 227 189 131 326 -32 -164 -40 -75 -241 246 26 1 66 45 -186
2115 -186 -30 -261 -117 103 -219 22 -215 -221 164 -79 -251 -122 -275 -134 -125 7 -39 -338 -133 -60 -262 2
2137 2 -143 -306 -181 -129 -329 9 -215 -148 -82 -68 264 -34 -298 -79 -131 -44 -145 -198 37 7 -221 -50 15 114
2161 114 213 105 91 83 436 128 129 86 264 238 -92 194 174 -95 192 476 169 122 165 269 227 -82 61 191
2185 191 -65 94 -106 104 174 237 -163 -179 157 -23 221 -242 87 -275 -229 -53 -138 -65 149 -201 26 -15
2207 -15 -232 -14 -324 -102 -158 -257 -114 86 -122 -242 -100 -243 -77 -12 -315 -42 -139 -96 62 -136 258 61
2229 61 97 -230 127 24 148 125 70 193 200 151 -82 69 285 246 -69 229 162 -41 235 37 205 128 170 110
2253 110 67 -34 180 51 152 114 226 147 82 62 90 -55 -67 270 14 -91 166 -209 -133 -70 44 151 41
2276 41 -120 -209 13 -467 -109 93 -38 -209 -175 -109 -113 -292 159 6 -236 11 -111 -264 -21 -339 -8 -164
2298 -164 -97 140 51 -384 6 212 -47 5 -73 -233 36 65 85 268 52 325 8 123 51 -132 122 99 33
2321 33 165 80 389 320 299 217 128 171 212 374 53 -22 265 -117 112 66 -346 306 38 39 -76 -116 -271 137
2345 137 -231 -270 172 -82 -56 192 167 168 107 -4 1 -164 -92 157 -185 -29 -66 -19 227 -96 -193 -20 -302 52
2369 52 -99 -303 186 -82 -144 -169 -174 197 220 196 173 116 -235 58 158 52 151 -254 -171 -88 -248 -114 185 -156
2393 -156 136 29 -6 206 -152 51 28 -131 -131 166 -240 248 154 -119 170 194 -137 302 -206 -112 -76 -156 -122
2416 -122 12 157 76 33 139 504 -222 -66 143 125 139 -75 75 -150 37 -125 -59 -45 173 134 -317 -166
2438 -166 -292 -209 44 -150 -181 18 -101 36 -268 -331 -37 30 -314 -185 -76 137 -9 -238 -187 10 -100 -93
2460 -93 120 6 24 -260 -24 77 57 100 27 81 169 91 -204 203 82 141 411 -89 -58 490 -110 83 124 20
2484 20 101 -115 -26 113 19 -38 228 -41 15 -92 -164 248 -15 -65 265 -160 -3 112 -182 -13 -196 -268 -98
2507 -98 -93 -69 -53 9 -328 -158 -139 -133 -140 -46 -87 128 -227 -35 51 -158 -122 129 -207 -64 -235 -151 64 -140 -7
2532 -7 -142 -100 -55 87 -265 -68 -316 88 25 -224 193 110 -27 149 -124 112 -1 -40 139 355 24 260
2554 260 143 -6 90 -136 305 -85 23 303 42 121 -6 112 232 -140 66 26 113 3 15 58 42 220
2576 220 -108 -21 108 294 -73 -359 -9 -74 143 20 -118 75 -162 -50 -169 -188 25 136 78 -174 130
2597 130 -46 -35 -204 25 -3 -204 89 -222 -17 -144 -163 -124 -148 -112 -223 -113 -254 -105 -249 -82 -21 -118 118
2620 118 -38 -55 16 17 -297 71 215 -101 -76 -153 101 296 226 72 217 -6 84 174 201 98 -24 40 118 16
2644 16 445 197 -76 -62 5 -15 -43 -72 -6 94 -27 -55 -21 54 56 -93 -70 235 43 -180 55 -115 135 -302
2668 -302 176 -156 -152 -121 -254 -197 -284 148 -54 -196 -2 118 37 -4 -203 -192 -24 -238 -55 -148 -41 189 242
2691 242 -31 173 -192 63 217 -78 99 -91 45 -185 174 227 -94 80 -80 193 169 87 140 23 338
2712 338 117 176 123 15 152 249 186 87 -92 -55 -26 -35 132 23 112 103 -5 -132 58 -65 176 -44 -169 -145
2736 -145 -70 -119 116 -92 -15 -177 -178 67 -128 -191 -35 -139 87 -93 -248 16 505 61 229 21 91 44 18
2759 18 -38 25 -88 6 -29 -130 -108 190 -48 45 273 48 33 11 -36 -127 322 85 73 -190 55 -191 0 -40
2783 -40 133 179 226 -56 -64 168 80 18 40 47 218 210 19 69 191 -50 -71 47 131 195 25 -79 70 -61 239
2808 239 131 -193 130 8 90 61 -215 -67 -16 -418 96 -207 49 0 -180 31 167 -57 -100 95 -207 -19
2830 -19 76 33 81 66 -26 -92 150 -115 -154 12 -58 107 15 55 -143 -114 -45 -120 272 306 -35 -10 -63 44 253 -44
2856 -44 96 206 169 136 147 -129 199 129 -267 -136 -91 202 -140 -222 -197 137 -151 31 -88 -41 63 -132 -60
2879 -60 26 85 -208 -72 29 -32 30 -62 -126 66 -260 133 -65 27 55 -23 -185 185 -28 -87 10 -54 20 -251 -223
2904 -223 10 -97 87 -116 78 59 126 -111 -4 216 70 62 -148 147 -105 18 1 283 -232 35 85 122
2926 122 207 329 -122 -1 188 7 260 -12 60 58 148 3 -39 -49 -77 47 -122 -112 -113 -41 4 -25 62 -264 45
2951 45 137 -132 -164 20 18 -217 139 36 -91 99 -62 -109 36 -42 150 102 -90 123 -20 124 -91 11 332
2974 332 -136 3 195 40 -53 0 -83 86 -103 -130 228 -173 216 -42 96 -201 -117 -104 -72 184 65 157 -25
2997 -25 -71 30 140 53 -15 174 66 16 -64 137 340 156 19 -363 3 215 103 49 19 103 -16 62 31 71
3021 71 41 71 210 -79 14 120 -95 73 62 6 -140 9 25 202 -9 -10 54 25 291 40 -118 94 -9 112
3045 112 -200 -39 -153 -30 34 -169 -14 -175 263 -247 167 4 -58 175 68 5 -129 -27 202 429 -42
3066 -42 -107 -103 -199 139 273 -233 107 98 103 8 151 202 16 -109 288 90 114 206 -51 34 40 -47 49 -99 68 50
3092 50 103 -125 109 21 -13 109 -39 261 -3 56 -88 5 144 234 25 -188 22 -259 -267 88 -94 44 60
3115 60 122 -160 24 -220 10 -30 92 -71 -137 29 -37 -67 -142 2 -84 113 -101 -263 -88 -205 191 127 24
3138 24 27 101 15 231 -86 -171 -331 -51 -34 -297 -4 196 -49 36 284 -185 183 -31 36 -19 -71 157 -123 -5
3162 -5 -20 -36 56 174 88 44 -32 -160 -42 96 28 -199 19 -10 -10 1 35 77 66 -80 78 141 29 53 80 -12 36
3189 36 -6 -87 40 -78 376 217 20 -90 247 -76 -4 -118 40 -253 306 -90 -73 -68 83 -12 -135 20 -90
3212 -90 -125 -100 -41 -4 41 -43 214 -134 78 144 -206 -117 42 49 10 -7 -20 -19 145 -76 180 163 -184 -15 74 -22
3238 -22 149 -86 36 -5 91 -23 73 42 184 -97 -110 62 190 396 144 62 42 -48 -144 96 113 192 123 -195
3262 -195 64 -147 -113 101 143 0 -4 -49 48 44 -9 -100 -263 119 40 53 -174 -175 -263 -48 5 -326 -61 61 -189
3287 -189 -266 14 -52 -60 86 -106 -247 -102 169 205 -120 163 167 -131 74 -186 -206 -93 -93 185 123 174 60 10
3311 10 4 7 -133 -37 -121 250 -18 -40 -208 89 74 -4 150 -37 11 -1 95 -56 20 193 -202 -224 65 -295 111
3336 111 145 -110 -74 26 213 13 -100 27 77 -83 24 67 -17 -170 -108 -32 -370 -372 87 48 -44 181 -29 -66
3360 -66 55 204 -88 -110 5 -144 -247 59 -58 74 -5 -18 73 69 82 335 234 -289 -135 -92 119 276 370
3383 370 -62 6 44 173 -18 -44 -233 -189 85 -81 146 -206 135 5 -25 255 -164 -50 135 47 8 -149
3405 -149 -202 0 191 -97 1 -39 -107 -228 -118 -99 196 -304 -163 140 -200 -63 -322 -158 -68 -121 79 -276
3427 -276 -100 130 250 -186 -62 -262 43 98 -157 -28 -34 63 101 63 -273 -19 115 -152 -52 -24 90 41 81
3450 81 -211 125 -97 -151 31 -32 54 -85 -37 109 270 245 83 132 65 112 58 -2 4 108 316 -325 -75 98
3474 98 -115 104 76 29 214 72 19 76 -151 -146 63 -238 304 -110 -182 158 -130 -159 -66 253 -141 190 -149
3497 -149 43 -22 232 -86 -114 -117 -53 64 -3 -52 138 -61 15 157 40 -165 51 -88 -83 113 47 -166 65 157
3521 157 -20 313 1 264 40 4 101 -114 188 312 -37 -304 29 155 -40 265 189 212 21 222 -52
3542 -52 29 23 -65 65 -61 -39 -11 309 11 29 -47 -120 95 119 -152 37 141 -3 -147 274 28 88 165 -183
3566 -183 53 42 29 -111 22 -102 -107 -96 -255 94 301 188 122 -165 252 -141 -2 73 -289 -261 77 69 -58
3589 -58 70 -5 -149 336 213 15 3 120 54 130 45 55 -63 60 -123 145 271 185 79 313 -176 30 1
3612 1 9 5 -154 121 160 9 180 191 19 -13 0 76 -38 -51 18 -50 95 48 -137 4 201 261 -96 -41 -57 -35
3638 -35 141 95 -19 41 12 -125 7 72 112 94 132 -97 82 -163 -14 65 -294 -88 -117 -45 99 -105 -82 -28
3662 -28 124 -205 43 164 104 -13 -30 -105 -3 -51 134 51 -63 -119 -69 -70 90 140 25 18 22 -56 28 34 48 -27 -40
3689 -40 -82 -124 -15 123 21 -118 75 -120 87 21 -226 145 -38 -77 -54 -61 41 -123 -108 -68 221 38 -89
3712 -89 17 36 -226 141 -26 -273 -232 -267 -233 -81 -57 -72 33 133 -25 238 -188 -82 105 -482 -122 -256
3734 -256 -43 126 -41 184 -223 -219 88 17 -10 -160 170 -20 -100 238 128 302 -22 244 2 140 179 135
3756 135 61 -162 -61 110 91 -29 5 140 -9 115 70 -38 -3 -120 -115 10 -162 -25 -14 -171 -230 -14 49
3779 49 166 -60 116 255 -15 25 -11 -257 -44 -4 -237 1 30 41 12 -210 127 308 -64 -218 -64 -116 125
3802 125 -72 169 -99 -57 -246 39 -91 -103 -122 -180 -259 269 106 80 -154 -138 39 147 77 109 37 -151 32
3825 32 -129 118 -2 138 7 57 166 -62 53 79 83 67 -120 14 -38 7 -420 -205 280 -43 -18 -14 -81 96
3849 96 333 -223 32 -75 -102 -150 -120 -67 53 63 -103 -13 236 -82 40 118 4 101 -71 78 -222 72 -73
3872 -73 29 -23 -37 -56 -26 261 115 -48 -86 -73 -186 -85 -118 20 -64 41 9 -156 -154 239 -25 -119 -124 201 62
3897 62 175 -330 198 -134 118 35 128 -259 204 -172 -12 213 -206 127 -22 -1 14 70 95 -240 -21 249
3919 249 98 -42 -71 175 -129 10 -159 174 -26 223 -145 27 140 -3 -140 -57 81 -170 57 -45 -49
3940 -49 55 -210 188 0 33 -130 86 -198 111 -107 -94 -80 79 -106 154 -218 178 124 -152 243 37 197
3962 197 -100 177 -279 -77 -285 -22 -6 231 -93 -21 84 -29 145 51 49 -110 37 151 46 9 148 -30
3984 -30 132 173 311 102 79 -237 125 -1 -42 47 15 70 -36 48 157 -303 272 128 230 70 -155 125 91
4007 91 102 -135 -91 203 -185 41 93 34 59 96 -221 21 -42 -62 -139 -165 83 -32 154 -60 1 -98 15 -36 -76
4032 -76 -185 26 -6 -211 105 -103 -214 67 -195 278 -22 102 -109 48 2 -94 -54 10 205 -117 8 76
4054 76 -57 105 223 -48 9 96 36 -89 96 -41 106 -57 11 6 260 50 64 9 35 -72 7 15 11 109 -183
4079 -183 -72 171 229 170 -24 157 -120 -138 110 209 -125 -29 -72 -29 -190 -118 -252 -105 46 -6 -10 61 -191 308
4103 308 -2 -60 -326 1 102 102 57 -291 -62 94 131 6 -82 156 -10 -38 -8 -25 4 -133 -73 120 98 -19
4127 -19 148 -67 120 -76 74 -75 -28 190 11 -150 120 40 72 -98 39 -27 2 150 -8 85 189 57
4149 57 -20 168 -76 145 223 131 -71 -80 43 -68 -41 -77 -228 -93 -101 -54 1 20 -36 -345 -92 -170 137 36 -136
4174 -136 55 -72 80 -74 -84 63 107 -149 -114 -124 -84 -99 -51 104 -141 119 109 116 123 -117 -100 30 19 138 73
4199 73 226 -10 -54 8 -34 -276 -227 160 35 59 -52 207 34 -63 -115 -182 -43 -63 175 -71 -137 132 -24 129
4223 129 120 264 -124 16 67 52 -2 141 -53 113 79 155 70 -85 -1 -73 -83 6 187 -20 -154 -162 70 -85 78
4248 78 -98 -202 -98 -125 154 -137 -5 -30 -258 -128 50 268 35 -2 44 173 59 234 101 -150 71 -234
4270 -234 8 93 24 61 -237 151 -174 -56 45 16 106 47 1 9 315 64 126 3 109 -102 52 240 327 -154
4294 -154 24 9 -213 -62 83 248 -187 -31 31 -204 -111 168 77 48 176 164 -64 198 58 -65 -53 10 201
4317 201 84 203 176 -82 -8 223 112 -103 -39 -172 61 -234 -114 53 88 -60 14 357 243 177 14 103
4339 103 86 27 -152 103 -340 -151 59 23 53 -138 -14 33 188 -81 -180 51 35 -158 -53 -22 -112 69 -94
4362 -94 -87 -132 -11 102 -71 131 52 93 19 -212 109 46 279 -42 206 -228 -44 -16 -6 255 58 143 -127 -11
4386 -11 -12 106 -42 -198 66 186 18 -137 -199 187 -85 -33 -44 119 194 -50 -155 13 -366 -108 84 138 -77
4409 -77 243 5 108 192 -107 15 -121 53 -27 123 13 -150 153 -108 62 190 -20 5 134 -167 282
4430 282 125 101 140 -150 150 89 -36 -52 37 -78 302 0 101 -140 185 -281 72 51 -17 -69 -216 26 -57
4453 -57 70 -248 121 -143 -86 173 -205 326 84 -118 -33 -30 4 177 105 96 113 270 -6 -100 -19 -104 28 85 -45
4478 -45 -220 127 -113 -145 3 17 -37 -14 -134 204 -36 -145 -91 131 132 115 101 109 -48 -64 -95 44 -227 -38 11
4503 11 166 22 29 9 47 193 116 -57 43 51 -170 -92 11 2 -260 88 -105 -104 -57 -147 -419 27 71 99 227 17
4529 17 -233 -140 -50 185 -52 -89 -54 17 -4 -32 121 -92 229 56 89 -148 22 10 20 -74 98 78 -170 60
4553 60 -76 -6 -58 4 66 144 -153 117 -127 -226 -107 -16 4 -76 -283 -151 326 46 -62 57 -105 -34 -40 166
4577 166 104 155 33 -283 -33 -149 251 -152 208 -208 52 371 297 -216 -64 41 53 8 75 91 163 -194 171
4600 171 81 -155 119 -154 -71 -275 153 -40 38 -163 -145 -16 114 12 -46 17 78 -146 -216 171 118 -94 -50
4623 -50 208 257 34 -122 -57 26 88 94 -24 14 -294 38 -16 25 -81 -87 119 -51 -150 28 -110 117 -63 -17 -310
4648 -310 -157 118 -139 5 -158 70 -116 51 2 16 261 -18 127 -61 -42 28 -61 81 35 -57 -155 -161 102
4671 102 -51 40 -67 65 205 291 106 -76 56 -151 -36 86 -61 91 -215 92 97 -146 -150 -96 -265 -18
4693 -18 -6 -62 363 333 -115 -76 165 -69 -38 2 120 -136 -53 -181 -39 5 161 101 -110 19 3 -110 -42 42
4717 42 -158 134 39 -187 126 24 -9 25 112 77 16 235 168 43 -6 139 139 66 -106 -82 49 175 152 -11 242
4742 242 178 143 211 -32 4 309 42 -34 140 89 52 78 -93 -155 15 -139 -107 48 127 -88 59 -158 36 -66
4766 -66 -13 -90 -183 -3 90 -17 -16 5 4 -34 -96 -106 -22 -39 -42 -64 -83 -13 -66 131 161 -12 87 -82 -8 48 -144 11
4794 11 -145 363 78 24 98 -27 -117 -33 -22 -197 -112 -46 164 129 79 -59 -20 47 99 -72 -22 133 98 32 206
4819 206 -107 -27 120 -164 116 150 17 20 139 -47 -121 -179 -57 344 -123 173 -287 167 65 -119 162 -1
4841 -1 49 -181 -96 152 -133 196 -366 -186 154 26 207 240 33 123 33 -112 -46 62 -39 -227 -155 131 -99
4864 -99 70 -3 -42 112 202 8 -174 -47 270 -119 -22 27 -154 102 -89 58 -156 148 -96 -31 66 -12 114
4887 114 -33 -23 -9 16 -126 -173 127 -30 205 -48 -84 -2 -52 85 -46 -28 281 133 19 24 -50 66 37 101
4911 101 128 186 154 -108 -85 -199 -193 -65 73 48 278 -63 -115 -45 107 -126 -26 67 152 40 100 -91 277 261
4935 261 -52 79 162 120 99 -110 192 -161 182 83 -261 -71 274 273 -196 7 -119 162 136 -95 -311 26
4957 26 65 81 -38 -9 98 305 -228 314 -130 -209 153 58 -153 166 -148 132 115 27 -143 13 -156 95 184
4980 184 -53 -97 100 -176 -82 -79 -109 3 -61 -164 -180 175 102 -110 -16 -21 -116 43 -31 30 -81 51 -63 94 -55
5005 -55 -207 -63 -203 -158 -24 82 82 -18 -153 39 -21 32 59 -166 -98 -69 25 168 -116 -46 72 -120 27 400
5029 400 34 -83 99 -81 -131 49 -12 -259 -234 102 227 161 93 -95 184 -11 -57 -57 20 -138 -99 238 -95
5052 -95 -197 -152 -148 199 17 33 70 -247 137 4 129 148 -22 -63 -27 130 177 -95 36 128 -16 -165 83 80
5076 80 174 -30 202 -260 -237 214 215 -163 -44 -14 44 94 51 129 -201 169 148 -119 154 57 153 14 136 -43
5100 -43 194 102 -101 -11 215 -52 22 -35 74 94 -138 -104 -51 -123 -59 -26 105 300 -89 -41 41 284 54 125 184
5125 184 70 157 -104 114 28 -27 -50 94 235 171 40 118 25 -271 14 196 -25 -161 32 3 187 150 -113
5148 -113 -101 120 -37 -351 -32 182 -75 -100 -175 -88 -14 -180 144 153 -14 176 -46 -136 38 -154 -26 110 472
5171 472 86 25 87 -73 92 -108 312 219 -182 286 -100 223 -3 -370 -31 154 -33 -157 67 84 -52
5192 -52 -150 67 43 218 2 0 193 102 41 3 9 -6 -90 -42 99 76 309 -113 -81 -133 260 242 -173 -239 58 224
5218 224 -30 270 -31 86 197 144 15 267 -77 -308 -247 46 -135 -243 -155 -193 80 -11 -225 20 -155 -45
5240 -45 217 0 135 -35 -187 42 -262 -139 -148 247 -16 -8 -15 -71 229 -16 -1 334 137 116 247 206 77 -24
5264 -24 -97 85 121 310 228 221 -84 30 51 46 86 74 97 77 16 60 76 -201 37 16 -206 -110 0 -41 -30 137 87
5291 87 -170 31 -51 -15 116 -89 -314 123 77 18 90 229 -52 -68 -235 -107 5 193 -16 -107 -49 -150 43
5314 43 124 -1 57 -63 -13 -66 18 -14 -1 -52 14 -37 -238 -23 -10 -57 -102 4 -21 -58 199 139 35 -96 11 118
5340 118 174 127 65 248 38 -18 102 28 167 168 145 55 -116 89 177 78 -34 40 -168 150 129 67 149 -127 107
5365 107 130 -52 -25 107 -114 -22 -112 -90 -165 -145 109 -33 -12 217 -143 -27 102 15 114 28 -46 -120 -275 -77
5389 -77 -248 -36 -24 -78 -82 47 72 46 -53 -164 261 -83 93 -174 91 -152 43 144 65 -166 146 87 -157
5412 -157 261 72 -123 80 111 -253 -205 -33 105 -101 -18 94 -139 89 -72 -104 -55 178 83 26 158 151 -54
5435 -54 120 126 -12 188 27 -76 20 80 -82 -141 -92 -99 -13 -199 -2 -99 -149 87 303 89 64 -88 20 92 167
5460 167 65 273 160 -134 212 -307 -275 -81 -131 125 -29 -414 136 -66 100 130 206 -154 254 -157 -71 122
5482 122 -112 -6 118 180 30 123 216 -205 66 83 43 -27 133 164 362 151 -23 69 -188 42 -76 139 -15
5505 -15 -112 -178 -145 -53 175 163 166 2 92 47 -267 -70 84 -141 -26 -39 -190 262 -9 -22 74 48 93 -46 -100
5530 -100 166 -148 146 34 78 -18 13 -161 -177 203 145 -37 -37 9 -171 -15 -134 117 233 266 39 81 -130
5553 -130 -112 -154 -111 -74 -60 225 35 -161 -101 47 -47 80 58 -59 61 166 -56 41 75 -41 158 -39 99
5576 99 -46 50 -37 191 81 19 -179 101 21 87 -116 99 -56 -31 65 65 -80 -307 -205 -46 -161 -114 88 7
5600 7 140 215 -37 -35 -77 18 -220 26 2 169 254 15 130 -339 38 415 -114 89 90 -141 -134 -115 -8 310 150
5625 150 -65 -71 -141 20 21 -398 -216 41 3 -139 -389 63 -93 -108 52 -220 -70 -94 122 6 22 -202 -132
5648 -132 82 -35 124 -207 180 10 36 -2 85 127 -159 390 81 246 73 -154 135 218 -51 375 -147 -153
5670 -153 -45 -259 -101 -295 63 -149 -140 -18 -168 -64 -285 87 137 -11 -88 -208 -20 86 -78 -97 210 9
5692 9 -11 -51 -2 -391 -158 -71 -178 126 -184 -182 13 306 16 64 121 -15 67 98 171 -124 79 -50 -58 27 108 130
5718 130 -103 129 47 -87 -40 71 -73 22 18 57 -16 -178 -6 -33 -68 56 118 48 -11 -82 -148 256 18 144 -56
5743 -56 -16 87 -37 73 -58 -113 -14 226 -103 -218 -178 -12 39 100 -162 -90 -35 -43 19 11 246 -131 -26 128 72
5768 72 25 71 157 -8 40 -16 138 137 80 -7 58 4 178 12 -241 -113 251 50 -145 -7 84 -199 138 -4
5792 -4 1 97 149 24 -19 74 178 24 -356 23 -252 130 -81 -92 -66 65 -155 -72 24 56 -164 147 -86 245
5816 245 168 -33 89 -45 -93 62 -118 -16 -14 322 -5 -3 -123 34 78 -250 51 139 9 -145 13 -69 -56
5839 -56 282 63 -174 -74 206 198 113 71 -235 -139 -240 -154 -168 210 59 146 -13 -13 -23 -35 -2 -70 119 170 109 -171
5865 -171 126 19 133 -8 -74 -143 88 -203 183 85 -113 -94 12 7 -115 56 229 -117 25 -169 230 7
5887 7 -25 -109 34 20 -40 -49 28 167 -5 -117 -41 -86 -27 -198 -162 -255 -196 -228 -245 71 231 86 41 -200 243 -264
5913 -264 -42 118 -72 143 6 -73 104 24 8 -114 -191 96 19 11 -51 75 229 68 -54 47 71 175 7
5936 7 -33 -197 98 207 -12 252 36 121 -9 26 -109 160 84 143 151 -26 -206 -48 -28 122 93 111 27 61 -196
5961 -196 42 -18 -149 72 128 271 177 74 -138 -15 -7 -11 -67 49 64 -188 -25 -42 -9 2 -43 -92 -6 -40 -3 14
5987 14 -64 -216 107 48 213 111 -248 41 -16 234 -45 18 108 51 -23 213 -66 -13 108 -124 -34 155 -183
6010 -183 -105 97 -187 71 0 7 168 202 260 93 4 188 143 79 -4 -140 226 26 -25 -26 52 103 44 -19 -49 71
6036 71 -108 43 19 -54 -26 47 173 -35 -91 175 6 92 7 270 -43 -9 -86 70 -1 72 -101 78 15 42 -90
6061 -90 36 198 -71 18 30 -167 -42 157 88 40 -104 -6 19 -279 142 -150 127 -40 -192 108 157 2 -33
6084 -33 -162 -315 -15 -104 127 67 -54 -13 69 50 -33 275 73 18 -54 -119 -482 -173 -32 116 -42 44 -38 -180
6108 -180 261 87 -23 98 317 96 361 98 -43 116 -150 -175 237 83 86 -71 -132 -75 61 -10 -27 182
6130 182 -209 -122 -89 -41 -100 79 -69 -154 31 59 -82 47 9 45 42 -144 -329 -15 -121 -191 282 311 185 -11
6154 -11 -82 9 -136 184 -96 -72 -84 -236 -176 -5 20 -160 188 73 -104 131 -69 -102 32 -98 79 -71 53
6177 53 -177 154 22 178 85 -102 -14 22 -63 76 149 -188 -128 -34 -26 85 -141 60 226 22 11 19 43 -86 -77
6202 -77 -4 -76 -76 63 169 34 72 -117 -105 326 -19 -161 171 1 -133 -101 -93 95 -92 -274 195 -84 -8 -31
6226 -31 81 -21 35 -18 5 0 -235 14 -87 139 -51 182 0 11 110 19 48 -9 87 189 -235 24 -188 9
6250 9 158 28 -236 -156 -80 -61 95 -43 108 -120 325 72 247 82 -108 -89 -95 -189 -268 -66 165 61 182
6273 182 -172 -91 -118 30 -18 89 89 13 -184 28 86 248 -67 -137 -92 -94 -37 33 119 141 -76 368 70 -11 138
6298 138 -195 -70 -61 -134 -131 -137 -95 89 43 148 150 75 140 11 33 44 6 100 260 127 -258 -219 67 26 -15 223 139
6325 139 184 162 -72 71 -84 -121 52 207 86 31 -97 33 -67 73 6 -364 -41 -3 -108 183 137 -223
6347 -223 86 -49 -25 43 85 -22 120 76 -158 -142 -134 119 -6 156 3 -86 43 -142 120 25 96 -71 72
6370 72 -2 54 -42 -40 -45 120 26 -112 -36 -67 106 -58 -17 -59 6 77 94 -207 52 82 10 -49 -112 -108 27 -121 76
6397 76 -299 225 -92 126 -124 19 -116 -148 61 -59 -207 183 9 -119 -157 3 -131 16 -44 160 72 -228
6419 -228 153 -276 13 12 -31 143 163 -56 -44 49 101 21 202 -248 -195 159 71 39 -83 -138 -70 -17 72 -53 -62 59
6445 59 -47 -74 -67 92 75 -484 -20 64 22 -29 89 -84 -141 20 29 -89 -314 -26 172 113 142 -122 23 189
6469 189 230 -140 95 246 -45 -29 -99 67 -128 -24 88 -72 -128 -62 -22 -211 -56 -12 54 32 127 -47 -160
6492 -160 201 -322 172 123 -119 -30 -53 37 -12 -135 -185 173 52 -44 178 118 -121 27 -124 61 107 -420 -201
6515 -201 -23 59 15 274 -119 -357 142 -5 -90 -39 2 172 -155 62 -219 -39 -38 66 158 -81 -80 -60 187 135
6539 135 -19 -67 -4 -121 133 -106 105 50 -174 -53 81 -282 110 109 -51 207 -52 -120 -47 -10 -59 26 -211
6562 -211 211 237 -163 83 30 61 -21 -118 -173 -72 -116 -58 73 -31 -16 114 -227 125 28 -123 -83 -76 -208 -40
6586 -40 -158 16 82 14 -17 -161 -95 69 6 154 -53 -41 -59 -195 123 157 -202 14 125 -228 -56 -223 221
6609 221 -46 100 15 -244 164 298 -217 -178 209 -69 -198 11 -56 -127 -124 -105 -125 27 139 -167 -58 7 -17
6632 -17 -279 -10 -20 97 182 -73 -251 -228 -224 -11 23 -87 68 -150 20 -37 123 136 -205 35 -395 -100 190
6655 190 120 -8 139 -51 14 81 61 23 -63 -87 -108 72 203 52 -171 -27 187 -113 5 186 52 2 -23
6678 -23 -309 80 -219 45 62 -68 -45 202 -139 -59 -20 -315 144 -30 -68 -63 105 23 77 -15 243 -269 -147 31
6702 31 -229 -111 -108 61 -29 -149 -52 76 -145 34 13 -54 -175 -63 254 -7 -104 72 -109 -47 -86 -191 -119 -123
6726 -123 118 105 46 -9 -211 -126 198 -188 -102 64 -60 -118 -231 54 89 -252 93 120 -153 160 48 -73 -176
6749 -176 -110 97 -28 -46 -54 -126 120 80 -76 -4 -23 124 -110 22 239 -22 -96 -232 -41 -65 -180 146 1
6772 1 12 -221 -109 267 49 186 -47 -80 75 -147 -33 -85 -228 -4 -15 49 67 76 85 -52 -171 -16 -173 -66
6796 -66 -37 -26 -38 38 132 -32 171 313 -31 162 36 -60 -145 26 130 10 -128 -21 -77 -35 98 -63 34 -167
6820 -167 -139 52 -145 -147 115 -92 77 -80 257 -40 -130 -119 -9 167 -170 -136 96 -4 17 -31 -21 85 -315
6843 -315 61 -49 -123 -47 167 -70 144 -33 -245 -42 -264 -231 -12 -110 53 39 -97 -75 -24 110 32 155 -13
6866 -13 69 42 -177 47 -85 196 163 -116 57 -68 93 113 -45 -11 -128 108 70 -16 -33 -187 -15 -53 -51 58
6890 58 242 94 43 -338 11 -40 125 73 -139 259 -193 -81 191 -141 35 -12 205 23 -30 27 -27 -165 -24
6913 -24 104 32 133 44 -190 -64 71 -110 79 14 170 -159 -24 7 12 184 12 17 -126 310 -41 31 66 250
6937 250 10 31 55 2 -20 -21 -1 126 25 -152 -27 138 140 182 42 -158 -176 57 -82 189 -17 -183 -4 98
6961 98 83 -82 46 -294 -154 262 -124 68 -63 50 -9 223 -93 -240 52 -55 -229 154 -42 -69 50
6982 50 -136 105 22 20 -6 169 192 48 -84 25 93 -113 43 -64 -93 -10 -74 -31 -89 -91 -111 -180 -28 219 81
7007 81 17 -12 -311 61 -84 18 102 185 -140 -139 35 -170 -66 -180 17 -32 7 2 -37 -313 -308 289 -140 -19 237
7032 237 -251 98 180 -56 -11 85 48 -97 -60 227 -51 251 -33 -221 -24 -54 182 9 68 32 77 -252 82
7055 82 -26 119 -130 -54 -17 10 34 -46 -160 30 111 -181 -255 -46 132 -106 -53 157 138 -22 51 -5 149 1
7079 1 -20 -116 80 -61 126 -114 -26 79 37 62 293 -3 -101 -23 303 -38 164 -85 -39 84 54 228 15 296
7103 296 189 -96 -71 55 -117 -64 -75 70 50 128 -40 -81 -36 -147 42 -66 -88 118 -51 287 41 -206 65
7126 65 -155 -120 -37 -174 -105 -29 24 -14 85 -89 154 -396 68 11 44 -46 19 29 -9 -17 -258 -17 16 -21 -141 151
7152 151 -141 -16 240 281 -53 -41 -114 69 -129 81 -215 36 -81 203 29 -72 -62 2 -3 -72 158 16 -81
7175 -81 56 -178 16 20 124 220 -14 98 92 156 -90 299 40 -246 32 -92 140 -17 -62 -30 45 29 44 38 22
7200 22 16 334 -80 -239 213 81 134 52 186 -118 -101 -96 -53 147 -193 194 46 24 25 -46 -92 37 -148 -160 113
7225 113 -198 288 -71 -156 136 340 31 -58 -25 -145 110 198 -65 -70 39 148 -132 6 -27 52 -64 -101 231
7248 231 -26 119 -86 501 122 42 126 56 12 -37 -32 -16 -71 -37 -41 -60 7 -27 -36 142 101 -163 140 -141 -6 50
7274 50 73 -12 36 253 -124 -70 121 -55 4 251 158 28 320 182 -97 38 81 -85 -42 155 -146 -6 -96
7297 -96 25 136 -107 123 -185 -9 -109 -11 128 54 -59 -41 -1 37 33 -100 -78 -70 121 -11 -166 -189 -7 -4 126
7322 126 -148 -229 110 2 31 18 -224 22 131 -141 -160 -222 22 -28 -43 -40 -91 -64 173 -57 60 -367 209 45
7346 45 -342 97 179 159 144 -43 -255 -73 -138 -93 131 -97 -142 19 -258 -11 24 100 77 222 -15 -79 -148 110
7370 110 239 -27 -127 10 32 20 -46 14 -126 -37 -31 -27 4 83 139 228 2 245 41 182 385 65 152 68 -54
7395 -54 -26 -75 -190 223 -11 94 153 -92 140 102 -69 -50 213 -13 26 -146 14 9 -28 -273 64 156 232 131
7419 131 -112 119 142 -349 26 83 25 42 250 1 -260 33 -121 160 4 175 -8 -275 24 -27 136 -176
7441 -176 -26 -228 -18 -14 -17 13 108 -87 -132 -124 -153 17 195 75 88 97 -89 33 -85 179 -255 -43 -123 86 218
7466 218 -37 -108 41 59 -71 175 165 -166 7 -108 11 122 -119 -113 136 103 135 -38 83 -172 -97 79 53
7489 53 -338 169 26 85 68 179 -83 40 126 -51 -55 -189 -104 -163 192 96 -121 -251 49 -146 144 133 9
7512 9 23 112 171 23 -34 83 -200 153 -225 36 36 53 -103 11 -67 -136 86 7 12 28 28 182 -31 -46 23 -170
7538 -170 24 49 74 -174 -81 162 -11 51 -93 -70 40 112 -211 123 -182 77 22 -18 3 47 -180 -49 72
7561 72 120 -103 -195 265 -41 294 26 -139 -57 -49 -112 -107 -137 -35 87 -55 80 -38 -179 41 -31 -49 58 293
7585 293 62 -55 200 -32 2 -11 27 9 7 10 -96 -240 45 72 -66 -77 18 -85 121 270 25 20 -25 -93 -105
7610 -105 56 -232 -185 -119 -61 -42 -30 -112 85 144 -4 197 96 -76 232 -153 330 74 53 -135 142 -26 281
7633 281 -123 0 -43 -105 -127 48 98 -11 -29 134 -90 115 44 310 -82 134 171 -54 -140 -34 387 -245 -221
7656 -221 113 -81 87 -53 61 2 -55 -239 -106 -78 -172 178 146 37 193 -129 -208 59 -151 -164 204 -160
7678 -160 9 -9 108 30 -179 120 -299 -69 54 -43 -208 -114 169 173 221 41 154 169 151 45 -35 -204 -38
7701 -38 226 -140 39 218 -94 120 -206 -181 -3 -32 229 -39 -142 19 127 74 84 -216 108 106 278 -243
7723 -243 -118 -241 163 7 191 128 -11 -93 -259 -75 -91 106 264 -103 31 33 114 -163 134 80 270 -137
7745 -137 154 153 -48 176 -109 -297 -64 -84 60 79 -99 6 120 -114 68 272 25 61 -34 138 99 -28
7767 -28 28 -298 102 -77 -157 122 -42 -228 -348 -91 -202 -44 79 8 -171 103 -16 7 137 214 133 124 51
7790 51 19 -379 -31 154 194 227 52 -78 43 97 29 154 253 23 -122 -19 38 124 -12 9 -119 -164 104 -131
7814 -131 35 9 -88 -36 50 -11 -65 75 51 -11 29 119 111 81 -67 194 60 -18 8 57 140 -129 219 -75 88 -104
7840 -104 148 48 -132 -96 133 227 -70 19 132 37 122 -5 -18 -278 98 120 -86 126 65 176 -175 -126 203
7863 203 62 -258 15 113 13 35 94 75 15 64 79 203 -15 42 -58 99 260 212 193 69 -354 -19 -47 -150
7887 -150 -123 -235 23 -17 46 -97 -213 -120 -35 48 -30 -153 -48 157 -169 -31 -91 283 -208 -62 -80 -158 -95 -6
7911 -6 123 -82 163 45 132 196 -235 22 325 284 106 176 106 -89 -39 -40 6 234 211 -25 55 -15 27 0 -33 -66
7937 -66 -30 44 -126 -139 83 91 139 -14 -120 64 26 218 -37 -87 19 -65 73 14 126 29 39 208 95 191 58
7962 58 -214 10 -41 8 -19 209 168 142 198 250 -100 -123 302 -36 -37 -68 -27 -31 30 146 -64 14 129 110 49 38 279
7989 279 -11 5 48 56 112 -20 -206 57 -96 65 -103 51 -94 -259 137 115 -68 176 -82 -30 -65 85 -27
8012 -27 104 74 112 183 -98 -423 12 -135 -73 147 33 122 153 239 -122 15 182 18 -169 93 -14 -167 -71
8035 -71 46 202 108 236 111 -73 130 -13 112 -187 -156 -80 14 166 57 -222 35 51 68 -169 92 -272
8057 -272 16 37 103 270 123 204 -224 -93 119 -104 -204 -18 64 -143 -62 8 58 182 208 267 121 47 80 82
8081 82 -110 -63 194 -117 -105 -104 -91 37 147 73 175 -87 -95 -21 -68 -102 36 80 122 -14 -13 28 53 181 243 -138
8107 -138 -191 -41 -78 -13 -296 192 -14 -69 -26 -86 -23 -140 37 22 89 108 -57 -26 -251 249 17 212 51 -42
8131 -42 -84 79 -152 66 -20 -90 152 -196 38 -17 148 -79 10 132 81 107 112 16 -109 135 71 63 -138 46 276
8156 276 -110 -54 -296 -129 87 4 79 123 -131 -91 -56 27 116 17 -206 -175 14 -224 -25 58 35 209 -343 57
8180 57 106 -163 -53 132 179 117 -56 -128 -17 -11 92
8191I2
##END NTUPLES=NMR FID
##END=
