##TITLE=1H_LR-733-CR5
 CDCl3,8 sc, 
 4.03.2021
##JCAMPDX= 6.0         $$ Bruker NMR JCAMP-DX V2.0
##DATA TYPE= NMR FID
##DATA CLASS= NTUPLES
##ORIGIN= UXNMR, Bruker Analytische Messtechnik GmbH
##OWNER= root
$$ XWIN-NMR		Version 3.5
$$ Thu Mar  4 09:51:52 2021 Russian Standard Time (UT+4h)  she@DPX200
##.OBSERVE FREQUENCY= 200.1315066352
##.OBSERVE NUCLEUS= ^1H
##.DELAY= (6, 6)
##.ACQUISITION MODE= SIMULTANEOUS
##.ACQUISITION SCHEME= undefined
##.AVERAGES= 8
##.DIGITISER RES= 18
##SPECTROMETER/DATA SYSTEM= spect
##.PULSE SEQUENCE= zg30
##.SOLVENT NAME= CDCl3
##.SHIFT REFERENCE= (INTERNAL, CDCl3, 0, 15.7039)
##AUDIT TRAIL= $$ (NUMBER, WHEN, WHO, WHERE, WHAT)
$$ ##TITLE= Audit trail, XWIN-NMR		Version 3.5
$$ ##JCAMPDX= 5.01
$$ ##ORIGIN= Bruker BioSpin GmbH
$$ ##OWNER= she
$$ F:/spectra/data/she/nmr/H-F/1/audita.txt
$$ ##AUDIT TRAIL=  $$ (NUMBER, WHEN, WHO, WHERE, WHAT)
(   1,<2021-03-04 09:50:49.87 +0400>,<she>,<DPX200>,
      <created by zg, POWCHK disabled, PULCHK disabled
       configuration hash MD5:
       00 E9 B6 7A A2 85 ED C7 34 08 36 98 17 FE 4E 26
       data hash MD5: 16K
       C5 C4 BB EF 7F 41 61 07 6C DB 8F 3D F1 5B 48 6F>)
$$ ##END=
$$ 
$$ hash MD5
$$ C7 5C 86 48 76 E0 EE 6F 72 14 AB 01 54 70 67 0E
##$RELAX= 
##$RELAX= 
##$RELAX= 
##$RELAX= 
##$RELAX= 
##$RELAX= 
$$ Bruker specific parameters
$$ --------------------------
##$DU= <F:/spectra>
##$EXPNO= 1
##$NAME= <H-F>
##$PROCNO= 1
##$TYPE= <nmr>
##$USER= <she>
##$AMP= (0..31)
100 100 100 100 100 100 100 100 100 100 100 100 100 100 100 100 100 100 
100 100 100 100 100 100 100 100 100 100 100 100 100 100 
##$AQSEQ= 0
##$AQ_mod= 1
##$AUNM= <au_zg>
##$AUTOPOS= <>
##$BF1= 200.13
##$BF2= 200.13
##$BF3= 200.13
##$BF4= 200.13
##$BF5= 200.13
##$BF6= 200.13
##$BF7= 200.13
##$BF8= 200.13
##$BYTORDA= 1
##$CFDGTYP= 0
##$CFRGTYP= 5
##$CHEMSTR= <none>
##$CNST= (0..31)
1 1 145 1 1 1 1 1 1 1 1 1 1 1 1 1 1 1 1 1 1 1 1 1 1 1 1 1 1 1 1 1 
##$CPDPRG= <>
##$CPDPRG1= <>
##$CPDPRG2= <>
##$CPDPRG3= <>
##$CPDPRG4= <mlev>
##$CPDPRG5= <mlev>
##$CPDPRG6= <mlev>
##$CPDPRG7= <mlev>
##$CPDPRG8= <mlev>
##$CPDPRGB= <>
##$CPDPRGT= <>
##$D= (0..31)
0 1.2 0 0 0 0 0 0 0 0.06 0 0.03 0 0 0 0 0.0002 0 0 0 0 0 0 0 0 0 0 0 0 
0 0 0 
##$DATE= 1614837049
##$DBL= (0..7)
120 120 120 120 120 120 120 120 
##$DBP= (0..7)
150 150 150 150 150 150 150 150 
##$DBP07= 0
##$DBPNAM0= <>
##$DBPNAM1= <>
##$DBPNAM2= <>
##$DBPNAM3= <>
##$DBPNAM4= <>
##$DBPNAM5= <>
##$DBPNAM6= <>
##$DBPNAM7= <>
##$DBPOAL= (0..7)
0.5 0.5 0.5 0.5 0.5 0.5 0.5 0.5 
##$DBPOFFS= (0..7)
0 0 0 0 0 0 0 0 
##$DE= 6
##$DECBNUC= <off>
##$DECIM= 32
##$DECNUC= <off>
##$DECSTAT= 4
##$DIGMOD= 1
##$DIGTYP= 9
##$DL= (0..7)
0 120 120 120 120 120 120 120 
##$DP= (0..7)
150 150 150 150 150 150 150 150 
##$DP07= 0
##$DPNAME0= <>
##$DPNAME1= <>
##$DPNAME2= <>
##$DPNAME3= <>
##$DPNAME4= <>
##$DPNAME5= <>
##$DPNAME6= <>
##$DPNAME7= <>
##$DPOAL= (0..7)
0.5 0.5 0.5 0.5 0.5 0.5 0.5 0.5 
##$DPOFFS= (0..7)
0 0 0 0 0 0 0 0 
##$DQDMODE= 0
##$DR= 18
##$DS= 0
##$DSLIST= <SSSSSSSSSSSSSSS>
$$ [...]
##$SUBNAM2= <"">
##$SUBNAM3= <"">
##$SUBNAM4= <"">
##$SUBNAM5= <"">
##$SUBNAM6= <"">
##$SUBNAM7= <"">
##$SUBNAM8= <"">
##$SUBNAM9= <"">
##$SW= 16.9725356469052
##$SWIBOX= (0..15)
0 0 2 0 0 0 0 0 0 0 0 0 0 0 0 0 
##$SW_h= 3396.73913043478
##$TD= 16384
##$TD0= 1
##$TE= 0
##$TE2= 300
##$TE3= 300
##$TEG= 300
##$TL= (0..7)
0 120 120 120 120 120 120 120 
##$TP= (0..7)
150 150 150 150 150 150 150 150 
##$TP07= 0
##$TPNAME0= <>
##$TPNAME1= <>
##$TPNAME2= <>
##$TPNAME3= <>
##$TPNAME4= <>
##$TPNAME5= <>
##$TPNAME6= <>
##$TPNAME7= <>
##$TPOAL= (0..7)
0.5 0.5 0.5 0.5 0.5 0.5 0.5 0.5 
##$TPOFFS= (0..7)
0 0 0 0 0 0 0 0 
##$TUNHIN= 0
##$TUNHOUT= 0
##$TUNXOUT= 0
##$USERA1= <user>
##$USERA2= <user>
##$USERA3= <user>
##$USERA4= <user>
##$USERA5= <user>
##$V9= 5
##$VALIST= <valist>
##$VCLIST= <CCCCCCCCCCCCCCC>
##$VD= 0
##$VDLIST= <DDDDDDDDDDDDDDD>
##$VPLIST= <PPPPPPPPPPPPPPP>
##$VTLIST= <TTTTTTTTTTTTTTT>
##$WBST= 1024
##$WBSW= 4
##$XGAIN= (0..3)
0 0 0 0 
##$XL= 0
##$YL= 0
##$YMAX_a= 704813
##$YMIN_a= -632405
##$ZGOPTNS= <>
##$ZL1= 120
##$ZL2= 120
##$ZL3= 120
##$ZL4= 120
##$ABSF1= 10
##$ABSF2= 0
##$ABSG= 5
##$ABSL= 3
##$ALPHA= 0
##$AQORDER= 0
##$ASSFAC= 0
##$ASSFACI= 0
##$ASSFACX= 0
##$ASSWID= 0
##$AUNMP= <proc_1d>
##$AZFE= 0.1
##$AZFW= 0.1
##$BCFW= 1
##$BC_mod= 2
##$BYTORDP= 1
##$COROFFS= 0
##$CY= 11.3945322036743
##$DATMOD= 1
##$DC= 2
##$DFILT= <>
##$DTYPP= 0
##$F1P= 15.9154993809931
##$F2P= -4.1035820241983
##$FCOR= 0.5
##$FTSIZE= 0
##$FT_mod= 4
##$GAMMA= 1
##$GB= 0.15
##$INTBC= 1
##$INTSCL= 1
##$ISEN= 128
##$LB= 0.24
##$LEV0= 0
##$LPBIN= 0
##$MAXI= 10000
##$MC2= 0
##$MEAN= 0
##$ME_mod= 0
##$MI= 1.114404
##$NCOEF= 0
##$NC_proc= 0
##$NLEV= 6
##$NOISF1= 3.799351
##$NOISF2= 2.8
##$NSP= 1
##$NTH_PI= 0
##$NZP= 0
##$OFFSET= 15.70392
##$PC= 1
##$PHC0= -10758.08
##$PHC1= 10.80094
##$PH_mod= 1
##$PKNL= yes
##$PPARMOD= 0
##$PSCAL= 0
##$PSIGN= 0
##$REVERSE= no
##$SF= 200.130013532006
##$SI= 16384
##$SIGF1= 3
##$SIGF2= 2
##$SINO= 400
##$SIOLD= 16384
##$SREGLST= <1H.CDCl3>
##$SSB= 0
##$STSI= 0
##$STSR= 0
##$SW_p= 3612.71676300578
##$SYMM= 0
##$S_DEV= 0
##$TDeff= 0
##$TDoff= 0
##$TI= <>
##$TILT= no
##$TM1= 0
##$TM2= 0
##$TOPLEV= 0
##$USERP1= <user>
##$USERP2= <user>
##$USERP3= <user>
##$USERP4= <user>
##$USERP5= <user>
##$WDW= 1
##$XDIM= 8192
##$YMAX_p= 0
##$YMIN_p= 0
$$ End of Bruker specific parameters
$$ ---------------------------------
##NTUPLES= NMR FID
##VAR_NAME=  TIME,          FID/REAL,        FID/IMAG
##SYMBOL=    X,             R,               I
##VAR_TYPE=  INDEPENDENT,   DEPENDENT,       DEPENDENT
##VAR_FORM=  AFFN,          ASDF,            ASDF
##VAR_DIM=   8192,          8192,            8192
##UNITS=     SECONDS,       ARBITRARY UNITS, ARBITRARY UNITS
##FACTOR=    0.0002944,     1,               1
##FIRST=     0,             0,               0
##LAST=      2.4114304,     0,               0
##MIN=       0,             -632405,         0
##MAX=       2.4114304,     704813,          0
$$ Real data points
##PAGE= N=1
##DATA TABLE= (X++(R..R)), XYDATA
$$ [...]
2122e85j391K598j592k08J913k182Q54P37k374K011J96j834K747r40p35K149j946
2139e82M48R08j984J449J21j302J703p55j50Q09j336M57R54j363J755n3j215J495
2157A359o81q76J232j577M90P96j074N91L37j256Q70P5q60M97k24P7O74o62Q72
2176F60J6j164P78m63n78P42n79M67N48r81N35K00q61M44L63l91O80l73M44L49
2196H36p87J58k4n54L70O5k73M79m6R7M0o13L05J47n48N79J84m73M79k76n4P9
2218A70o94J24P5lP6L49m65J32j25J3N7K31q5K74J36J22k98Kj20l01L26j32L1
2241a05J03M07k45j66K37l03J26N28k55K92r5J11k43nj5k70PR8l76R2N38n00K74
2264B35J12n14P9J14r4k1K38k89J19m39Q0O2m86L76k25p6P73n46j19R19q37P3
$$ plain form
2122 -585 -1976 622 -970 -1178 735 -1447 -593 144 -2230 -219 -23 -1857 890 -50 -785 1364 -582
2139 -582 -134 774 -1210 239 360 -942 761 6 -144 665 -671 -214 740 -623 1132 1079 -136 1359
2157 1359 678 -198 1034 -543 -53 743 -331 260 597 -659 211 286 -574 -77 -301 -224 450 -212 660
2176 660 676 -488 290 -173 -751 -9 -588 -121 427 -554 -19 181 -680 -236 127 -264 416 43 487 836
2196 836 49 207 183 -371 -1 64 -209 270 224 321 361 -252 53 200 -348 231 415 -58 421 145 91 170
2218 170 -524 -400 -325 -328 -252 97 -368 -236 -361 -348 -291 -60 -145 129 265 387 89 91 -29 -330 -4 -136 -105
2241 -105 -2 405 160 -6 231 -72 54 582 327 619 524 635 392 387 372 102 109 207 -169 -77 461 -39 235
2264 235 347 -167 -88 26 -68 -89 149 -140 -21 -460 -380 -318 -804 -428 -653 -729 44 -502 -621 298 -539 -466
2286d66N19o71N20J36m13P34l28n36K88k07J34L56k14M55j62k07Q11q43m4J138
2306A000r92J14J015j233M98P48j011Q05n01n99Q94n43K20M08r03Q51N0j043R46
2325G24o09n56J704j181l94J005j328O77N22j631R12j5n58J336j062j16R95j280
2343h55Q17k15j340J855l31j037J580j616m4K154k246M67R27j610J717k34j055
2360a066J453r90J90J579k266Q91P93j701K289q75j821K813j357m75K014k631
2376a160J334J285k290J820r6j875K889j517q18K131k313J131J234k785K065l93
2392F42j924L302j943q46K724k558J017J289k833K077o9k270L086j844j008K946
2408A788l182J235J214l023K354Kk244L353k025j057L151k823Q58J357l336K367
$$ plain form
2286 -466 53 -618 -98 38 -375 359 31 -505 -217 -424 -290 66 -148 307 145 -62 749 -94 -138 1000
2306 1000 8 122 1137 -96 402 1150 139 944 443 -156 738 195 415 823 -80 771 821 -222 724
2325 724 115 -441 1263 82 -312 693 -635 42 564 -1067 -155 -170 -728 608 -454 -570 425 -855
2343 -855 -38 -253 -1593 262 -69 -1106 474 -1142 -1186 968 -1278 -811 116 -1494 223 -11 -1066
2360 -1066 387 -603 -413 1166 -1100 -209 584 -1117 1172 297 -1524 1289 -68 -543 1471 -1160
2376 -1160 174 1459 -831 989 893 -982 1907 390 -428 1703 -610 521 1755 -1030 1035 642
2392 642 -1282 2020 77 -769 1955 -603 414 1703 -1130 947 878 -1392 1694 -150 -1158 1788
2408 1788 -1394 -159 1055 -1968 386 388 -1856 1497 -528 -1585 1566 -1257 -399 958 -2378 -11
2424a1L88k432L152j838j283L659l065N30J792l162K885M85l003K860j381o64
2440a088L533l558O2K480k740K473P1l009L068j130p96K813l283L52L031k916
2456f37J437L19l147L987p67k026K501k681P38L077l802J441O04k145L176j731
2472C44j825L019j937M75K160m070J731J560k891K655j439j874L713k023q30K519
2488A287l153J841J161l341K638p62j276L179k688l76K477k699J856J121l691
2503b426K940j17j972K721k079o44L031k569J247P76k795L008k85k330K799j559
2519b54o87K833k682Q82J262k690K611k39k481L064j349q21K673k737M23K101
2535A909l073K194l7k251K770j455o47K061k220P82J272k872K399L2k451K768
$$ plain form
2424 -11 377 -2055 1097 -741 -2024 1635 -1430 -900 892 -2270 615 1100 -1903 957 -424 -1088
2440 -1088 2445 -1113 -1051 1429 -1311 1162 1233 -1776 1292 162 -634 2179 -1104 -752 2279 -637
2456 -637 800 1119 -2028 1959 1192 -834 1667 -1014 -276 2801 -1001 440 1044 -1101 2075 344
2472 344 -1481 1538 -399 76 2236 -1834 -103 1457 -1434 1221 -218 -2092 1621 -402 -1232 1287
2488 1287 -1866 -25 1136 -2205 433 -329 -1605 1574 -1114 -1490 987 -1712 144 1265 -2426
2503 -2426 514 397 -1575 1146 -933 -1577 1454 -1115 132 908 -1887 1121 836 -1494 1305 -254
2519 -254 -941 1892 -790 92 1354 -1336 1275 1036 -1445 1619 270 -551 2122 -615 -192 1909
2535 1909 -1164 1030 993 -1258 1512 57 -590 1471 -749 33 1305 -1567 832 864 -1587 1181
2551A181j308r78K364k342N42J632k518J432N60k050K076q87j011K302k245O25
2567f25J449k389J823M00j833J849q69r39K058j623Q0J585k077J477J63j446J699
2584G82p57p74J712j462L52J199j582R75O57j623J629p19j016J731j478M07R77
2601A010j373Q64O9j199J211l02o79J084r01M3J016j215N43M03j354J044j48n76
2619d60J136j008j3J003j014J90J83o25P87l39l86J149q34k18Q01r35O02K27p57
2638e11N84j23l69Q88o01j27N86q75L81N75o98M76j77m55O29m94P9K98o62K38
2658c58N50k79RQ8m17M29j74j02N27l21k9K74m58L34o5k97N26k36j40M85k63j23
2680d0K68Pk07J68j12L26j68o1O9k23R2L79l57N5J4j31J69j01k15L13l31m3K51
$$ plain form
2551 1181 -127 -1105 1259 -1083 -541 1091 -1427 5 565 -1485 591 -296 -1307 995 -1250 -625
2567 -625 824 -1565 258 658 -1175 674 -195 -1134 924 -699 -619 966 -1111 366 529 -917 782
2584 782 25 -749 963 -499 -147 1052 -530 445 1102 -521 1108 389 -627 1104 -374 33 1010
2601 1010 -363 501 570 -629 582 280 -399 685 -216 -173 843 -372 171 574 -780 264 116 -460
2619 -460 676 -332 -345 658 -356 -166 17 -608 179 -160 -546 603 -231 -449 352 -583 19 246 -511
2638 -511 73 -50 -419 469 -132 -259 327 -548 -167 408 -290 186 9 -446 183 -311 -232 66 -596 -358
2658 -358 192 -87 -78 10 -407 22 -152 -254 273 -48 -77 197 -261 73 8 -289 237 1 -139 346 83 -40
2680 -40 228 235 28 196 84 410 242 181 250 27 119 498 141 196 210 79 248 147 -68 245 -86 -129 122
2703A22q6pJ9l12O9q0JK00q9m1mj07P9O6j95j00J75j26K97k00J22j47k2Q4l9j27
2729d48O53n86K60K3j89M56O8k05r9K1o6K20L12l14K20j04j82K69j78J63R4k13
2751A75J82N8j33J60k64J64J85k85J16J83m15L61l05j39J70k2Lk7l20K15m1k65
2773b44L56l06Q1K39m10j3L52n63J72L75o72M83km87N57l85l6M43m49K85K34o53
2795f43O05k84n63J326q85k2Q87r64O26M85j139O82J24n79P22n07q1R14o55K44
2815B93K06j057J139M2j242J292p83k20J673j425K64N74j038P05L55j260J260
2832G78m05o42J047j151J35Q30r42O53J26j270J581o98p07J287j451L33J345j516
2850f67M76M70j124J378o16q24J631j315q8J379j796J284L34j752J779o15j016
$$ plain form
2703 122 36 29 48 -264 -195 -275 -274 -74 -163 -204 -208 -315 -236 -170 -365 -465 -290 -416 -119 -319 -197 -344 -366 -282 -321 -448
2729 -448 205 -381 -121 -98 -287 169 237 32 -67 -46 -112 108 420 106 326 222 40 309 131 294 388 175
2751 175 357 415 282 442 178 342 527 242 358 541 126 487 182 43 213 191 194 167 -153 62 21 -244
2773 -244 112 -194 -113 126 -284 -297 55 -508 -336 39 -633 -150 -152 -639 -82 -467 -503 -60 -509 -224 10 -643
2795 -643 -38 -322 -885 441 -444 -466 421 -543 83 568 -571 111 235 -344 378 -129 -210 704 49 293
2815 293 499 -558 581 623 -619 673 -110 -330 1343 -82 182 756 -282 423 778 -482 778
2832 778 373 -269 778 -373 -238 592 -350 303 429 -841 740 42 -665 622 -829 -496 849 -667
2850 -667 -191 279 -845 533 -83 -907 724 -591 -679 700 -1096 188 522 -1230 549 -66 -1082
2867a082J999j416q5J588j900J000P36j933J549l87j162K000j345l9J580j977
2883h74R99N99k082K153m48j309K345j758k23J993k043N73Q75k040J994k93j333
2900h72K148j596l21J933k119R25O96k046K162m69j838K810j786m04K207k455
2916a025J104J034k367K100k59j643K431j726n08K106k154R81J140k523J968m28
2932B31j664K510j408r95K456k122O17J337k315J719K91k220K549j187q89K443
2948A353k459Q20J282k631J876L06k199K889j637p92K511k240O90J521k885J834
2964B39M86k108K582r90r69K414k359M27J652k304J294O96k492K596n68j676K654
2981A574j965P4J849k488J148Q50k209K157q48j091K110j547M0J505k321J402
$$ plain form
2867 -1082 917 -499 -584 1004 -896 104 840 -1093 456 69 -1093 907 -438 -477 1103 -874
2883 -874 125 724 -1358 795 347 -962 1383 -375 -598 1395 -648 -75 800 -1240 754 461 -872
2900 -872 1276 -320 -641 1292 -827 98 794 -1252 910 441 -1397 1413 -373 -777 1430 -1025
2916 -1025 79 1113 -1254 846 587 -1056 1375 -351 -859 1247 -907 74 1214 -1309 659 231
2932 231 -1433 1077 -331 -1326 1130 -992 -375 962 -1353 366 657 -1563 986 -201 -1090 1353
2948 1353 -1106 -286 996 -1635 241 547 -1652 1237 -400 -1192 1319 -921 -231 1290 -1595 239
2964 239 725 -1383 1199 209 -760 1654 -705 -278 1374 -930 364 1060 -1432 1164 596 -1080 1574
2981 1574 -391 -317 1532 -956 192 1042 -1167 990 142 -949 1161 -386 -346 1159 -1162 240
2997B40P66k118J950n65j868K710j601n33K010k228J026P73j931J583j68j354
3013a308J983j193O0J374j875P92Q93k103J749k56j117J966j508p47K155j545
3029f80L30J161k106J807K98j756J761r36m40J886j568JP79j230J698j73j887
3046a055J827o14k82J461j882M2J518j473J139p3j291J593l20n98Q47j234K53
3063a42J413j629O53J57j288J717o76r15J297j148L13J009j735J018L50j138J059
3080C15o97o33J327q14j17O79o78K88M63p87P40n96l36J158o30k24L99n65M61
3099b47N27j179Q28J76n16R78p18j96Q94n42P8J13m02O34J7o60Q02k50k76P97
3119H58p49K12K56o75P25k70m30O52l68q2L96l80J94K89m27M5J66n05L73m97j2
$$ plain form
2997 240 1006 -1112 838 273 -1595 1115 -486 -1019 991 -1237 -211 562 -1369 214 46 -1308
3013 -1308 675 -518 -458 916 -959 -167 726 -1377 372 116 -1001 965 -543 -1290 865 -680
3029 -680 -350 811 -1295 512 810 -946 815 -121 -561 1325 -243 -242 537 -693 1005 832 -1055
3046 -1055 772 158 -124 1337 -545 -503 1015 -458 681 608 -683 910 590 -8 839 -395 -142
3063 -142 1271 -358 295 452 -836 881 205 -710 587 -561 -248 761 -974 44 394 -744 315
3080 315 -382 -1015 312 -502 -619 60 -618 -330 133 -654 86 -510 -846 312 -318 -542 -143 -708 -247
3099 -247 280 -899 -71 105 -411 567 -151 -347 547 5 83 196 -206 428 445 -215 587 337 61 858
3119 858 109 321 577 -98 627 357 -73 579 211 129 525 145 339 628 201 246 412 -93 280 -217 -229
3140b29M01m56M00J23n28K09K36n09J79P8l82N48j52m24L00l10K56N5l82J80n4
3161d61P8J36j44J47M0n9K4J51l90L03j74j03M08k06qL32p0L7j3P6J84p1J48j81
3185A84J20k74L02j59J80K11r7j34J39k08k20J18J60j01k4J53k41K3K61k27k78
3206a12K51q0J85k9j47j9j55k3Q8p5j18K47j97J41Q7j21j05K13m13K98j01pL2
3229a60k94M02n8k62J92k19L1J6J77k8J32J65j62J91k52k8J34j00J67k02J13J17
3251G2o1n7J72j74O3M57l79K08R7l32M21j98j79L84m78K63O1n41O64k52j55L35
3273C91m84j80P32m80O7L31n87P29k39p14O22p0k64L43m16J00M77j135P72K69
3293B64q83Q05m46p2O03n46j2O51r51M16L39r76R27k05m71R83o74J07M50q60P92
$$ plain form
3140 -229 172 -284 116 239 -289 -80 156 -353 -174 -96 -478 70 -82 -506 -206 -516 -260 -205 -587 -407 -461
3161 -461 -383 -247 -391 -244 -204 -263 -239 -88 -478 -175 -349 -452 -44 -250 -258 74 4 41 28 104 288 217 365 184
3185 184 304 30 332 173 353 564 467 333 472 264 44 162 322 221 197 350 109 132 393 166 -112
3206 -112 139 59 244 215 68 49 -106 -129 -41 -116 -234 13 -184 -43 44 -77 -182 31 -382 -84 -185 -192 -160
3229 -160 -454 -52 -110 -372 -180 -399 -368 -352 -175 -203 -71 94 -68 123 -129 -157 -23 -123 44 -158 -45 72
3251 72 11 -46 126 -48 15 472 93 301 398 66 487 289 110 494 16 279 340 -201 463 211 56 391
3273 391 -93 -273 459 -21 46 377 -210 519 280 -434 188 118 -146 197 -219 -119 358 -777 -5 264
3293 264 -619 186 -260 -332 271 -275 -287 364 -587 -171 168 -808 119 -86 -557 426 -248 -141 309 -551 241
3314B41J88j120R52j40p02J293p47l59J043j281N59P46j154Q61k33m64Q66o41
3332i2l10J111j208J004L47j227Q20j15o79J264r80l20J057q38K41P03j331J252
3350F99k17r25J265p79l45J199j274M25P18j582R90O7r71J323p61m51J380j444
3368f83L95Q51j453J151J95j613J666n44m89J370j700K64J135j575J280k15j362
3385a327K009o75o57J587j607jJ620j608R21J66j226J526k93j382J402j041K86
3402c00J366j661N52O76j213J647p17j317K103j294J41J212k101J108Q04j623
3418f17J272l97j111J773j125j50J345j623R84O62j984J435l86n96J579j493n5
3435d87J446j687P97N51k165J628J0j176J645r56m40J572j582N93P52j660J397
$$ plain form
3314 241 429 -691 261 121 -581 712 -35 -394 649 -632 -73 673 -481 380 147 -317 549 -92
3332 -92 -402 709 -499 505 852 -375 445 330 -349 915 -65 -385 672 -166 75 778 -553 699
3350 699 482 -443 822 43 -302 897 -377 48 766 -816 174 241 -730 593 -168 -619 761 -683
3368 -683 -288 563 -890 261 456 -1157 509 -35 -524 846 -854 -590 545 -1030 250 35 -1327
3385 -1327 682 7 -650 937 -670 -671 949 -659 262 428 -798 728 435 -947 455 -586 -300
3402 -300 1066 -595 -43 633 -580 1067 350 -967 1136 -158 -17 1195 -906 202 1006 -617
3418 -617 655 258 -853 920 -205 -355 990 -633 351 1013 -971 464 78 -518 1061 -432 -487
3435 -487 959 -728 69 620 -1545 83 93 -1083 562 -394 -834 738 -844 -251 501 -1159 238
3452B38j87r31J451j097O2J211j666N27R98j585J414k9j359J743o35j069J745
3469H31j336J76J063j417Q56L13j019J142p95l26J705j549M32P39j494J262R6
3486F79j092J144n80n42J310j052j63J074j122P13Mr09J182n52m73J180j102J26
3504a75Q52j359O90L35j204J367n14q48J197q22Q7Q45j233M94O98r57R88k98o68
3523e25J017n88k38P26j298R24N37j317R12j7q23J099p60q1P00o35N66K25p75
3542c51N39q8n55P32p11p4J239r76K98M62r38Q42j00o23P57l73N8P15q01J14J58
3563C24p21Q14L6q11P16n02J37M53o02J18K48m39M82k4n44M88k59j31M87o12K09
3584a33K95p09M04p9J6L62k74k33M04l50J25R0j85N13k69j70K35j08l72K59j44
$$ plain form
3452 238 51 -880 571 -526 -464 747 -919 -392 606 -979 435 406 -953 790 155 -914 831
3469 831 -505 -329 734 -683 173 486 -533 609 -186 -512 1193 -356 76 815 -679 583 679
3486 679 -413 731 151 -391 919 -133 -296 778 -344 369 373 -536 646 94 -379 801 -301 -175
3504 -175 677 -682 8 343 -861 506 -8 -856 341 -481 -394 451 -782 -288 410 -547 441 143 -525
3523 -525 492 -96 -334 392 -906 18 555 -762 150 133 -690 409 -351 -432 268 -367 199 424 -351
3542 -351 188 100 -455 277 -434 -508 731 -245 53 515 -423 419 319 -304 453 80 138 853 52 166 324
3563 324 -397 417 453 -358 358 -144 -7 446 -156 -38 210 -229 253 229 -315 173 -86 -217 270 -342 -133
3584 -133 162 -547 -143 -222 -206 156 -118 -351 53 -297 -172 -82 -267 246 -23 -193 42 -66 -438 -179 -323
3605c23J72pJ6K23J94m45K34r9k96M07j33J31K41j47j40K99l91P4p7j21M67j12
3627A67m76O25j07K23l98L8Q5O6j20J30J23l70K61j52Q8o1l33L86l24J03L49l29
3649b6k9K10k48o8j5O0J76N6q3o3Q9j06p4nj42J5N7qK6J00L9Qj02K4k83K41L13
3676A62k03j11M9J1j70O9M8RLJ75j27J87j42J6L7Q2l58K43K60m08R3K90l9q9l
3701H4j51r6K80k7J30J01k37K9j97M63k58j50K35j92j82J72J65n7L6m18K94J66
3723A90k46K86l17J26L39l58j39L38j21j51r1L49l3j22m19M14j29q7L01m35J97
3744a08K97l37J69j80l0L48m77J4K78k15K91R8m32L72k6m35K96q7R3R1j77N5K52
3767A50m69L91r8m28N80J70n42N15l24J62rl37L77Q0j76M37k89j00L16n44K15
$$ plain form
3605 -323 -151 -158 -142 81 275 -170 64 -35 -331 76 -57 74 315 168 28 327 -64 10 -67 -188 279 167
3627 167 -309 316 209 432 34 72 157 223 103 233 356 -14 247 95 183 122 -211 175 -149 -46 303 -26
3649 -26 -55 155 -93 -161 -176 -116 60 116 33 -30 59 -47 -121 -126 -268 -253 -196 -204 -178 -78 -39 -31 -133 -109 -392 -151 162
3676 162 -41 -152 -103 -92 -262 -193 -145 -136 -133 42 -85 102 -40 -24 13 95 -263 -20 240 -168 -75 215 176 87 84
3701 84 -67 -163 117 90 220 321 84 113 -84 379 121 -29 206 14 -168 4 169 112 148 -270 24 190
3723 190 -56 230 -87 39 378 20 -119 219 98 -53 -144 205 172 50 -369 45 -84 -171 130 -305 -108
3744 -108 189 -148 21 -159 -189 159 -318 -304 -26 -241 50 148 -284 88 62 -373 -77 -164 -71 20 -157 -102 150
3767 150 -319 72 -26 -454 126 296 -246 269 -55 107 98 -239 138 218 42 479 190 90 406 -138 77
3788G7L22o11K28M87o90M57k93j68O71m64j99N15o22N26mn93P77k82k77K55k87
3809a75j00N00p22O15R7q23M92K41o83P23n34J7L91m36N54K13r03M60r0k23N24
3830A38n70J42O87q07M59M9p70Q71J50p88O71n20J84L46n58L44K74p28R08o17
3850a35k24Q85m33j70O03o93O0Q06j095O65l2l22N82k64j29M72p75M53J55o67
3870b58O20l03m49J026o26o36R96p47N81K59j031Q46l1p62Q29n50k49Q50o51J62
3890a24K34p33N77L56o20N84m57j58O10r03N55K97p26L21O0m63O98k19l76P42
3910B55n41m7P47q49N12M0o01J022m58l04P23o67K6O99j042Q57k83l00N67k98
3930E8m89Q53k35MM28j107O16M11n34N18l75l44O54p72M28L05p59N85K15o92L47
$$ plain form
3788 77 399 -212 16 503 -187 270 -23 -191 480 16 -183 332 -290 236 232 -361 416 134 -143 112 -175
3809 -175 -275 225 -497 118 215 -608 -116 125 -558 165 -369 -352 39 -397 157 370 -533 -73 -163 -386 138
3830 138 -432 -290 397 -410 49 98 -672 199 349 -439 232 -288 -104 242 -316 28 302 -426 482 -135
3850 -135 -359 526 93 -77 526 -167 -107 699 -396 269 237 -85 497 233 104 576 -199 254 409 -258
3870 -258 362 59 -390 636 10 -626 370 -377 204 463 -568 278 247 -515 314 -236 -485 365 -286 -124
3890 -124 110 -623 -46 310 -310 274 -183 -341 269 -634 -79 218 -508 -187 -127 -590 108 -111 -487 255
3910 255 -286 -333 414 -435 77 117 -484 538 80 -224 499 -168 -142 557 -485 372 89 -211 356 58
3930 58 -431 422 187 191 619 -488 128 539 5 523 148 -196 458 -314 114 419 -340 245 460 -232 115
3951A15r7k63N45n35j08P22q68O78J6r29P58m8l30P94r10K5P51n79K12J65o61
3972e47O44k27l61L79j00J88K84q84N33J53o74O05j28l74Q43k41m97P69o19J72
3992h2M59p85P79k16k94L69j35j44N76n33O1K79o50O74Ln26N68j59k17N19p74
4013b28M42K07n51J98K20l86J81J74m48N31o90L82K79n03K29P6j52P4R7j72J39
4034I9l71K56N3k15K69k53l03N79k07l09L39k77qL55k25L13k11k50O43o12P8L77
4056A20k47l4J60l31L24J49k48R1j06J33k4R2l52M09k74J16Q7k53N31j73j31K47
4078B86j52Q4O9m4j73L24k62K32j29j81J19j8q2j5JJ48m5l02L27o7k91L03j15
4101A7mL62n14l4M97m45%J13k0O2k13j0J12m2J22j26j21K80j82O6J95j97m8j35
$$ plain form
3951 115 18 -245 300 -235 -343 379 -489 189 205 -724 34 -14 -344 450 -460 -435 316 -263 -51 114 -547
3972 -547 97 -130 -491 -112 -212 -24 260 -624 -91 62 -612 -7 -135 -509 334 93 -404 365 -254 -82
3992 -82 377 -408 371 155 -139 230 95 -49 527 -6 55 334 -316 358 361 -165 403 244 27 546 -228
4013 -228 214 421 -130 68 288 -98 83 257 -191 340 -350 32 311 -192 37 113 -39 35 132 -40 99
4034 99 -272 -16 37 -178 91 -162 -465 114 -93 -402 -63 -340 -348 7 -218 95 -116 -366 277 -335 -257 120
4056 120 -127 -161 -1 -332 -8 141 -107 -16 -122 11 -13 79 -273 136 -138 -22 65 -188 343 170 39 286
4078 286 134 218 287 243 70 394 132 364 235 54 173 155 73 58 59 207 162 -140 187 120 -171 132 17
4101 17 13 375 -139 -173 324 -121 -121 -8 -28 34 -179 -189 -77 -119 3 -123 -244 36 -146 -80 115 -82 -130 -265
4125b65K53j60o7J20L0J32m79L78j14K07k27k4O3Q4P1j80K98k16J51N7j31K66
4147B47k06M9J5k16K44J51k23n9K94k21L9J2j7K53p3j26l8j45Q5P5j93J68L2l33
4171a86K45k89L9L20k84K22j15K12l14j27K13K0j12m2NJ50r9q5K51k20j00J63
4193a33j27J3L45k25j16K8K00k11J72j28J00j8Jj39JK25J15K17l23J43k06LM52
4216C89l00j25J64N8n0R1j86K9PJ68q5k9j21J90j18J99l78P0L07k57K70Q1k98
4239G6J67l01n4J92k9j40M2M7j11J25n6o1m7J49j81K60k68K03k30K3n3J7K1R6
4263a13K2j63J73o8L40k88j4r9J23j10J61r3J29j89j87M94j01r0M16m27l2L35
4285B19j84O0K41m31K89j07NJ14k01L32l03k9K97j81q8K15Qk38K80k38r0K44k81
$$ plain form
4125 -265 -12 -172 -239 -119 -89 43 -436 -58 -172 35 -192 -216 -153 -69 2 -178 120 -96 55 112 -19 247
4147 247 41 90 105 -111 133 284 61 2 296 75 114 126 109 362 289 163 125 -20 65 140 -53 115 147 -186
4171 -186 59 -230 -191 129 -155 67 -48 164 -150 -277 -64 -44 -156 -198 -193 -43 -142 -227 24 -196 -296 -133
4193 -133 -260 -247 98 -127 -243 -215 -15 -226 -54 -182 -82 -100 -99 -238 -237 -12 103 320 -3 140 -66 -63 389
4216 389 89 -36 128 186 136 227 41 70 77 245 160 131 10 200 82 281 -97 -27 280 23 293 374 76
4239 76 243 -58 -112 80 51 -89 -47 0 -111 14 -42 -103 -150 -1 -182 78 -190 13 -217 -194 -247 -230 -209 -113
4263 -113 -91 -254 -81 -149 191 -97 -111 -210 -87 -197 -36 -129 0 -189 -376 118 17 -73 343 -84 -116 219
4285 219 35 95 336 -95 194 87 92 206 5 337 34 5 302 121 33 248 256 18 298 60 -30 214 -67
4308f7K44N4n27M47J5pm5l97L78j23k17K90k6k81K07o8j03K03J36m81L00l25K87
4331a06J7k23L31o3j28K96k39j62K66n1n2J65k08L30j52k80N15n01J10K98n02
4352c39L27N3m75L76J66l89J54K31j81M71l86J09J62n58J87L52l47K67j11l6J48
4373A81k39J95J71m02K98pk59M47m19j3M14m29J41L72o13L08j50k97L86m1j93
4394a49R6J5j11K79m91K52r1J69K61l09j12P7k20K93K20m45L3J46j3J13j52j70
4416c09N85l73q3K77j57l8J76k00L16j03j08k0r5n6M47k88O8R2k0K43k47q3J55
4439A79j12o9K80p9r0J49l50L63k4j36R7j3j93J39j42j07L38j54J21Q8n05M83
4461B63j90K6K50m20Q2j8j94L39j32j73J02l6o1J03k73K26j79rL85j19n22M89
$$ plain form
4308 -67 177 231 -296 151 166 159 114 -283 95 -28 -245 45 19 -262 -55 -123 -226 -23 113 -368 -68 -393 -106
4331 -106 -89 -312 19 -44 -172 124 -115 -277 -11 -62 -114 51 -157 173 21 -259 256 -245 -135 163 -339
4352 -339 -12 41 -434 -58 108 -281 -127 104 -77 394 8 117 279 -279 -92 260 -87 180 69 33 181
4373 181 -58 137 308 -94 204 197 -62 385 -34 -47 367 -62 79 451 -162 146 -4 -301 85 44 -149
4394 -149 -53 -38 -149 130 -361 -109 -200 -31 230 -79 -191 -114 -334 -41 179 -266 -233 -87 -100 13 -139 -309
4416 -309 276 -97 -180 97 -60 -98 78 -122 194 91 -17 -37 -132 -188 259 -29 39 131 111 354 107 24 179
4439 179 67 -2 278 199 109 258 -92 271 247 111 208 195 2 141 -1 -108 230 76 197 285 -220 263
4461 263 73 99 349 -71 11 -7 -201 138 6 -167 -65 -101 -162 -59 -332 -106 -285 -294 91 -28 -550 -61
4483f1k66qJ55n7j88L75j6K70j29l35K49p4l5p4K59j0ol53L24j20n7J95K4k43
4507a81J51P2N8q8o8L13m2l4Mk67m9J95N7J2K8l2j40K83j89N6L4L1j87J30J67
4532C14k89N5j9j67j17L85q3r3K58j70J8q2J09k37N7m2%M9j28J72r8K67m09j16
4556c66K44J2l9J14J0%K0k39P7n2j99L43n2K83k48p1K29j11j05l7J13K6n4J01
4580ak5j4J67J03l68L02O3j7m8O9p5R1k55Q6P4k48P5O0L6j10J52J46k13K13k49
4605A4J83j51q5NN7j44j56M13j26k2J66k06O1L4j00J85j93M5k3j68K78j39J06
4628C4k68J82J33l51j0L1r0R1K45j16O6j7K27n74L86J24k28K75k04j44m1R8O5
4651h6l6J96L2j47N3m0rJ72k5r7Q8L8q0J99m24L40r8K44Q4q6j37j03K36k22p9
$$ plain form
4483 -61 -327 -335 -180 -237 -425 -50 -66 204 75 -260 -11 -85 -120 -194 65 55 49 -304 20 -100 -157 38 62 -181
4507 -181 -30 42 100 12 -56 257 215 181 185 -82 -131 64 121 133 161 129 -11 272 83 139 173 204 17 147 314
4532 314 25 80 61 -106 -223 162 79 -14 244 74 92 10 119 -118 -61 -103 -103 -54 -182 -10 -108 159 -250 -366
4556 -366 -122 -110 -149 -35 -25 -25 -5 -244 -167 -219 -418 -75 -127 156 -92 -163 66 -45 -150 -187 -74 -48 -102 -1
4580 -1 -26 -40 127 230 -138 164 227 210 162 231 156 247 -8 78 152 -96 -21 39 75 -35 117 263 50 263 14
4605 14 197 46 -39 -34 23 -121 -277 136 10 -12 154 -52 9 43 -57 128 -65 -20 -43 -211 67 -72 34
4628 34 -234 -52 81 -270 -280 -249 -339 -248 -3 -119 -53 -70 157 -417 -31 93 -135 140 -64 -208 -249 -151 -86
4651 -86 -122 74 106 -41 12 -28 -37 135 110 13 101 139 59 258 -166 174 76 320 404 318 181 78 314 92 13
4676A3J5J75N4j41j6N9K5j55j1K41j77p6k4Q6K31j78j57oM6j45J81j48j72J28
4700a52K44l52K81j00j44K84k33J9J65N7l16K46k45j48K02J38k8Pp1Q1j43R4k8
4723a42K68J2j20r1K69q7O4j78P3j66M31k70m9J70j99J42j8M1j65J14%K67k57
4746A09j7QL2L1J18j71j62J52j41K16j49o4M7K2ok8R2J2j40k24J85o1N7o7jL78
4772B28l14l20M05K39l21r4N5j46L05Lj65o0k4j57L65N6l4o7J76k86l8L06j64
4795e2m9Q5QK5K8k0j01Q1j2M0M2j67L90l03k1K60k03Q8L2j61Q3n8L25j69O4k44
4821iR1nj3M5J09j53no2L41l06N7K3j12K7J25m8K7j61j75K96l34J93Q3j1k05J38
4847d4p3J21j44p5L0N3J7J3l3J07j17J02J13j25k09J39o0KJ2K9J34k5r2J43m9
$$ plain form
4676 13 28 203 257 116 100 159 184 29 18 259 82 6 -18 68 299 121 -36 -42 4 -141 40 -108 -280 -152
4700 -152 92 -260 21 -79 -223 61 -172 -153 12 69 -247 -1 -246 -394 -192 -54 -82 -75 -146 -65 -208 -114 -142
4723 -142 126 138 18 -73 196 109 173 -5 68 -98 333 63 14 184 -15 127 109 150 -15 99 99 366 109
4746 109 92 100 132 163 281 110 -52 100 -41 175 26 -38 9 31 25 -3 89 101 -39 -263 -78 -139 -82 -149 -150 228
4772 228 -86 -406 -1 238 -83 -177 -122 -268 37 40 -125 -185 -209 -366 -1 55 21 -46 130 -156 -194 112 -52
4795 -52 -101 -16 -8 17 45 25 -76 5 -7 33 75 -92 298 -5 -26 234 31 119 151 -10 73 15 340 171 235 -9
4821 -9 82 77 64 109 218 65 60 -2 339 33 90 113 1 28 153 105 132 -29 -204 92 -242 -49 34 23 -182 -44
4847 -44 -117 4 -140 -215 -185 -132 -115 -102 -135 -28 -145 -43 70 -55 -264 -125 -185 -183 -171 -142 -8 -33 -125 18 -31
4872c1j05K45o8k85J52j48K48kk5K59j54r6J84M6j21J9j20J91K8j48J5K26k79
4895C1K44kk54L23j18j7P9n3n8k40R1J20P8r1J77j20j19J04k87M25l04l16K89
4918a8o8n0J37j44J08j50n7L51k78J18J13k80k5L8lL5J49j92r8K01j7K16j33m
4942e1R2k10Q9J64k15J74j14n2J88R3j90N1r9j48K50Q6L6J68p6p0R1k90L17k99
4966a5K18j23k04K26j03l7L70k47O8P5j13n4n5j4K22k1l02Q2j6k0N5%j52M1N4
4991f5lQ4k46J69j3J06r9k26J66L95n05L54j52j99J60K46l68O4j0Q1K87l12j3
5014i9Pj8j19K72k60K15j59R4J12j37K08J26L0r8j63qJ95m44M77k66RK75j41Q2
5038A90r0J64K9o0j19n5J01j51J96j66J17j13R2j98R8j83J76l4Q6ok92K96P0k11
$$ plain form
4872 -31 -136 109 41 -244 -92 -240 8 6 -19 240 86 -10 174 220 99 118 -2 189 217 69 84 310 31
4895 31 275 273 19 342 224 207 286 233 175 -65 26 146 224 133 310 190 71 175 -112 313 9 -307 -18
4918 -18 -86 -136 1 -143 -35 -185 -242 109 -169 -51 62 -218 -243 -205 -208 -173 -24 -216 -314 -113 -130 86 -47 -51
4942 -51 41 -169 -80 84 -131 43 -71 -123 65 158 -32 19 -80 -228 22 108 144 312 236 166 257 -33 284 -15
4966 -15 203 80 -124 102 -1 -38 332 85 153 228 115 61 6 -8 214 193 -109 -27 -43 -63 -8 -8 -160 -119 -65
4991 -65 -68 16 -230 -61 -74 32 -67 -293 -127 268 -237 117 -35 -234 -74 172 -196 -132 -142 -61 226 -86 -99
5014 -99 -92 -110 -229 43 -217 -2 -161 -67 45 -92 116 242 272 174 11 3 198 -246 231 -35 -26 249 108 190
5038 190 100 264 293 233 114 59 160 9 205 39 156 43 135 -63 35 -148 28 -6 80 74 -218 78 148 -63
5062f3P7j7k23o6M25l30p1L99l92k4k6ML08o6j30J94R8l27J72k65K60m0r8oJ0
5087a97K6K16j12K04j89j04K90n9P5j85K6q3L77k14m4J60P0j37K77l31J09kj29
5110D4%p0NL4N0r0K53p5l%j70L40k40m2K88l56l7J2P2q6K58k31p9K35n4j66O2
5137d6k34K55M0l5J58j60J24l18k25L38Q3j54M38m25km9m4J99j70J14K09k29Q
5160a25Q1L2n7j34n4M59l03pM29n04K25m6J81k48K00O6q9j28L09k11n2J29o2m7
5184D4J42j85K85L8k10J43k29L2N0rk68L07N1m02M31j76Q9L4j76J83J9j55J04
5207A42p6j69L51l20L1O7j42l0K89j80Ql94J18J82j29K38k29J79p4J22k64M5M3
5230a92J33J81k04K5P1j41K72L3k86L3K31l19K15J13k82K48j59N6J89k52J26j19
$$ plain form
5062 -63 14 -3 -226 -292 133 -197 -268 131 -261 -285 -311 -307 1 -65 -195 -1 97 -230 -58 -323 -63 -103 -201 -207 -197
5087 -197 -171 45 -67 137 -52 -156 134 75 150 -35 -9 -92 285 71 27 187 257 120 397 66 175 173 44
5110 44 44 -26 -21 13 63 -27 226 151 148 148 -22 318 78 36 324 -32 -69 -57 15 -71 187 -44 -123 112 58 -108 -46
5137 -46 -280 -25 15 -20 138 -22 102 -216 -441 -103 -20 -174 264 -161 -163 -212 -256 -57 -227 -113 96 -133 -125
5160 -125 -44 -12 -69 -203 -257 202 -101 -108 321 -183 42 -4 177 -71 129 195 106 -22 287 76 24 153 91 44
5184 44 186 1 286 324 114 257 28 60 110 101 -167 140 191 -211 220 44 133 167 -9 174 193 38 142
5207 142 66 -103 248 -72 -41 26 -116 -146 143 -37 -29 -423 -305 -123 -252 -14 -243 -64 -138 -16 -280 -235 -192
5230 -192 -59 122 -82 -57 14 -127 145 178 -108 -75 156 -163 52 165 -117 131 -28 28 217 -35 91 -28
5252b8j75M46q6k8K18j18J14j92r9R2j10j12J08l6L9L18m09K32K48m96J18l4K30
5275B40k08r6j26n2L10j9n5j17L79k62j47N0J49J33j48j95J78m2N0k05J04k65
5297c44K82j42j47K86j14J05J34j99J21j15k40M14j49K2j10R2n6J53J10P5j09
5318F9k51K92q9j19J24j42k74N99j18J60k65J00N9j42Q3N9j81j24K80j17L6J11
5340A50j48K03p5j90J33k5k82J96q4l4K72k64O8R6j4K1J86n06K64J39o5J54n16
5363c21N21k84R8l7r7k2J62j58j03L72k39M5j14L5K81m4l64M43l17K47q2l59K82
5386e5J18l41M18N2m70K31j14K84P1m11K09J24k13K47J09l41M13k91K01k58l4
5407e1K24q1J17n7J1k17L8J81l13N28k68r6q5m3M99j58k30J87n7q0O1j93K85k34
$$ plain form
5252 -28 -203 243 157 129 347 229 343 151 52 144 34 -78 30 -6 33 351 -58 174 422 -74 44 10 240
5275 240 32 -64 -190 -242 68 49 -6 -123 256 -6 -153 -103 46 179 31 -164 14 -28 22 -183 -79 -344
5297 -344 -62 -204 -351 -65 -179 -74 60 -139 -18 -133 -373 41 -108 -86 -196 -104 -160 -7 103 178 69
5318 69 -182 110 21 -98 26 -116 -390 209 91 251 -14 86 145 3 86 145 -36 -160 120 3 39 150
5340 150 2 205 130 -60 73 48 -234 -38 -122 -156 116 -148 -80 16 2 23 209 -297 -33 106 41 195 -321
5363 -321 200 -84 14 -23 -120 -142 20 -138 -241 131 -108 -63 -177 -142 139 95 -269 174 -143 104 22 -337 -55
5386 -55 63 -278 140 192 -278 -47 -161 123 194 -217 -8 116 -97 150 259 -82 331 40 241 -17 -51
5407 -51 173 92 209 152 163 -54 -16 165 -148 380 112 16 -69 -112 387 229 -1 186 129 49 110 -83 202 -32
5431c2l8JR9k35K20m1J3j7k81M58p2n97L50R3j42K16J35l41K6k8J84M1r9K0j28
5456a95l6L21j1k84l3K14l48L73o2J76k08L7j5J00O2Q4j12j04KK62L6n6jp5j91
5481f4J43K59m06J41M6J23j04p8q1J10J18j04P6jp4K09l83J60j42O7P3n7j83p
5505a59K08q7L57m06J78j24J50j01j06l5J37j53J54Mk53l3J80N4J78n09L09P6
5527A9k9nj88J05J11o7L9L8k19K7J02q4L8J87k10L34j56k3k08L77j75K28o0k20
5551c9K05j10N6l0L2p5K0O0k16L44o1j62J37k9O1j99K35k07K09M3k56k2J70m1
5575A25k14L33m78L31K20l00L6j37p4Q7o5P5j00K55j36j3m7j40L70j85L1n6k00
5598b82J50J39Q4j85m1J21j30R8mP8k16k2J9M86m09n7K51j56J38m7P3k90K53Q6
$$ plain form
5431 -32 -70 -69 30 -205 15 -26 -13 -30 -311 147 75 -522 -172 -79 -221 -5 130 -211 -185 -213 -29 12 -87 -67 -195
5456 -195 -231 90 79 -205 -238 -24 -372 1 -61 115 -93 -56 -71 29 91 175 63 -41 -39 223 259 203 202 127 -64
5481 -64 79 338 -68 73 119 242 138 60 -21 89 207 103 179 178 104 313 -70 90 -52 15 88 31 -152 -159
5505 -159 49 -38 319 -87 91 -33 117 16 -90 -125 12 -141 13 17 -236 -269 -89 -35 143 -366 -57 19
5527 19 -10 -15 -203 -98 13 -54 -15 23 -196 -169 -67 -151 -113 74 -136 198 42 19 -189 188 13 241 181 -39
5551 -39 166 56 112 82 114 39 59 119 -97 247 186 24 161 132 193 -6 229 22 231 274 18 -4 166 125
5575 125 -89 244 -234 97 317 17 53 -84 -158 -71 -136 -61 -161 94 -42 -55 -102 -242 128 -57 -26 -82 -282
5598 -282 -132 7 91 -94 -135 -14 -144 -46 -50 28 -188 -210 -191 295 -114 -171 80 -76 62 15 88 -202 51 137
5622A37n1K7j66O3J1K50j17k72J24J38o4Q4j25N8k3J6J2j27J12J4J12p5j59J17
5646I6j1k7M5k71N1J50n0L3o0J1J73k51L12j72M5j9j84l4NJ5o8L23q2q0K3l8J04
5673C9k54J95P2j82Q8p1RoJ25P8k58J90L0M6j0R3k70n6J6K07j12p5N6R4J54j03
5699I5n0Q1o8K20j07o1L40m87K97k7J2p7K8n8l7K58o22L72j1m0j94K62n2j56K24
5724A42m6j19M1J61j61k18J01k79K10M09l48j5O8L6j25J32j71K03j79J13L9j27
5746a33L57r3m24L20j38l9J70n8J5J22j62q7R4q1J52P1j4M4oj78N5j63J52J45
5770A21L1j35l15N13k09K35o1r7R0M6j28k03K7L21q0n8N1P0r6o4l8j73L58M0o5
5795A81l28P2j02J97J50l87R9O6l6L25m45J85O8m18K59L9J71k14J29j48J16n6
$$ plain form
5622 137 86 113 -53 10 21 271 154 -118 6 144 80 164 39 97 74 90 102 -25 87 101 213 138 -21 96
5646 96 85 58 103 -168 -117 33 -17 16 -44 -33 140 -111 201 29 74 55 -129 -163 -158 -143 -211 112 30 -50 -27 -65 39
5673 39 -215 -20 52 -130 -42 -113 -104 -110 15 93 -165 25 55 101 91 184 -86 -142 -126 81 -31 -106 -50 44 198 95
5699 95 45 126 58 278 171 110 450 -37 260 233 245 168 196 138 101 359 -263 109 98 58 -136 126 74 -82 142
5724 142 96 -23 18 179 18 -200 -99 -378 -168 241 -107 -122 -54 -18 -143 -11 -182 21 -158 -45 -6 -133
5746 -133 224 131 -293 27 -111 -150 20 -38 -23 99 -63 -150 -56 -137 15 86 72 116 110 -68 -13 -176 -24 121
5770 121 152 17 -298 215 6 241 180 83 173 219 91 -112 -85 236 156 98 149 219 123 59 21 -152 206 246 181
5795 181 -147 -75 -177 20 170 -217 -118 -52 -88 237 -208 -23 45 -373 -114 -75 96 -118 11 -137 -21 -77
5817g7j22J91K8Kj25J39Mo5q6m5J19l6J10j18J81k39K22j32n0L0J25l48J89P4
5841b9J41j12n3j42J43k2J04J66M9l02L90m02J02O1n9J61J64m18J77J75j01j81
5863A2J69m3j8N7r5O1j47pj12J47P5J04k87K36j36J10k6q5J7l2j60l6J82k27J61
5888h0k7R0j25j00L07m21K1L97n36K61K38k59K11M4k68J42J88j22J11l06M5J74
5910a5j8k4K45j91L18N1o22L43Pl37K60J08l3J23l46K10M1l19J75rJ47K51j08
5933B57m7k13q3M06k87J0m0P6j98J43N5Q8j11j14J49j58n0J73j01J01m4k3J25
5956A14l46J30O4L5P3j51J70m89L43M1j46Q2P2o7o7O8L7k02J76j47L1J33%j5o1
5981a22J66J6j45m2O9Q1m5n1L11j10n7J17k53q7K18p0J78j83k6J70j56LK3k2K12
$$ plain form
5817 -77 -199 -8 20 22 -103 36 40 -25 -111 -156 -37 -73 37 -81 100 -139 83 -49 -99 -69 56 -292 -103 -29
5841 -29 112 0 -53 -195 -52 -74 30 196 245 -57 333 -69 33 94 35 196 360 -58 119 294 193 12
5863 12 181 138 120 177 82 143 -4 -11 -123 24 99 203 -84 152 16 126 100 15 32 0 -160 -196 -14 -241 -80
5888 -80 -107 -17 -142 -242 65 -356 -335 62 -474 -213 25 -234 -23 21 -247 -105 83 -39 72 -234 -189 -15
5910 -15 -33 -57 188 -3 315 366 -256 87 94 -243 17 125 92 215 -131 79 120 -199 -24 -33 114 365 257
5933 257 210 -3 -86 320 33 43 3 79 -119 24 79 167 56 -58 91 -67 -117 56 -45 56 12 -11 114
5956 114 -232 -102 -38 -3 70 -81 89 -400 -57 -16 -162 -80 -8 -75 -142 -74 -37 -239 -63 -210 -179 -46 -46 -61 -122
5981 -122 44 60 -85 -127 -58 23 -22 -73 238 128 71 188 -65 -152 66 -4 174 -9 -35 135 -21 -18 5 -17 195
6006A95l86j0J18J62N5l7k40P7J27j04K83j09k71K31K6k79K22J63l19L66k71o2
6028f3M2PJ56j62q2L61k38j59NJ67J25l87K13j4J98p6k47q2J80Qq9K87r5K5k2
6053E8q1r6K25k23J69o2J31m6q0p1J57l20K11N5J25p6j84J22K57Q5l74J96k40
6076f2j04M43l23K02J98m25P4%M0Q5k39K10j21qJ03k0l8j24P7M0J42o1k37j11
6100b59J24L00m2j11r0N0%p0J20j33R2k16J22j13K31j3j37K4J22J78k02n5k34
6123c12J26j60L60p7O4k04J61j23J16j2J86n7K14j66J7j12k3K28k33N2K79r7p
6146B20pm9k62L56j57kn7k56M58j56J66q0P8j70oj54j63M10j45j48K29j72K39
6169A72k69J19j32M9J64j39K3j32J22j61P1j97J64J27R3J1j76m2K50l33K32j06
$$ plain form
6006 195 -191 -201 -83 79 134 97 -143 -66 61 -43 240 131 -140 91 117 -162 60 223 -96 270 -1 -63
6028 -63 -21 -14 142 -20 -102 259 21 -138 -133 34 159 -228 -15 -29 169 93 -154 -236 -56 -48 -137 150 55 80 58
6053 58 -23 -119 106 -117 52 -10 121 75 -5 -76 81 -239 -28 27 152 76 -108 14 271 356 -18 178 -62
6076 -62 -166 277 -46 156 354 -71 3 3 43 128 -111 99 -22 -30 73 53 15 -109 -32 8 150 89 -148 -259
6100 -259 -135 165 123 12 -78 -28 -28 -98 22 -111 -19 -235 -113 -226 5 -8 -145 -121 1 179 -23 -78 -312
6123 -312 -186 -346 14 -63 1 -203 -42 -165 -49 -61 125 68 282 116 133 21 -2 226 -7 45 324 227 220
6146 220 213 164 -98 258 101 99 42 -214 244 88 254 174 252 82 76 -78 -241 169 24 -124 105 -67 172
6169 172 -97 22 -110 -61 103 -36 -13 -145 -23 -184 -113 -310 -146 -19 74 85 -91 -133 117 -216 16 -90
6191i0L3O3j46J26r7n6J31L0M1j54J60q0kp2j65P2K93j89K5Q1L2K73k87r7L5J89
6217A49q8L03n89O03l16j29J90j09m0J93l10K55r9q2O8j09R6J45k32J29N2j63
6239h3L40l20J21R6q9NJ34l3q7P0k63N4l5J50J58m61Q6J57j47L3K30l31J67m2
6263i0NK85k90N4M9k48J64L5r1R8M1L7j56j29M11r1m34L0L33k14J87J14k3j88
6287a11K38q9Mp4o9J81n9R2N2p5J84o5k99L66j96j1R3k19L39k51l3J06j19k1O3
6312B7j22lJ40m2j97K65k22J74j16K9K6k6K8J85q2Qk13K1L03k09n9P7p6j06M16
6337B26k64M4J60m56M10r1k08L57k40J00lK1k73J89k09J31j73K4M17j37r8K01
6359A28j71K37j68j22M22k82m6k05J07J48K77k00l6j14O0J92j02r8J57l7nq5j04
$$ plain form
6191 -90 -57 6 -140 -14 -111 -167 -36 -6 35 -119 41 -39 -41 -113 -278 -206 87 -102 -77 4 36 309 22 -75 -40 149
6217 149 61 364 -225 378 62 -67 123 14 -26 167 -143 112 13 -69 -1 -110 -14 131 -101 28 80 -83
6239 -83 257 -63 58 154 65 70 204 171 84 154 -109 -55 -90 60 218 -243 -157 0 -147 -114 116 -215 -48 -90
6263 -90 -85 200 -90 -36 13 -235 -71 -36 -127 -29 12 49 -107 -236 175 84 -350 -320 13 -201 -14 100 77 -111
6287 -111 127 38 42 -32 -101 80 21 113 165 90 274 209 -90 276 80 69 162 -57 282 31 -2 104 -15 -36 27
6312 27 -95 -98 42 0 -197 68 -154 20 -96 -67 -41 -67 -39 146 64 72 -141 -120 183 -26 -85 -8 -84 -190 226
6337 226 -38 6 166 -290 120 29 -179 178 -62 38 35 56 -217 -28 -237 -106 -279 -255 162 25 -73 128
6359 128 -43 194 26 -96 326 44 -2 -207 -100 48 325 125 89 -25 35 227 125 27 184 147 142 57 -47
6382d7K03Pk60L41qj15j01rj94L96l22K0pO6R3N3k19J11j27k19N44k64j46M30
6406B26k62j90K23k90J00J57J14k35J38j50K5j09J16K1k74L90j54K53j06j73K07
6427B7n2RO9K06m83M32j93j10J95r8o5K95k55O6k29J91J61k93J6M66n04J49J00
6450A00j45l1J40k78L45k66J05N2M3j72O1O2J02K6j31r5Q1J88j25k46k1Q7J33
6473A5j13J92q1k16O7p9J04R0o3j2jK51k72k83M00Q1j76J26p7r6J86qj09j67J85
6498e6J22k07J38R9N9O1j50K45l12K45k67J39r7O3j23J72l07L80k04k21K31Kj32
6521a20J92l1k09M44m17J42j5R2R6n6k43K77j43J21k79r5L43QLn7j65K7m1J74
6545D8O2j31J23j91P6K12m01J58K45k45N4j67K41K9j14P1j43N0Q5l24J3L3J92
$$ plain form
6382 -47 156 163 -97 244 236 121 20 11 -183 213 -109 -89 -96 -30 63 116 -103 8 -119 -338 206 -58 -204 226
6406 226 -36 -226 -3 -293 -193 -36 78 -157 -19 -169 -144 -253 -137 -116 -390 0 -154 99 -7 -180 27
6427 27 -25 -16 53 259 -224 208 15 -95 100 2 -63 232 -23 43 -186 5 166 -127 -111 355 -149 0 100
6450 100 -45 -76 64 -214 131 -135 -30 22 65 -107 -46 16 118 144 13 -82 -1 187 62 -184 -205 -118 15
6473 15 -98 94 13 -203 -136 -215 -111 -21 -84 -96 -97 154 -118 -401 -1 80 -96 30 -47 -143 43 35 -74 -241 -56
6498 -56 66 -141 -3 96 155 216 66 311 -1 244 -23 116 19 82 -41 131 -176 204 0 -221 10 12 -120
6521 -120 72 41 -168 276 -141 1 -14 78 174 118 -125 152 9 130 -149 -244 99 107 110 53 -112 -85 -126 48
6545 48 110 -21 102 -89 -13 199 -202 -44 201 -44 10 -157 84 113 -1 70 -73 -23 62 -262 -249 -216 -24
6568b4J31q4j81K19j70OK31q9J7o2n7R3j64K31J02l45O6K1rJ14K9Q0k75N5J02
6593C7K73k81K59j78p2J22j15J1j8mq3J43p0J90k52J52j28O1J08r3J93j33p6m4
6617BK4L0J9q2l17L88j26k13K28l6jK20k65k4M9j8O7J30l24L00k80O8L48l80l9
6642b32L76N0j10m0l4j4j31K14m1j16K41n7K3j68P6k76J30J76j44L1L10j68r8
6665bK47l77K84k3j04J83j06Q1k90J18Q6n1j16K84k12j62K17j1K23L6l07J56l15
6688a61M28k84L0P7j12O0k02O0JL43n05K62j66K91M5j57k5j99L05l75L54k74j4
6711b18L12j57J24L0q9O6j31P4J2j4j86J07j87K47K33l49K08j32N7P3O2j61l6
6734e5j43K09O8k5J17J4j28K29k87M1J56j54K2N2j36J89j47q1K84j94oQ1k65J80
$$ plain form
6568 -24 107 23 -158 61 -109 -103 128 39 56 -6 -63 30 -134 97 199 -146 -80 -59 -68 46 75 155 -120 -65 37
6593 37 310 29 288 110 38 160 45 56 38 34 -49 94 24 214 -38 114 -14 47 155 62 255 122 46 2
6617 2 26 56 75 -7 -324 64 -62 -275 -47 -83 -84 136 -129 -153 -104 -122 -55 75 -249 51 -229 -161 187 -193 -232
6642 -232 144 194 84 44 10 -4 -135 79 38 -78 163 106 129 -39 37 -239 -109 67 -77 -46 264 96 -2
6665 -2 245 -132 152 129 25 208 102 183 -107 11 97 46 -70 214 2 -160 57 46 269 305 -2 154 -161
6688 -161 267 -17 13 90 -22 38 -164 -104 -103 240 -265 -3 -169 122 167 10 -15 -214 91 -284 70 -204 -218
6711 -218 94 -63 61 91 2 68 -63 11 23 9 -177 -70 -257 -10 223 -126 82 -50 7 80 142 -19 -55
6734 -55 -198 11 79 54 171 185 57 286 -1 40 196 42 64 116 -20 169 22 -59 225 31 25 106 -159 21
6758B1K06j19K5j73j09K83r7J5n1j34J31L14m76M73l62m9Q3j45Q0K03k2o1J07
6781A43j93PRk87L73j89K0K70l6j82K58m39J5J35k05M47k31RK99l32J17K46l18
6804f4K04P7l33M02l80K46Mp7m40N70l81K66p4n5L50j21k04J15J84l92K45j20
6826B2N4Q4l08K38l5k66M81j98p2J64l31J24K25n40O23k51j06J98l43L66k18k46
6848c35N28p2j78M3n5j46M98m39n5M28k99K3K67j92k92K50m5P1k15L44k92j65
6870c28L97k26J22J27l6j23K72l6k36K37j96q8K48k52J35N5j91L24j66J73J17
6891C29m05R2J79l90L17o4q9J95j48K6J37l0N7j33j89n3L15j34P0n3k75L07K09
6914B70m24Q6p5J28O6k23K76k68J13L35l45k7K9j71K04j40mJ66J93k69O8j63J24
$$ plain form
6758 21 227 108 133 -40 -149 134 37 52 1 -133 -2 312 -164 309 -53 -102 -19 -164 -84 119 97 36 143
6781 143 -50 -43 -34 -321 52 -137 -117 153 117 -65 193 -246 -231 -96 -301 146 -85 -76 223 -109 8 254 -64
6804 -64 140 217 -116 286 -94 152 156 79 -361 209 -172 94 20 -35 315 194 -10 105 289 -103 142 22
6826 22 76 160 -148 90 55 -211 270 72 0 164 -167 -43 182 -358 265 14 -92 106 -237 129 -89 -335
6848 -335 193 121 -57 -14 -69 -215 283 -156 -211 217 -82 -59 208 16 -276 -26 -71 0 -215 129 -163 -328
6870 -328 69 -157 -35 92 56 -67 205 169 -67 170 -26 -114 134 -118 17 72 -119 205 39 212 329
6891 329 -76 16 195 -195 122 58 -31 164 16 42 179 149 206 73 -116 -169 146 12 82 29 -246 61 270
6914 270 -154 -68 -143 -15 51 -172 104 -164 -51 284 -61 -88 -59 -230 -26 -166 -170 -4 189 -80 -12 -175 -51
6937e1Q3q0Q0j31P6J86l51k3L36j82j19L56l7k62J59m7J66j0j92J63J1j31J3l0
6961a7O1q4P7Q8j04j09K29j43K66j09m8m0j18J18J00j77j09O0J56j71P8j19J41
6984B6q3Q0j95K17PJ4l12J28J88l08P3J43p1M7j56K10O5j77r0J26J60l10J55n
7008f8n4L3k9J98j43J90O5j13k84N36n49J62N2l2K58j08nk69K40r8Q6L7l33K87
7032E9n5N6J94k74J58j18k4J55k13J81J15l69N7K33P8j17m3O0j56J69q4j19L22
7055B65k29o2K41l07J13Q6Q0L0k81K35j29j03k18L44l8j39Nl5J11l8J21m0r5J08
7079B5j81K36r8Q4j28K4N4rj83K80k61j37K28PK23j50R8r1K21m32K92l61J09K70
7103A20k0P4l4k13J20N8p2L1N9l20K65j44J78k9K46j88K0m3Q2j19K0J82l10Q7
$$ plain form
6937 -51 32 -48 32 -99 -23 163 -188 -211 125 -57 -176 180 143 -119 40 -7 159 149 -43 120 131 0 13 -17
6961 -17 44 -40 37 125 21 -88 141 -2 264 155 107 67 -51 67 167 -10 -119 -59 97 -74 4 -115 26
6984 26 -57 23 -172 45 52 66 -246 -118 70 -238 -165 -22 -93 -46 -202 8 73 -104 -194 -68 92 -218 -63 -68
7008 -68 -122 -89 -118 80 -63 127 192 79 -205 331 -218 -56 -4 -36 222 114 109 -160 80 -18 68 105 -228 59
7032 59 4 60 254 -20 138 20 -4 151 -62 119 234 -135 -78 155 233 116 73 133 -23 146 62 -57 265
7055 265 36 -26 215 -92 21 107 187 217 -64 171 42 -61 -279 65 27 -112 -107 -142 -31 -69 52 12 -83 25
7079 25 -156 80 -18 66 -62 -38 16 7 -176 104 -157 -294 -66 -59 164 14 112 21 242 -190 102 -259 -150 120
7103 120 100 174 140 -73 47 105 33 64 123 -197 68 -76 102 73 319 131 151 108 190 71 91 273 -37 50
7127E0J99J25k75po9j93L11Kl31K57j14j0j6O2Ql77L47J33l10J00J15j00mj18
7151b15lL31q4j47J64J04l54j2J68K05l69R1P9J9o6N6k36K07k01J25J56M4j56
7174i4K68k07K96j89m1L20n09J07J62j0nJ80j40%p8q6K79k45J60K3k75L12L7l83
7198a18J57J9k1O0O2j52J35l66N9L48k54j46J82n5M2K28k48K08n6j78J09k95K21
7221e9j8k26L60Qj41J92k61K2L03k65N9J46l14K08j98k6N49l01l17M21j44r8J61
7244F1p7l1J02j79K98j39n4M80n25P6J41l63L20J71m18Jr4J48K81j96Q6j5j27
7267e3L59k81j62J76L1j60J65j39P4P6r4p7o4k25M14k4j48L14j01k1Q1k3n5n6
7291GJ44l20J50k85M57l79rK82o5m1K33l13L49j93j38n4K71l4k63J89j24L81m36
$$ plain form
7127 50 249 374 99 92 23 -170 141 143 -188 69 -45 -55 -71 -9 -1 -378 -31 102 -208 -108 7 -93 -97 -215
7151 -215 -218 113 29 -118 46 150 -204 -216 -48 157 -212 -121 -42 -23 -89 -33 -269 -62 -263 -138 18 62 -94
7174 -94 174 -33 263 74 33 353 -156 -49 113 103 98 278 138 138 60 -26 253 8 168 191 -84 228 265 -118
7198 -118 39 58 37 97 159 7 142 -224 -165 183 -71 -217 -35 -90 -48 180 -68 140 84 -94 15 -280 -59
7221 -59 -77 -303 57 65 -76 116 -145 -123 180 -85 -26 120 -194 14 -184 -210 339 38 -279 142 -2 -100 61
7244 61 -16 -47 55 -124 174 35 -19 461 -64 12 153 -210 110 281 -137 -136 -230 -82 199 3 89 74 -53
7267 -53 306 25 -137 39 70 -90 75 -64 10 86 -8 -85 -149 -374 40 16 -132 182 81 60 141 118 63 7
7291 7 151 -169 -19 -304 153 -226 -235 47 -18 -59 174 -139 210 17 -121 -175 96 62 -201 -12 -136 245 -191
7314a91Q6O4j30N10l06L1J76l80K01R1k16k7J44j09L74k31k47K90j6P9n79K26
7336a60K91O1k69J64J8j77K14k63nJ74j00R7r8J02N9K84n14L94k64j49L29m42
7358b54L32Pl67M01k49r3J94M2l5K79k65k1J74m96L42l72N81j52p5j45K16j70
7380a26J35r4q8K02N2m78O88j94l93L26N8j38M5K5kL0J5J42k75P4J85k71R3o8
7404e7Q1J26j20q0P6k06K23J09k21J9J22r2k7K07Q0l01n6k2Q0K41j46N8j53K63
7428B04k54M8P2l2j65N6J56j31L89m15K9n8J13R2m76J41K04J00%l76K41LN1j13
7452a21J38q6j71L04j33J0R5N3j80L8Q4O3j66m4J11M9J3q8K78j78j44P3j8Q5m3
7477B2L0k92L87N4j79L2Qj57K34rj56M10m13l9J11k7P9j32M8j47nJ81p7q3R3n4
$$ plain form
7314 -191 -105 -41 -171 339 33 64 240 -140 61 152 -64 -91 53 -56 318 87 -160 130 114 193 -386 -160
7336 -160 131 192 -77 87 105 -72 142 -121 -126 48 -52 45 -53 49 108 392 -122 272 8 -141 188 -254
7358 -254 78 85 -282 119 -130 -223 -29 13 -22 257 -8 -29 145 -351 -9 -381 200 48 -27 -172 44 -126
7380 -126 9 -85 -173 29 81 -397 291 97 -296 30 88 -50 -5 20 18 48 63 205 -70 4 189 -82 11 -57
7404 -57 24 150 30 -50 26 -180 43 152 -69 -50 72 -20 -47 160 240 -61 -117 -139 -59 182 36 94 -59 204
7428 204 -50 -2 70 38 -127 -71 85 -46 343 -72 -43 -101 12 104 -372 -231 -27 73 73 -303 -62 -59 -8 -121
7452 -121 17 -69 -240 64 -69 -59 36 89 -91 -53 31 94 -72 -116 -5 44 57 -31 247 69 -75 -2 -20 65 22
7477 22 52 -240 147 201 22 54 62 -95 139 130 -26 384 -29 -68 43 16 95 -37 11 -136 -141 40 -37 -120 -27 -81
7503h1J02q2K4M9j22n5J05J33j30k0j1J86k89l1KM66j43q6k65J91J39q3L3j36
7527a04J23m3J20j41L03l03m6J94q4L3k39J98P0j89N17n81J30L60m66J61L69m17
7549c5P5O4J06k10r4K11m10J33K52m4K3J04r2k61J91k9j3j50J1J58k57M27j91
7572c1P6l3j22r6J70L2j1k0K8n4m4J27pK9p8k6q2J6K18m74J61Q9K52k21J35K6
7598F0l8j17Q4k17L98j65n7j94N7K35k14J28K1lj09M9n4K73k60K07j92m9L09j1
7622A41o0mj26M8M3M7J47j1k07o8J94l29L49j39J07j85n5J97J35j00o8N3l7J70
7646B42p2k19M3j91L19r3n8l2N6k15K86k35J09L7N7j96K3O3P6J29l28O4K2J2J73
7671G2j42j89K92k48M05k01j5J4j87L42Nj87J69O2m09J78J70m20K68l7j8K3o2
$$ plain form
7503 -81 21 -61 -37 12 -110 -165 -60 73 -57 -77 -88 98 -191 -222 -220 246 103 17 -248 -57 82 -1 32 -104
7527 -104 19 -24 96 -45 258 -45 -91 103 19 52 -187 11 81 -108 409 -172 -42 318 -148 13 382 -35
7549 -35 40 104 210 0 -94 117 -293 -160 92 48 71 175 83 -178 13 -16 -29 -179 -168 -10 -267 160 -31
7572 -31 45 12 -110 -206 -36 -4 -15 -35 -7 -61 -105 22 15 44 -34 -60 -142 -126 92 -382 -221 -132 120 -101 34 60
7598 60 22 -95 -11 -228 170 5 -52 -246 -189 46 -168 -40 -19 -22 -131 -82 -136 137 -123 84 -108 -157 152 141
7622 141 81 77 -49 -1 42 89 236 225 18 -50 144 -185 164 25 132 -53 -108 89 224 124 56 109 72 242
7646 242 170 -49 -6 -197 122 29 -29 -61 -5 -220 66 -169 -60 -23 34 -162 -139 -76 0 129 -199 -135 -113 -101 72
7671 72 -70 -259 33 -215 190 -11 -26 -12 -199 143 148 -39 130 192 -217 -39 131 -289 -21 -58 -76 -53 -115
7694a15K5K15j99n0K03l51N03k9k01K03p2k06K73R1k29j70K45P3o2j40R5l09L50
7717A43j1j28k8J20Lj52K25m25L50j42j28K40Pl76N00k94J67p8JN0L2p2k00n5
7741b51k3L12l59K12m1Q9J17p0k47K53k2r6L09l19J81J95k95J73j69l3J86rR1
7764A84l05o7Q2L59k85K56k83J04K17o6l05K90j17J26j98j08K68k52J62J60j29
7785I3j01j30J61J22j7j03J87j04k19K83j76j38J06j75J79J82j03k4J48j71R5
7806I5j26J6K19l05J44N5l01M10k25J38J28k75qQ1l52J99J92k00J10J53j52K35
7828B31l11N9L9K16k39Mo5O0mk36O15n21J90J41n0k83L06k13J6L1p6J71o8K0L8
7853G1n9j33J26l0J35k00K03j04K8p3K63k51j68M76l68R8M9j44J07M2k14K58k06
$$ plain form
7694 -115 -90 125 -74 -124 79 -272 231 202 1 204 132 -74 199 290 61 -109 136 209 147 7 102 -207 143
7717 143 132 4 -24 96 99 -53 172 -253 97 -45 -173 67 74 -302 198 -96 71 -7 -6 44 76 4 -196 -251
7741 -251 -274 38 -321 -109 -150 -61 56 -14 -261 -8 -30 -126 183 -136 45 240 -55 118 -51 -84 102 93 184
7764 184 -121 -188 -106 253 -32 224 -59 45 262 196 -109 181 64 190 -8 -116 152 -100 62 222 93
7785 93 -8 -138 23 145 128 25 212 108 -111 172 -4 -142 -36 -211 -32 150 47 23 171 0 95
7806 95 -31 -15 204 -101 43 98 -203 207 -18 120 248 -27 -35 46 -306 -107 85 -115 -5 148 -4 231
7828 231 -80 -21 18 234 -5 -1 -66 -6 -10 -246 369 -152 38 179 129 -154 152 -61 -45 -14 -90 81 13 33 71
7853 71 12 -121 5 -25 110 -90 113 9 37 -36 227 -24 -192 284 -84 14 63 -81 26 68 -146 112 -94
7876i4k57J74K8j28M86k48J81k93J5J9K7P8J81k85q9J89l01L28J26l82K85K1o9
7899hn7Oj56K00O8j66R9J47l6k72J19j30J65n4o0K75k2J06k76P5l2m0P3NnK62
7925B86k42J49k47J00J6j03J08Nn7K53j02j41l1Jl4oJ72j59J86j01J8Pk4N0j67
7950f3l4J60o1o8l0k67K00k0J37Pk81L93j43K4L1o5J31j82K82k37M0J02j21J59
7974I4P6j71j87J00J65Q3r6j83J05QK15k26L8L65m32j69L67k84L41j29j54L24
7996B50k15j87J64J20j48j17L43m39K50K02l34J28n9LK87k74oK02k10O8J16j83
8018c9K2O9k61K73l9k66P1J45Q8j07K3o3j99L77j80qM4j80R6oJ11r9o8J42K01
8043A47k41J03r9O5j94J08r8K69l0P7j18P3J87J8l70k01K71m9K89k07J20m5j8
$$ plain form
7876 -94 -351 -177 -149 -277 209 -39 142 -151 -136 -117 -90 -12 169 -116 -205 -16 -317 11 137 -245 40 61 -8
7899 -8 -65 -59 -215 -15 53 -113 -14 133 97 -175 -56 -186 -21 -75 -135 140 118 224 -52 23 -9 -49 24 29 24 286
7925 286 44 193 -54 46 62 -41 67 72 15 268 166 25 -6 -5 -39 -45 127 -32 154 53 71 78 54 104 -63
7950 -63 -97 63 2 -66 -96 -363 -163 -183 -46 -39 -320 73 -70 -46 -15 -80 51 -131 151 -86 -46 56 -65 94
7974 94 170 -1 -188 -88 77 160 64 -119 -14 -6 209 -17 21 386 -46 -215 152 -132 209 80 -74 250
7996 250 35 -152 12 132 -16 -133 210 -229 21 223 -111 17 -42 -39 248 -26 -32 170 -40 28 144 -39
8018 -39 -17 52 -209 64 25 -241 -170 -25 63 -44 -21 -84 -283 94 -86 -94 -50 -230 -134 -140 -29 -128 -196 -54 147
8043 147 -94 9 -90 -25 -219 -111 -209 60 30 107 -11 62 249 267 -103 -304 -33 -82 207 0 120 75 57
8066E7J21j96J43L2j37L9K35k08k38L39j02J4K3k52N1K24p1k08J57j20Q3L98l89
8089eJ65j21R6k09j4J42Q5l42L01j47j83L72O1k94J11O7j2j29O1p9J46j07J08
8112G3jn8m4j28K72o1q7J28o1j16K75k32O6q3j19K29L6k57K70j09M3Q6%k02o5
8137a45J79j45R2N9J30j11L2L6j12j52K64j07J18p0j81J7J52j54Q8k16K45K17
8159B36k10j54J90j43L41l57j55L85j19j59J55k99M5K15J72o0p7n4J63l1j51O4
8181cP3j76J17j60j2Q8J42J08l74J74
$$ plain form
8066 57 178 -18 125 157 20 59 294 86 -152 187 85 99 122 -130 -79 145 74 -134 23 -97 -14 384 -5
8089 -5 160 39 135 -74 -88 54 139 -203 98 -49 -232 140 201 -93 18 85 73 -56 5 -74 72 -35 73
8112 73 72 14 -30 -158 114 53 -34 94 33 -83 192 -40 26 -57 -176 53 89 -168 102 -7 36 122 122 -80 -145
8137 -145 34 -111 -19 40 170 59 91 127 15 -137 127 20 138 68 -113 -96 56 -98 -10 -226 19 236
8159 236 26 -128 62 -81 260 -97 -252 133 14 -145 10 -289 -244 -29 143 83 6 -48 115 84 -67 -3
8181 -3 70 -106 11 -149 -161 -73 69 177 -197 -23
8191b3
$$ Imaginary data points
##PAGE= N=2
##DATA TABLE= (X++(I..I)), XYDATA
0@%%%%%%%%qJ6j6J7k5L8m6N6p2R4j18J42j69K03k41K84l38L98m62N34o18P15q22
31d38R38j068J213j373J550j745J961k198K455k736L044l381L750m155M596n078
47b665N603o175O804p496Q257r098J0028j1067J2231j3542J5036j6754J8754k1118
61a1202K3959k7451L1872l7677M5683n7536P7195j17975L57401l64340J11606
72C1535M86876n23233K62782j26360k37459J99738j00004L2129J8713m53294J92678
83b15899J48844p4710j4397l19342K96009L20859o25096K20782K28403n97858
93f32405L79526K92711n18318J48461Q4914j9999K27349l13370l9836L12008j28041
104b07000R1099O6480p2282J43356r5660J65372J24397m95861K63134L73169m37915
$$ plain form
0 0 0 0 0 0 0 0 0 0 -8 8 -8 9 -16 22 -24 32 -40 54 -64 78 -91 112 -129 155 -183 215 -247 287 -331 384 -438
31 -438 500 -568 645 -728 822 -923 1038 -1160 1295 -1441 1603 -1778 1972 -2183 2413 -2665
47 -2665 2938 -3237 3567 -3929 4328 -4770 5258 -5809 6422 -7120 7916 -8838 9916 -11202
61 -11202 12757 -14694 17178 -20499 25184 -32352 44843 -73132 284269 -80071 31535
72 31535 518411 -4822 257960 131600 -105859 93879 -6125 26004 44717 -408577 -215899
83 -215899 -67055 -141765 -156162 -475504 -179495 141364 -483732 -262950 -34547 -632405
93 -632405 -252879 39832 -478486 -330025 -245111 -265110 -37761 -351131 -390967 -78959 -207000
104 -207000 -115901 -49421 -121703 21653 -74007 91365 215762 -280099 -16965 356204 -81711
115h1711J42746J80538k68534K31979l340j76212J94528j49865K6765K66670k10781
126A52783l0795J13484m6419M7463j83747k691J82989k62344Q1139K00416l31293
137g9015P6126J51201k15938R1687m3735r9532K21794j22612p0363J79752j56100
148f6735k0934P7247j20493N2363m2914k2718J63751j49593j0662J74229j68999
159a35458K8226J05439j26935J17338K0810q2417J60778q4047o9280J39477j20478
170d6547o564R0519r2764Q5714J0922p5800J27699p4545n6425J29442r3333J0655
182H973R3192r1977O1613R108r4391P9327o7095o0359R4142q1622J5420P5775
194D2106r6806N7999J9934r6940Q0383k3610n0646R7486m5062m929N9891p6456
$$ plain form
115 -81711 61035 241573 -26961 205018 201678 25466 219994 70129 96894 363564 152783
126 152783 121988 235472 189053 236516 52769 50078 233067 -29277 51862 252278 -79015
137 -79015 -2889 148312 -67626 24061 -19674 -119206 102588 -20024 -90387 89365 -66735
148 -66735 -87669 -10422 -130915 -78552 -121466 -144184 19567 -130026 -140688 33541 -135458
159 -135458 -107232 -1793 -128728 -11390 9420 -72997 87781 3734 -65546 73931 -46547
170 -46547 -53111 37408 -55356 30358 41280 -34520 93179 18634 -37791 91651 -1682 8973
182 8973 102165 10188 71801 80909 -13482 65845 -1250 -61609 32533 -49089 -33669 42106
194 42106 -54700 3299 23233 -73707 6676 -16934 -67580 29906 -15156 -20085 39806 -36650
206c6650K1755O876p2793N5898j5073j8244Q0059m5118J3524N6601p3772L5605
218H668K7155o1152O5312P113l3325N8407l7202k0571L0884n7504J0820K0176
230A8781l4400M6664K206j7633M1677l5595r750K9074m4197J7524K3876l5427
242B800K6872m998l7180J2934k8047j6781J4572j8923K1751J7261j7132K7990
254A119o133k7435K0869j2935j0563K4226p772M476J0925j9811j449m393j7405
267d6281M284O255J3015J2915N449K3551j591j8178J7431l699j8997K0382Q945
280B3481p736R770J28j0681n095r464l956P734O352N496J6539J2962r078l786
294C2666P063j6260j4719J3003N01j0624P799K768j5822r354m494r390k417M724
$$ plain form
206 -36650 -14895 -8019 -80812 -24914 -39987 -58231 21828 -23290 -9766 46835 -26937 8668
218 8668 35823 -25329 39983 47096 13771 72178 34976 14405 45289 -12215 -1395 18781
230 18781 -15619 31045 33251 15618 57295 21700 11950 41024 -3173 14351 38227 2800
242 2800 29672 24674 -12506 428 -27619 -44400 -29828 -48751 -27000 -9739 -26871 1119
254 1119 -5014 -32449 -11580 -24515 -35078 -10852 -18624 -14148 -3223 -23034 -24483 -28876 -46281
267 -46281 -41997 -35742 -22727 -9812 -4363 19188 17597 -581 16850 13151 -5846 14536 23481
280 23481 15745 25515 25643 14962 9867 403 -3553 4181 10533 16029 32568 45530 36452 32666
294 32666 39729 23469 8750 21753 22254 11630 19429 22197 6375 -2979 -7473 -16863 -19280 -14556
308a4556O082J1520O154l042P27l877j6380o191K497o022j144R075p23r882j073
323b6835m794r877P74Q262O141Q813J1894Q092k028n281M76p190q359P675M553
338g684Q02O465J210J314m357q280R715M681l219J9325J4095m80J442M25K060
353C7514j6350j4570K0221n520j6757K5109j074j8209Q018p412k312j575j2757
366e674K6794R582k4102J6328L485k2108o787r930N038j1819j8980M0958o475
379c690m1970L3714L48k7991J5949r522J2620J7818k4269L2359M081m8850L0305
392i098O970l2091Q875n799K5663J4029m0430L7711R081m7740M5030O791l0495
405a1503L0982m326K2884J2786o1039L7560J7764o3872L9210K649l5138M4983
$$ plain form
308 -14556 -8474 3046 9200 6158 6885 3008 -13372 -19563 -17066 -23088 -24232 -15157 -15880 -25762 -26835
323 -26835 -31629 -41506 -40732 -32470 -26329 -17516 -5622 2470 442 -4839 -4363 -11553 -19912 -12237 -7684
338 -7684 -6882 -417 793 2107 -2250 -10530 -815 3866 647 19972 34067 33587 35029 35454 37514
353 37514 21164 6594 26815 21295 4538 29647 28573 10364 18382 10970 8658 7083 -5674
366 -5674 21120 30702 6600 22928 26413 4305 -2482 -12412 -7374 -19193 -38173 2785 -3690
379 -3690 -45660 -11946 -11598 -39589 -23640 -33162 -20542 -2724 -26993 5366 9447 -39403 -9098
392 -9098 -2128 -34219 -25344 -31143 -5480 8549 -31881 5830 14911 -32829 12201 18992 -11503
405 -11503 19479 15153 38037 50823 -10216 27344 45108 -18764 20446 23095 -12043 32940
417C2940j4550O43J9594n9826L7988L0834o7597L3691J2420k5665L5815l7809
429a522l682K1541o7685M3222K0890q0770N8073J0415m4384N5745m6048j2140
441d6345O3101o8425K2697N0196p1878M2182J9372m9487L6970l2972q21M5685
453A0275o2655M4120L4025p0344P2909n180o0357Q7530m5995k6825R3523o7931
465C095P243O4125q1928L2263K3984n9910M8706k5040j3700O3754n4176K1342
477B9758K2638p6858P7640r292q4492R5078m1998m1084J01767q6665k2684P2477
489C6285q1635L6488K2444q8924P2974P681m3433N0339n6302J2708M4114p3452
501f0713O0811j0461q0335J23437l0184q1748R2868o0582l117Q6544r8478L1791
$$ plain form
417 32940 18390 19033 38627 -21199 16789 47623 -19974 13717 26137 472 36287 -1522
429 -1522 -5204 16337 -51348 -8126 12764 -68006 -9933 482 -43902 11843 -34205 -46345
441 -46345 16756 -51669 -28972 21224 -50654 -8472 10900 -38587 -1617 -34589 -35410 10275
453 10275 -52380 -8260 25765 -44579 28330 23150 -37207 50323 4328 -22497 71026 3095
465 3095 10338 74463 -7465 24798 48782 -11128 37578 12538 -1162 62592 8416 29758
477 29758 52396 -24462 53178 43886 -40606 54472 12474 -28610 73157 -13508 -36192 36285
489 36285 -45350 -8862 13582 -75342 -2368 5313 -38120 12219 -44083 -31375 12739 -60713
501 -60713 98 -10363 -90698 32739 2555 -79193 13675 -46907 -50024 36520 -61958 -30167
513c0167N7372p6036P6603j035p8080P0875j7478J797L5841q5024O7006L5130
525E6804r4303Q2267k3618p4134J11784m3601k9680P3255q4744N2765N9788j22067
537c5484N6603K2810p1203P7241l7195l1519O3070o8780M3813K8503j16533Q0299
549A1625J8214p5376Q4280m9153k4474R3709q8616J7230N4190j09421P1302L1494
561C5004q9860O8371k4842k3505P6293q6006J5569O0877q8430O7147J9807q4377
573e3952Q1668k2519l3012P4306q3918J4306P1414q9544M9981J9735p9041Q2081
585C1505k3398m5845P6911o6736J2054P0716q7476M0013K5821p0750P1933k8447
597F301m8246P8884n5992L799N8305q3751M1910K7484p2026O7738k1084m5568
$$ plain form
513 -30167 27205 -48831 27772 26737 -51343 19532 2054 3851 39692 -45332 21674 56804
525 56804 -37499 44768 21150 -52984 58800 15199 -14481 58774 -25970 26795 86583 -35484
537 -35484 21119 43929 -27274 49967 12772 -18747 44323 -24457 19356 47859 -68674 11625
549 11625 29839 -45537 38743 -10410 -34884 58825 -29791 -12561 41629 -67792 3510 35004
561 35004 -54856 13515 -11327 -34832 41461 -44545 -28976 31901 -56529 10618 30425 -53952
573 -53952 27716 5197 -27815 46491 -37427 -23121 48293 -41251 8730 28465 -50576 31505
585 31505 8107 -37738 39173 -27563 -15509 55207 -32269 7744 33565 -37185 34748 6301
597 6301 -41945 36939 -19053 -15254 43051 -40700 1210 28694 -43332 24406 3322 -42246
609d2246Q3245m6582q675N4235o8852L5146K3766o9932O0170j1728m3371P2105
621C7281m0679j4087N0881n6319K9509K1831o3457N8936j611m6831O0202l1812
633C844j7426M4103m9482K1629J8790n6546N2811j605m7992N4085k4729j8069
645b0587M1348m3516J9800K5218n5563M1662P456m8385M1398j3353k0399L0999
657F078k9654J7961J6933m5895L8986N414m0785M0353j3268j5315L7851l1766
669a3107J0523K6010m5781K6361J7668m2625K4505M927j3542K0882j8064Q286
681F043J4497k9508K4419M301l0746L0034m930j3253K5723k7712K243K7121l7084
694h852R159J9527k9827J4520Q850j6442R445q492K256Q090k0761J2497M106j7750
$$ plain form
609 -42246 40999 -5583 -14258 39977 -28875 6271 30037 -39895 20275 8547 -34824 37281
621 37281 -3398 -17485 33396 -22923 6586 28417 -35040 23896 22285 -24546 35656 3844
633 3844 -13582 30521 -18961 2668 21458 -35088 17723 16118 -31874 22211 -2518 -20587
645 -20587 20761 -22755 -2955 22263 -33300 8362 15818 -32567 8831 -4522 -24921 6078
657 6078 -23576 -5615 11318 -34577 4409 9823 -30962 9391 -3877 -19192 18659 -13107
669 -13107 -2584 23426 -22355 4006 21674 -20951 3554 8481 -5061 15821 -2243 6043
681 6043 20540 -8968 15451 19752 -10994 19040 14110 857 26580 -1132 1111 28232 -8852
694 -8852 307 19834 -9993 4527 13377 -3065 6380 -2112 144 8234 -12527 -30 4076 -13674
708a3674J8592q922j2865K0581j8532k925K0801k3829M681J9109j9454N264P544
721c629j1106P244j706j156N651o414P091J486q978J1533n337n587J5391r522
735e039j539J6371j0007N91J1259r390K460O320o515L352K536j483J653r18K184
750A1835k989k652O757m658l061R561m412l807P176m616l394L739l578j377J651
765F175k736l71R4k449k323l83J13l461m02L452l700j735M193k622m188K589m5
782g799m003R21K223j472j556J643L05j974L3J650J081l00L82L174J493k295R36
799e558M596k224k521N627K303m035J746N760j812l362M533M216m636m85P215
814A1363L5m087K473L199l92m193K73O832m551o145Q388O29q937J739N409k658
$$ plain form
708 -13674 4918 -4004 -16869 3712 -14820 -17745 3056 -20773 -16092 3017 -16437 -11173 -3629
721 -3629 -14735 -7491 -9197 -10353 -4702 -11116 -4025 -2539 -11517 16 -5321 -10908 4483 -5039
735 -5039 -6578 9793 -214 377 11636 2246 4706 11026 4511 7863 10399 8916 10569 9651 11835
750 11835 8846 6194 12951 8293 5232 14793 10381 6574 13750 9134 5740 9479 5901 4524 6175
765 6175 3439 3068 3162 713 -1610 -1993 -1880 -5341 -5743 -2291 -5991 -7726 -3533 -6155 -10343 -7754 -7799
782 -7799 -11802 -10881 -8658 -10130 -11686 -10043 -9738 -11712 -11679 -10029 -8948 -9248 -8866 -5692 -4199 -6494 -5558
799 -5558 -962 -3186 -5707 -80 2223 -1812 -66 5694 3882 520 5053 9269 4633 4148 11363
814 11363 11398 7311 9784 12983 12591 8398 8671 15503 10952 4807 13195 13824 4887 6626 12035 9377
830I377p831J594R238q292p869J1261k232j0661M126J859k354n746k232J1473
844A711o914j2544J3560P45j2291M074L468K06n926k638J5630q191j4468J9795
858c783Q23j4234P383K651K730j592p734J7014k728j6971K1349K870j5501Q300
872E77L305N638l347j2160K1404j400k1570K3601M01j8023J4036p28J055N26j6625
887c310K0882K948k6893J9762K217j5902J2438o768J614K465k0885K3622K452
900A4642l4399K3516N109k0697J5004j0058j60J0699k2687J8921M904l2686K5848
913b044M907k1289J5899j2161M643J6438k9839J8118J1611l3135K9027L725k6140
926b0240K2731r764K320J9450l3089J6175J9109l1698K3522J192k4249K8406j1550
$$ plain form
830 9377 1546 3140 12378 4086 -3783 7478 5246 -5415 -1289 570 -1784 -7530 -9762 1711
844 1711 -5203 -17747 -4187 -3442 -15733 -11659 -8191 -7985 -13911 -16549 -919 -9110 -23578 -3783
858 -3783 -2960 -17194 -9811 -7160 -4430 -6022 -13756 3258 530 -16441 4908 7778 -7723 577
872 577 3882 9520 6173 -5987 15417 14017 -7553 16048 16449 -1574 12462 11734 12789 13315 -3310
887 -3310 17572 20520 -6373 13389 15606 -296 12142 5374 6988 9453 -11432 12190 14642
900 14642 -19757 3759 8868 -11829 3175 -6883 -7043 3656 -19031 -110 4794 -27892 -2044
913 -2044 2863 -18426 -2527 -14688 -10045 6393 -23446 -5328 6283 -26852 2175 5900 -20240
926 -20240 2491 -7273 -4953 14497 -18592 -2417 16692 -15006 8516 9708 -14541 13865 2315
939B315k433K0112l4367J8916K2013l8879K1042M535k4325L1544j5413j2009K6534
952A9585k8850J3125J9853m0949K1621P884k4585K9725k0547j2097L5115l0598
964a0718P256K1096m1761K5960J1811l2596K9376j5468j2706L8470l1643M58K4961
977A4496l5641K5929Q836l7026L3612j0107j5412L7595l4239K14L3049l7025K0080
990D361R813l7956L7134o256k4012L6374k8725o92L2980l9065J6688J3215l6221
1003b2362L6044q233k6891L9673k6617m537L4018m0732J6388J8525m0004L3536
1015H808m296k8520M1784k4824p974L4825l8572J6173J9876m0738L3377k920k8250
1028b1251M2553k4897r878L8198l7898J2701K2948m1223L2122Q78l0710M0448
$$ plain form
939 2315 -118 19994 -14373 4543 26556 -12323 8719 13254 -11071 20473 5060 -6949 19585
952 19585 -9265 3860 23713 -17236 4385 12269 -12316 17409 -3138 -15235 19880 -10718
964 -10718 -3462 17634 -24127 1833 13644 -18952 10424 -5044 -17750 20720 -10923 -10465 14496
977 14496 -21145 4784 13620 -23406 10206 99 -15313 22282 -11957 -11743 21306 -15719 4361
990 4361 14174 -23782 13352 7096 -16916 19458 -9267 -9959 23021 -16044 644 13859 -22362
1003 -22362 13682 5449 -21442 18231 -8386 -12923 21095 -19637 -3249 15276 -24728 8808
1015 8808 4512 -24008 17776 -7048 -15022 19803 -18769 -2596 17280 -23458 9919 6999 -21251
1028 -21251 21302 -3595 -13473 24725 -13173 -472 22476 -18747 13375 14253 -16457 23991
1040B3991k2057j1862L8741l7093Q699K3853l8874K8244J128l1243L8575k0793
1052A309j4433L9085l5635M409K4874l7441K5005K861l2479L6187j7896j5081
1064a9235L7292l4047J762K6148l4354K2309K213l1988L8222j4317j7805L6537
1076A2737l0359J098K8904l2082J7063L459k6071L7443j3099k0415L5039k3731
1088a0014K975K5918l2873J5632Q419k2842L4144j4226k2764L7630j6528m001
1100A470K0448k9049J5388J2097k4039K3922j2277j7027L5609j8017j0346J8293
1112A6472k1540J6610P176k9953K2656m983j6985K9237j9026j3202K2119j5278
1124f697Q151L033k5275K2280k47j7656K0833j6384n627K2668j7012M476M349
$$ plain form
1040 23991 1934 -9928 28813 -8280 419 24272 -14602 13642 14770 -16473 22102 1309
1052 1309 -13124 25961 -9674 -5265 19609 -17832 7173 10034 -22445 13742 -4154 -19235
1064 -19235 18057 -15990 -14228 11920 -22434 -125 2088 -29900 8322 -5995 -23800 12737
1076 12737 -17622 -16524 12380 -19702 -2639 820 -25251 12192 -907 -21322 13717 -10014
1088 -10014 -7039 18879 -13994 1638 10057 -12785 21359 7133 -15631 21999 5471 1470
1100 1470 21918 -7131 8257 20354 -3685 20237 7960 -9067 26542 8525 -1821 16472
1112 16472 -5068 11542 18718 -11235 11421 6438 -10547 18690 -336 -13538 8581 -6697
1124 -6697 1454 4487 -20788 1492 1245 -16411 4422 -11962 -17589 5079 -11933 -7457 -3108
1137c108k0119K3848o90k2539K0447o649n229J8976j6145J943R724j2586J6606
1150D479l287j6439K1011l950n498J3412j4494N125J1341j5028J1087m2j3426
1163e709J9090l144j0300J1442p396K457O892j2019Q022K85r057J3731p212q221
1177a139J2117q430k51O069j2279P514L069j1130Q906k810p798Q855m238k242
1191c787L145n684N766j284p613Q297m308n031R510o068j341O661n861L288K329
1206a981o942N890J232n302M858N14j337J340r02L042k461k124O691k777l151
1221c410P253k112j509M443l099R21K364l745K376K208l899J539J948j488k496
1236A294R81K047l631q8M439k395k173L960j893k331K240j906k09J310k098K4
$$ plain form
1137 -3108 -23227 621 -69 -22608 -2161 -8810 -14039 4937 -11208 -9265 459 -12127 4479
1150 4479 1192 -15247 5764 1814 -3684 9728 -4766 359 11700 -3328 7759 7717 -5709
1163 -5709 13381 10237 -63 11379 3983 6440 13332 1313 9335 9620 563 14294 7082 -1139
1177 -1139 10978 2548 2297 8366 -3913 3601 6670 -4460 4446 1636 -6162 2693 -1545 -3787
1191 -3787 -642 -6326 -560 -1844 -9457 -1160 -5468 -10499 -989 -7057 -8398 -1737 -7598 -4310 -1981
1206 -1981 -8923 -3033 -1801 -7103 -2245 -1731 -3068 -1728 -2630 412 -2049 -4173 2518 -259 -3410
1221 -3410 3843 1731 222 4665 1566 2487 4851 1106 3482 5690 1791 3330 5278 3790 1294
1236 1294 2275 4322 691 603 5042 2647 474 4434 2541 210 2450 544 335 1645 -453 -429
1252d29K285k706j724K360r03k594K122K010k834O79K726k044j400K073j060p61
1268b200J527j092k9J896j542j065J713j016j065J872R97j253J351J190j175j12
1284cP78j501j33J661j388l8K123j667j032J615j042r15R08O85P06k31M58J151
1302B135j542l93Q10j420L72k9j80J622j406j015K635j875j555K464k18M78K23
1319A106r0L036k972j808M142l533j955M329k533L41J546k826K956j199l136M474
1335A878j447j711L419j228J553j031k921M541l871l890P821m428l154P625n102
1350a946J96L331o052M079J226n485O429j006k528L887l988J718k42n542Q016
1365B093k771o883J1633m803m366R805q001l98P864q533N338L460q624P932j118
$$ plain form
1252 -429 1856 -850 -2574 -214 -1117 -3711 -1589 421 -2413 -1734 992 -1052 -2452 -379 -1439 -2200
1268 -2200 -673 -1765 -1794 102 -1440 -2505 -792 -1808 -2873 -1001 -4 -1257 94 1284 109 -3
1284 -3 775 -726 -859 802 -586 -624 1499 -168 -1200 415 -627 -1542 -634 51 757 526 984 2135
1302 2135 593 200 1010 -410 -38 -67 -247 1375 -31 -1046 1589 -286 -1841 623 405 883 1106
1319 1106 1016 4052 1080 -728 3414 -119 -2074 2255 -278 63 1609 -1217 1739 540 -2596 1878
1335 1878 431 -1280 2139 911 2464 1433 -1488 3053 -818 -4708 3113 -1315 -4469 3156 -1946
1350 -1946 -1750 1581 -4471 -392 834 -4651 1778 772 -1756 2131 -1857 -139 -381 -5923 2093
1365 2093 -678 -7561 4072 -731 -5097 4708 -3293 -3691 4173 -4360 978 4438 -4186 3746 2628
1380B628m822N505o372K291M162r093R363n08r104J2865n411p134J3131r629R3
1395b035J1508j2848N026N875j1887P905k432o346R615p604J911P695j2713R048
1409B718K349j3152J4023n165q446J6784j1431k150J4665j5836L168P510j3417
1422h380R960j329p965J3403r041K04J1066j5397O986O160j4549J4495l911j0548
1436h846J9307j1924n846J5972j6260L633J0931j5028J0476j54q541J6392j1591
1449a479m807J4763j4295P091P517j8137J4723j176j2820J8547j3310p983K1069
1462I703j3993J057J0897j6055J2815J587j4013J4773r335m054J8279j5928J073
1475c194J0533j6134J3663o66j8205J9512n989p618J9563j5369q89J5181j5518
$$ plain form
1380 2628 -2194 3311 -3061 -770 3392 -5701 3662 3154 -5950 6915 1504 -5630 7501 -2128 -2035
1395 -2035 9473 -3375 1651 7526 -4361 3544 1112 -5234 4381 -3223 -1312 6383 -6330 2718
1409 2718 5067 -8085 5938 773 -7673 9111 -2320 -4470 10195 -5641 -2473 5037 -8380
1422 -8380 1580 251 -7714 5689 -3352 -3148 7918 -7479 -493 5667 -8882 5613 1702 -8846
1436 -8846 10461 -1463 -7309 8663 -7597 -3964 6967 -8061 2415 2261 -6280 10112 -1479
1449 -1479 -6286 8477 -5818 1273 8790 -9347 5376 4200 -8620 9927 -3383 -11366 9703
1462 9703 -4290 -3233 7664 -8391 4424 6011 -8002 6771 -2564 -6618 11661 -4267 -3194
1475 -3194 7339 -8795 4868 4202 -14003 5509 -480 -8098 11465 -3904 -4793 10388 -5130
1488e130Q299J258j5442J8843m739r737J6424j4506J356J3301j8786R145M631
1501D917j5685J9835m970j2497J9070j1961k009J3817j8486P956P197j5623J5710
1514G271n486j1998J8554j2300k649J4122j7029R278Q743j7846J5229k390j3217
1527i718J8415j1480m880J5842j5496O101Q487j7731J3392j396j2691J7706r923
1540c372l626J7453j5734N556R130j8076J3023l35j3500J7109q735m875J6244
1553A0262j5227L342Q951j6236J2336M29j1845J6835p773m576J4901j4884K611
1566h74R023j6275J0726J165j2079J5547p125o512J3934j3033K023R744j3619
1579g355R422K193j0228J3480p111o168J2389j2075J729Q992j3244Q764K767j0979
$$ plain form
1488 -5130 3169 4427 -11015 7828 3089 -6648 9776 -4730 -3374 9927 -8859 286 4917
1501 4917 -10768 9067 4097 -8400 10670 -1291 -3300 10517 -7969 -13 7184 -8439 7271
1514 7271 1785 -10213 8341 -3959 -6608 7514 -9515 -237 8506 -9340 5889 3499 -9718
1527 -9718 8697 -2783 -7663 8179 -7317 -1216 7271 -10460 2932 1536 -11155 6551 -3372
1540 -3372 -6998 10455 -5279 277 9407 -8669 4354 4019 -9481 7628 -1107 -5982 10262
1553 10262 -4965 -1623 7328 -8908 3428 3857 -7988 8847 1074 -3502 11399 -3485 -874
1566 -874 8149 -8126 2600 3765 -8314 7233 108 -6404 7530 -5503 -3480 6264 -7355
1579 -7355 2067 4260 -5968 7512 401 -5767 6622 -5453 -3724 5268 -7976 788 3555 -7424
1593g424J1683n127o437J3045r095N68R572j0443O163K486r959Q881m499m534
1607e120J0210q684J053P991r853N920J897r365R736l031n114J0549o196j014
1621a021P859q863J767K851p062N707j707l419P913n494J67N313q124L960L220
1636C067o829O766r19m378P728m969l527O160n800K82M247m170K665P22j971M218
1652C292m545o27N336n068K201K586m572M372r15m650M798l819k756O226l300
1667a441j557M387j937P61k01k122K760k162k13L723l270O23K130l082J156j359
1683a804k933M524j640j703M628j231j429K776j143n80J91PK099p87q78K356j647
1700H06r05O93j479J248j05o35L288r61j076K844j019k133J526J44l23L8j0R07
$$ plain form
1593 -7424 4259 -868 -7305 5740 -3355 -2787 6785 -3658 2505 4991 -4968 3913 -586 -5120
1607 -5120 5090 -3594 -2541 5450 -4403 1517 3414 -5951 3785 754 -4360 6189 -7 -1021
1621 -1021 6838 -2025 -258 2593 -4469 1238 -469 -3888 4025 -1469 -1302 4011 -4113 -153 3067
1636 3067 -3762 3004 2085 -2293 5435 466 -3061 3099 -2701 -2419 1828 -2342 323 1045 -926 3292
1652 3292 -1253 -1880 3456 -1612 589 3175 -1397 2975 2060 -2590 2208 -1611 -4367 1859 -1441
1667 -1441 -2998 1389 -548 213 12 -2110 650 -1512 -1725 1998 -1272 -649 1481 -1601 -445 -1804
1683 -1804 -4737 -213 -1853 -3556 1072 -159 -1588 1188 45 -535 -344 -337 1762 975 97 2453 806
1700 806 -99 594 -885 363 258 -377 2911 1950 874 3718 2699 566 2092 2236 1913 1951 1941 2848
1718B848j545q92M89j306q17Q11M4J048k56o6J115j084j648R83m4j265O45P34
1736b06n59o97k37l67p14j137J084L55O1N09J446K4o71oL36q19m02J288J75l7
1756e74J24j22k9l73p31P99M56K83J063J153q1j50K64j44r52K26N96k96K41N87
1776B340l24q58m6p96N16M09o91J603M63n37L55k42j146m67k00j26l50J40N60
1795F03q62n01N48j323l33J178j170R73J553j494R06O20k376N43Rj546J223j83
1813a632J32N71j176Q33m62j049J888j062J70L315k090M38K339l454O46J463l072
1830b202J925N61j892K791r21m80J201j939J334N76j820L740j235j199L669l526
1846E83l81L228m737J155K866l868K671M95l130K944j668r10K698k892K057J358
$$ plain form
1718 2848 1303 411 900 -406 -1223 -412 -368 680 424 358 1473 389 -1259 -276 -320 -1585 -940 -206
1736 -206 -765 -1462 -1699 -2066 -2780 -3917 -2833 -2478 -2417 -1908 -462 -438 -1109 -1115 -779 -1598 -2000 -712 -537 -574
1756 -574 -450 -572 -601 -974 -1705 -906 -450 -167 896 2049 1968 1818 2082 1938 986 1212 1808 1512 1753 2340
1776 2340 2016 1158 1112 316 832 1241 550 2153 2616 2079 2434 2192 1046 579 379 253 -97 43 603
1795 603 -259 -760 -212 -1535 -1868 -690 -1860 -887 666 -828 78 698 -1678 -1135 -1126 -2672 -1449 -1632
1813 -1632 -1500 -929 -2105 -1272 -1734 -2783 -895 -1957 -1787 1528 -562 -124 2215 -1239 -593 870 -2202
1830 -2202 -277 284 -1608 1183 262 -218 983 -956 378 954 -866 2874 1639 440 4109 583
1846 583 202 3430 -1307 -152 2714 -1154 1517 2012 -1118 1826 158 -752 1946 -946 1111 2469
1862B469l107L692j749l525M767l751j633N045m868J381L467m886K850J98l795
1877c445M721k426p89L950m170K536J732n420L767j113m064O038l411j566O476
1892B816n182J242L986o722L668J683m043N326k447j922N641n241P12K776o351
1907d058N184L16m945O654k737k492P066o577K62N159o166M298J716n896N906
1922C690k224k972N252o381R58N054o346M414R56o070P415k503m368O919n938
1937b144Q58O232p370K979J829n954N891k633m559O772m176P54N018p836M231
1952a08K907o688N959k814m149Q734m199j577N207p802L844L424p570M681o70
1967h21l021Q311n214k062N975n888L861K387q604O087J268m094N905n598j979
$$ plain form
1862 2469 -638 3054 1305 -2220 2547 -1204 -2837 2208 -2660 -1279 2188 -2698 152 350 -3445
1877 -3445 1276 -1150 -1939 2011 -2159 377 2109 -3311 456 -657 -4721 1317 -2094 -3660 2816
1892 2816 -2366 -1124 2862 -3860 -192 1491 -2552 2774 327 -1595 4046 -1195 -483 2293 -4058
1907 -4058 1126 1442 -3503 3151 414 -2078 4988 -1589 -1327 3832 -2334 1964 3680 -2216 3690
1922 3690 1466 -1506 3746 -2635 -1677 3377 -2969 1445 2401 -3669 3746 1243 -3125 3794 -2144
1937 -2144 -1286 4946 -2424 555 2384 -3570 2321 -312 -4871 1901 -2275 -1521 3497 -4339 -108
1952 -108 2799 -3889 2070 -744 -4893 3841 -358 -1935 3272 -4530 -686 2738 -4832 -151 -821
1967 -821 -3842 4469 -745 -2807 3168 -2720 1141 3528 -5076 1011 2279 -1815 4090 -1508 -3487
1982c487P477n997J528K362p090P751J110n832N522m513l32P602p624L78M064
1997B919n238O072m77p549N701j525o31N088p693J605O309n732M164j427o333
2012d747Q647j991m081N050o223K523O286p991J373Q48l583O945k835m312O017
2027A926l502K384L165q855L798K807m651N730m318l339Q187m086j259L299o592
2042e306M441L530n591L529j372j065O126n253j134L589m460M423Q36o530N768
2057A531p83k800N552n622o09O273m550J605J901m308M582m88l605L763l231L20
2073d69M016n159K209J605m181M626j638l577N210k799l55L996m498J330K413
2088B729m183K751o96k962M120k358q40L006l535J851Q32l736L211l81k210M280
$$ plain form
1982 -3487 3990 -2007 -479 1883 -5207 2544 3654 -2178 3344 -1169 -1501 6101 -1523 -1145 2919
1997 2919 -2319 3753 3276 -4273 1428 -97 -728 4360 -3333 -1728 4581 -1151 3013 1586 -4747
2012 -4747 3900 1909 -2172 2878 -3345 -822 5464 -2527 -1154 -306 -3889 3056 221 -4091 1926
2027 1926 -1576 808 3973 -4882 -1084 1723 -2928 2802 -1516 -4855 3332 -754 -2013 1286 -5306
2042 -5306 -865 2665 -2926 603 -769 -1834 4292 -961 -2095 1494 -2966 1457 2293 -4237 1531
2057 1531 748 -2052 3500 -2122 -2731 3542 -1008 597 2498 -1810 2772 2284 -1321 2442 -789 -469
2073 -469 3547 -1612 597 2202 -1979 2647 1009 -2568 2642 -157 -512 3484 -1014 316 2729
2088 2729 -1454 1297 601 -2361 1759 -599 -1439 1567 -1968 -117 715 -3021 190 -191 -2401 1879
2104A879k383q94L239l645Q38J490l322K794J68k443K750j166r41K612k675O79
2120a020J962k452K347K33k276K771j276r37J744k257R47J636k291J723K76j992
2136h62K179r23r39J894j482L59J462j625J002K37j412Q47q04l91J203j256P61
2153B50Q06j916J103N12j673J122k45m06J352q20r3R73j415k47P62j138O06r2
2171e59RO82o04N71J97j027Q63J43q94Q32J32n76Q42p32j57N60r21K13N09k67
2191a84J38K89j34J63n78R4O29p87O98J20l54J6o4j76K80o97M3M37o4k7K27j52
2213h3o0R6j21Q5k04M84K54m69J24J11j46j50L0j20K33k98K68J61J03JNM4j81
2236A67J88j8J97k50J19q2j69l08J39j81O4M4J1K23Q4m3j3k86j92k1L63N6k99
$$ plain form
2104 1879 -504 -1398 1841 -1804 -966 524 -2798 -4 164 -2279 471 -695 -1636 976 -1699 -1020
2120 -1020 942 -1510 837 1070 -1206 1565 289 -648 1096 -1161 -214 1422 -869 854 1130 -862
2136 -862 1317 394 -545 1349 -133 226 1688 63 1065 1302 -110 737 -67 -458 745 -511 250
2153 250 1056 -860 243 755 -918 204 -41 -447 905 85 -8 965 -450 -697 65 -1073 -467 -559
2171 -559 -550 132 -472 99 296 -731 132 275 -619 213 345 -231 611 -121 -278 282 -639 -426 83 -184
2191 -184 -46 243 109 272 -306 -212 417 -370 328 448 94 110 46 -130 150 -547 -504 -67 -131 -158 69 -83
2213 -83 -143 -47 -168 -83 -287 197 451 -18 106 217 71 -79 -49 -169 64 -234 34 195 298 299 304 348 167
2236 167 355 337 534 284 403 321 152 -156 -17 -198 -134 -90 -79 144 228 185 172 -114 -306 -327 36 92 -207
2259b07N0O2k34l86L73m95J28L31j86R2N30m39J07j54K10P5M5Q6K7l21N35l21
2281i2LN04p27k26J006o29K37Q13p33M83L45q99N62k20j01N82n38J1M84q26O11
2302F50l6j175J246j62o97J390p83m97R39j144M80N4j055J070k36m36O77r26L54
2321b87N02j262N88J62o80J499n78q74J400j058j37R95j408L22J248j437J066
2338F1k43r68J724j055k89J101j637J195R92j920J416k09j208K358j030j131J833
2355I90j761J061R63k316J697J20j399K065j241m50K302k172R03P11k604K087
2371I56M76k166K450j546r10K619k158J62J433k386J560L50k127K291j156l91
2387e43K264k920O93J748k897K212j56k448L022j377j402K833k389K8K264k737
$$ plain form
2259 -207 -157 -95 -329 -715 -342 -837 -709 -378 -564 -472 58 -381 -274 -428 -218 -143 -98 -12 15 -306 229 -92
2281 -92 -89 415 -312 -538 468 -161 76 889 156 639 984 85 647 427 326 908 370 381 865 39 650
2302 650 614 -561 685 523 -174 1216 433 -64 875 -269 211 265 -790 280 44 -392 285 -641 -287
2321 -287 215 -1047 -459 -297 -977 522 -56 -930 470 -588 -725 270 -1138 -816 432 -1005 61
2338 61 -182 -1150 574 -481 -770 331 -1306 -111 881 -1039 377 168 -1040 1318 288 -843 990
2355 990 -771 290 1253 -1063 634 754 -645 1420 179 -271 2031 -141 762 1473 -1131 956
2371 956 1432 -734 1716 170 -740 1879 -279 -117 1316 -1070 490 840 -1287 1004 -152 -543
2387 -543 1721 -1199 -506 1242 -1655 557 401 -2047 975 -402 -1804 1029 -1360 -1332 932 -1805
2403a805K016L71k425K635j251r95K770k799N11K098l220K415L16k832L174j018
2419c9j421L059l085R71K393l514K168J84k563L543r92k124K909k048P42K311
2435B494l703J716Q37k540L258j514j977L312j771R9K075l997K119J500k886K509
2451A531j404j667L919k388n06K079l450K606J081l750K819o56j540L440l031
2466i17n89K619k731K218L62l621L067o3j676K738l100Q1L579l304J070J106l140
2483b301L284l54k568K696j597j36K812l165P09J918k952K845o78k350L170j471
2499a38o40K687l178R88K269l288K039J65k584L584j420j346K587k494Q76J988
2515B095l437K142M30k473L139j707j038K593k658R43J759l454K321L85k326K510
$$ plain form
2403 -1805 211 582 -1843 792 -459 -1454 1316 -1483 -972 1126 -2094 321 637 -2195 979 -39
2419 -39 -1460 1599 -1486 -515 1878 -1636 532 716 -1847 1696 704 -1420 1489 -559 183 2494
2435 2494 -1209 507 1344 -1196 2062 548 -1429 1883 112 211 2286 -1711 408 1908 -978 1531
2451 1531 127 -1540 2379 -9 -515 1564 -1886 720 1801 -1949 870 214 -1326 2114 -917
2466 -917 -1506 1113 -1618 600 962 -2659 408 345 -1331 1407 -1693 -1612 1967 -1337 -267 839 -2301
2483 -2301 983 629 -1939 757 -840 -976 1836 -1329 -620 1298 -1654 1191 513 -1837 1333 -138
2499 -138 -778 1909 -1269 -281 1988 -1300 739 904 -1680 1904 484 -862 1725 -769 107 2095
2515 2095 -1342 800 1230 -1243 1896 189 -849 1744 -914 29 1788 -1666 655 1040 -1286 1224
2531A224j104j225K851k414K92J511k658J620N11k376K393q84j020K311k161K46
2547h83J844k602J610O43k374K138l74j472K353j854l3K147k477J492N80k050
2563a312J897m93j112K560j965R8J697k372J312N93k054K370o82j438K164j323
2579f0k71J312j557R59M36j665J708o09q76J959j584j34J385j584Q72N13j427
2596f23J412n68r44J349j031m33J506j453N25P60j377J063Q5j200J512p69l50
2613e36J124j487P24N39j184J194k02r30J231p83l92R64q44L05N56r56R19k03
2631C9n26P21m65j11P13q47N60J37p66P15j3o35N41J0k92N17m94K0M38o23O26
2652B65k1p00R24o14j70O78l01p9M96o36O0M42m12N07l53J5K36l78L82k6k42q0
$$ plain form
2531 1224 120 -1105 1746 -668 -376 1135 -1523 97 608 -1768 625 -259 -1279 1032 -1129 -883
2547 -883 961 -1641 -31 612 -1762 376 2 -1470 883 -971 -1004 1143 -1334 158 738 -1312
2563 -1312 585 92 -1020 1540 -425 -327 1370 -1002 310 903 -1151 1219 537 -901 1263 -60
2579 -60 -331 981 -576 383 819 -846 862 253 -623 1336 -248 -382 1003 -581 291 804 -623
2596 -623 789 221 -723 626 -405 -838 668 -785 -260 500 -877 186 271 -929 583 -186 -536
2613 -536 588 -899 -175 364 -820 374 172 -758 473 -310 -702 262 -582 -277 279 -677 242 39
2631 39 -487 234 -231 -342 371 -476 84 221 -545 170 157 -478 63 73 -219 298 -196 -176 262 -361 265
2652 265 244 -456 468 -146 -316 362 61 -18 478 -158 -98 344 -68 439 86 101 337 -41 341 315 73 -7
2674gJ74L8k3k0O7m7q9K0J85q3l22L89j86j26M9j50j37J30k3J73k45p1L49l48
2698c03J47m9j18r2K36j60k0K28k21K24k79L74j72k49J02O5K6J20r4J22j63l5
2720c11K14L03k98j7N9L28J26l63J90P0p6k3Q7k02L90k43N1J43j47j25K23k16
2742A63K43L1l18K8l2K95m27j28K78l3j65J72k8l29M37l09j37K77n0j08K26n07
2764d21L48j99k37L63J40l93M12m57L35l39l62P42j06j44L17l10l05R67o77K8
2784b98L77m73K97M09n38J56K7J03M38n74Q8M52o52N69j67l92M55J96k47P68j040
2805d6j5J053j227O01L14q41P77k82n07P72q77L27N73j171Q57K55j050J122o62
2824b7n89R29p19J1R55j460R67L87q82J049r47l75J163r53L16P45j543J266K14
$$ plain form
2674 -7 167 205 182 162 229 182 93 113 298 215 -107 282 96 -30 19 -131 -268 -138 -161 12 -233 -304 45 -303
2698 -303 -156 -205 -323 -415 -179 -339 -359 -131 -352 -128 -407 -33 -205 -454 -352 -287 -261 -141 -235 -113 -276 -311
2720 -311 -97 206 -92 -109 -50 278 404 41 231 301 225 202 289 87 477 234 285 428 281 156 379 163
2742 163 406 437 119 147 115 410 -17 -145 133 100 -65 107 79 -250 187 -122 -259 18 -32 -140 86 -421
2764 -421 -73 -272 -509 -146 -6 -399 13 -444 -109 -448 -810 -68 -174 -318 -1 -311 -616 351 -326 -298
2784 -298 79 -394 -97 312 -226 -70 -43 60 498 -76 12 464 -188 381 214 -178 277 473 226 994 -46
2805 -46 -61 992 -235 366 680 -161 616 334 -173 599 -278 49 622 -549 308 563 -487 635 -27
2824 -27 -616 313 -406 -395 560 -900 67 454 -428 621 -326 -701 462 -491 -175 570 -973 293 507
2843E07j630J337l74n74J402j051k99J415j324M83O93j849J648M2j281J755j475
2860e75Q6J386j598P17O07j783J914k48j423J974j279k38J763j882M94Q89j834
2877a030J880l29j691K434j342m72J661j955Q22J133k373J926k02j699K448j218
2893gn41J858k056N57J346k262J801ok103K499j422o86K663k509P84J519k545
2910a110J560J65k168K653j318r74K487k343M45J743k674K009M0k192K605j088
2926a60j041K652k315M16J710k702J740O00k617K599j142q15K296k175K52J974
2942A272k468J410O09k031K624j169j323K701k294L11J709k396J288O87k173K193
2958I50k58j788K735k148j12J998k280J296Q75k761K407o39j519K445j862j64
$$ plain form
2843 507 -1123 214 -160 -734 668 -383 -682 733 -591 -108 585 -1264 384 426 -855 900 -575
2860 -575 -489 897 -701 16 623 -1160 754 506 -917 1057 -222 -460 1303 -579 -85 804 -1030
2877 -1030 850 521 -1170 1264 -78 -550 1111 -844 -22 1111 -1262 664 462 -1237 1211 -7
2893 -7 -548 1310 -746 -189 1157 -1105 696 690 -1413 1086 -336 -1022 1641 -868 -84 1435 -1110
2910 -1110 450 615 -1553 1100 -218 -1192 1295 -1048 -603 1140 -1534 475 515 -1677 928 -160
2926 -160 -1201 1451 -864 -448 1262 -1440 300 900 -1717 882 -260 -1075 1221 -954 -702 1272
2942 1272 -1196 214 823 -1208 1416 247 -1076 1625 -669 -358 1351 -1045 243 930 -1243 950
2958 950 692 -1096 1639 -509 -621 1377 -903 393 1268 -1493 914 275 -1244 1201 -661 -825
2974h25K169k423J243Q95k577K366l88j767K256j346l54J845k046Q20R42k304
2990a494J999m99j234K037j519j19K044k666J006J293k570K183m25j279K170j233
3006c06n38J896k023O28J208j922J394K4j261J759q19n69J830k339P76J385j923
3023h00J216K45j710J991p09j020J983j697J81J884k228J030J13j141K011j254
3039I5p37J661j297N40J042k255J348N54j565J331p56j152K195j220k19J101j578
3056i12J085L10j306R22n47m14J677j216n37J242j234P61L39j538J303j15p02
3073h82J475j216k93J228q94K19L54r57J165L85j223P12o65L79Q67j146N25K93
3091C26p80J127k17j156J316n57p8J024j236K76Q06o78O19l85n80J032m70j16
$$ plain form
2974 -825 1344 -1079 164 1059 -1518 848 460 -1307 949 -397 -751 1094 -952 -132 810 -1494
2990 -1494 505 6 -1228 809 -710 -829 1215 -1451 -445 848 -1722 461 36 -1243 927 -306
3006 -306 -844 1052 -971 -343 865 -1057 337 361 -900 859 40 -529 1301 -1038 -262 1123 -800
3023 -800 416 661 -1049 942 233 -787 1196 -501 -320 1564 -664 366 479 -662 1349 95
3039 95 -642 1019 -278 262 1304 -951 397 951 -614 717 -39 -1191 1004 -216 -435 666 -912
3056 -912 173 483 -823 99 -448 -862 815 -401 -938 304 -930 -169 170 -1368 -65 -180 -882
3073 -882 593 -623 -916 312 -582 -363 -9 -966 199 584 -639 73 -592 -213 654 -492 33 326
3091 326 -454 673 456 -700 616 59 -19 1005 -231 45 851 173 792 407 -173 859 389 273
3109B73L21q32Q44K13r46N18r2m16P10n15j83M92l58J33q8o75L82Q8j88J09nk53
3131d68P09n54m4J95l49L27k44j45J95j19R5K74n36N8J53j14J00K79l59M98k3
3152g2J15pj77j40J85MR8k5j8K11j62J04R3m22L41K61j99N2J79j55K0L12m42K69
3176D25J47l73J57j39O1j52j89K09l3j61L89k61J16K42m56l1L57o31L43k33J5
3197a98K43j41l5q4j98l1K86O5j71M3j82K72o7k44L27l16j3K04j96K20l0J9J12
3220a15m42N43p9j3n8Q0qM05l55MK53j78k9M17p06L16L07r9o7j23j56L25J14j91
3244A45K14k41J20J14n20N52l97J53J85l83K7N08m00j38N65m45k5J30j97O9J17
3265A53k56M74k13j03L38n86J02K66n06K27j7j55N02n02o1L94l71KM35o33O53
$$ plain form
3109 273 594 -238 606 819 -127 391 299 -117 593 78 -105 387 29 162 74 -601 -219 -131 -319 -210 -215 -468
3131 -468 241 -313 -357 -162 -511 -184 -428 -573 -378 -497 -402 -128 -664 -606 -453 -567 -467 -188 -547 -49 -72
3152 -72 43 36 -141 -281 -96 -92 6 -19 -37 174 12 116 209 -213 128 389 190 242 421 266 286 598 156 425
3176 425 572 199 356 217 278 126 -63 146 113 -48 341 80 196 438 -18 -49 308 -323 20 -213 -198
3197 -198 45 -96 -131 -215 -413 -444 -158 -93 -264 -221 -403 -131 -198 -442 -115 -431 -444 -240 -436 -216 -246 -227 -115
3220 -115 -557 -14 -93 -106 -164 -84 -92 313 -42 -38 215 37 8 425 -281 35 342 243 176 53 -103 222 336 145
3244 145 359 118 238 352 -168 384 -13 140 325 -58 -31 477 77 -61 504 59 34 164 -33 36 153
3265 153 -103 371 158 55 393 -193 -91 175 -331 -104 -121 -276 226 -276 -337 57 -314 -312 123 -510 143
3286A43q8l75N92n90j48M87m65K21K24m83M75K19m72N41o83N9J069r79K42M01
3306C90q39P37k0r48J226o53j02Q92r84K31P15q63Q03k3r73J004m50l08R70q92
3326h7L12M37j159O70J10r61J412p47l19J311j364M14O25j504R69L30j350J275
3344C74j56q28J292j100kQ17j253Q70K94j387J707q00k21J094j292L92R28j610
3362h81R97J35r04J236o73j158J505q76J03J430j855J118K27j042J423r71m78
3379f64J454j217R6J135j709J162N59j384J198p54m93J740j068k47J484j821J095
3396E66N54j939J387k13o88J631j412j02J329j374N60K92j719J825j56j099J758
3413A200j715j1J759j855K03R79j634J389K00j767J602o45l83J452j792M48P71
$$ plain form
3286 143 55 -320 272 -318 -466 21 -444 -223 1 -482 -7 212 -260 281 -402 -343 726 -253 -11 390
3306 390 -449 288 268 -680 546 -107 -209 683 -301 -70 645 -218 585 562 -411 593 143 -165 805 -87
3326 -87 225 662 -497 173 283 -678 734 -13 -332 979 -385 29 654 -850 119 449 -901 374
3344 374 218 -610 682 -418 -420 397 -856 14 308 -1079 628 -172 -393 701 -591 -199 729 -881
3362 -881 116 251 -653 583 -90 -1248 257 -619 -516 914 -941 177 404 -638 785 -186 -664
3379 -664 790 -427 -331 804 -905 257 816 -568 630 -124 -617 1123 55 -192 1292 -529 566
3396 566 1120 -819 568 355 -333 1298 -114 -216 1113 -261 299 591 -1128 697 541 -558 1200
3413 1200 -515 -526 1233 -622 -419 560 -1074 315 515 -1252 350 -295 -678 774 -1018 -570 201
3430B01r80J025p6j308J798q85l84J430j829M94J347j749R48L50j434J700o11
3447C7p33J355j175P41O88j602J128J82j127J467j147l27J774j733M61R98k080
3464a093J223N62j511J720n09r92J508q37M8O43j365Q54K24j314J517n52o94J536
3482I68j424J04J320j714Q84M89j336J327n74p16J114n79j35Q36j366P25M46j197
3500h28J213m61q29J688j204j24R74j158R66M04j462Q50mp65J249o38k07P86r90
3519e40O06N44j451J039J68r01J030o03OQ56j095M18L59r78O60m8m60Q66m34p0
3539b8Q85q39j50P90q88O00j73n87R04j56o63J079r62rM38n47N49R7n12O88l16
3560B00n33N39n19J16M34n73K56K60p29P69k35n33O70k23k70M45l66K13J9k40
$$ plain form
3430 201 -779 246 170 -1138 660 -225 -609 821 -1008 -514 833 -916 32 382 -1052 648 37
3447 37 -696 659 -516 225 913 -689 439 621 -506 961 -186 -513 1261 -472 -11 987 -1093
3464 -1093 130 692 -819 901 392 -600 908 71 119 762 -603 251 475 -839 678 126 -568 968
3482 968 -456 -352 968 -746 138 627 -709 618 44 -672 442 -137 -272 564 -802 -77 369 -828
3500 -828 385 -76 -905 783 -421 -545 429 -729 237 641 -821 29 25 -740 509 -129 -336 450 -540
3519 -540 66 610 -841 198 366 -535 495 -108 -102 754 -341 77 436 -542 118 70 -390 476 42 -28
3539 -28 857 18 -132 658 -230 370 197 -390 514 358 -305 774 -188 -197 241 -306 243 340 -172 516 200
3560 200 -333 206 -313 -197 237 -336 -80 180 -549 220 -15 -548 122 -101 -371 74 -292 -79 -60 -300
3580c00L79j84l95M64q1LL45m37J65k2l73N11l01q0L79k17O2N42m59J22J03k85
3602e9L41r7k70O08l88K47k5n49J69P5j14K54m4j14L07p6m44L93j64o7O7k03N53
3625D00j96k32L57k10k67K73k10j81M34k30j18K88k31Q1J11k84qr9K63J14k32
3646a77K48k27j68J62j2k40L00Jm7K28j74K6p8j57K44K0J13n2K3M2l02M4J63k63
3670b83J84J37j3JJ23L1l16L84l2k0l2K8j11J97k59K6Q7q0J8r2J77j45j34K25
3694A01J9M1Q2j21j3J05k31j20J95j64J87j9m5q7j8j0N1J82k2M4m21M04o3j28
3718e1J0k11M02p3k7n5O6r0k54K34k60L63k57M47l02M6j9m6o5j28K71k85K46j67
3742b05j1L20l25R2M10n81K34L5m6N4M5M7J90l26o2J18j18J69Q4j68K40k21r8
$$ plain form
3580 -300 79 -105 -500 -36 -117 -114 231 -206 -41 -63 -436 75 -226 -306 73 -144 -82 460 1 123 226 -59
3602 -59 282 185 -85 523 135 382 357 -192 -23 52 -62 192 148 34 341 265 -179 214 50 -17 50 -153 400
3625 400 204 -28 329 119 -148 125 -85 -266 168 -62 -180 108 -123 -42 69 -215 -223 -322 -59 55 -177
3646 -177 71 -156 -324 -162 -174 -414 -114 -113 -160 68 -106 -80 -158 -315 -71 -51 62 10 33 75 -227 -183 -20 -283
3670 -283 -99 38 25 26 149 180 -136 248 216 196 164 192 81 278 19 45 132 52 70 -22 155 10 -124 101
3694 101 120 161 243 122 109 214 -17 -137 58 -106 81 62 17 -70 -88 -98 -47 135 113 157 -264 140 77 -51
3718 -51 -41 -252 150 77 50 -5 61 -29 -283 -49 -309 54 -203 244 -58 -12 -31 -77 -142 -270 1 -284 -38 -205
3742 -205 -216 104 -221 -129 281 -300 -66 -31 -77 -23 22 69 259 -67 -129 -11 -129 40 124 -44 196 -25 -123
3765a23M20m95K66K01k92L09Q4n36O02l08k14L76k51P0R6k73L67o1n46P26j87
3786B31l61M02k83j06L64l14Q6J79o49L79o5j82N73l65l24O61o45K74L86q49O72
3807F4q1k59L24k79j35M06m95M43R5m90P54l52l83K91j07M4O21q21M09K62p43
3828d32M77M0k65P33m00m13O55p66P83K0p17L71O5l34P28m40j72P15p80M01P1
3849C40o60O60k2p80R60o22k50R44n74r7K52n09N80J37r07O58j77j86Q11j011
3869d53K37M32q80P45L2o81Q50m84j33N14p52M36N82r18M57Qo93R17k65k81N16
3890A86q00P01K73r45O35K03p77J046o14k88R40n53J40L69j102Q64nq29R15k98
3910F1k97P45o53j0M75o90Q66L7p62O22j30o11Q68m51j82O22p22O11k36p69Q56
$$ plain form
3765 -123 297 -198 68 269 -23 286 370 -166 436 128 -86 290 39 109 205 -68 299 238 -308 418 231
3786 231 -130 272 -11 -117 247 -67 19 198 -451 -72 -137 -319 254 -111 -435 226 -419 -145 241 -608 64
3807 64 -17 -276 48 -231 -366 40 -455 -12 83 -407 347 -5 -388 -97 -204 -160 461 -360 49 311 -432
3828 -432 45 85 -180 553 153 -260 395 -371 412 432 -285 86 151 -183 545 105 -67 648 -132 269 340
3849 340 -320 340 318 -462 498 -124 -374 570 -4 -101 151 -358 222 359 -548 110 -67 -253 558 -453
3869 -453 -216 216 -664 81 113 -568 282 -202 -335 179 -573 -137 445 -473 -16 -8 -701 216 -49 -330 186
3890 186 -614 87 360 -585 50 253 -524 522 -92 -380 560 7 147 516 -586 278 273 -556 359 61
3910 61 -236 509 -144 -154 321 -369 497 534 -228 394 264 -347 521 70 -112 510 -212 399 163 -606 250
3931B50j79l14Q09p51J82O42r08M09o4o89J054l19p98Q71m10N0N78p70l2L35k80
3952c34N96l72m78Q34m59k27P04r05P10L32j004P11l33j73P46m72r7K67k56L96
3972A86K53o98K14L62l34L24k21m49R31o70L55J32n77L36K91m73M25k58l35R87
3992G81r32K13L47n33L89j2m74M07r6m7N95q19Q6R7P2J41L5n84N68j54k70L00
4014A10k70k40N67l52P7R3j65K76l42J34J46j15j22K47m10P9N48n63M69r8l24
4035b55J92o5m5M28l69m0J94l40K28L23j79J37l30K49l1j97J63j9q6L04j03k26
4057f7L70j36O8r3j40J58kM2k2j79p2M07j46j88J77j28P8L4k50L22m3k31K59K49
4081D67n83J50q5R6j35J15J66k35k46L73k1k78J28j12J53j04j79P4K03l02L29
$$ plain form
3931 250 71 -243 566 -185 -3 639 -269 140 76 -613 441 122 -676 195 -215 -165 413 -357 -389 -54 -334
3952 -334 262 -110 -588 246 -213 -440 264 -641 69 401 -603 108 -225 -398 348 -124 -221 46 -210 186
3972 186 439 -259 -45 317 -17 307 86 -363 568 -102 253 385 -192 144 435 -38 387 129 -206 781
3992 781 -151 62 409 -124 265 253 -221 186 90 43 638 -181 -95 2 74 215 250 -334 234 80 -190 110
4014 110 -160 -400 167 -185 -108 -15 -180 96 -246 -112 34 -81 -203 44 -366 -287 261 -302 167 69 -255
4035 -255 -63 -128 -173 255 -114 -154 40 -300 -72 251 72 209 -121 128 97 -100 63 44 -42 262 159 -67
4057 -67 303 167 235 142 2 160 158 200 178 -1 -73 334 188 0 177 49 127 161 -89 233 190 -41 218 467
4081 467 -116 34 -51 45 -90 25 191 -44 -290 83 62 -216 -88 -200 -47 -151 -330 -256 -53 -355 -26
4102b6P4m66M3M6J63N9j85J56m8j38J11M46l01m4k27L60r6j19J84M5nJ40j29q1
4126c8J09J56m4J04j89o8R7R9J63q0j45j55L47l85L74O0P5l89N0K2j59R8r6Q4
4150I0N2L9M5j83J56o0kj42j48L86m19P8m5O2j20N7j46J58p4N5J10mL6J0l02N9
4176b52J65o1J11j98R8j60J62M0J25j66n5M2M3K6K14k93J84j09l1K65l38K41R8
4199A51n3Q2ql2M7jl5k6k44L15Q6O0p9Q6l79J8K29l68L91o3o0M8j97Q2o7p6M21
4226C28k17k98K08P8j27n2k05M22k66m5R8K9l34K29R%j01j52K16L1k0m3l4J2L5
4251a99r5j01J88o0P5R9j92K07%l28J72J1K51p4j77K74j03J49m8j02K34Oj74R
4275B2L15k19K16l11j32O43k57k51l1O8J31J28m02J34J6O0k3j27k9L53l23j81
$$ plain form
4102 -26 48 -418 -375 -329 -166 -107 -292 -136 -184 -322 -211 235 -66 -110 -337 23 -73 -192 -8 37 32 172 43 -38
4126 -38 71 227 183 287 98 30 127 226 389 309 164 9 356 -29 345 405 480 91 141 163 4 102 6 90
4150 90 142 181 226 43 199 139 137 -5 -153 233 -186 -108 -153 -91 -211 -154 -300 -142 -216 -161 -51 -55 -19 -9 -311 -252
4176 -252 -87 -148 -37 -235 -137 -297 -135 -95 30 -136 -191 -149 -106 -80 134 -159 25 -84 -115 150 -188 53 151
4199 151 98 180 172 140 187 186 151 125 -119 196 282 342 263 349 -30 -12 217 -151 240 177 117 165 -32 50 -17 -93 328
4226 328 111 -187 21 99 -28 -80 -285 137 -129 -174 -76 -47 -381 -152 -143 -143 -244 -396 -180 -149 -169 -212 -246 -234 -199
4251 -199 -294 -395 -207 -267 -192 -93 -285 -78 -78 -406 -234 -223 28 -46 -223 51 -52 97 49 -53 181 187 13 22
4275 22 337 118 334 23 -109 534 277 26 -5 63 194 322 -80 54 70 130 107 -20 -49 304 -19 -200
4297b00K47j40j72L38l88N04k65k02M12j37l3J88m73M37k0k30K13j12j88J8K48
4318D5k12j6k03L82j17j44K57j92J62O7j35j19J98k40J70J81k31L7J52k69K98
4339G1K9k09N06m39k0N11m67K51l5j34J35r4O5R5r2k08J26j19L5Q9k3J27k72J85
4363A13P2l01q0N55m93J54Mj01K29j30QL47k66j08J08m42L70J04n21M70k88k56
4385d52K44Q2K69k85j84K48R5m11M66k47j99L84l98Q9K61l86J66J91Q3J03k03
4406h4q8N63k44k06L7k02K89J09l78N04j70j67O4k35J65J91O9k39j5RJ66nk20
4429h7M77k91n4K86l37J11kn2jR0j33K33j82J7K35l22K4O8k07L50p8L0k59J54
4453G0j65J36j01j3ol11J89K02j36J59j65K1J51k19m1k9o2L3J42O1j50K21j25
$$ plain form
4297 -200 47 -93 -265 73 -315 189 -76 -278 134 -3 -36 152 -321 116 96 -134 79 -33 -221 -203 45
4318 45 -167 -183 -386 -4 -121 -265 -8 -200 -38 29 -106 -225 -27 -267 -97 84 -147 -110 42 -227 71
4339 71 100 -109 397 -42 -62 449 -18 233 198 64 199 105 170 265 173 -35 91 -28 7 96 73 200 -72 113
4363 113 185 -116 -196 359 -134 20 24 -77 152 22 30 377 111 3 111 -331 39 143 -378 92 -196 -452
4385 -452 -208 -126 143 -142 -326 -78 17 -394 72 -175 -374 10 -388 -299 -38 -424 -258 -67 16 119 -84
4406 -84 -172 391 147 -59 -22 -224 65 174 -204 300 130 -37 27 -208 -43 148 217 -22 -37 -28 138 133 -87
4429 -87 390 99 45 331 -6 105 103 51 50 140 7 240 58 75 310 -12 12 80 -127 223 145 175 -84 70
4453 70 -95 41 -60 -73 -79 -390 -201 1 -135 24 -141 -120 31 -188 -229 -258 -320 -287 -145 -84 -234 -13 -138
4476a38J31j45j23K50j18K48j61m6J29j21J53j10k31L07J16j15R1o4k3J15J27
4497B72k09l3R7L2J62j94j10R2j20L19k36J25Q2j59J09qo4J4k26J01L5oR3J0m60
4522b82K83K3O7j65OJ17r0j45J90j7j33J37k03O5j28J45k0J62j85j11J13R0rj55
4546b45R6J65J6q5M7q9q4J82j1j25o9J88M7K01l74J69Q5j33j22J17J00O2j56J78
4570A60j47J75j9k0j06K18q7n4J45Pq3n8P6j69L4J15Mk27L6J10J09o8j91J55N8
4595A73m6Q5j21k6k5n2r1K4p0J33J07j21j64R3P5j87J13L2j55K42k3j56J80j57
4619a37j9k1P4n0K45l23J02R9j52O6j09J56j72J53Q4jjQ3P0j62k3O1k69L53n8
4644D9J15k9k6J30k04O7m0K6P9M0k45K75r8O1j82K1Q6j87K1L13j1k75J19Oj6J24
$$ plain form
4476 -138 -7 -152 -275 -25 -143 105 -56 -102 27 -94 59 -51 -282 25 141 26 117 53 30 145 272
4497 272 63 30 127 159 321 127 17 109 -11 308 72 197 279 120 229 221 157 171 -55 46 81 75 168 178 -282
4522 -282 1 24 91 -74 -68 49 -41 -186 4 -13 -146 -9 -212 -147 -275 -130 -150 12 -173 -284 -171 -81 -90 -245
4546 -245 -149 16 32 -53 -6 -95 -179 3 -8 -133 -202 -14 33 234 -140 29 114 -19 -141 -24 76 138 -18 160
4570 160 13 188 169 149 43 261 174 120 265 272 189 131 207 38 72 187 191 -36 0 110 219 151 -40 115 173
4595 173 127 212 91 65 40 -12 -103 -79 -149 -16 91 -30 -194 -101 -26 -213 -100 -68 -223 19 -4 -160 20 -137
4619 -137 -156 -177 -103 -153 92 -231 -129 -30 -182 -116 -225 -69 -241 -88 -4 -5 -6 77 147 -15 -38 23 -246 107 49
4644 49 164 135 109 239 35 102 62 88 167 207 -38 237 139 200 18 39 125 -62 -41 272 261 -14 105 111 95 219
4670B19j68k05J43J82j31J11j7q5j3O6J38n50L36j68Q0p0P1j17J8K06N0o9j0l1
4694a4J6J46m7l0k12o4o0J91n4J11p3K30j67J06j10J66k23Q9M00n17PJ91q1j04
4718a03L20q8p6P8j09PJ9Q6r2L3R8j4J95k70L2l3J1M0R6k02J21J3J71k66J27r1
4744A03k8k58K20Q5k06L37l40j00j4J18p7J12r9Lq1Q0l0r9J82r2K53j75L7r0J05
4769e4Qp1j73K02K64k87n5j35J06K0K20l8j26J57k50K67L9l13J62N9K74k06K45
4792C15j0m72K40P4m5p6J82k24M4Q0j69L77k87O0N5pK6j54JM4J05p3J9J3j04N1
4818F5K1j14j28m0J75N7j29J47r4p4M8j50Q6M4j09O7L0J00j49l3J9J80K52m59
4842a88J38o4o9N7k20M33k69k1J07P5r9O4l5P8J63m13L01J22l43L47J45r3l3j58
$$ plain form
4670 219 51 -154 -11 171 40 151 134 49 36 102 240 -310 26 -142 -62 -132 -61 -178 -160 46 96 27 17 -14
4694 -14 2 148 101 71 -141 -205 -265 -74 -128 -17 -90 140 -27 79 -31 135 -88 1 401 -116 -109 82 1 -103
4718 -103 217 129 53 131 22 29 48 134 42 75 173 159 354 84 116 83 94 134 230 28 149 162 333 67 194 103
4744 103 75 -183 37 122 -84 253 -87 -187 -201 -83 -160 -48 -147 -144 -225 -145 -175 -274 -92 -184 69 -106 -69 -159 -54
4769 -54 -46 -117 -290 -88 176 -111 -166 -301 -195 -175 45 7 -119 38 -212 55 94 -219 -57 2 276 70 315
4792 315 305 -167 73 147 102 26 208 -16 28 108 -61 316 29 89 144 137 163 9 10 54 159 86 105 118 14 65
4818 65 86 -28 -156 -196 -21 36 -93 54 -40 -114 -66 -216 -130 -86 -195 -128 -98 2 -147 -180 -161 19 271 -188
4842 -188 -50 -114 -183 -126 -346 87 -182 -203 -96 -21 -120 -56 -91 -13 150 -263 38 160 -183 164 309 216 183 25
4866B5k3Q3J49l04K21o4J11l99K33K35m9P7Kk69J54R2l65K16Lnj91p1J10Q3p8
4891b4J48oj19N0j17L9M0J9k3R8m14R6L18l72K31o9j03K38j83l6J28j65j2Q3j55
4916c10K83l6j23K22j64r3J67j57J39L43m98L49j12j55K39o3j96M07j97K22l9
4937B28l13L78j57j54K10j01N7J61k68K6L13l66L78l01j45L52k96J99J37k00L3
4958A71J70l32J86J10k66K84m6j66M1m6r7N4k14Q0o9R8L02l99J55P8m34J46l9
4981b33K18p6J12l03M66m59J10J89k09M7r2J59k05J88j55K41j12r7K09K2n0J38
5003A08k03J18j28N6Q2K21k61J02p3J41k5j99L23k42j66L15j40P3RK33j53J88
5025C79m23p9J89K67l03J1R6l09M08k25J23j87J01j39L1J22j8K3J7j31L2J82n17
$$ plain form
4866 25 2 85 234 -70 151 87 198 -201 32 267 218 295 297 28 182 274 -91 125 128 123 -68 -139 -29 54 -24
4891 -24 124 118 -1 49 -68 -29 11 30 7 105 -309 -213 105 -267 -36 -105 -208 30 -153 -189 -61 -226 -238 -155 -310
4916 -310 -27 -63 -186 36 -128 -221 -54 -211 -72 271 -227 122 10 -145 94 31 -165 242 45 267 228
4937 228 -85 293 136 -18 192 91 148 309 41 67 380 14 392 91 -54 298 2 201 338 138 171
4958 171 341 9 195 305 39 323 277 111 152 106 9 63 -151 -71 -140 -42 260 -139 16 94 -340 -194 -233
4981 -233 -15 -91 21 -282 184 -275 -165 24 -185 -138 -230 -71 -276 -88 -243 -2 -114 -211 -2 20 -30 108
5003 108 -95 23 -105 -49 33 254 -7 95 22 163 138 -61 262 20 -146 169 29 102 111 344 191 379
5025 379 -44 -123 66 333 30 41 137 -172 236 11 134 -53 48 -91 -60 62 44 67 84 -47 -15 167 -350
$$ [...]
8191b4
##END NTUPLES=NMR FID
##END=
