##TITLE=1H_LR-733-CR4B
 CDCl3,8 sc, 
 4.03.2021
##JCAMPDX= 6.0         $$ Bruker NMR JCAMP-DX V2.0
##DATA TYPE= NMR FID
##DATA CLASS= NTUPLES
##ORIGIN= UXNMR, Bruker Analytische Messtechnik GmbH
##OWNER= root
$$ XWIN-NMR		Version 3.5
$$ Thu Mar  4 09:59:47 2021 Russian Standard Time (UT+4h)  she@DPX200
##.OBSERVE FREQUENCY= 200.1315066352
##.OBSERVE NUCLEUS= ^1H
##.DELAY= (6, 6)
##.ACQUISITION MODE= SIMULTANEOUS
##.ACQUISITION SCHEME= undefined
##.AVERAGES= 8
##.DIGITISER RES= 18
##SPECTROMETER/DATA SYSTEM= spect
##.PULSE SEQUENCE= zg30
##.SOLVENT NAME= CDCl3
##.SHIFT REFERENCE= (INTERNAL, CDCl3, 0, 15.7039)
##AUDIT TRAIL= $$ (NUMBER, WHEN, WHO, WHERE, WHAT)
$$ ##TITLE= Audit trail, XWIN-NMR		Version 3.5
$$ ##JCAMPDX= 5.01
$$ ##ORIGIN= Bruker BioSpin GmbH
$$ ##OWNER= she
$$ F:/spectra/data/she/nmr/H-F/1/audita.txt
$$ ##AUDIT TRAIL=  $$ (NUMBER, WHEN, WHO, WHERE, WHAT)
(   1,<2021-03-04 09:58:44.09 +0400>,<she>,<DPX200>,
      <created by zg, POWCHK disabled, PULCHK disabled
       configuration hash MD5:
       00 E9 B6 7A A2 85 ED C7 34 08 36 98 17 FE 4E 26
       data hash MD5: 16K
       51 AE CF D6 89 E1 6B CE F9 85 E6 E9 F4 B1 EC 6D>)
$$ ##END=
$$ 
$$ hash MD5
$$ CE 0F D5 83 4F 47 33 EF DA 0E 0A 7B 65 FE E9 41
##$RELAX= 
##$RELAX= 
##$RELAX= 
##$RELAX= 
##$RELAX= 
##$RELAX= 
$$ Bruker specific parameters
$$ --------------------------
##$DU= <F:/spectra>
##$EXPNO= 1
##$NAME= <H-F>
##$PROCNO= 1
##$TYPE= <nmr>
##$USER= <she>
##$AMP= (0..31)
100 100 100 100 100 100 100 100 100 100 100 100 100 100 100 100 100 100 
100 100 100 100 100 100 100 100 100 100 100 100 100 100 
##$AQSEQ= 0
##$AQ_mod= 1
##$AUNM= <au_zg>
##$AUTOPOS= <>
##$BF1= 200.13
##$BF2= 200.13
##$BF3= 200.13
##$BF4= 200.13
##$BF5= 200.13
##$BF6= 200.13
##$BF7= 200.13
##$BF8= 200.13
##$BYTORDA= 1
##$CFDGTYP= 0
##$CFRGTYP= 5
##$CHEMSTR= <none>
##$CNST= (0..31)
1 1 145 1 1 1 1 1 1 1 1 1 1 1 1 1 1 1 1 1 1 1 1 1 1 1 1 1 1 1 1 1 
##$CPDPRG= <>
##$CPDPRG1= <>
##$CPDPRG2= <>
##$CPDPRG3= <>
##$CPDPRG4= <mlev>
##$CPDPRG5= <mlev>
##$CPDPRG6= <mlev>
##$CPDPRG7= <mlev>
##$CPDPRG8= <mlev>
##$CPDPRGB= <>
##$CPDPRGT= <>
##$D= (0..31)
0 1.2 0 0 0 0 0 0 0 0.06 0 0.03 0 0 0 0 0.0002 0 0 0 0 0 0 0 0 0 0 0 0 
0 0 0 
##$DATE= 1614837523
##$DBL= (0..7)
120 120 120 120 120 120 120 120 
##$DBP= (0..7)
150 150 150 150 150 150 150 150 
##$DBP07= 0
##$DBPNAM0= <>
##$DBPNAM1= <>
##$DBPNAM2= <>
##$DBPNAM3= <>
##$DBPNAM4= <>
##$DBPNAM5= <>
##$DBPNAM6= <>
##$DBPNAM7= <>
##$DBPOAL= (0..7)
0.5 0.5 0.5 0.5 0.5 0.5 0.5 0.5 
##$DBPOFFS= (0..7)
0 0 0 0 0 0 0 0 
##$DE= 6
##$DECBNUC= <off>
##$DECIM= 32
##$DECNUC= <off>
##$DECSTAT= 4
##$DIGMOD= 1
##$DIGTYP= 9
##$DL= (0..7)
0 120 120 120 120 120 120 120 
##$DP= (0..7)
150 150 150 150 150 150 150 150 
##$DP07= 0
##$DPNAME0= <>
##$DPNAME1= <>
##$DPNAME2= <>
##$DPNAME3= <>
##$DPNAME4= <>
##$DPNAME5= <>
##$DPNAME6= <>
##$DPNAME7= <>
##$DPOAL= (0..7)
0.5 0.5 0.5 0.5 0.5 0.5 0.5 0.5 
##$DPOFFS= (0..7)
0 0 0 0 0 0 0 0 
##$DQDMODE= 0
##$DR= 18
##$DS= 0
##$DSLIST= <SSSSSSSSSSSSSSS>
$$ [...]
##$SUBNAM2= <"">
##$SUBNAM3= <"">
##$SUBNAM4= <"">
##$SUBNAM5= <"">
##$SUBNAM6= <"">
##$SUBNAM7= <"">
##$SUBNAM8= <"">
##$SUBNAM9= <"">
##$SW= 16.9725356469052
##$SWIBOX= (0..15)
0 0 2 0 0 0 0 0 0 0 0 0 0 0 0 0 
##$SW_h= 3396.73913043478
##$TD= 16384
##$TD0= 1
##$TE= 0
##$TE2= 300
##$TE3= 300
##$TEG= 300
##$TL= (0..7)
0 120 120 120 120 120 120 120 
##$TP= (0..7)
150 150 150 150 150 150 150 150 
##$TP07= 0
##$TPNAME0= <>
##$TPNAME1= <>
##$TPNAME2= <>
##$TPNAME3= <>
##$TPNAME4= <>
##$TPNAME5= <>
##$TPNAME6= <>
##$TPNAME7= <>
##$TPOAL= (0..7)
0.5 0.5 0.5 0.5 0.5 0.5 0.5 0.5 
##$TPOFFS= (0..7)
0 0 0 0 0 0 0 0 
##$TUNHIN= 0
##$TUNHOUT= 0
##$TUNXOUT= 0
##$USERA1= <user>
##$USERA2= <user>
##$USERA3= <user>
##$USERA4= <user>
##$USERA5= <user>
##$V9= 5
##$VALIST= <valist>
##$VCLIST= <CCCCCCCCCCCCCCC>
##$VD= 0
##$VDLIST= <DDDDDDDDDDDDDDD>
##$VPLIST= <PPPPPPPPPPPPPPP>
##$VTLIST= <TTTTTTTTTTTTTTT>
##$WBST= 1024
##$WBSW= 4
##$XGAIN= (0..3)
0 0 0 0 
##$XL= 0
##$YL= 0
##$YMAX_a= 795169
##$YMIN_a= -590343
##$ZGOPTNS= <>
##$ZL1= 120
##$ZL2= 120
##$ZL3= 120
##$ZL4= 120
##$ABSF1= 10
##$ABSF2= 0
##$ABSG= 5
##$ABSL= 3
##$ALPHA= 0
##$AQORDER= 0
##$ASSFAC= 0
##$ASSFACI= 0
##$ASSFACX= 0
##$ASSWID= 0
##$AUNMP= <proc_1d>
##$AZFE= 0.1
##$AZFW= 0.1
##$BCFW= 1
##$BC_mod= 2
##$BYTORDP= 1
##$COROFFS= 0
##$CY= 11.3945322036743
##$DATMOD= 1
##$DC= 2
##$DFILT= <>
##$DTYPP= 0
##$F1P= 15.9154993809931
##$F2P= -4.1035820241983
##$FCOR= 0.5
##$FTSIZE= 0
##$FT_mod= 4
##$GAMMA= 1
##$GB= 0.15
##$INTBC= 1
##$INTSCL= 1
##$ISEN= 128
##$LB= 0.24
##$LEV0= 0
##$LPBIN= 0
##$MAXI= 10000
##$MC2= 0
##$MEAN= 0
##$ME_mod= 0
##$MI= 1.114404
##$NCOEF= 0
##$NC_proc= 0
##$NLEV= 6
##$NOISF1= 3.799351
##$NOISF2= 2.8
##$NSP= 1
##$NTH_PI= 0
##$NZP= 0
##$OFFSET= 15.70392
##$PC= 1
##$PHC0= -10759.54
##$PHC1= 9.200939
##$PH_mod= 1
##$PKNL= yes
##$PPARMOD= 0
##$PSCAL= 0
##$PSIGN= 0
##$REVERSE= no
##$SF= 200.130013532006
##$SI= 16384
##$SIGF1= 3
##$SIGF2= 2
##$SINO= 400
##$SIOLD= 16384
##$SREGLST= <1H.CDCl3>
##$SSB= 0
##$STSI= 0
##$STSR= 0
##$SW_p= 3612.71676300578
##$SYMM= 0
##$S_DEV= 0
##$TDeff= 0
##$TDoff= 0
##$TI= <>
##$TILT= no
##$TM1= 0
##$TM2= 0
##$TOPLEV= 0
##$USERP1= <user>
##$USERP2= <user>
##$USERP3= <user>
##$USERP4= <user>
##$USERP5= <user>
##$WDW= 1
##$XDIM= 8192
##$YMAX_p= 0
##$YMIN_p= 0
$$ End of Bruker specific parameters
$$ ---------------------------------
##NTUPLES= NMR FID
##VAR_NAME=  TIME,          FID/REAL,        FID/IMAG
##SYMBOL=    X,             R,               I
##VAR_TYPE=  INDEPENDENT,   DEPENDENT,       DEPENDENT
##VAR_FORM=  AFFN,          ASDF,            ASDF
##VAR_DIM=   8192,          8192,            8192
##UNITS=     SECONDS,       ARBITRARY UNITS, ARBITRARY UNITS
##FACTOR=    0.0002944,     1,               1
##FIRST=     0,             0,               0
##LAST=      2.4114304,     0,               0
##MIN=       0,             -590343,         0
##MAX=       2.4114304,     795169,          0
$$ Real data points
##PAGE= N=1
##DATA TABLE= (X++(R..R)), XYDATA
$$ plain form
0 0 0 0 0 0 0 0 -8 8 -8 8 -8 16 -16 24 -32 40 -48 56 -72 80 -101 119 -142 165 -193 224 -260 300 -347 397
30 397 -452 515 -583 660 -743 836 -937 1050 -1172 1307 -1450 1611 -1783 1975 -2181 2411
46 2411 -2657 2929 -3226 3552 -3914 4314 -4756 5250 -5804 6434 -7152 7983 -8950 10101
60 10101 -11494 13217 -15414 18319 -22347 28313 -38035 56496 -103609 469844 795169 -168216
72 -168216 462233 434942 213368 558374 342506 232134 415611 340213 580404 354925
82 354925 162252 352228 245140 429190 317965 -181386 365275 363972 -187139 237950
92 237950 99845 -297457 139609 1180 -199259 -60715 -260008 -80874 39331 -283642
102 -283642 -201355 -154287 -209538 -174610 -291707 -160467 -210225 -385720 -666 -129525 -485195
$$ packed form
0@%%%%%%qJ6j6J6j6K4l2M0n6P2q8J04j28J52j81K20k61L07l58M17m84N60o47P44
30C97q49R67j098J243j403J579j773J987k222K479k757L061l394L758m156M592
46B411n068N586o155O778p466Q228r070J0006j1054J2238j3586J5135j6933J9051
60A0101k1595K4711k8631L3733m0666N0660o6348R4531j60105N73453L25325r63385
72a68216O30449k7291k21574L45006k15868j10372J83477p5398K40191k25479
82C54925j92673J89976j07088J84050j11225m99351N46661j303n51111M25089
92B37950j38105l97302M37066j38429k00439J38544j99293J79134J20205l22973
102b83642Q2287M7068n5251L4928j17097J31240m9758j75495L85054j28859l55670
$$ plain form
113 -485195 -97133 -127199 -345747 -60483 -136374 -199084 13701 -83448 -80043 -5018 -109392
124 -109392 -47219 12750 7141 2963 -51592 79697 87495 -78888 70754 93308 -69206 103610
136 103610 156230 22418 104249 122712 109715 157041 58967 72932 150137 46901 66746
147 66746 135122 53402 61143 91861 52420 45541 9902 27129 61941 -6685 29456 71147
159 71147 -9108 17280 -933 -77316 -10960 -57953 -109222 -615 -57567 -101895 -21257 -82638
171 -82638 -91247 -50793 -88610 -37005 -42167 -54631 37058 -24620 -44823 33723 -40624 -26348
183 -26348 24134 -38028 15537 22937 -13066 61576 17434 6030 70800 -2145 33558 84634
195 84634 7315 70628 84626 14033 71417 36279 -8980 33593 -14793 -2196 23236 -23794
$$ packed form
113d85195L88062l0066k18548K85264p5891o2710K12785r7149L405P5025j04374
124a09392O2173N9969n609m178n4555J31289P798j66383J49642K2554j62514J72816
136A03610N2620j33812Q1831J8463j2997M7326r8074J3965P7205j03236J9845
147F6746O8376q1720P741L0718l9441o879l5639J7227L4812o8626L6141M1691
159G1147q0255K6388j8213p6383O6356m6993n1269J08607n6952m4328Q0638o1381
171h2638q609M0454l7817N1605n162j2464R1689o1678k0203P8546p4347J4276
183b6348N0482o2162N3565P400l6003P4642m4142j1404O4770p2945L5703N1076
195H4634p7319O3313J3998p0593N7384l5138m5259M2573m8386J2597K5432m7030
$$ plain form
207 -23794 26760 9929 -40894 15399 -30119 -44788 20676 -33466 -17648 23324 -36264 -10555
219 -10555 -14363 -63297 -26744 -48293 -52622 -6893 -40915 -18917 6246 -36627 -1148 583 -28475
232 -28475 16046 2439 -1404 38459 8024 13887 27393 -13076 1838 2315 -17540 11722 7913
245 7913 8758 30367 12735 21453 22669 -1966 20042 16821 3242 33827 22418 6154 20105
258 20105 -1091 -12846 -6271 -16525 -10237 -711 384 9210 9289 7964 2647 -6482 2404 -3047 -11185
273 -11185 9188 4171 -11856 1423 -6713 -27677 -22540 -21485 -26590 -16185 -6335 -2419 2679 3176
287 3176 -2526 -3450 -3539 -10564 -7331 3276 -2121 -4306 5180 -2631 -15807 -10455 -9573 -13922 -5523 6531
303 6531 10942 15692 19856 18509 15987 11313 8163 10366 10848 10167 14863 16529 9884 6855 4720 -796
$$ packed form
207b3794N0554j6831n0823N6293m5518j4669O5464n4142J5818M0972n9588K5709
219a0555l808m8934L6553k1549m329M5729l4022K1998K5163m2873L5479J731k9058
232b8475M4521j3607l843L9863l0435N863J3506m0469J4914M77j9855K9262l809
245G913Q45K1609j7632Q718J216k4635K2008l221j3579L0585j1409j6264J3951
258B0105k1196j1755O575j0254O288R526J095Q826P9j325n317r129Q886n451q138
273a1185K0373n017j6027J3279q136k0964N137J055n105J0405R850L916N098M97
287C176n702r24q9p025L233J0607n397k185R486p811j3176N352Q82m349Q399J2054
303F531M411M750M164j347k522m674l150K203M82o81M696J666o645l029k135n516
$$ plain form
319 -796 -2638 2354 8063 13478 18067 20147 18060 10290 3488 1368 -4313 -8328 -1455 -619 -8268 -4203
335 -4203 -5216 -19909 -20074 -14835 -18090 -15244 -5568 -1203 -3369 -5296 -3845 -10003 -18713 -18083 -19490
350 -19490 -19001 -17146 -18934 -8151 -9045 -22425 -10707 -6481 -17737 -4442 4622 4939 14120 13672 21011
365 21011 21394 -1299 5760 16918 1263 6569 20287 20131 15435 10592 24752 16014 -8886 21020
379 21020 29959 1928 22670 28980 9611 14696 122 -5757 1524 -17773 -4560 5119 -18730
392 -18730 -7842 -2687 -6494 -299 -26525 -13416 13586 -21490 -6576 16621 -18779 -8849 3302
405 3302 -13661 -14815 -34833 -15528 8368 -34366 -11904 17080 -23986 -2220 6691 -24013 128
418 128 -4133 719 28230 -12969 -1664 27904 -11941 2243 1343 -20048 24577 8123 704
$$ packed form
319g96j842M992N709N415M589K080k087p770o802k120n681m015O873Q36p649M065
335d203j013j4693j65N239l255K846R676M365k166j927J451o158q710O30j407
350a9490M89J855j788J0783q94j3380J1718M226j1256J3295R064L17R181m48P339
365B1011L83k2693P059J1158j5655N306J3718j56m696m843J4160q738k4900K9906
379B1020Q939k8031K0742O310j9369N085j4574n879P281j9297J3213R679k3849
392a8730J0888N155l807O195k6226J3109K7002l5076J4914K3197l5400R930J2151
405C302j6963j154k0018J9305K3896m2734K2462K8984m1066K1766Q911l0704K4141
418A28m261M852K7511m1199J1305K9568l9845J4184r00k1391M4625j6454p419
$$ plain form
431 704 39806 -3407 7845 44086 -544 18632 22808 1485 49953 11046 -4795 54253 -6609
444 -6609 -9153 41743 -19250 -4192 25387 -9720 16475 1515 -5181 26945 -24640 -5360 14435
457 14435 -48034 7224 6261 -56573 11362 -16725 -63430 -299 -45245 -52133 -1638 -48007 -24351
470 -24351 -10641 -45757 3916 -23387 -48286 3885 -32840 -10898 20928 -44063 1067 17231
482 17231 -28493 27939 -5844 -29157 50488 6753 6893 55596 -8653 28540 69486 1322
494 1322 20627 32649 20579 46817 12835 21890 35579 -6475 47630 34429 -40785 29645
506 29645 32288 -9986 43016 1618 -18753 43441 1471 -11654 10747 -27708 -1613 14834
518 14834 -16014 -4648 -25347 -15172 19364 -36773 -28842 11468 -28488 -997 11912 -34471
$$ packed form
431G04L9102m3213J1252L6241m4630J9176M176k1323M8468l8907j5841N9048o0862
444f609k544N0896o0993J5058K9579l5107K6195j4960o696L2126n1585J9280J9795
457A4435o2469N5258r63o2834O7935k8087m6705O3131m4946o888N0495m6369K3656
470b4351J3710l5116M9673k7303k4899N2171l6725K1942L1826o4991M5130J6164
482A7231m5724N6432l3783k3313P9645m3735J40M8703o4249L7193M0946o8164
494A322J9305J2022j2070K6238l3982R055J3689m2054N4105j3201p5214P0430
506B9645K643m2274N3002m1398k0371O2194m1970j3125K2401l8455K6095J6447
518A4834l0848J1366k0699J0175L4536n6137P931M0310l9956K7491J2909m6383
$$ plain form
530 -34471 -1814 -4940 -20608 16401 -35388 -36370 31328 -19354 -23910 13161 -31809 -7795 10447
543 10447 -23137 4487 -15814 -15913 35723 -14662 -10924 21591 -28194 12660 13811 -42774 23861
556 23861 5658 -31443 40134 -7528 -24182 32990 -13075 6184 16136 -27054 38997 13571
568 13571 -24602 45286 -13297 -21048 44131 -24031 -3428 21627 -32702 28889 9012 -34782
580 -34782 33425 -17576 -16031 41381 -33889 4513 31770 -37915 29075 9660 -40565 36892
592 36892 -10213 -19447 35653 -30396 11262 33940 -34551 30957 10353 -28881 48394 -6839
604 -6839 -12598 44318 -22930 14562 32713 -35354 23383 3636 -30178 36776 -19211 -17296 37250
617 37250 -32051 3 21329 -39383 12046 -497 -30056 21958 -23269 -15807 23432 -39903
$$ packed form
530c4471L2657l126j5668L7009n1789r82O7698n0682m556L7071m4970K4014J8242
543A0447l3584K7624k0301r9N1636n0385L738L2515m9785M0854J151n6585O6635
556B3861j8203l7101P1577m7662j6654N7172m6065J9259R952m3190O6051k5426
568A3571l8173O9888n8583p751O5179o8162K0603K5055n4329O1591j9877m3794
580c4782O8207n1001J545N7412p5270L8402K7257o9685O6990j9415n0225P7457
592C6892m7105r234N5100o6049M1658K2678o8491O5508k0604l9234P7275n5233
604f839n759N6916o7248L7492J8151o8067N8737j9747l3814O6954n5987J915N4546
617C7250o9301L2054K1326o0712N1429j2543k9559N2014m5227P462L9239o3335
$$ plain form
629 -39903 -8206 8825 -40562 8067 -5265 -30100 18749 -17971 -12883 23063 -26607 -990
641 -990 15354 -21002 14793 2470 -11778 26164 -9764 -5116 27938 -13383 3289 20034 -8312
654 -8312 15811 11131 1953 24071 -3641 2095 25179 -6702 4487 16034 -6470 11106 5008
667 5008 -8361 11677 -6733 -10432 12782 -7264 -7554 9026 -3320 -2283 -3009 -7731 3380 -6266
681 -6266 -8742 3576 -9710 -7276 3413 -10094 -5859 -3840 -12747 2488 -2051 -14357 4380
694 4380 351 -10371 5182 -623 -7837 547 -2863 -1855 -419 -3888 5248 16 -4051 5554 -2391
709 -2391 321 7589 -2874 6992 10678 -2690 11255 10007 -4791 9079 7241 -276 9383 4913
723 4913 3863 7155 1319 6107 4491 478 6917 1659 2690 7856 -2279 3964 6004 -6020 2400
$$ packed form
629c9903L1697J7031m9387M8629j3332k4835M8849l6720N088L5946m9670K5617
641i90J6344l6356L5795j2323j4248L7942l5928M648L3054m1321J6672J6745k8346
654h312K4123m680r178K2118k7712N736K3084l1881J1189J1547k2504J7576o098
667E008j3369K0038j8410l699K3214k0046k90J6580j2346J037p26m722J1111r646
681f266k476J2318j3286K434J0689j3507M235K019q907J5235m539j2306J8737
694D380m029j0722J5553n805p214Q384l410J008J436l469R136n232m067R605p945
709b391K712P268j0463R866L686j3368J3945j248j4798J3870j838p517R659m470
723D913j050L292n836M788j616m013O439n258J031N166j0135O243K040j2024Q420
$$ plain form
738 2400 2787 -7112 457 -1329 -6026 145 -3804 -4529 -1885 -5919 -4913 -5275 -5001 -2014 -6538 -4621
754 -4621 -1778 -8897 -6863 -3832 -8913 -6796 -4948 -6197 -3710 -5645 -5040 -2825 -5368 -3890 -1109
769 -1109 -2190 -895 -64 -195 1093 166 237 2198 1816 1709 2771 3950 3880 3595 5925 6321 4245 5674
787 5674 7663 5051 5366 8102 6732 5178 7452 7088 4005 3624 5509 4528 2490 4649 5958 3237
803 3237 1512 3009 3037 97 -212 3374 1407 -3316 -104 1381 -4241 -4642 -1706 -3786 -5051 -5511
819 -5511 -3932 -3791 -6850 -7217 -3678 -4455 -8298 -6550 -2410 -6185 -11162 -2954 854 -10846 -7984 2405
835 2405 -5778 -9553 17 -429 -5598 -3501 1768 2114 -4567 -2114 4944 360 -1699 3550 4674 3617
851 3617 42 2905 9408 695 -142 12696 5902 -18 7736 8070 7570 3879 2505 12519 5005
$$ packed form
738B400L87r899P569j786m697O171l949p25K644m034J006l62K74K987m524J917
754d621K843p119K034L031n081K117J848j249K487j935O05K215k543J478K781
769a109j081J295Q31j31J288r27P1J961l82j07J062J179p0k85K330L96k076J429
787E674J989k612L15K736j370j554K274l64l083l81J885r81k038K159J309k721
803C237j725J497K8k940l09L586j967m723L212J485n622m01K936k080j265m60
819e511J579J41l059l67L539p77l843J748M140l775m977Q208L808j1700K862J0389
835B405q183l775R570m46n169K097N269L46o681K453P058m584k059N249J124j057
851C617l575K863O503q713q37J2838o794n920P754L34n00l691j374J0014p514
$$ plain form
866 5005 -1767 12835 7191 -4552 4645 8045 4200 -3484 -1780 10113 -3959 -9173 9378 -3448
880 -3448 -10231 4331 -4609 -6189 -3871 -10776 1284 -3979 -16281 121 -3041 -10219 -3346 -9568
894 -9568 -3064 -3508 -12345 6534 -2795 -18192 7246 2153 -9758 2656 -3551 2619 3726 -9238
908 -9238 10448 3146 -11396 14824 5111 -7033 10280 1290 5502 8823 -6635 12504 9131
921 9131 -6102 15039 2826 -3951 13831 -1699 5667 10881 -12181 9641 11271 -11415 7536
934 7536 1186 -6670 9163 -5248 -433 3688 -15733 6696 4289 -19581 4597 -581 -12484
947 -12484 5574 -10344 -8048 4828 -13309 895 990 -17839 5799 -66 -11945 7103 -9568
960 -9568 -5622 12452 -10416 -607 6749 -12179 8212 6229 -7922 10159 -3189 -992 16443
$$ packed form
866E005o772J4602n644j1743R197L400l845p684J704J1893j4072n214J8551j2826
880c448o783J4562q940j580K318o905J2060n263j2302J6402l162p178O873o222
894i568O504m44q837J8879r329j5397K5438n093j1911J2414o207O170J107j2964
908i238J9686p302j4542K6220r713j2144J7313q990M212L321j5458J9139l373
921I131j5233K1141j2213o777J7782j5530P366N214k3062K1822J630k2686J8951
934G536o350p856J5833j4411M815M121j9421K2429k407k3870K4178n178j1903
947a2484J8058j5918K296J2876j8137J4204R5j8829K3638n865j1879J9048j6671
960i568L946J8074k2868R809P356j8928K0391j983j4151J8081j3348K197J7435
$$ plain form
973 16443 -8358 1708 14111 -8354 10645 9468 -10240 12216 3699 -3204 13999 -7486 1354
986 1354 15469 -10331 5398 5875 -13633 14112 2032 -13309 10939 -7195 -5041 12018 -15089
999 -15089 -978 5939 -15727 7822 -3094 -15878 12252 -9517 -9081 12328 -15508 307 8564
1012 8564 -18411 7924 2021 -12960 15061 -7509 -6618 16649 -13303 3002 13327 -15473 11576
1025 11576 6016 -11999 17398 -3490 -5568 16798 -10767 4780 13183 -14649 11529 3945 -12962
1038 -12962 17003 -5229 -8044 16824 -11804 -1278 11059 -14210 7495 2444 -14021 12210
1050 12210 -5600 -8653 13107 -13107 -3487 9261 -13675 5116 1440 -15247 9670 -4724
1062 -4724 -9423 12539 -10072 -4205 10165 -10383 3842 3308 -11917 11182 665 -8427 11754
$$ packed form
973A6443k4801J0066J2403k2465J8999j177j9708K2456q517o903J7203k1485Q840
986A354J4115k5800J5729M77j9508K7745j2080j5341K4248j8134K154J7059k7107
999a5089J4111O917k1666K3549j0916j2784K8130k1769M36K1409k7836J5815Q257
1012H564k6975K6335n903j4981K8021k2570Q91K3267k9952J6305J0325k8800K7049
1025A1576n560j8015K9397k0888k078K2366k7565J5547Q403k7832K6178p584j6907
1038a2962K9965k2232k815K4868k8628J0526J2337k5269K1705n051j6465K6231
1050A2210j7810l053K1760k6214R620J2748k2936J8791l676j6687K4917j4394
1062d724m699K1962k2611N867J4370k0548J4225n34j5225K3099j0517r092K0181
$$ plain form
1075 11754 -4395 -1820 11754 -6995 4215 6565 -6832 13095 2670 -9083 13325 630
1087 630 -1837 12442 -6315 779 8770 -6269 8826 1863 -11997 10663 2174 -6262 6191
1100 6191 -8639 -1020 8882 -9723 1579 119 -12146 9221 -1641 -13991 3862 -5477 -1482
1113 -1482 4791 -15932 -489 4871 -12020 4790 -3506 -12742 9012 -2470 -4498 3649 -11908
1126 -11908 4086 7622 -11379 5175 771 -6947 10997 -2215 -2253 8588 -6391 7480 9650
1139 9650 -9879 8608 6789 -3102 11915 -511 -655 11088 -2863 5376 6400 -7595 9359
1152 9359 6503 -4121 7535 -2543 -194 9889 -5553 1599 5420 -7090 5999 2461 -8158
1165 -8158 2892 -3247 -3277 2677 -8223 -828 1247 -8966 1519 -2377 -9062 1984 -4442 -5472
$$ packed form
1075A1754j6149K575J3574j8749J1210K350j3397J9927j0425j1753K2408j2695
1087F30k467J4279j8757P094P991j5039J5095o963j3860K2660q489q436J2453
1100F191j4830P619R902j8605J1302j460j2265K1367j0862j2350J7853r339L995
1113a482O273k0723J5443N360j6891J6810q296r236K1754j1482k028Q147j5557
1126a1908J5994L536j9001J6554m404p718J7944j3212l8J0841j4979J3871K170
1139I650j9529J8487j819r891J5017j2426j44J1743j3951Q239J024j3995J6954
1152I359k856j0624J1656j0078K349J0083j5442P152L821j2510J3089l538j0619
1165h158J1050o139l0N954j0900P395K075j0213J0485l896o685J1046o426j030
$$ plain form
1179 -5472 667 -8408 -2251 847 -8707 -1294 -2322 -7222 461 -3064 -4082 528 -4089 919 1619
1194 1619 -4244 2595 1025 -2327 4453 990 616 5266 112 2865 4786 -495 4103 5286 940
1209 940 4749 5607 3223 4069 3535 4645 2965 1378 5647 3186 346 4498 2224 -120 2299 -385
1225 -385 -410 1297 -1649 -692 1399 -1823 -1783 138 -1522 -3409 -2532 -1011 -2887 -4049 -1475 -2207 -4317
1242 -4317 -3051 -2866 -3895 -3248 -3337 -2048 -1057 -2780 -1559 19 -2201 -2122 -205 -1125 -1557 163 617
1259 617 -318 107 271 133 438 813 306 1696 2665 1465 2222 3379 1519 1049 2711 1569 823 2097
1277 2097 1865 1283 1392 1506 821 501 878 754 363 1252 1290 709 1188 1043 45 10 -242 -636 -1052 -1010 570
1298 570 -1082 -1937 284 -945 -2687 -218 -506 -1793 -31 -525 -265 -105 -1203 -887 -1670 -2352 -1060
$$ packed form
1179e472O139r075O157L098r554P413j028m900P683l525j018M610m617N008P00
1194A619n863O839j570l352O780l463l74M650n154K753J921n281M598J183m346
1209I40L809Q58k384Q46n34J110j680j587M269k461k840M152k274k344K419k684
1225c85k5J707k946R57K091l222M0J921j660j887Q77J521j876j162K574p32k110
1242d317J266J85j029O47q9J289R91j723J221J578k220P9J917r20m32J720M54
1259F17r35M25J64j38L05L75n07J390R69j200P57J157j860m70J662j142p46J274
1277B097k32n82J09J14o85l20L77j24l91Q89L8n81M79j45r98l5k52l94m16M2J580
1298E70j652q55K221j229j742K469k88j287J762m94K60J60j098L16p83o82J292
$$ plain form
1315 -1060 -1737 -682 -650 -2630 530 -467 -3113 846 105 -2054 1770 302 391 1615 -1350 676 1272
1332 1272 -2221 619 1261 -1232 869 1092 1748 1090 -1343 2769 1227 -1948 4022 1975 -1166 3984
1348 3984 653 -669 2882 -1980 -567 2258 -2177 695 1765 163 1485 -644 388 1584 -2585
1363 -2585 2381 2748 -3273 2265 2343 -2996 1372 -1376 -3592 1311 -2084 -1512 2538 -2904 -346 2052
1379 2052 -2565 473 -526 -1632 2211 -2100 -671 3060 -3775 199 993 -5897 1218 -466 -4574
1394 -4574 4018 -1085 -3650 5014 -2226 -1772 2674 -3954 1005 1373 -2669 4211 -1772 -2751 4352 -4687
1410 -4687 -764 4014 -5657 3552 3876 -4938 6310 1599 -3990 5993 -2128 -103 5828 -4008 2952
1425 2952 3133 -5041 5684 -875 -4688 6099 -3332 34 6228 -5650 4771 5107 -6764 5658
$$ packed form
1315a060o77J055L2j980L160r97k646L959p41k159L824j468Q9J224k965K026N96
1332A272l493K840O42k493K101K23O56o58k433M112j542l175N970k047l141N150
1348C984l331j322L551m862J413K825m435K872J070j602J322k129J032J196m169
1363b585M966L67o021N538P8n339M368k748k216M903l395N72M050n442K558K398
1379B052m617L038r99j106L843m311J429L731o835L974P94o890P115j684m108
1394d574Q592n103k565Q664p240M54M446o628M959L68m042O880n983r79P103r039
1410d687L923M778r671R209L24q814J1248m711n589R983q121K025N931r836O960
1425B952J81q174J0725o559l813J0787r431L366O194j1878J0421L36j1871J2422
$$ plain form
1439 5658 138 -4859 7124 -3185 -1904 5285 -6077 2810 2650 -8556 3067 -1368 -4033 6627
1453 6627 -4883 -1118 6280 -7010 2548 2039 -10439 3462 523 -5898 4199 -5172 -3079 4500
1467 4500 -7596 -409 1142 -6868 4981 696 -4771 4979 -2962 -511 5728 -7711 -269 4604
1481 4604 -5099 3853 1377 -5602 4810 -431 -1182 5369 -4261 1558 7507 -1980 4543 3427 -2377
1496 -2377 6759 464 -2457 5677 -2343 1631 7333 -4322 1812 4902 -3927 3744 162 -3755 6568
1511 6568 169 -935 5333 -4767 62 3324 -6810 943 -758 -6261 4450 -3130 -5129 4876
1525 4876 -6312 -3058 3570 -7316 1484 2483 -6630 4080 -1626 -5171 4725 -6142 -3490 3737
1539 3737 -7574 2068 2535 -7050 5365 -853 -5122 6966 -4344 -1150 7948 -5301 3649 5311
$$ packed form
1439E658n520m997J1983j0309J281P189j1362Q887j60j1206J1623m435k665J0660
1453F627j1510L765P398j3290R558n09j2478J3901k939o421J0097r371K093P579
1467D500j2096P187J551q010J1849m285n467R750p941K451O239j3439P442M873
1481D604r703Q952k476o979J0412n241p51O551r630N819N949r487O523j116n804
1496b377R136o295k921Q134q020L974N702j1655O134L090q829P671l582l917J0323
1511F568o399j104O268j0100M829L262j0134P753j701n503J0711p580j999J0005
1525D876j1188L254O628j0886Q800R99r113J0710n706l545R896j0867K652P227
1539C737j1311R642M67r585J2415o218m269J2088j1310L194R098j3249Q950J662
$$ plain form
1553 5311 -6057 5933 -553 -5562 6308 -3544 -100 7239 -5531 3657 4597 -5774 6432 -245
1567 -245 -4219 8448 -2826 -196 7231 -6070 2462 2858 -7370 4248 -371 -4223 6423 -3108
1581 -3108 -449 6113 -4826 2371 2660 -5586 5238 241 -3147 6015 -3592 -1331 4521 -6718
1595 -6718 579 1864 -5941 3440 326 -2755 4740 -2008 -1110 2968 -4167 1604 1607 -3930 3143 -619
1611 -619 -3247 2567 -4079 -2500 2167 -4581 158 2162 -3090 2276 591 -2919 1733 -1046 -1027 1217
1627 1217 -2652 641 1458 -2327 778 -1009 -2893 1511 -1056 -1021 2675 -833 1933 4074 -1229 974
1643 974 2486 -1070 896 1379 -258 1824 964 595 633 -1706 290 1418 -536 1956 1301 793 4073
1660 4073 222 -535 2511 -1656 -777 2619 -1644 -857 998 -551 -325 -1610 -1623 -36 -1683 -676
$$ packed form
1553E311j1368J1990o486n009J1870r852L444P339j2770R188R40j0371J2206o677
1567b45l974J2667j1274K630P427j3301Q532L96j0228J1618m619l852J0646r531
1581c108K659O562j0939P197K89q246J0824m997l388R162r607K261N852j1239
1595f718P297J285p805R381l114l081P495o748Q98M078p135N771Ln537P073l762
1611f19k628N814o646J579M667o748M739K004n252N366j685l510M652k779J9K244
1627A217l869L293Q17l785L105j787j884M404k567L5L696l508K766K141n303K203
1643I74J512l556J966M83j637K082q60l69L8k339J996J128j954K492o55n08L280
1660D073l851p57L046m167Q79L396m263P87J855j549K26j285j3J587j647J007
$$ plain form
1676 -676 863 -1525 360 157 -1920 -49 -2677 -2815 361 -2785 -2485 496 -1994 -1655 -220 -1871
1692 -1871 -1074 -874 -1061 1357 104 550 1815 47 135 -376 -861 809 -383 -423 2304 84 -161 2256
1710 2256 514 -246 1277 1300 1727 1815 2113 2412 999 979 958 -148 253 -170 208 988 244 -272 1152
1729 1152 -92 -992 57 164 -194 154 447 348 -560 -656 -646 -1798 -2001 -1650 -1432 -1289 -879 -319 -208 -1063
1749 -1063 -1121 -337 -983 -533 317 375 342 195 -108 -287 -1107 -1208 -731 -578 -512 289 779 490 607 671 756 407
1771 407 713 1391 1017 1448 1340 618 716 125 -378 593 131 -195 1364 918 567 1233 1127 383 533 477
1791 477 39 174 570 286 -409 93 -660 -1979 -1207 -822 -1948 -264 466 -869 598 41 -1476 -315
1809 -315 -557 -1292 -165 -310 -641 -537 -767 -601 -1556 -1478 -721 -1605 -269 1049 -795 780 1013 -1049
$$ packed form
1676f76J539k388J885k03k077J871k628j38L176l146L00K981k490L39J435j651
1692a871P97K00j87K418j253M46J265j768Q8n11m85J670j192m0K727k220k45K417
1710B256j742p60J523K3M27Q8K98K99j413k0k1j106M01m23L78P80p44n16J424
1729A152j244r00J049J07l58L48K93r9r08r6J0j152k03L51K18J43M10N60J11q55
1749a063n8P84o46M50Q50N8l3j47l03j79q20j01M77J53O6Q01M90k89J17O4Q5l49
1771D07L06O78l74M31j08p22R8n91n03R71m62l26J559m46l51O66j06p44J50n6
1791D77m38J35L96k84o95N02p53j319P72L85j126J684P30j335J467n57j517J161
1809c15k42p35J127j45l31J04k30J66r55P8P57q84J336J318j844J575K33k062
$$ plain form
1827 -1049 799 665 -1190 995 471 -528 1411 -2 88 424 -716 542 269 -305 2010 350 877
1844 877 3056 -242 784 2157 -1689 729 1210 -1410 1802 594 -1007 1060 -1361 -602 771 -1683
1860 -1683 992 858 -752 2601 -290 -1076 1864 -2297 -699 1593 -2846 379 1071 -2773 911 -668
1876 -668 -2425 1397 -1593 -1070 1767 -1410 1517 1109 -2389 1772 -882 -2030 2454 -2401 -1053 2302
1892 2302 -2603 777 1600 -2682 1182 67 -1557 2828 -425 375 3167 -1218 1367 743 -2969 2313
1908 2313 -165 -2245 2644 -1466 -491 2892 -2578 -101 1935 -1917 2500 894 -1716 2896 -277
1923 -277 -562 2132 -3227 -365 1371 -2768 1569 31 -2713 3016 -862 -1909 2309 -2529 11
1938 11 2694 -2431 942 946 -2088 2440 -1742 -3110 1800 -2019 209 1786 -3601 1413 1531 -2496
$$ packed form
1827a049J848j34j855K185n24r99J939j413R0L36j140J258k73n74K315j660N27
1844H77K179l298J026J373l846K418M81k620L212j208j601K067k421P59J373k454
1860a683K675j34j610L353k891p86K940m161J598K292m439L225O92l844L684j579
1876f68j757L822k990N23K837l177K927m08l498M161k654j148M484m855J348L355
1892B302m905L380Q23m282L864j115j624M385l253Q00K792m385K585o24l712N282
1908B313k478k080M889m110R75L383n470K477K036l852M417j606k610M612l173
1923b77k85K694n359K862J736m139M337j538k744N729l878j047M218m838K540
1938A1K683n125L373Ml034M528m182j368M910l819K228J577n387N014J18m027
$$ plain form
1954 -2496 2129 -1074 -2305 3823 -963 -136 2303 -2754 1391 1675 -3278 1252 -869 -1426 3850 -1633
1970 -1633 -1074 2642 -1878 2126 1488 -3799 1720 972 -564 3027 -2744 -1314 3540 -2122 217 -115
1986 -115 -3710 2755 1202 -1977 1682 -1695 -136 3645 -2608 -558 1229 -1511 2777 336 -2855
2001 -2855 1530 -1120 -468 1733 -3320 -156 2712 -1155 1965 69 -2328 3157 428 -968 1768
2016 1768 -2213 658 3423 -1462 49 -341 -1570 2449 -39 -1887 1415 -504 1410 2369 -2472
2031 -2472 507 1160 -1218 2401 -1023 -2613 2514 -241 -856 706 -3027 -306 1317 -1767 -32
2046 -32 -311 -1059 2117 -322 -1545 625 -1809 368 1095 -2619 177 27 -1870 1825 -1211 -2443
2062 -2443 1687 -1022 -147 1685 -1951 877 1662 -1400 1072 -482 -1264 1896 -1117 -188 1434 -1740
$$ packed form
1954b496M625l203j231O128m786Q27K439n057M145K84m953M530k121n57N276n483
1970a633N59L716m520M004o38n287N519p48j536L591n771J430M854n662K339l32
1986a15l595O465j553l179L659l377J559L781o253K050J787k740M288k441l191
2001b855M385k650O52K201n053L164K868l867L120j896k397N485k729j396K736
2016A768l981K871K765m885J511l90j229M019k488j848L302j919J914R59m841
2031b472K979O53k378L619l424j590N127k755o15J562l733K721J623l084J735
2046c2k79p48L176k439j223K170k434K177P27l714K796j50j897L695l036j232
2062b443M130k709Q75J832l636K828P85l062K472j554p82L160l013R29J622l174
$$ plain form
2078 -1740 1504 848 -2203 1514 -166 -1042 2625 -710 -59 2783 -1045 983 827 -1617 1276 56
2094 56 -863 1829 -797 238 1423 -1932 596 656 -1571 1708 -125 -881 2179 -1032 -106 1438 -2160
2111 -2160 55 530 -1681 730 -199 -788 1324 -1306 -215 714 -1160 688 405 -1118 1124 -120
2127 -120 -542 880 -1105 -480 894 -1317 40 367 -1062 889 -60 -521 911 -597 179 1011 -253
2144 -253 855 464 -321 565 -345 -677 379 -850 -367 470 -505 13 192 -399 184 -58 -407 238 -46
2163 -46 -184 318 -270 -54 -149 -392 -532 -361 -82 169 -22 130 466 179 57 263 55 153 301 215 513
2184 513 392 59 115 254 -268 56 128 43 239 482 702 359 65 298 157 56 74 171 23 104 -91 -8
2206 -8 -219 -532 -325 -310 -356 -73 -271 -68 -319 -427 -337 -459 -608 -346 -336 -430 -355 -260 -530 -380 -467 -525 -260 -217
$$ packed form
2078a740L244o56l051L717j680q76L667l335O51K842l828K028j56k444K893j220
2094E6r19K692k626J035J185l355K528O0k227L279j833p56L060l211R26J544l598
2111b160K215M75k211K411r29n89K112k630J091R29j874J848k83j523K242j244
2127a20m22J422j985O25J374k211J357L27j429J951r49m61J432j508P76Q32j264
2144b53J108l91p85Q86r10l32J056j229M83Q37r75N18J79n91N83k42l49O45k84
2163d6j38N02n88K16r5k43j40J71K79K51j91J52L36k87j22K06k08R8J48q6K98
2184E13j21l33N6J39n22L24P2q5J96K43K20l43k94K33j41j01J8R7j48Q1j95Q3
2206hk11l13K07J5m6K83j98K03k51j08R0j22j49K62J0r4P5R5k70J50q7n8K65M3
$$ plain form
2230 -217 -71 -66 184 114 -92 74 146 -263 131 670 -68 392 254 198 156 307 -99 198 -23 240 549 595
2252 595 451 311 540 308 62 378 153 17 636 342 51 344 -174 -247 150 -182 -42 -24 -77 122 171
2273 171 -173 -16 -342 -262 5 -517 -396 -370 -864 -398 -442 -1011 98 -525 -496 64 -311 -143 -107 -381 146
2294 146 -259 -309 332 -243 -66 452 -204 32 446 -500 487 188 -311 622 268 102 828 81 190 303
2314 303 -370 207 295 210 516 -23 -147 742 -209 -85 173 -367 379 653 -490 300 227 -128 501 -442 -491
2335 -491 112 -520 44 -76 -853 -255 -294 -493 210 -678 -851 286 -401 -260 292 -606 120 91 -991 15
2355 15 -250 -532 434 -268 -276 499 -425 249 381 -862 431 212 -491 911 -272 -199 962 -802 12
2374 12 824 -1085 617 538 -683 1102 -213 -578 1243 -527 228 1062 -911 840 660 -704 1355
$$ packed form
2230b17J46NK50p0k06J66P2m09L94N39p38M60j38n6m2J51m06K97k21K63L09M6
2252E95j44j40K29k32k46L16k25j36O19k94k91K93n18p3L97l32J40J8n3J99M9
2273A71l44J57l26Q0K67n22J21K6m94M66m4n69J109o23K9N60l75J68L6k74N27
2294A46m05n0O41n75J77N18o56K36M14r46R87k99m99R33l54j66P26p47J09J13
2314C03o73N77Q8q5L06n39j24Q89r51J24K58n40P46K74j143P90p3l55O29r43m9
2335d91O03o32N64j20p77N98l9j99P03q88j73J137o87J41N52q98P26k9j082J006
2355A5k65k82R66p02qP75r24O74J32j243J293k19p03J402j183P3J161j764Q14
2374A2Q12j909J702p9j221J785j315l65J821j770P55Q34j973J751j80j364K059
$$ plain form
2391 1355 -511 -814 1490 -473 247 928 -1199 1031 784 -1350 893 -452 -468 1457 -1111 -142 1231
2408 1231 -1543 1161 -80 -2082 1387 -323 -963 1506 -1740 -139 1314 -1501 794 -253 -1737
2423 -1737 1651 -421 -855 1263 -1701 193 1309 -2059 811 -51 -1602 1828 -633 -981 1465 -1418
2439 -1418 266 1136 -1926 918 474 -999 2013 -894 -1251 1959 -888 675 1008 -2007 1023 992
2455 992 -788 1573 -902 -601 1982 -840 -161 666 -1519 1462 605 -1227 913 -455 -292 1604
2471 1604 -1291 -276 902 -943 967 149 -1489 1047 -35 -459 1207 -1511 -83 1123 -773
2486 -773 288 159 -1132 994 -87 -819 582 -789 17 943 -1080 -72 176 -957 818 -15 -1133
2503 -1133 1129 -446 -357 958 -947 -15 725 -858 440 -38 -810 979 -214 -538 981 -676 2
$$ packed form
2391A355j866l03K304j963P20O81k127K230k47k134K243j345j6J925k568R69J373
2408A231k774K704j241k002L469j710o40K469l246J601J453k815K295j047j484
2423a737L388k072m34K118k964J894J116l368K870q62j551L430k461l48K446k883
2439a418J684Q70l062K844m44j473L012k907l57L210k847J563L33l015L030l1
2455I92j780K361k475L01K583k822O79Q27k185K981q57j832K140j368J63J896
2471A604k895J015J178j845J910q18j638K536j082m24J666k718J428J206j896
2486g73J061j29j291K126j081p32J401j371Q06R26k023J008K48j133J775q33j118
2503a133K262j575Q9J315j905R32P40j583J298m78p72J789j193l24J519j657O78
$$ plain form
2520 2 923 -880 507 278 -875 1112 -247 -487 1112 -619 -43 875 -502 504 493 -710 572
2537 572 -229 -522 995 -657 39 874 -759 486 322 -806 531 -260 -604 822 -539 -510 901
2554 901 -817 86 470 -1015 443 -40 -596 601 -203 -67 661 -823 149 339 -676 717 7 -737
2572 -737 648 -478 -377 661 -540 165 369 -860 333 257 -741 480 -193 -375 710 -189 200 680
2590 680 -629 364 290 -628 611 -132 -72 574 -232 200 526 -258 70 457 -579 378 -65 -241 452 -385
2610 -385 79 367 -443 81 82 -682 411 -122 -349 401 -339 -195 295 -288 109 93 -350 513 -87 -478 441
2631 441 -269 -115 544 -470 69 257 -350 410 191 -375 419 -150 -274 96 -76 -13 237 -174 284 -110
2651 -110 -111 470 -144 -199 -13 -431 196 187 -194 211 -27 -178 29 -120 -256 199 -270 16 58 -245 41 -27
$$ packed form
2520BR21j803J387k29j153J987j359k40J599j731N76R18j377J006j1j203J282
2537E72q01k93J517j652O96Q35j633J245j64j128J337p91l44J426j361K9J411
2554I01j718R03L84j485J458m83n56J197q04J36P28j484R72J90j015J393p10p44
2572g37J385j126J01J038j201P05K04j229J193p6r98J221o73j82J085q99L89M80
2590F80j309R93p4r18J239p43O0O46q06M32L26p84L28L87j036R57m43j76O93q37
2610c85M64K88q10N24Jp64J093n33k27P50p40J44M90n83L97j6m43Q63o00l91R19
2631D41p10J54O59j014N39J88o07P60k19n66P94n69j24L70j72O3K50m11M58l94
2651a10jN81o14n5J86m18O27rl81M05k38j51K07j49j36M55m69K86M2l03K86o8
$$ plain form
2673 -27 -50 226 -239 -80 -24 -30 -122 -51 22 -52 103 -42 5 -51 199 255 -113 74 136 77 -81 213 -12 398 63
2698 63 169 51 -70 329 333 -95 62 38 -100 89 -44 36 43 168 46 0 -184 -36 -19 -86 22 -144 41
2721 41 -58 -81 -96 97 -148 -217 298 -303 -198 7 -41 13 -68 8 8 -12 88 84 -154 -10 53 -74 70 250 -5
2746 -5 20 -83 242 199 139 -53 286 -82 183 153 56 363 -1 57 424 -187 -68 42 -214 214 31 -226 87
2769 87 -28 -107 231 90 194 167 -185 99 87 -246 16 -226 -136 514 -310 136 77 -448 64 82 -281 115
2791 115 -210 -178 221 -384 84 310 -513 449 -160 -430 432 -120 -43 379 -475 -12 468 -633 415 254
2811 254 -474 536 -169 31 532 -402 291 490 -326 702 -254 -500 630 -88 -221 281 -511 467 344
2830 344 -594 573 40 -498 567 -454 -326 455 -694 437 -100 -547 556 166 -503 521 -461 -18
$$ packed form
2673b7k3K76m65J59N6or2P1P3p4J55j45M7n6K50N6l68J87O2n9j58K94k25M10l35
2698F3J06j18j21L99Mm28J57k4j38J89j33Q0PJ25j22m6j84J48J7o7J08j66J85
2721D1r9k3j5J93k45o9N15o01J05K05m8N4q1P6%k0J00mk38J44O3j27J44J80k55
2746eK5j03L25m3o0j92L39l68K65l0r7L07l64N8L67o11J19J10k56M28j83k57L13
2769H7j15p9L38j41J04k7l52K84j2l33K62k42R0O50q24M46n9n25N12J8l63L96
2791A15l25L2L99o05M68K26q23R62o09k70Q62n52P7M22q54M63M80j101J048j61
2811B54p28J010p05K00N01r34O93J99q16J028r56k46J130p18j33N02p92R78j23
2830C44r38J167n33n38J065j021J28P81j149J131n37m47J103l90o69J024r82M43
$$ plain form
2848 -18 369 -420 185 249 -711 627 55 -249 380 -471 -76 433 -515 145 236 -423 463 130 -194 538 -244
2869 -244 111 635 -421 70 473 -314 184 194 -409 654 172 -123 395 61 -126 552 -108 168 339 -451
2889 -451 305 12 -600 584 -250 -286 505 -286 -188 733 -470 374 108 -724 581 -40 -800 546 -611
2908 -611 -557 599 -1010 34 281 -742 345 -120 -856 1095 -615 -491 940 -833 170 561 -991
2925 -991 696 170 -793 985 -783 -141 1144 -1075 259 944 -906 929 146 -829 1538 -564 -336
2942 -336 1453 -749 608 538 -1390 1019 168 -995 1145 -734 -273 1233 -1205 219 709 -1265
2958 -1265 980 -41 -974 1482 -725 -517 977 -1393 386 740 -1286 989 -189 -1080 1053 -720
2974 -720 -341 1092 -1384 530 717 -1112 1046 -133 -767 1092 -441 -163 778 -1220 503 367 -931
$$ packed form
2848a8L87p89O05O4r60J338n72l04O29q51L95N09r48O60R1o59Q86l33l24P32p82
2869b44L55N24j056M91M03p87M98J0o03J063m82k95N18l34j87O78o60K76J71p90
2889d51P56k93o12J184q34l6P91p91R8R21j203Q44k66q32J305o21p60J346j157
2908f11N4J156j609J044K47j023J087m65p36J951j710J24J431j773J003L91j552
2925i91J687n26r63J778j768O42J285k219J334O85j850J835p83r75K367k102K28
2942c36J789k202J357p0j928K409q51j163K140j879M61J506k438J424M90j974
2958a265K245j021r33K456k207K08J494k370J779L54k026K275j178q91K133j773
2974g20L79J433k476J914J87j829K158j179o34J859j533K78R41j998J723j36j298
$$ plain form
2991 -931 1179 -139 -582 984 -813 -266 700 -832 420 570 -886 514 130 -505 854 -717 -290
3008 -290 465 -218 183 352 -791 510 81 -428 438 -384 -131 709 -661 43 408 -636 457 107
3026 107 -680 488 106 -174 534 -327 -68 440 -275 172 -75 -493 426 42 -441 429 -514 -157 581 -312
3046 -312 202 209 -376 553 333 -671 232 41 -96 526 -214 -31 241 -106 356 -36 -456 570 -160 -141
3066 -141 614 -208 204 898 -387 159 300 -476 643 267 -367 438 -209 109 546 -365 21 207 -300
3085 -300 125 -37 -497 397 -435 -264 55 -381 -56 221 -604 66 -146 -284 431 -279 -422 293 -372 141
3105 141 175 -319 387 58 44 242 -199 -94 365 160 -104 187 -126 276 123 -267 299 12 90 426 -27
3126 -27 35 470 -19 184 129 -71 252 -138 -57 350 198 125 252 -22 378 316 -131 155 -18 -49 39 115 -42
$$ packed form
2991i31K110j318m43J566j797N47R66j532J252J50j456J400l84o35J359j571M27
3008b90P55o83M01J69j143J301m29n09Q66q22K53Q40j370P04L65j044J093l50
3026A07p87J168l82k80P08q61K59N08p15M47k47m18R19l84m83Q70r43L57P38q93
3046c12N14Pn85R29k20j004R03j91j37O22p40J83K72l47M62l92m20J026p30J9
3066a41P55q22M12O94j285N46J41p76J119l76o34Q05o47L18M37r11L86J86n07
3085c00M25j62m60Q94q32J71L19m36L25K77q25O70k12j38P15p10j43P15o65N13
3105A41L4m94P06l29j4J98m41J05M59k05k64K91l13M02j53l90N66k87P8L36m53
3126b7O2M35m89K03n5k00L23l90Q1M07j52p3J27k74M00o2m47K86j73l1Q8P6j57
$$ plain form
3149 -42 36 -286 -22 25 -187 -58 -36 -243 -130 -177 -175 -148 -136 -42 -140 -177 -58 -58 -15 -127 -275 -345 -47 -92 9 -217
3175 -217 -52 328 72 -110 46 13 -5 -50 -206 183 39 124 86 199 -67 291 -38 38 -68 114 261 72
3197 72 4 190 -31 29 226 224 95 142 7 23 -3 -225 84 51 -222 39 62 7 -169 -189 -134 -70 -64 -129 -144 -40
3223 -40 -17 -95 -40 49 -266 -293 -194 -142 -220 99 -165 52 -184 -211 -14 -18 -85 -16 -180 40 130 -231 159 -21 -118
3248 -118 196 15 4 -24 2 338 131 45 98 228 52 499 23 58 348 221 78 -23 -207 -31 94 -119
3270 -119 -100 240 254 483 19 104 341 68 -4 -52 -100 20 -67 -342 177 -103 -5 212 -307 -30 181 -360 338
3293 338 35 -352 60 -80 -109 106 -294 196 211 -644 -14 -139 -309 238 -70 -167 140 -149 -183 -10 -272
3314 -272 374 64 -300 66 -369 -15 300 -462 90 253 -459 72 58 -260 634 -50 118 588 -64 352
$$ packed form
3149d2P8l22K64M7k12J29K2k07J13m7KK7J2R4r8l7J19%M3j12j48p0K98m5J01k26
3175b17J65L80k56j82J56l3j8m5j56L89j44Q5l8J13k66L58l29P6j06J82J47j89
3197G2o8J86k21O0J97kj29M7j35J6k6k22L09l3k73K61K3n5j76k0N5O4Oo5j5J04
3223d0K3p8N5Q9l15k7R9N2p8L19k64K17k36k7J97mo7O9j64K20R0l61L90j80r7
3248a18L14j81j1k8K6L36k07q6N3J30j76M47m76L5K90j27j43j01j84J76J25k13
3270a19J9L40J4K29m64Q5K37k73p2m8m8J20q7k75N19k80R8K17n19K77K11n41O98
3293C38l03l87M12j40k9K15m00M90J5q55O30j25j70N47l08r7L07k89l4J73k62
3314b72O46l10l64L66m35L54L15p62N52J63p12N31j4l18Q94o84J68M70o52M16
$$ plain form
3334 352 375 -448 461 185 -520 688 -87 -95 553 -399 -46 313 -433 255 282 -423 510 -160 -285 608 -537
3355 -537 122 317 -529 206 102 -474 543 -466 -200 435 -646 -16 316 -365 377 126 -352 430 -211
3374 -211 -235 352 -739 -87 279 -657 332 -233 -439 487 -350 -384 432 -539 63 373 -565 305 40 -501
3394 -501 387 -335 -419 388 -430 14 139 -551 275 15 -350 211 -96 -1 842 -224 -158 423 -530 298 192
3415 192 -678 479 213 -268 513 -153 113 407 -148 -46 283 -341 286 164 -336 396 -135 -206 449 -308
3435 -308 31 453 -359 -12 325 -420 317 -88 -648 523 -233 -226 363 -411 -120 288 -525 156 -132 -395
3455 -395 428 -424 -213 480 -530 20 408 -418 470 19 -664 692 -142 -410 512 -347 -71 291 -552
3474 -552 323 243 -221 630 -291 -365 728 -546 266 654 -673 569 238 -264 389 -156 -158 760 -425 390
$$ packed form
3334C52K3q23R09k76p05J208p75qO48r52L53L59p46O88K7p05R33o70j25Q93j145
3355e37O59J95q46P35j04n76J017j009K66O35j081O30L32o81P42k51m78P82o41
3374b11k4N87j091O52L66r36R89n65k06R26q37l4Q16r71O02L10r38Q70k65n41
3394e01Q88p22q4Q07q18M44J25o90Q26k60l65N61l07R5Q43j066O6N81r53Q28j06
3415A92q70J157k66m81P81o66K66K94n55J02L29o24O27j22n00P32n31p1O55p57
3435c08L39M22q12L47L37p45P37m05n60J171p56PN89p74K91M08q13O81k88k63
3455c95Q23q52K11O93j010N50L88q26Q88m51o83J356q34k68R22q59K76L62q43
3474e52Q75q0m64Q51r21p4J093j274Q12L88j327J242l31n02O53n45kR18j185Q15
$$ plain form
3494 390 308 -225 449 248 -549 442 -301 8 575 -431 167 603 -496 294 45 -558 553 -185 -262 348
3514 348 -356 54 289 -537 251 137 -428 322 -383 -398 215 -396 21 317 -578 267 -82 -446 181 -240
3534 -240 -269 407 -345 -137 179 -234 227 92 -259 277 17 -329 182 -169 44 51 -150 477 127 46 476
3555 476 10 -83 250 76 88 316 -121 197 207 -89 224 -26 -89 299 71 31 281 -9 52 21 214 164 211
3578 211 -158 -133 -329 -59 147 -148 -1 227 -171 41 -45 -126 54 -296 16 -84 -129 -78 -27 9 122 -118
3600 -118 -48 -9 -267 -346 23 -142 -59 142 -323 -140 -83 -153 -57 -119 -23 -96 -223 20 -77 -93 -42 -71 -92 -54 48
3625 48 -54 87 -31 9 11 57 72 -12 20 16 -112 100 79 -132 -47 -37 -44 149 28 -3 166 250 -66 -82 105 100 81
3652 81 92 48 151 -53 3 -26 -65 112 -161 66 58 29 -82 -30 -120 -115 51 -139 -76 -110 47 -231 -222 -86 -121 -172
$$ packed form
3494C90q2n33O74k01p97R91p43L09N67j006N98M36j099P90k49o03J111p38p7O10
3514C48p04M10K35q26P88j14n65P50p05j5O13o11M17K96q95Q45l49l64O27m21
3534b40k9O76p52K08L16m13M61j35l51N36k60l46N11l51K13Pk01O27l50q1M30
3555D76m66r3L33j74J2K28m37L18J0k96L13k50o3L88k28m0K50k90O1l1J93n0M7
3578B11l69K5j96K70K06k95J47K28l98K12q6q1J80l50L12j00m5N1N1L6J13k40
3600a18P0L9k58p9L69j65Q3K01m65J83N7p0R6o2R6p3j27K43r7j6N1k9k1L8J02
3625D8j02J41j18M0KM6J5q4L2mj28K12k1k11Q5J0pJ93j21l1J69Q4l16j6J87nj9
3652H1J1m4J03k04N6k9l9J77k73K27qk9j11N2r0NJ66j90O3l4J57k78RJ36l5n1
$$ plain form
3678 -172 -11 -95 -40 -228 121 72 -189 128 -44 52 91 22 -79 -158 -114 -26 -153 298 49 188 113 142 34 58
3702 58 32 104 170 104 -24 36 39 193 46 98 264 111 52 30 35 207 210 127 41 133 203 -26 -119 123 -35 -269 -106
3729 -106 -339 -250 -103 13 -39 -52 -207 -168 98 -199 200 -107 -202 8 -20 -87 -212 -185 55 7 -128 -53 -283
3752 -283 -61 -171 -194 -157 1 -91 163 -104 -91 -83 -127 -41 162 36 -34 235 -185 136 106 -111 60 226 -130
3775 -130 216 -37 155 297 -15 111 -119 -131 185 0 -161 372 44 -144 -54 131 368 53 -167 222 -50
3796 -50 -150 208 -94 129 97 -190 -117 256 -157 176 -197 -114 103 193 93 -160 -8 46 279 -7 86 -236
3818 -236 -51 248 -72 122 157 -98 -83 48 -178 14 93 141 126 -120 -333 79 -318 35 208 -243 3 109
3840 109 -64 91 -148 -122 282 51 -216 222 13 101 323 -49 48 165 -44 358 54 -161 224 1 241
$$ packed form
3678a72J61q4N5j88L49m9k61L17j72R6L9o9j01p9M4Q8j27M51k49J39p5K9j08K4
3702E8k6P2O6o6j28O0LJ54j47N2J66j53n9k2NJ72Lq3q6R2P0k29r3K42j58k34J63
3729a06k33Q9J47J16n2j3j55L9K66k97L99l07r5K10k8o7j25K7K40m8j35P5k30
3752b83K22j10k3L7J58r2K54k67J3Qm4Q6K03j26p0K69m20L21l0k17J71J66l56
3775a30L46k53J92J42l12J26k30j2L16j85j61N33l28j88R0J85K37l15k20L89k72
3796e0j00L58l02K23l2k87P3L73m13L33l73Q3K17R0j00k53J52N4K33k86R3l22
3818b36J85K99l20J94L5k55J5J31k26J92P9M8j5k46k13M12l97L53J73m51K46J06
3840A09j73J55k39K6M04k31k67M38k09Q8K22l72R7J17k09M02l04k15L85k23K40
$$ plain form
3861 241 89 -91 132 14 -173 224 -77 -372 242 -58 -122 149 -274 21 -56 -73 100 -233 -419 239 -228
3882 -228 -26 211 -120 176 23 -313 543 50 -247 42 -347 -144 202 -269 95 250 -487 129 -178 -310
3902 -310 179 -78 -91 453 -267 -64 -216 -146 237 297 -193 281 1 134 305 -455 146 279 -166 241 108
3923 108 31 436 -25 -163 275 -149 -180 -101 -239 -23 20 -152 326 7 -32 201 -298 177 536 -153 -38 193
3945 193 -97 109 -173 -232 176 -43 159 -52 -324 -42 137 -96 -14 -110 62 163 -122 -3 -89 -228 210
3966 210 101 -284 232 -3 -176 190 -114 -99 53 -94 34 -60 -84 128 -31 -47 153 -69 -79 240 -64 -92
3988 -92 169 62 151 291 54 -77 -19 -270 274 -127 -12 88 -254 -25 79 87 218 -190 -82 175 -40 94
4010 94 396 64 -26 151 -100 422 -93 41 30 87 33 98 -155 107 54 -66 57 -60 -18 -235 -141 34 78
$$ packed form
3861B41j52j80K23j18j87L97l01k95O14l00o4K71m23K95p7j7J73l33j86O58m67
3882b28K02K37l31K96j53l36Q56m93k97K89l89K03L46m71L64J55p37O16l07j32
3902c10M89k57j3N44p20K03j52P0L83O0m90M74k80J33J71p60O01J33m45M07j33
3923A08p7M05m61j38M38m24l1P9j38K16M3j72M78l19l9K33m99M75L59o89J15K31
3945A93k90K06k82n9M08k19K02k11k72K82J79k33Q2r6J72J01k85J19q6j39M38
3966B10j09l85N16k35j73L66l04J5J52j47J28r4k4K12j59j6K00k22j0L19l04k8
3988i2K61j07Q9J40k37j31N8k51N44m01J15J00l42K29J04QJ31m08J08K57k15J34
4010I4L02l32r0J77k51N22n15J34j1N7n4O5k53K62n3j20J23j17M2k17R4J75M4
$$ plain form
4033 78 6 -3 183 -231 28 -45 -259 -22 -103 -61 102 60 -61 85 73 -110 -100 140 304 -55 -58 261 84 -9
4057 -9 18 -43 83 99 -66 2 24 91 127 192 -39 74 -148 -45 3 137 -28 112 -6 16 -21 119 154 -183 169
4082 169 -122 -94 110 117 -159 -106 -12 -100 -143 98 -19 181 127 0 -8 -144 -37 -209 -262 -88 -38 -376 58 -98
4106 -98 -44 11 -71 109 -60 9 245 -218 -259 -193 374 36 -160 -26 -34 39 -105 -243 -310 -75 -107 263 30 -202
4130 -202 -56 66 -211 8 -11 -132 15 22 -12 -117 38 -187 -54 -78 92 25 54 159 200 71 -8 91 -71
4153 -71 34 237 52 155 24 51 -50 -84 53 -196 -211 27 -23 213 -55 107 -103 120 292 21 214 -148
4175 -148 26 8 54 -36 -91 63 -133 134 60 185 -288 -207 -220 92 -103 -228 -150 -34 85 -112 -212 -18 178
4198 178 90 19 57 -42 -14 -52 163 -83 -27 83 68 20 42 -217 -218 -9 183 68 64 11 175 273 3 37 -31 -68
$$ packed form
4033G8p2rJ86m14K59p3k14K37q1M2J63m2j21J46j2j83J0K40J64l59lL19j77r3
4057iK7o1J26J6j65O8K2O7L6O5k31J13k22J03M8J34j65J40j18K2l7J40L5l37L52
4082A69k91K8K04Pk76N3R4q8m3K41j17K00n4j27qj36J07j72n3J74N0l38M34j56
4106i8N4N5q2J80j69O9K36m63m1O6N67l38j96J34qP3j44j38o7K35l2L70k33k32
4130b02J46J22k77K19j9j21J47Pl4j05J55k25J33k4J70o7K9J05M1j29p9R9j62
4153g1J05K03j85J03j31K7j01l4J37k49j5K38n0K36k68J62k10K23J72k71J93l62
4175a48J74j8M6r0n5J54j96K67p4J25m73Q1j3L12j95j25P8J16J19j97j00J94J96
4198A78q8p1L8r9K8l8K15k46N6J10j5m8K2k59jK09J92j15mn3J64R8k70L4o8l7
$$ plain form
4224 -68 83 234 35 -164 28 81 -32 -37 174 26 -124 -77 -74 -160 108 -36 -216 9 -157 -78 283 -60 -172
4247 -172 -142 -192 -377 -129 64 -1 -79 120 64 -208 56 66 66 120 -92 8 -76 63 -54 -53 -34 -63 257 107 121
4272 121 245 138 -49 -13 93 79 -100 115 155 -44 179 230 201 70 -104 61 -140 103 19 99 -26 96
4294 96 135 90 141 174 51 24 134 -127 288 66 104 50 34 -8 -94 -164 38 11 -71 186 -40 -196 -27 52 -91
4319 -91 50 -139 113 162 -124 240 -143 -204 14 -215 -136 -220 -172 -153 3 -28 -107 -39 -12 -194 -234 -88 -106 -18 -2
4344 -2 19 -264 78 -55 349 -59 -48 -159 342 -52 -250 5 99 81 -92 -38 -245 -107 48 -120 -134 -95 234
4367 234 253 20 -19 53 226 -159 -5 185 298 -9 -67 196 184 50 -284 75 -214 -115 -135 -168 29 20 88 34
4391 34 -2 -48 -16 91 242 -164 -94 3 47 190 -67 67 -195 13 -43 10 -52 42 79 -74 -104 -139 139 180 162
$$ packed form
4224f8J51J51j99j99J92N3j13nK11j48j50M7Lq6K68j44j80K25j66P9L61l43j12
4247a72L0n0j85K48J93o5p8J99n6k72K64J0%N4k12J00q4J39j17JJ9k9L20j50J4
4272A21J24j07j87L6J06j4j79K15M0j99K23N1k9j31j74J65k01K43q4Q0j25J22
4294I6L9m5N1L3j23k7J10k61M15k22L8n4j6m2q6p0K02k7q2K57k26j56J69P9j43
4319i1J41j89K52M9k86L64l83o1K18k29P9q4M8J9J56l1p9O8K7j82m0J46j8Q8J6
4344bK1k83L42j33M04m08J1j11N01l94j98K55R4j8j73N4k07J38J55j68j4L9L29
4367B34J9k33l9P2J73l85J54J90J13l07n8K63j2j34l34L59k89R9k0l3J97rO8n4
4391C4l6m6L2J07J51m06P0R7M4J43k57J34k62K08n6N3o2R4L7j53l0l5K78M1j8
$$ plain form
4416 162 36 -285 -33 23 -201 34 154 -262 18 189 -245 115 -189 74 -153 -37 157 -73 -6 0 23 45
4438 45 -64 114 -12 11 -109 -69 76 130 -164 -124 64 -49 -101 157 46 -190 49 103 -219 118 132 27 -26
4461 -26 24 -135 -120 97 -80 68 107 240 44 -253 109 -146 -270 -200 54 -86 -145 -168 251 6 -74 193 -157
4484 -157 -51 101 163 26 12 -66 -74 -12 -205 104 273 -89 -102 -94 84 -53 147 -33 -8 -2 -38 82 3 -24 140
4509 140 80 10 147 105 87 -141 43 165 55 -11 70 259 128 17 63 -46 -21 44 -11 140 -292 -17 99
4532 99 -156 63 168 224 60 -111 -121 103 29 104 70 130 -77 16 161 -174 -47 165 -147 27 6 13 120 -108
4556 -108 -38 -128 -93 -151 17 61 -198 82 -163 8 8 -48 -56 171 -205 51 25 23 -47 55 -122 47 -82 -11 53
4581 53 14 -57 -30 -108 291 0 109 -149 -256 -272 -173 249 168 7 -118 1 -95 -142 209 150 114 -27 -23 -129 -68
$$ packed form
4416A62j26l21K52N6k24K35J20m16K80J71m34L60l04K63k27J16J94k30O7OK3K2
4438D5j09J78j26K3j20M0J45N4k94M0J88j13n2K58j11k36K39N4l22L37J4j05n3
4461b6N0j59J5K17j77J48L9J33j96k97L62k55j24P0K54j40n9k3M19k45q0K67l50
4484a57J06J52O2j37j4p8qO2j93L09J69l62j3QJ78j37K00j80K5Ol6J20p9k7J64
4509A40o0p0J37m2j8k28J84J22j10o6Q1J89j31j11M6j09K5O5n5J51m32K75J16
4532I9k55K19J05N6j64j71j0K24p4P5l4O0k07R3J45l35J27K12l12J74k1PJ07k28
4556a08P0r0L5n8J68M4k59K80k45J71%n6qK27l76K56k6kp0J02j77J69j29P1O4
4581E3l9p1K7p8L99k91J09k58j07j6R9M22q1j61j25J19r6m7L51n9l6j41Mj06O1
$$ plain form
4606 -68 130 275 -112 -237 -37 -44 -26 -168 -340 -90 -56 -97 33 -126 -1 -120 -203 27 -210 131 178 100 252
4629 252 -51 -50 23 -55 123 221 -225 -75 -67 -364 -50 157 -201 -171 117 -45 234 -64 -54 -180 -62 197 -71
4652 -71 -130 -68 127 327 20 88 165 26 43 -303 -36 45 -100 99 -25 28 171 48 -202 109 -36 177 -26
4675 -26 -67 39 -150 114 -45 -295 -35 50 2 72 -32 51 -174 61 -148 95 96 -39 -3 -77 -159 -102 -79 -146 -213
4700 -213 -119 166 5 -181 116 60 49 50 5 -47 -36 -1 -3 -221 29 194 -47 235 -8 -12 160 204 -117 33 -73
4725 -73 88 195 12 -114 66 74 31 172 -34 -295 194 -137 121 119 -257 -35 -108 106 -140 245 205 -75 89
4748 89 292 196 53 -99 -95 -147 241 201 106 -119 188 155 -82 85 0 -150 6 -35 -213 -158 0 53 -25 -268
4772 -268 206 26 -194 15 -46 8 -7 -103 68 22 -120 213 19 -237 -123 20 22 205 -27 89 47 -163 209
$$ packed form
4606f8J98J45l87j25K00pJ8j42j72K50L4m1J30j59J25j19q3K30k37L41M7p8J52
4629B52l03JP3p8J78R8m46J50Qk97L14K07l58L0K88j62K79k98J0j26J18K59k68
4652g1n9O2J95K00l07O8P7j39J7l46K67Q1j45J99j24N3J43j23k50L11j45K13k03
4675b6m1J06j89K64j59k50K60Q5m8P0j04Q3k25K35k09K43Jj35L6p4q2N7K3o7o7
4700b13R4K85j61j86K97n6j1Jm5n2J1L5kk18K50J65k41K82k43mJ72M4l21J50j06
4725g3J61J07j83j26J80Qm3J41k06k61M89l31K58kl76K22p3K14k46L85m0k80J64
4748H9K03r6j43j52Mn2L88m0r5k25L07l3k37J67q5j50J56m1j78N5J58N3p8k43
4772b68M74j80k20K09o1N4j5r6J71m6j42L33j94k56J14J43KJ83k32J16m2k10L72
$$ plain form
4795 209 -72 -54 -48 280 170 -114 -67 60 110 -39 -70 -48 114 139 189 -43 50 62 6 40 201 10 -139 -29
4819 -29 -252 119 -91 113 155 -97 108 -298 -154 310 -32 74 1 -92 11 -99 65 129 -13 -129 48 -13
4841 -13 -55 -9 -40 -33 28 92 50 28 -19 108 -240 218 -131 -176 -20 -59 91 -107 17 -56 265 -3 117 133 -86
4866 -86 22 -101 50 -11 -158 -87 54 180 -124 232 -31 275 187 44 241 154 -136 44 -6 2 -36 -39 140 -16
4890 -16 -27 65 142 -27 -19 72 122 137 35 240 -43 88 187 42 -63 229 73 -34 73 157 106 -71 -37 -58 -190
4915 -190 81 36 139 294 -61 -154 167 71 -312 140 -143 110 103 -26 -111 -56 -324 -151 -40 -205 140 -84
4937 -84 -195 89 -69 -187 -50 209 124 109 161 2 -109 3 144 25 98 105 175 0 -1 -39 14 20 71 -140 -60
4962 -60 -26 153 27 100 92 -51 165 68 -45 -14 101 -76 154 -183 -147 93 68 -185 -191 -50 136 -68 -109 172
$$ packed form
4795B09k81J8OL28j10k84M7J27N0j49l1K2J62K5N0k32R3J2n6L4J61j91j49J10
4819b9k23L71k10K04M2k52K05m06J44M64l42J06p3r3J03j10J64O4j42j16J77o1
4841a3m2M6l1PO1O4m2k2m7J27l48M58l49m5J56l9J50j98J24p3L21k68J20J6k19
4866h6J08j23J51o1j47P1J41J26l04L56k63L06q8j43J97q7k90J80n0Ql8lJ79j56
4890a6j1R2P7j69QR1N0J5j02K05k83J31R9j45j05K92j56j07J07Q4n1j77L4k1j32
4915a90K71m5J03J55l55r3L21r6l83M52k83K53pj29q5N5k68J73J11j65L45k24
4937h4j11K84j58j18J37K59q5j5N2j59j11J12J41j19P3PP0j75jl8N3ON1k11Q0
4962f0L4J79j26P3qj43K16r7j13L1J15j77K30l37L6K40k5k53oJ41J86k04m1K81
$$ plain form
4986 172 -248 -21 -109 -38 -150 218 -225 -64 32 -1 171 106 87 -180 59 180 -218 -54 265 -1 -310 -57
5008 -57 -72 111 -62 -106 47 -52 -93 -172 16 35 4 26 29 -77 -135 -151 -41 14 235 -146 -169 -47 -20 -79 -10 -62
5034 -62 15 256 125 125 -86 -58 192 -33 -301 336 -159 128 65 -91 204 -15 38 20 83 -80 106 -39 1
5057 1 5 130 103 25 -87 180 37 -30 -1 65 -149 47 -4 -101 133 31 41 56 56 -120 -138 -366 94 -2 76 78 -107
5084 -107 200 150 -18 287 80 -192 -5 -192 18 -5 -186 250 -69 40 29 45 37 -25 103 139 40 256 -71
5107 -71 -44 168 150 121 -105 -11 59 -103 117 50 80 -79 5 90 -117 118 221 201 40 250 -135 72 -31 115
5131 115 243 74 73 -114 249 53 239 93 69 39 24 108 6 131 21 10 122 -45 -265 -17 -129 -221 -136
5154 -136 74 -21 143 4 97 107 -73 -81 -100 19 -56 -6 33 114 144 105 145 73 190 117 116 -247 -312 -140 -213 -13
$$ packed form
4986A72m20K27q8P1j12L68m43J61R6l3J72o5j9k67K39J21l98J64L19k66l09K53
5008e7j5J83j73m4J53r9m1p9J88J9l1K2Lj06n8j6J10N5K21l81k3J22K7n9O9n2
5034f2P7K41j31%k11K8K50k25k68O37m95K87o3j56K95k19N3j8O3j63J86j45M0
5057AMJ25k7p8j12K67j43o7K9O6k14J96n1r7K34j02J0J5%j76j8k28M60r6P8Kj85
5084a07L07n0j68L05k07k72J87j87K10k3j81M36l19J09j1J6qo2J28L6r9K16l27
5107g1K7K12j8k9k26R4P0j62K20o7L0j59Q4Q5k07K35J03k0j61K10l85K07j03J46
5131A15J28j69jj87L63j96J86j46k4l0j5Q4j02J25j10j1J12j67k20K48j12r2Q5
5154a36K10r5J64j39R3J0j80qj9J19p5N0L9Q1L0l9M0p2J17p3jl63o5J72p3K00
$$ plain form
5180 -13 -171 49 291 -10 56 10 56 -38 -120 172 7 59 -95 36 117 3 51 104 -144 -29 136 105 -80 -252
5204 -252 4 -152 46 237 -134 121 -40 -10 -142 -143 12 -99 104 -38 40 -38 -87 54 47 23 -171 -241 -19
5227 -19 -156 -53 -174 2 -74 -78 50 44 152 44 -119 67 -32 10 168 19 84 188 -230 15 -19 3 112 228
5251 228 -230 -69 -78 15 16 118 173 -128 93 -59 -68 -59 -25 80 28 125 -79 -120 184 -4 86 100 48 -49 142 -142
5277 -142 -16 -58 109 25 -143 -82 72 -43 121 -48 -126 1 146 -24 270 11 -2 -33 -117 -176 245 -237 -120
5300 -120 153 -164 47 -183 -122 -73 5 102 311 -69 54 -115 -46 -60 23 -93 40 61 19 -15 -112 237 199 -92
5324 -92 132 -149 22 151 -35 -40 99 1 164 147 -80 82 -83 -8 108 -202 -151 -66 -192 173 32 -51 78
5347 78 -124 -75 155 -107 -211 188 -118 -25 -225 -82 21 -141 159 -137 3 69 -71 -263 191 -115 -60 20
$$ packed form
5180a3j58K20K42l01O6m6M6r4q2K92j65N2j54J31Q1j14M8N3k48J15J65l1j85j72
5204b52K56j56J98J91l71K55j61L0j32jJ55j11K03j42P8p8m9J41pk4j94p0K22
5227a9j37J03j21J76p6mJ28oJ08j08j63J86r9M2J58j49O5J04m18K45l4K2J09J16
5251B28m58J61rR3JJ02N5l01K21j52rRL4J05n2R7k04m1L04j88R0J4n2r7J91k84
5277a42J26m2J67q4j68O1J54j15J64j69p8J27J45j70K94k59j3l1q4n9M21m82J17
5300a20K73l17K11k30O1M9P8R7K09l80J23j69O9j4Q3j16J33K1m2l4r7L49l8k91
5324i2K24k81J71J29j86nJ39r8J63j7k27J62j65P5J16l10N1Q5j26L65j41q3J29
5347G8k02M9K30k62j04L99l06R3k00J43J03j62L00k96J40O6j40j92M54l06N5Q0
$$ plain form
5369 20 -92 -213 70 -195 -93 63 100 -44 136 -123 180 -244 41 -58 22 -4 85 141 298 108 -130 183
5391 183 -154 -50 174 -88 -209 -80 -278 164 21 77 286 57 -162 17 180 44 169 -70 6 218 74
5412 74 158 233 -15 173 -211 65 186 106 -55 243 -200 133 -35 -58 -34 138 -106 -65 280 -113 26 -51 187
5435 187 -9 116 -140 102 -61 26 -2 -139 26 71 223 -145 -339 53 25 -201 25 -160 -97 155 -54 33
5457 33 -29 146 -104 12 75 -4 117 -265 25 -196 -28 87 11 96 80 -76 142 -191 91 -150 -30 170
5479 170 129 117 32 -32 -83 12 -43 56 22 -141 135 -109 59 -38 -70 -55 185 179 57 -76 24 -247 3 20 69
5504 69 115 34 -15 -81 -73 -122 -28 243 139 -36 -28 9 -39 5 -110 -12 43 -136 -201 -33 265 119 -133 109 23 -40
5530 -40 43 102 -155 15 39 182 52 26 -41 -152 71 -94 -23 -126 79 212 153 -140 209 -1 -7 -78 153 65
$$ packed form
5369B0j12j21K83k65J02J56L7j44J80k59L03m24K85r9Q0k6Q9N6J57j90k38L13
5391A83l37J04K24k62j21J29j98M42j43N6K09k29k19J79J63j36J25k39P6K12j44
5412G4Q4P5k48J88l84K76J21q0j61K98m43L33j68k3K4J72k44M1L45l93J39p7K38
5435A87j96J25k56K42j63Q7k8j37J65M5J52l68j94L92k8k26K26j85O3K52k09Q7
5457C3o2J75k50J16O3p9J21l82K90k21J68J15p6Q5j6j56K18l33K82k41J20K00
5479A70m1j2q5o4n1R5n5R9l4j63K76k44J68r7l2J5K40oj22j33J00k71K50J7M9
5504F9M6q1m9o6Qm9R4K71j04j75QL7m8M4j15R8N5j79o5J68K98j46k52K42q6o3
5530d0Q3N9k57J70K4J43j30k6o7j11K23j65P1j03K05J33n9k93L49k10op1K31q8
$$ plain form
5554 65 -23 160 173 14 -192 -167 -44 -7 -204 -128 -75 89 7 -32 92 327 -35 -63 41 41 -217 92 -163 27
5578 27 -26 -107 -16 -121 123 134 129 85 121 107 235 28 -9 -226 -47 -35 -75 -330 179 -77 -22 -27 -213 142 102 105
5604 105 162 42 197 -141 125 -56 -78 28 35 169 -96 -98 -9 111 -103 -14 -30 17 22 97 -55 222 166 -43 137
5629 137 92 32 -1 -8 228 142 -19 -54 -139 -19 225 87 -246 117 98 -55 7 -183 150 -6 -44 -166 11 30
5653 30 -108 168 56 -151 -80 77 -50 -168 -65 -108 -189 -113 323 -173 -32 -208 -199 104 -35 10 -95 152 333
5676 333 134 -126 -57 35 26 -170 88 11 -110 -131 -180 26 -200 1 -59 394 116 -91 182 -171 155 15 -120
5699 -120 127 7 39 393 -39 -64 -7 13 -102 -71 -63 -3 -32 -126 55 150 -14 -169 62 141 139 -139 -6 -173 -9
5724 -9 12 -232 182 -47 99 -169 -29 -256 221 -172 100 33 69 -66 177 -162 -162 -98 -193 148 56 -245 5
$$ packed form
5554F5q8J83J3j59k06K5J23L7j97P6N3J64q2l9J24K35l62k8J04%k58L09k55J90
5578B7n3q1R1j05K44J1nm4L6j4J28k07l7k17J79J2m0k55N09k56N5nj86L55m0L
5604A05N7j20J55l38K66j81k2J06PJ34k65kQ9J20k14Q9j6M7NP5j52K77n6k09J80
5629A37m5o0l3pK36q6j61l5q5J20K44j38l33L63j9j53O2j90L33j56l8j22J77J9
5653C0j38K76j12k07P1J57j27j18J03m3q1P6M36m96J41j76RL03j39M5j05K47J81
5676C33j99k60O9R2rj96K58p7j21k1m9K06k26K01o0M53k78k07K73l53L26j40j35
5699a20K47j20L2L54m32k5N7K0j15L1QO0k9r4J81R5j64j55K31P9kk78J33j67J64
5724iK1k44M14k29J46k68J40k27M77l93K72o7L6j35K43l39%O4r5L41r2l01K50
$$ plain form
5747 5 -67 -179 75 -4 17 64 -78 1 13 26 -57 162 -2 60 -11 -20 211 -195 87 98 -151 225 87 211 33
5772 33 52 65 13 182 -133 58 -322 41 51 5 -34 -229 -132 229 -174 115 183 -330 31 28 -196 48 154 -137
5796 -137 -171 29 202 84 -220 51 -33 34 44 161 73 118 -168 -85 121 -2 20 235 -90 -198 -134 -107 41
5819 41 -230 202 41 22 1 265 16 88 -49 -67 296 32 -14 46 -216 44 -4 -116 -33 -121 158 56 -11 -27
5843 -27 76 -114 -101 200 -147 152 74 -44 65 -59 -96 241 45 -10 130 -121 -107 -121 1 61 151 64 280
5866 280 -112 3 -38 30 226 129 103 246 -182 32 158 -25 2 265 -220 150 41 -97 45 -2 -198 142
5888 142 88 -90 80 -367 -108 -95 -45 -92 203 64 198 -126 -43 118 -186 40 114 72 -89 59 -90 -109 -9
5911 -9 -191 125 -61 -174 -115 -45 -68 -123 -59 46 -197 -202 231 -62 72 37 -139 82 287 -141 46 -10 36 60
$$ packed form
5747Ep2j12K54p9K1M7j42P9J2J3q3K19j64O2p1rK31m06K82J1k49L76j38J24j78
5772C3J9J3n2J69l15J91l80L63J0m6l9j95R7L61m03K89O8n13L61lk24K44J06k91
5796a37l4K00J73j18l04K71q4O7J0J17q8M5k86Q3K06j23K2K15l25j08O4K7J48
5819D1k71M32j61j9k1K64k49P2j37j8L63k64m6O0k62K60m8j12Q3q8K79j02o7j6
5843b7J03j90J3L01l47K99p8j18J09j24l7L37j96n5J40k51J4j4J22O0R0q7K16
5866B80l92J15m1O8J96r7k6J43m28K14J26j83K7K63m85L70j09j38J42m7j96L40
5888A42n4j78J70m47K59J3N0m7K95j39J34l24Q3J61l04K26P4m2j61J48j49j9J00
5911ij82L16j86j13N9P0k3n5O4J05k43nM33k93J34l5j76K21K05m28J87n6M6K4
$$ plain form
5935 60 -11 161 231 24 202 152 -45 173 -77 57 134 -4 69 92 -177 71 48 -34 201 33 -54 51 -61
5958 -61 219 -50 60 207 -150 -146 69 -23 95 45 -65 -137 -17 7 65 -27 -133 31 -157 -151 150 -84 -37 97
5982 97 -109 -193 -113 -60 -40 8 140 150 -52 -138 113 -123 -32 -72 -173 -157 177 -288 281 54 -128 215 147 178
6006 178 169 54 137 -44 36 -2 -147 94 44 -221 -334 -73 121 -129 39 -83 -71 -118 -52 -44 10 144 191 -129
6030 -129 -64 49 -2 166 121 35 227 7 -64 335 -218 -160 -131 -5 28 -164 134 51 -162 -92 15 -225 -82
6053 -82 49 -184 -6 -136 -33 16 49 104 255 89 -172 -54 172 25 94 -157 204 -44 -55 46 -61 -177
6075 -177 -305 107 90 27 -141 -67 108 -68 24 -61 -33 75 53 83 -66 -87 229 49 -56 143 -53 60 -140
6098 -140 -55 15 -114 -117 35 -61 -184 -144 99 65 -46 -154 173 132 31 99 112 -50 -37 238 -216 131 97 -149
$$ packed form
5935F0p1J72P0k07J78n0j97K18k50J34P7j38P3K3k69K48k3q2K35j68q7J05j12
5958f1K80k69J10J47l57MK15r2J18n0j10p2J20K4N8r2j06J64j88OL01k34M7J34
5982I7k06q4Q0N3K0M8J32J0k02q6K51k36R1m0j01J6L34m65N69k27j82L43o8L1
6006A78rj15Q3j81Q0l8j45K41n0k65j13K61J94k50J68j22J2m7O6QN4J34M7l20
6030a29O5J13n1J68m5q6J92k20p1L99n53N8K9J26L3j92K98q3k13P0J07k40J43
6053h2J31k33J78j30J03M9L3N5J51j66k61J18K26j47O9k51L61k48j1J01j07j16
6075a77j28M12j7o3j68P4J75j76R2q5K8J08k2L0j49k1L16j80j05J99j96J13k00
6098a40Q5P0j29lJ52r6j23M0K43l4j11j08L27m1j01O8J3j62J3K75m54L47l4k46
$$ plain form
6122 -149 188 174 160 -76 -8 -105 -11 88 -161 -17 -168 -117 -22 55 90 84 140 28 -168 -66 -293 -6 34 -121 35
6147 35 -47 -154 242 75 -10 -90 -108 -34 182 -224 -16 -46 -51 33 -37 0 131 -203 -31 -13 -17 -61 310 -211 -29
6172 -29 -101 4 300 200 151 160 -24 12 219 -35 95 -161 -177 -130 -167 -246 27 -99 13 -4 -11 15 -60 -153 130
6197 130 -51 -176 -156 -267 97 -101 1 -63 105 -185 -198 51 134 141 77 163 139 156 -36 -173 84 -23 -33 -94
6221 -94 233 224 -30 -45 24 344 53 -240 243 6 -24 219 4 123 466 -214 -101 181 -194 175 98 -143
6243 -143 73 -67 163 256 -74 45 -199 -14 -172 104 -176 386 27 -58 -111 -106 94 -12 -92 -327 -46 -178
6265 -178 317 -161 -190 -61 1 -294 123 27 115 31 -102 234 35 28 -121 -126 252 -21 -117 57 86 -89 126 -192
6289 -192 162 19 -98 38 -144 -76 208 -21 -176 54 115 169 240 -123 81 1 -105 38 -161 2 114 45
$$ packed form
6122a49L37j4j4k36O8r7R4R9k49J44j51N1R5P7L5oN6j12j96J02k27K87M0j55J56
6147C5q2j07L96j67q5q0j8P4K16m06K08l0nQ4p0L7J31l34J72J8mm4L71n21J82
6172b9p2J05K96j00m9Rj84L6K07k54J30k56j6M7l7p9K73j26J12j7pK6p5r3K83
6197A30j81j25K0j11L64j98J02o4J68k90j3K49Q3Po4Q6k4J7j92j37K57j07j0o1
6221i4L27rk54j5O9L20k91k93M83k37l0K43k15J19L43o80J13K82l75L69p7k41
6243a43K16j40K30R3l30J19k44J85j58K76k80N62l59q5n3NK00j06q0k35K81j32
6265a78M95m78k9J29O2k95M17r6Q8q4j33L36j99pj49nL78k73r6J74K9j75K15l18
6289a92L54j43j17J36j82O8K84k29j55K30O1N4P1l63K04q0j06J43j99J63J12o9
$$ plain form
6311 45 20 287 -79 -271 -74 10 -180 -9 -114 -5 0 -53 120 -213 -368 355 -250 -35 115 -317 266 -36
6333 -36 -102 9 -50 -56 187 -84 35 65 -40 53 67 -195 76 -24 -317 61 -155 -74 17 215 3 -209 -38
6356 -38 256 -199 73 169 -132 2 169 -247 115 227 65 50 144 7 296 88 148 -40 -287 205 -120 111
6378 111 -101 -229 -92 245 -103 -103 -170 123 -161 -4 -268 52 -185 3 36 20 40 151 -347 -275 100 -18
6400 -18 110 108 129 134 -239 -24 -19 -208 62 -145 76 136 52 -92 128 169 138 125 -1 -73 81 213 67 60 -104
6425 -104 56 -71 129 -123 -191 309 82 -169 -77 -60 -146 55 -118 -30 94 -15 188 52 168 -47 75 -21
6447 -21 -58 -25 79 -59 36 -127 181 57 -3 23 -209 -125 -151 101 95 -201 95 241 17 -77 79 -251 -5 -82
6471 -82 135 178 -85 -117 -65 28 -2 111 216 155 -45 198 -58 -91 -110 74 54 194 -211 -95 -3 -349 162 50
$$ packed form
6311D5k5K67l66j92J97Q4j90J71j05J09Nn3J73l33j55P23o05K15J50m32N83l02
6333c6o6J11n9oK43k71J19L0j05R3J4k62K71j00k93L78k16Q1R1J98k12k12J71
6356c8K94m55K72R6l01J34J67m16L62J12j62j5R4j37K89k08O0j88k47M92l25K31
6378A11k12j28J37L37l48%o7K93k84J57k64L20k37J88L3j6K0J11m98P2L75j18
6400a8J28kK1Nl73K15Nj89K70k07K21O0q4j44K20M1l1j3j26p2J54J32j46pj64
6425a04J60j27K00k52o8N00k27k51R2J7q6K01j73Q8J24j09K03j36J16k15J22r6
6447b1l7L3J04j38R5j63L08j24o0K6k32Q4k6K52ok96K96J46k24r4J56l30K46p7
6471h2K17M3k63l2N2R3l0J13J05o1k00K43k56l3j9J84k0J40m05J16R2l46N11j12
$$ plain form
6495 50 -132 -108 35 98 -155 -81 -260 -123 -184 -77 -72 -84 67 -15 128 68 -19 39 42 20 211 -36 -159 80 183
6520 183 24 30 9 50 257 190 235 -20 43 -192 249 -225 -1 115 -21 -14 36 -66 21 2 -147 -112 -138 -7 93
6545 93 -92 4 49 -310 -90 -129 -95 37 -223 -65 -81 -35 -161 -45 -49 124 128 76 -6 112 67 -224 38 42 234
6570 234 -237 -21 -170 -27 119 -42 -123 306 54 -84 -18 -12 289 -3 -72 257 39 70 -85 118 74 -26
6592 -26 -23 -40 97 214 106 74 52 -140 196 121 61 78 -109 -24 139 -121 -275 -97 67 -71 93 -15 -3 -31
6616 -31 -124 -304 -214 -57 -170 100 55 -36 -153 -24 111 147 -95 215 -2 10 -12 -19 254 170 -115 97 332 -98
6640 -98 104 -233 -50 100 285 75 -54 32 153 -122 -241 22 -25 44 205 -100 -64 167 -194 22 147 -14
6662 -14 -119 -75 -14 227 65 -74 -13 -134 -85 95 -97 73 -65 -154 48 -8 13 84 132 15 67 35 145 134
$$ packed form
6495E0j82K4J43O3k53P4j79J37o1J07Nj2J51q2J43o0q7N8Lk2J91k47j23K39J03
6520A83j59Ok1M1K07o7M5k55O3k35M41m74K24J16j36PN0j02Q7j9j49L5k6J31J00
6545I3j85R6M5l59K20l9L4J32k60J58j6M6j26J16mJ73Mn2q2J18m5k91K62MJ92
6570B34m71K16j49J43J46j61q1M29k52j38O6OL01k92o9L29k18L1j55K03m4j00
6592b6Lj7J37J17j08l2k2j92L36p5o0J7j87Q5J63k60j54J78J64j38J64j08J2k8
6616c1r3j80R0J57j13K70m5r1j17J29J35L6k42L10k17J2k2pK73q4k85K12K35m30
6640i8K02l37J83J50J85k10j29Q6J21k75j19K63m7O9J61l05L6K31l61K16J25j61
6662a4j05M4O1K41j62j39O1j21M9J80j92J70j38q9K02n6K1P1M8j17N2l2J10j1
$$ plain form
6686 134 -13 118 -25 -13 -12 -95 176 84 -81 129 -116 56 208 148 109 209 -138 148 -161 18 -47 -117 -270
6709 -270 63 89 13 -22 -180 124 -74 115 51 108 -124 28 -357 22 56 -14 51 56 -172 -158 81 87 -140 -100 -65
6734 -65 -16 203 -393 150 -71 -199 -158 -4 9 -52 -11 82 114 181 29 300 33 357 -161 75 259 -74 -2
6757 -2 -217 -73 -244 26 57 -30 -48 188 -22 -82 -77 -143 224 295 -223 49 -33 84 -49 140 25 -27 -22 -298 148
6782 148 -66 80 76 77 -63 273 -278 70 -51 137 97 -1 -182 -53 -250 157 114 -299 174 1 -237 92
6804 92 88 -16 122 -106 216 -192 -58 33 8 -245 122 -91 130 173 -82 206 44 -160 170 -30 -290 54
6826 54 184 -138 67 -157 144 46 162 160 306 -124 118 -94 -133 197 -157 20 185 -95 216 -126 52 27
6848 27 93 139 80 -157 46 303 -158 74 15 -145 153 -225 -143 -29 -82 -108 270 -95 -1 -96 -116 80 70 -67
$$ packed form
6686A34j47J31j43J2Jq3K71r2j65K10k45J72J52o0l9J00l47K86l09J79o5p0j53
6709b70L33K6p6l5j58L04j98J89o4N7k32J52l85L79L4p0O5Nk28J4K39Ok27M0L5
6734f5M9K19n96N43k21j28M1J54J3o1M1R3L2O7j52K71k67L24n18K36J84l33P2
6757bk15J44j71K70L1q7j8K36k10o0No6L67P1n18K72q2J17j33J89j15n2Nk76M46
6782A48k14J46mJj40L36n51L48j21J88m0r8j81J29j97M07m3m13M73j73k38L29
6804I2mj04J38k28L22m08J34R1k5k53L67k13K21M3k55K88j62k04L30k00k60L44
6826E4J30l22K05k24L01r8J16kJ46m30K42k12l9L30l54J77J65k80L11l42J78k5
6848B7O6M6n9k37K03K57m61K32n9j60K98l78Q2J14n3k6L78l65R4r5k0J96j0j37
$$ plain form
6872 -67 148 -188 -63 65 -41 289 140 86 134 -237 -70 360 30 51 96 -24 -29 142 -154 79 165 -80 124
6895 124 48 -68 128 -192 54 -68 -196 96 115 109 169 143 -105 -197 -72 -40 404 -102 -166 -97 -88 315 5 -12
6919 -12 64 210 -85 -117 31 -56 5 -189 -133 -65 -88 -15 101 -255 26 -194 -82 112 28 155 -87 -88 131 -112
6943 -112 -202 -114 84 3 104 148 158 -164 -90 -20 -89 206 100 -40 87 9 -160 188 -138 16 -44 9 -33 98
6967 98 -149 33 -131 -17 65 -438 41 113 -67 -2 137 -88 66 -82 -171 -139 -347 84 -206 -141 53 79 -109
6990 -109 -168 -1 53 320 122 10 86 -23 -270 12 -45 21 49 -57 -5 154 -165 70 -18 58 -74 -25 185
7013 185 -124 15 108 31 -33 151 -193 96 -171 7 23 -363 -170 -187 -3 -37 78 -242 114 -130 211 58
7035 58 42 -58 -65 127 21 -78 -22 -60 -154 -290 -98 -50 2 -36 -43 -223 122 -11 -110 158 225 -119 91 -157 -41
$$ packed form
6872f7K15l36J25J28j06L30j49n4M8l71J67M30l30K1M5j20nJ71k96K33Q6k45K04
6895A24p6j16J96l20K46j22j28K92J9oO0k6k48r2J25L2M44n06o4O9RM03l10j7
6919a2P6J46k95l2J48q7O1j94N6O8k3P3J16l56K81k20J12J94q4J27k42jK19k43
6943a12r0Q8J98q1J01M4J0l22P4P0o9K95j06j40J27p8j69L48l26J54o0N3m2J31
6967I8k47J82j64J14Q2n03M79P2j80O5J39k25J54j48q9L2k08M31k90O5J94K6j88
6990a09n9J67N4K67j98j12P6j09k47K82n7O6K8j06N2J59l19K35q8P6j32M9K10
7013A85l09J39R3p7o4J84l44K89k67J78J6l86J93j7J84l4J15l20L56k44L41j53
7035E8j6j00pJ92j06r9N6l8r4j36J92M8N2l8pj80L45j33r9K68O7l44K10k48J16
$$ plain form
7060 -41 61 -189 60 11 107 127 -104 55 235 -144 -37 151 -55 347 18 -171 27 -12 -132 -98 68 -66
7082 -66 58 -6 -52 -51 61 -51 -51 -49 61 -95 70 -48 -364 -40 85 -25 156 92 -118 -81 10 50 -101 -66 -65
7107 -65 -15 -120 -61 147 -96 -71 155 251 55 40 95 -70 -202 -78 80 -44 -250 222 -67 86 -31 49 33
7130 33 -109 53 -58 21 19 -134 94 113 22 -65 123 -228 -223 -21 -4 107 -117 67 29 62 193 90 -512 -158
7154 -158 163 -175 132 103 -301 67 -130 -74 101 -29 182 -27 -163 53 173 -99 57 185 41 -29 -75
7175 -75 253 287 -59 46 -45 -168 190 111 -103 -86 -93 -12 120 -38 212 -20 -91 168 19 -335 130 -221 91
7198 91 41 -29 282 -104 -263 94 -167 7 27 -171 -47 -1 -248 1 1 -186 83 -54 -31 16 -393 -44 71
7221 71 17 246 -72 -54 46 84 -131 128 62 162 -29 -40 120 40 -94 240 -11 81 419 -15 53 154 -206
$$ packed form
7060d1J02k50K49m9R6K0k31J59J80l79J07J88k06M02l29j89J98l9j20L4J66j34
7082f6J24o4m6JJ12j12%KJ10j56J65j18l16L24J25j10J81o4k10L7R1M0j51L5J
7107f5N0j05N9K08k43K5K26R6j96j5N5j65j32J24J58j24k06M72k89J53j17Q0j6
7130C3j42J62j11P9kj53K28J9r1q7J88l51NK02J7J11k24J84l8L3J31j03o02L54
7154a58L21l38L07k9m04L68j97N6J75j30K11k09j36K16J20k72J56J28j44p0m6
7175g5L28L4l46J05r1j23L58p9k14J7pQ1J32j58K50k32p1K59j49l54M65l51L12
7198I1n0p0L11l86j59L57k61J74K0j98J24M6k47K49%j87K69j37K3M7m09L49J15
7221G1n4K29l18J8J00L8k15K59o6J00j91j1J60q0j34L34k51R2L38m34O8J01l60
$$ plain form
7244 -206 32 61 -214 102 -73 119 118 -120 -41 196 -256 -75 3 -148 -43 -40 -146 238 11 -125 107 -249
7266 -249 -228 -62 -85 16 24 57 171 189 -32 115 113 -134 28 -277 -108 255 -155 83 197 -23 53 -123 78
7289 78 72 114 -100 84 -228 -88 29 122 42 -59 -74 -6 65 277 238 -201 34 -88 -319 186 80 80 -15 -137
7313 -137 -125 78 -203 55 284 117 297 89 -170 -53 -25 -180 -159 -222 98 -63 -31 74 -75 -125 193 -324
7335 -324 -141 158 -232 162 -67 124 202 -210 107 13 -184 55 126 63 189 123 -88 30 32 -246 151 -27
7357 -27 15 -28 -127 45 53 -125 66 27 170 353 -41 -77 39 -124 110 -177 -162 129 -105 59 208 84 -3
7380 -3 -8 -363 74 -64 -129 -96 -189 60 -263 63 56 -14 -213 257 87 -243 -147 42 170 82 43 2 157 -34 -58
7405 -58 -48 -46 91 -33 38 63 -1 41 168 10 114 160 238 342 -22 249 27 43 55 16 -33 -60 59 -327 -177
$$ packed form
7244b06K38K9k75L16j75J92jk38P9K37m52J81P8j51J05Lj06L84k27j36K32l56
7266b49K1J66k3J01QL3J14J8k21J47kk47J62l05J69L63m10K38J14k20P6j76K01
7289G8oM2k14J84l12J40J17R3q0j01j5O8P1K12l9m39K35j22k31N05j06%r5j22
7313a37J2K03k81K58K29j67J80k08k59J17K8j55K1o3L20j61L2J05j49n0L18n17
7335c24J83K99l90L94k29J91P8m12L17r4j97K39P1o3J26o6k11J18Kk78L97j78
7357b7M2m3r9J72Qj78J91l9J43J83l94l6J16j63K34k87J5K91k34J64J49j24q7
7380cnl55M37j38o5L3r3K49l23L26pp0j99M70j70l30R6J89J28q8l9m1J55j91k4
7405e8J0KJ37j24P1K5o4M2J27j58J04M6P8J04l64K71k22J6J2l9m9k7J19l86J50
$$ plain form
7430 -177 95 4 89 37 205 155 -187 53 -199 -45 -43 -126 53 -45 -97 -74 -41 128 85 2 -7 -121 65 -143 138
7455 138 45 -173 -207 -65 94 192 68 75 116 -153 -116 60 33 1 53 -96 91 16 37 -135 123 -135 -114 145
7479 145 -34 -26 47 252 -68 -23 207 -5 9 167 30 -154 76 -124 -235 -17 -97 46 -62 -291 101 109 120
7502 120 106 103 9 -386 141 -31 -29 -19 65 -105 188 41 55 -114 -257 -191 -62 50 -20 74 189 -55 -195 -133
7526 -133 -27 90 -37 -53 -51 204 25 -176 -47 -83 108 -2 111 70 -34 -135 -75 95 -275 -103 4 346
7548 346 -40 -4 -115 -81 5 -149 179 -75 -363 80 -335 -171 -155 -208 156 -103 -53 56 -243 10 -167 -111
7570 -111 148 -126 -89 1 51 -62 75 71 -17 123 10 -43 -36 47 89 -263 49 -63 -38 235 -140 129 269 18
7594 18 -107 381 -237 41 269 -198 154 -171 34 -15 19 -47 -91 -5 -80 -92 -203 -91 -16 -9 -107 239 -56 206
$$ packed form
7430a77K72r1Q5n2J68n0l42K40k52J54Kq3J79r8n2K3L3J69m3q3rj14J86k08K81
7455A38r3k18l4J42J59R8j24PM1k69L7J76k7l2N2j49J87p5K1j72K58k58K1K59
7479A45j79QP3K05l20M5K30k12J4J58j37j84K30k00j11K18q0J43j08k29L92QJ1
7502A20j4lr4l95N27j72KJ0Q4j70K93j47J4j69j43O6J29J12p0R4J15k44j40O2
7526a33J06J17j27j6KK55j79k01J29l6J91j10J13m1j04j01O0J70l70J72J07L42
7548C46l86L6j11L4Q6j54L28k54k88M43m15J64J6n3L64k59N0J09k99K53j77N6
7570a11K59k74L7R0N0j13J37mq8J40j13n3PQ3M2l52L12j12K5K73l75K69J40k51
7594A8j25M88o18K78K28m67L52l25K05m9L4o6m4Q6p5j2j11J12P5Pr8L46k95K62
$$ plain form
7618 206 -147 125 31 16 177 35 209 43 150 -304 42 -104 270 186 -167 -242 87 -64 214 166 -78 285
7640 285 -142 146 -15 127 -3 218 14 -63 -178 -121 136 57 -5 154 -36 58 186 -119 171 118 -63 -58 -241
7663 -241 -195 200 -161 30 29 -118 47 -37 -85 213 91 150 -97 -160 150 87 -82 42 194 -99 -53 63 -29
7686 -29 39 22 19 -64 -91 -82 115 -201 -138 -82 -228 161 -171 -78 219 -146 -62 91 -454 -26 -61 3 -141 -52 164
7711 164 49 125 95 118 -251 170 -134 -184 -178 -166 -41 108 54 -228 121 -187 327 -152 -257 207 -42 30 144
7734 144 -243 100 271 -61 323 -285 -317 124 73 -20 -71 9 168 -52 68 -71 -94 101 213 -137 -150 170
7756 170 -260 66 117 -44 -46 20 -5 31 -29 -180 -22 -172 -7 263 -107 150 190 -317 230 19 -20 239 -91
7779 -91 153 79 70 103 -545 -183 -121 16 -13 32 42 -135 21 102 -19 -275 -132 156 -119 -86 158 152 -78 -86 119
$$ packed form
7618B06l53K72r4j5J61j42J74j66J07m54L46j46L74q4l53p5L29j51K78m8k44L63
7640B85m27K88j61J42j30K21k04p7j15N7K57p9o2J59j90R4J28l05K90n3j81Nj83
7663b41M6L95l61J91jj47J65q4m8K98j22N9k47o3L10o3j69J24J52k93M6J16r2
7686b9O8j7lq3k7RJ97l16O3N6j46L89l32R3K97l65Q4J53n45M28l5O4j44Q9K16
7711A64j15P6l0K3l69M21l04n0OJ2J25J49n4k82L49l08N14m79j05M64k49P2J14
7734A44l87L43J71l32L84o08l2M41n1r3n1Q0J59k20J20j39k3J95J12l50j3L20
7756A70m30L26N1j61kO6k5L6o0j51J58j50J65K70l70K57M0n07N47k11l9K59l30
7779i1K44p4rL3o48L62O2J37k9M5J0j77J56Q1j21k56J43K88k75L3K44ok30qK05
$$ plain form
7804 119 -18 50 -100 23 -274 16 52 278 72 -13 82 -2 60 9 -43 -324 -169 -158 -173 55 232 36 33 243
7828 243 -74 5 8 -254 184 -114 -14 -79 35 -57 161 34 -233 147 -60 34 -12 -125 184 -52 12 71 -360
7851 -360 77 -89 -61 -138 17 -265 136 -97 60 235 -10 219 149 5 94 -103 -168 161 -252 29 -88 101
7873 101 13 -17 -165 223 113 -38 -42 51 -119 82 124 15 96 69 72 -17 -146 -34 31 -49 154 -143 102 -123
7897 -123 -123 159 40 -64 19 -7 -67 274 124 -95 -182 -71 41 -15 -7 -85 -199 -154 56 -48 145 -11 15 -85
7921 -85 164 -112 22 58 -75 200 128 43 152 56 46 139 -117 46 106 -181 74 38 75 182 -2 26 -87 -100
7945 -100 -251 85 1 140 -100 64 -100 46 -97 -85 -29 66 -154 -123 103 -155 137 31 284 -35 65 -30
7967 -30 56 -213 -78 2 35 -62 -89 72 -236 13 -108 -101 178 25 196 27 -255 43 -180 11 -31 11 63 -20
$$ packed form
7804A19j37O8j50J23k97K90L6K26k06q5R5q4O2n1n2k81J55J1j5K28J77j96lK10
7828B43l17P9Lk62M38k98J00o5J14r2K18j27k67L80k07R4m6j13L09k36O4N9m31
7851c60M37j66K8p7J55k82M01k33J57J75k45K29p0j44Q9j97o5L29m13K81j17J89
7873A01q8l0j48L88j10j51mR3j70K01M2j09Q1k7Lq9j29J12O5q0K03k97K45k25
7897a23%K82j19j04Q3k6o0L41j50k19q7J11J12n6Qp8j14M5K10j04J93j56K6j00
7921h5K49k76J34L6j33K75p2q5J09r6j0R3k56J63O0k87K55l6L7J07j84K8j13j3
7945a00j51L36q4J39k40J64j64J46j43J2N6R5k20L1K26k58K92j06K53l19J00r5
7967c0Q6k69J35Q0L3r7k7J61l08K49j21PK79j53J71j69k82K98k23J91m2M2N2q3
$$ plain form
7991 -20 -84 203 164 114 147 -135 -15 -188 -67 134 -31 -63 -19 260 -40 1 142 -165 143 -18 -37 172 68
8014 68 33 56 -245 -70 27 -403 -158 -197 -193 84 -131 -111 86 51 48 -126 180 -95 28 0 61 67 -168 94 -230
8039 -230 -176 170 -90 -66 -200 47 50 197 79 96 154 4 212 -48 50 139 -41 -72 51 167 151 179 -64 -104
8063 -104 -52 -189 53 12 178 32 -55 33 -71 -44 100 -81 108 -8 108 56 -146 73 36 98 79 72 -129 -103
8087 -103 213 42 -25 -37 135 -333 -75 21 -2 -54 18 162 6 52 -257 27 -218 -62 -150 18 215 -17 -110
8110 -110 102 93 -69 -65 8 137 59 -142 89 55 -90 -39 125 -75 39 -77 307 135 -16 -44 279 229 -81
8133 -81 202 57 -60 76 33 -48 28 -40 -41 -33 223 -81 122 2 -73 94 32 -191 -148 83 -134 175 55 143
8157 143 -49 147 29 -185 177 105 -141 150 -194 54 31 -85 -58 -9 31 -62 -42 277 77 -38 -146 30
$$ packed form
7991b0o4K87l9n0L3k82J20j73J21K01j65l2M4K79l00M1J41l07L08j61j9K09j04
8014F8l5K3l01J75R7m30K45l9MK77k15K0J97l5lj74L06k75J23k8O1Ok35K62l24
8039b30N4L46k60K4j34K47LJ47j18J7N8j50K08k60R8Q9j80l1J23J16j6K8k43m0
8063a04N2j37K42m1J66j46q7Q8j04K7J44j81J89j16J16n2k02K19l7O2j9pk01K6
8087a03L16j71o7j2J72m68K58R6k3n2P2J44j56M6l09K84k45J56q8J68J97k32r3
8110a10K12rj62MP3J29p8k01K31l4j45N1J64k00J14j16L84j72j51k8L23n0l10
8133h1K83j45j17J36m3q1P6o8jQK56l04K03j20p5J67o2k23M3K31k17L09j20Q8
8157A43j92J96j18k14L62p2k46K91l44K48k3j16K7M9M0r3K0L19k00j15j08J76
$$ plain form
8179 30 -209 86 -273 138 151 -286 -109 144 -194 69 57 -44
$$ packed form
8179C0k39K95l59M11J3m37J77K53l38K63j2j01
8191d4
$$ Imaginary data points
##PAGE= N=2
##DATA TABLE= (X++(I..I)), XYDATA
$$ plain form
0 0 0 0 0 0 0 0 0 0 -8 8 -8 16 -16 24 -32 38 -48 56 -70 85 -101 121 -144 173 -202 238 -272 318 -366 424
30 424 -484 554 -627 713 -805 908 -1020 1146 -1281 1431 -1594 1773 -1969 2181 -2413 2668
46 2668 -2946 3251 -3582 3945 -4345 4787 -5275 5816 -6424 7102 -7872 8754 -9773 10962
60 10962 -12378 14096 -16231 18965 -22617 27759 -35609 49244 -79984 309351 -105203 67073
72 67073 596577 -23813 279982 154656 -123170 84627 19965 -623 -75065 -415373 -150561
83 -150561 -166304 -201728 -150116 -565506 -235991 84417 -577741 -314284 -93515 -590343 -228359
94 -228359 -102680 -483887 -258280 -289965 -265555 -39702 -329194 -312901 -82478 -166086 -97026
105 -97026 -119926 -59566 44786 -134572 109952 172672 -256282 48954 233618 -112109 105594
$$ packed form
0@%%%%%%%%qJ6j6K4l2M0n6P0q6J04j26J55j86K22k65L17l75M40n10N90o84P90
30D24r08J038j181J340j518J713j928K166k427K712l025L367l742M150m594N081
46B668n614O197o833P527q290R132j0062J1091j2240J3526j4974J6626j8527K0735
60A0962k3340K6474l0327L5196m1582N0376o3368Q4853j29228L89335m14554J72276
72F7073N29504o20390L03795j25326k77826K07797o4662k0588p4442l40308K64812
83a50561j5743l5424N1612m15390L29515L20408o62158K63457K20769m96828L61984
94b28359J25679l81207K25607l1685K4410K25853k89492J6293K30423q3608O9060
105i7026k2900O0360J04352j79358K44524O2720m28954L05236J84664l45727K17703
$$ plain form
116 105594 178108 -22459 176013 142340 32152 157629 90163 107377 213702 167828 158583
127 158583 123209 175537 218628 33746 93774 195183 2566 82112 191450 2864 26505
138 26505 97825 25007 52416 -1112 -32248 70791 -705 -37943 53468 -21173 -63148 -13270
150 -13270 -63653 -87537 -91896 -92743 -46485 -92354 -93565 -22847 -89538 -93036 -45438 -105714 -46032
163 -46032 -14053 -82263 14684 12706 -79959 2245 -17213 -69327 644 -21396 -4603 31965
175 31965 -6996 61957 45438 -17896 76526 48286 15219 99650 48584 52031 93716 24167
187 24167 60153 47235 -20459 43435 -730 -24641 54107 -17701 -9379 46999 -39638 -11038
199 -11038 6995 -61306 -9392 -18212 -42149 5266 -42516 -34146 -17655 -88834 -44320 -37916 -79864
$$ packed form
116A05594P2514k00567J98472l3673j10188J25477o7466J7214J06325m5874r245
127A58583l5374N2328M3091j84882O0028J01409j92617P9546J09338j88586K3641
138B6505P1320p2818K7409n3528l1136J03039p1496l7238R1411p4641m1975M9878
150a3270n0383k3884m359q47M6258m5869j211P0718o6691l498M7598o0276N9682
163d6032L1979o8210R6947j978r2665Q2204j9458n2114O9971k2040J6793L6568
175C1965l8961O8953j6519o3334R4422k8240l3067Q4431n1066L447M1685o9549
187B4167L5986j2918o7694O3894m4165k3911P8748p1808Q322N6378q6637K8600
199a1038J8033o8301N1914q820k3937M7415m7782Q370J6491p1179M4514O404m1948
$$ plain form
212 -79864 -1677 -18898 -41013 27300 -16630 -18234 21988 -24716 6752 25022 -3294 41015
224 41015 18706 -1030 34040 -11602 -5814 23570 -15718 18088 32493 6403 46612 31253
236 31253 11122 39222 6991 6452 29097 2151 18138 22282 -2181 10620 -6970 -18937 -6409
249 -6409 -26600 -10759 8401 -9297 15525 18675 -9213 5582 -1414 -19106 -4092 -8344 -10652
262 -10652 -1028 -8927 -11359 -14567 -23174 -23904 -27021 -15007 -5677 -9613 9500 14615 -5197 3918
276 3918 5779 -15795 -9813 -281 -7558 -2284 4348 116 -2520 -4629 -9336 -7059 895 3929 10948
291 10948 25872 24584 17876 24511 18345 2158 5613 9960 2065 5209 12167 8427 4237 3679 -296
306 -296 -2484 -1666 1216 8458 13997 13678 15649 14556 4058 -3696 -6141 -11709 -14406 -10033 -6890 -6801
$$ packed form
212g9864P8187j7221k2115O8313m3930j604M0222m6704L1468J8270k8316M4309
224D1015k2309j9736L5070m5642N788K9384l9288L3806J4405k6090M0209j5359
236C1253k0131K8100l2231n39K2645k6946J5987M144k4463J2801j7590j1967J2528
249f409k0191J5841J9160j7698K4822L150k7888J4795o996j7692J5014m252k308
262a0652R624p899k432l208q607p30l117J2014R330l936J9113N115j9812R115
276C918J861k1574N982R532p277N274O632m232k636k109m707K277P954L034P019
291A0948J4924j288o708O635o166j6187L455M347p895L144O958l740m190n58l975
306b96k188Q18K882P242N539l19J971j093j0498p754k445n568k697M373L143Q9
$$ plain form
322 -6801 -7805 -9771 -13465 -17646 -18648 -13660 -9397 -7806 73 2827 -6972 -9145 -9422 -23648 -25717
337 -25717 -16171 -17566 -16376 -7295 -4231 -7158 -7679 -2672 -794 -2654 6029 13440 15305 19806 17393
352 17393 19407 18316 1949 5322 14112 675 6960 20016 13884 17902 18477 16558 19392 3566
366 3566 7344 26833 13647 10542 24311 15495 2766 -5602 -2367 -4739 -28259 -8449 12534
379 12534 -19518 -10728 8817 -15511 -13149 -10757 -19835 -3890 -12531 -11820 4944 -20330 -20990 -6575
393 -6575 -20710 -17334 -28429 -25960 9803 -12997 -17418 20968 -6209 -9472 19728 1333 -701
406 -701 -746 5157 34054 -1565 -6986 33822 -6431 -10545 19480 -13290 1736 20441 7056 32231
420 32231 7530 -4072 38967 5998 -2093 23155 -4077 23148 26660 -10751 22663 -601
$$ packed form
322f801j004j966l694m181j002M988M263J591P879K754r799k173k77j4226k069
337b5717R546j395J190R081L064k927n21N007J878j860Q683P411J865M501k413
352A7393K014j091j6367L373Q790j3437O285J3056o132M018N75j919K834j5826
366C566L778J9489j3186l105J3769q816j2729q368L235k372k3520J9810K0983
379A2534l2052Q790J9545k4328K362K392r078J5945q641P11J6764k5274o60J4415
393f575j4135L376j1095K469L5763k2800m421L8386k7177l263K9200j8395k034
406g01m5N903K8897l5619n421M0808m0253m114L0025l2770J5026J8705j3385K5175
420C2231k4701j1602M3039l2969q091K5248k7232K7225L512l7411L3414k3264
$$ plain form
432 -601 -21290 27792 -7895 -15057 18732 -11070 18454 11764 -33132 25322 -3101 -44469 21358
445 21358 -19727 -41828 10684 -28045 -27171 -15374 -44045 -10183 -36029 -46754 4377 -43649
457 -43649 -21443 22658 -49692 -6014 16563 -54424 5082 4530 -37493 26524 -910 -14136
469 -14136 28574 -11524 14918 25553 -19823 36645 31634 13050 63189 9252 16497 67487
481 67487 5745 32387 40982 -13965 55390 40883 -10317 48723 5639 -4048 59104 -7051
493 -7051 -14430 31193 4263 18953 3439 -15179 16433 -21703 -5743 14054 -66251 -19821
505 -19821 23930 -46359 -12471 -12542 -59091 5432 -8728 -50333 -6463 -24392 -19406 15774 -22013
518 -22013 -20430 -14021 -22340 13157 -22894 -40653 18658 -10070 -15825 19593 -26115 -10485 17812
$$ packed form
432f01k0689M9082l5687p162L3789k9802K9524o690m4896N8454k8423m1368O5827
445B1358m1085k2101N2512l8729Q74J1797k8671L3862k5846j0725N1131m8026
457d3649K2206M4101p2350M3678K2577p0987N9506n52m2023O4017k7434j3226
469a4136M2710m0098K6442J0635m5376N6468n011j8584N0139n3937P245N0990
481F7487o1742K6642Q595n4947O9355j4507n1200N9040m3084r687O3152o6155
493g051p379M5623k6930J4690j5514j8618L1612l8136J5960J9797q0305M6430
505a9821M3751p0289L3888p1m6549O4523j4160m1605M3870j7929M986L5180l7787
518b2013J583O409q319L5497l6051j7759N9311k8728n755L5418m5708J5630K8297
$$ plain form
531 17812 -14742 14386 -1822 -27728 44164 14730 -28171 25094 -4669 -11488 28223 -11208
543 -11208 -1118 10023 -11741 35846 8298 -21869 32557 -2649 1640 38442 -23591 15242
555 15242 40349 -27155 27885 19217 -37063 28898 4548 -17786 23693 -20907 13384 29839
567 29839 -37933 22447 10906 -39561 39421 -516 -27369 33914 -20523 2667 26597 -43979
579 -43979 12894 8006 -36576 36522 -11975 -23718 44443 -26034 1010 35223 -41511 21991
591 21991 22242 -33898 34865 -5374 -16500 42237 -30935 -3916 27419 -42220 22297 12133
603 12133 -41048 33389 -8984 -21679 35116 -35732 -8860 21252 -41904 15500 798 -43569
615 -43569 27555 -20142 -34074 24782 -36031 -13138 18856 -34141 12378 3131 -26996 29817
$$ packed form
531A7812l2554K9128j6208k5906P1892k9434m2901N3265k9763o819L9711l9431
543a1208J0090J1141k1764M7587k7548l0167N4426l5206M289L6802o2033L8833
555A5242K5107o7504N5040q668n6280O5961k4350k2334M1479m4600L4291J6455
567B9839o7772O0380j1541n0467P8982l9937k6853O1283n4437K3190K3930p0576
579d3979N6873m888m4582P3098m8497j1743O8161p0477K7044L4213p6734O3502
591B1991K51n6140O8763m0239j1126N8737p3172K7019L1335o9639O4517j0164
603A2133n3181P4437m2373j2695N6795p0848K6872L0112o3156N7404j4702m4367
615d3569P1124m7697j3932N8856o0813K2893L1994n2997M6519r247l0127N6813
$$ plain form
627 29817 -14891 -18897 33291 -20070 2798 26094 -22684 19884 11366 -17079 31594 -3397
639 -3397 -8414 34621 -6297 9526 25470 -9439 24497 10296 -13243 29962 -447 -10523
651 -10523 24284 -6937 -423 13326 -11225 7199 -4068 -16441 16149 -6940 -13153 13353
663 13353 -9578 -4694 5109 -16856 -460 -3589 -19500 5532 -4854 -18074 3782 -5225 -12014
676 -12014 -3611 -9320 -214 -829 -9392 4921 -916 -6930 8240 -2009 -5877 4502 -4419 3043
690 3043 7285 -9005 5272 10650 -6462 6211 8721 -3586 6548 7434 3545 8281 3752 7871
704 7871 7397 -1815 6947 4119 -927 9085 518 1300 10828 -3499 2422 9712 -7779 2239 9115
719 9115 -4163 3696 3794 -3751 1468 -3508 -3254 -807 -7513 -2303 -3366 -7693 -352 -7443 -7260 566
$$ packed form
627B9817m4708m006N2188n3361K2868K3296m8778M2568q518k8445M8673l4991
639c397n017M3035m0918J5823J5944l4909L3936j4201k3539M3205l0409j0076
651a0523L4807l1221O514J3749k4551J8424j1267j2373L2590k3089o213K6506
663A3353k2931M884R803k1965J6396l129j5911K5032j0386j3220K1856r007o789
676a2014Q403n709R106o15q563J4313n837o014J5170j0249l868J0379q921P462
690C043M242j6290J4277N378j7112J2673K510j2307J0134Q86l889M736m529M119
704G871m74r212Q762k828n046J0012q567P82R528j4327N921P290j7491J0018O876
719I115j3278P859R8p545N219m976K54K447o706N210j063m327P341p091J83P826
$$ plain form
735 566 -10492 -6703 568 -10516 -5559 -1095 -9121 -3351 -3571 -8330 -3660 -5864 -5676 -2867 -3857 -607
751 -607 -2032 -2515 2820 -2321 -2155 4395 475 819 4946 2851 3487 3096 1949 4667 3041 2948 6624
768 6624 5292 5013 6331 5553 6468 6171 5302 7031 6487 5156 6012 6004 5061 3981 4775 4890 1851 2191 4171
787 4171 1166 439 3374 1393 -988 292 199 -3082 -3574 -1743 -2491 -5016 -3932 -2958 -5804 -7934 -5893
804 -5893 -5127 -7336 -7689 -3848 -4282 -8617 -5744 -2615 -6817 -7399 -2797 -3602 -5541 -4634 -2925 -2396 -4408
821 -4408 -4469 -413 -495 -3736 -1898 2282 477 -3669 2598 7936 -1774 -2294 9569 3524 -3340 6817
837 6817 8568 1277 3330 8151 7699 2120 2922 10453 6974 2375 7913 8794 5128 3049 3589 8856
853 8856 3059 -2326 9402 5260 -5540 2754 4278 -886 -2165 -4321 2549 60 -10362 1435
$$ packed form
735E66j1058L789P271j1084M957M464q026N770k20m759M670k204J88K809r90L250
751f07j425m83N335n141J66O550l920L44M127k095O36l91j147K718j626r3L676
768F624j332k79J318p78R15k97q69J729n44j331Q56qr43j080P94J15l039L40J980
787D171l005p27K935j981k381J280r3l281m92J831p48k525J084R74k846k130K041
804e893P66k209l53L841m34m335K873L129m202n82M602q05j939R07J709N29k012
821d408o1M056q2l241J838M180j805m146O267N338r710n20J1863o045o864J0157
837F817J751p291K053M821m52n579Q02P531l479m599N538Q81l666k079N40N267
853H856n797n385J1728m142j0800Q294J524n164j279k156O870k489j0422J1797
$$ plain form
867 1435 1297 -13424 -4484 1726 -5435 -10219 -8883 1620 -5531 -16247 1853 -1575 -15814 373
881 373 -1989 -10598 -1831 -6496 -888 2336 -12279 925 6549 -7360 834 560 -104 6324 -3661
896 -3661 7310 9144 -11227 9650 15591 -6270 6390 7963 3985 10965 -2141 7863 12726
909 12726 -8557 10988 13448 -9574 7749 6875 -1733 7795 -6290 2407 10738 -11514 3041
922 3041 4777 -13701 6372 -786 -8361 6110 -13683 -4754 10610 -16900 -5227 4176 -13554
935 -13554 2105 -3089 -10552 3517 -12684 -2240 9803 -18399 -1729 8979 -13584 3138
947 3138 -216 -10117 9897 -4064 -3041 9871 -10990 4213 12440 -9904 7684 4554 -5901
960 -5901 17076 281 -4890 15114 -4210 4192 15421 -7323 6391 6613 -5309 14720 -1900
$$ packed form
867A435j38j4721Q940O210p161m784J336J0503p151j0716J8100l428j4239J6187
881C73k362q609Q767m665N608L224j4615J3204N624j3909Q194k74o64O428r985
896c661J0971J834k0371K0877N941k1861J2660J573l978O980j3106J0004M863
909A2726k1283J9545K460k3022J7323q74q608R528j4085Q697Q331k2252J4555
922C041J736j8478K0073p158p575J4471j9793Q929J5364k7510J1673R403j7730
935a3554J5659n194p463J4069j6201J0444J2043k8202J6670J0708k2563J6722
947C138l354r901K0014j3961J023J2912k0861J5203Q227k2344J7588l130j0455
960e901K2977j6795n171K0004j9324Q402J1229k2744J3714K22j1922K0029j6620
$$ plain form
973 -1900 -7419 15641 -5743 -1533 11966 -13060 1834 7928 -12086 5932 -3619 -11012 12239
986 12239 -9999 -9153 8069 -15088 1509 7161 -20011 3497 943 -13272 10548 -8054 -10204
999 -10204 12377 -11248 268 7952 -15708 9502 4264 -13662 14995 -3275 -7302 17083 -10680
1012 -10680 1289 15008 -11936 10858 6068 -12326 18149 -2164 -7197 19199 -10185 452
1024 452 15384 -14679 8914 6275 -14528 14157 -3277 -7972 15636 -13140 -1955 11782 -17135
1037 -17135 6904 3900 -17526 12660 -4648 -13228 13285 -11205 -3959 9316 -15931 4685
1049 4685 4170 -14781 11090 -3196 -10802 14388 -7236 -2253 10648 -12903 6196 7513 -11128
1062 -11128 12446 690 -9225 14647 -3060 -1858 11579 -8602 6703 10040 -10684 9326
$$ packed form
973a900n519K3060k1384M210J3499k5026J4894O094k0014J8018r551p393K3251
986A2239k2238Q46J7222k3157J6597N652k7172K3508k554j4215K3820j8602k150
999a0204K2581k3625J1516P684k3660K5210n238j7926K8657j8270m027K4385k7763
1012a0680J1969J3719k6944K2794m790j8394L0475k0313n033K6396k9384J0637
1024D52J4932l0063K3593k639k0803K8685j7434m695K3608k8776J1185J3737k8917
1037a7135K4039l004k1426L0186j7308q580K6513k4490P246J3275k5247K0616
1049D685n15j8951K5871j4286p606K5190k1624M983J2901k3551J9099J317j8641
1062a1128K3574j1756r915K3872j7707J202J3437k0181J5305L337k0724K0010
$$ plain form
1074 9326 3877 -7574 11906 -2665 -3841 10178 -6900 3854 6564 -13717 6699 5583 -10078
1087 -10078 7338 -3968 -8340 8660 -6417 -1818 4122 -14760 2890 5593 -13313 1073 -4337
1100 -4337 -7889 8559 -8027 -6819 4866 -11101 3398 5125 -15538 3376 4111 -5074 7034
1113 7034 -8793 -3381 13433 -7251 1160 7144 -9481 9741 7857 -6443 7954 -1740 2025
1126 2025 15410 -6446 1697 10931 -5210 9545 5708 -6517 9963 -925 490 11811 -8922
1139 -8922 982 11436 -6662 4901 2536 -7817 8265 -1449 -4269 5818 -9263 383 7113
1152 7113 -10559 -1073 -1466 -8287 5089 -6516 -7928 4136 -9056 -2706 3063 -12084 -1964
1165 -1964 141 -7365 1585 -5635 -5426 3684 -7471 -2107 2174 -8197 1776 1717 -5513 3666 -1657
$$ packed form
1074I326n449j1451J9480j4571j176J4019j7078J0754K710k0281K0416j116j5661
1087a0078J7416j1306m372J7000j5077M599N940j8882J7650K703j8906J4386n410
1100d337l552J6448j6586J208J1685j5967J4499J727k0663J8914P35r185J2108
1113G034j5827N412J6814k0684Q411N984j6625J9222j884j4300J4397r694L765
1126B025J3385k1856Q143R234j6141J4755l837j2225J6480j0888J415J1321k0733
1139h922R904J0454j8098J1563k365j0353J6082r714k820J0087j5081R646O730
1152G113j7672R486l93o821J3376j1605j412J2064j3192O350N769j5147J0120
1165a964K105p506Q950p220K09R110j1155N364M281j0371R973n9p230R179n323
$$ plain form
1180 -1657 -1418 6768 -2767 631 5824 -1929 4106 4822 -705 5557 2760 2922 6525 -280 3692 6567
1196 6567 345 5839 5511 825 6102 2780 1643 5477 172 1460 4878 -614 536 2790 -1113
1211 -1113 -866 -654 -830 -1052 -3078 26 -326 -4446 -1231 -1136 -4711 -2191 -3182 -4968 -2105 -4121 -4352
1228 -4352 -1765 -4135 -4926 -2005 -2881 -4246 -2539 -608 -1283 -2681 -98 727 -1792 -909 442 -804
1244 -804 211 422 878 1983 536 879 3082 1206 456 3246 2804 1831 3379 3762 2461 2355 2359 1501
1262 1501 1338 1914 1280 1338 2178 897 390 1909 273 -456 1211 612 -542 925 1083 -44 -468 -422
1280 -422 -1472 -1569 -1294 -1251 -1821 -1134 -916 -1750 -1289 -1058 -1890 -1691 -1023 -1178 -860 -937 420 -717 -2490 -678
1300 -678 -892 -3199 -913 -328 -1697 -140 336 -569 22 -574 11 572 -172 1282 1099 1046 1283 -573
$$ packed form
1180a657K39Q186r535L398N193p753O035P16n527O262k797J62L603o805L972K875
1196F567o222N494l28m686N277l322j137L834n305J288L418n492J150K254l903
1211a113K47K12j76k22k026L104l52m120L215R5l575K520r91j786K863k016k31
1228d352K587k370p91K921q76j365J707J931o75j398K583Q25k519Q83J351j246
1244h04J015K11M56J105j447L43K203j876p50K790m42r73J548L83j301j06Mq58
1262A501j63N76o34N8Q40j281n07J519j636p29J667n99j154J467J58j127m24M6
1280d22j050r7K75M3n70O87K18q34M61K31q32J99O68j55L18p7J357j137j773J812
1300f78k14k307K286N85j369J557M76r05N91n96N85N61p44J454j83n3K37j856
$$ plain form
1318 -573 647 1359 -2238 763 1833 -1600 1689 2374 36 2181 427 585 3117 -286 1247 3418
1334 3418 150 968 1707 305 527 -1818 664 1500 -3219 1696 2866 -2635 1648 1508 -2753 1656
1350 1656 -616 -2252 2092 -1165 -1510 1630 -1497 -1334 -1637 -2327 244 -2584 -583 3203 -3323 -109
1366 -109 3263 -3314 -419 1233 -3345 1668 437 -2715 2273 -2268 -2912 1674 -2748 -1845 668 -2367
1382 -2367 1875 600 -1520 3556 -1436 -1674 3722 -3187 394 3516 -4061 2565 2124 -4877 3748
1397 3748 306 -4067 3791 -1074 -56 5113 -1339 2837 2449 -3418 4925 -274 -2817 6197 -3106
1412 -3106 -351 6293 -5419 1562 3628 -6836 3008 1784 -3234 6525 -1385 -960 5654 -4706
1426 -4706 1718 2601 -7347 4017 58 -4960 5378 -5132 -2697 6233 -8492 -565 3760 -7425
$$ packed form
1318e73J220P12l597L001J070l433L289O85k338K145j754J58K532l403J533K171
1334C418l268Q18P39j402K22k345K482Q36m719M915J170n501M283j40m261M409
1350A656k272j636M344l257l45L140l127J63l03o90K571k828K001L786o526L214
1366a09L372o577K895J652m578N013j231l152M988m541o44M586m422R03K513l035
1382b367M242j275k120N076m992k38N396o909L581L122p577O626m41p001Q625
1397C748l442m373P858m865J018N169o452M176l88n867Q343n199k543R014r303
1412c106K755O644j1712O981K066j0464R844j224n018R759p910M25O614j0360
1426d706O424Q83r948J1364l959n018J0338j0510K435Q930j4725P927M325j1185
$$ plain form
1440 -7425 4516 1040 -6111 5617 -3016 -2564 4744 -8469 -1050 3453 -6463 3858 -1567 -6412
1454 -6412 6393 -4464 -2821 5798 -7757 1465 7342 -5666 3671 949 -4982 6149 -3137 -3514
1468 -3514 5533 -4462 2388 5274 -6168 3898 2237 -2401 7446 -2314 -1552 9716 -1228 1745
1482 1745 6111 -4745 3428 3890 -3770 3840 -1556 -2211 7425 -1952 -1048 4521 -4362 2637 2752 -5316
1498 -5316 4255 423 -3127 5625 -4339 -4577 4070 -5794 -2802 763 -6809 2065 711 -6409 2199
1513 2199 -3646 -4378 4217 -5062 -2068 3436 -5912 1917 946 -7811 3501 -2311 -6455 5122 -3945
1528 -3945 -1845 6374 -5002 2056 4481 -5092 5537 983 -4221 7823 -1098 -249 7677 -5121
1542 -5121 2196 4037 -6764 5380 1016 -4582 9076 -1628 -1482 8841 -4907 1808 4954 -6438
$$ packed form
1440g425J1941l476p151J1728q633M52P308j3213P419M503r916J0321n425m845
1454f412J2805j0857J643Q619j3555R222N877j3008R337k722n931J1131r286l77
1468c514R047r995O850K886j1442J0066j661m638R847r760P62J1268j0944K973
1482A745M366j0856Q173M62p660P610n396o55R636r377R04N569q883O999J15q068
1498e316R571l832l550Q752r964k38Q647r864K992L565p572Q874j354p120Q608
1513B199n845p32Q595r279K994N504r348P829r71q757J1312n812m144J1577r067
1528c945K100Q219j1376P058K425r573J0629m554n204J2044q921Q49P926j2798
1542e121P317J841j0801J2144m364n598J3658j0704J46J0323j3748O715L146j1392
$$ plain form
1556 -6438 5499 2121 -4094 7178 -3978 -2881 6008 -7128 521 3205 -7093 6108 1186
1569 1186 -5068 7211 -3876 -2628 6375 -6316 670 4177 -6278 4020 -466 -5766 4833
1582 4833 -4404 -3349 4267 -5631 1822 4106 -5163 4528 78 -4349 5363 -3481 -2857 5008 -4747
1597 -4747 336 3117 -5353 1805 -790 -4773 2797 -2315 -938 4033 -3206 1784 2583 -3889 2168
1612 2168 -771 -3470 3782 -1680 -1725 3883 -2853 -470 2025 -3340 880 1778 -838 3043 379 1059
1628 1059 4181 -699 508 1626 -1937 1849 1414 -1633 2195 -62 -658 3256 -1455 -1247 2890 -217
1644 -217 642 3023 464 1455 1336 -729 221 -1650 -1050 1063 -1594 -759 287 -1897 807 -1227 -3594
1661 -3594 799 -1135 -2023 2613 -677 -2037 982 -1378 -1755 -1663 -2500 -676 -1381 -1767 319 -1433 -795
$$ packed form
1556f438J1937l378o215J1272j1156J097Q889j3136P649K684j0298J3201m922
1569A186o254J2279j1087J248R003j2691O986L507j0455J0298m486n300J0599
1582D833r237J055P616r898P453K284r269R691m450m427R712q844O24P865r755
1597d747N083K781q470P158k595l983P570n112J377M971p239M990P99o472O057
1612B168k939k699P252n462m5N608o736K383K495n365M220Q98k616L881k664O80
1628A059L122m880J207J118l563L786m35l047L828k257n96L914m711K08M137l107
1644b17Q59K381k559R91j19k065R50j871O00K113k657Q35J046k184K704k034k367
1661c594M393j934q88M636l290j360L019k360l77R2q37J824p05l86K086j752O38
$$ plain form
1678 -795 487 -1582 113 41 -1064 2290 919 -820 2918 529 -1055 1054 -367 -639 719 510
1694 510 1907 1243 536 2378 981 716 1695 987 1925 2033 798 3009 1222 -1213 1095 -10 -1561
1711 -1561 196 480 16 201 38 381 -624 -1054 383 -618 -479 307 -344 25 -638 -1839 -1151 -1717
1729 -1717 -2701 -1242 -831 -1349 -569 22 -89 -637 -715 40 -453 -775 160 456 -131 -70 -56 -485 -788 -996
1749 -996 -265 -312 188 1121 1431 1301 1106 1061 860 926 498 1234 1323 934 1079 1031 -37 -341 -221 -151 -17 470
1771 470 931 984 959 904 323 195 92 -577 72 -35 -818 73 -88 -1160 -1077 -935 -1688 -1203 -488 -528 -99
1792 -99 422 351 -364 -381 -456 -1256 -1017 -82 -1345 -452 531 -1502 -928 -261 -1830 -747 273 -261 1148
1811 1148 1133 771 914 709 644 135 -88 918 204 367 1745 -18 57 1392 -494 176 1859 -331
$$ packed form
1678g95J282k069J695p2j105L354j371j739L738k389j584K109j421k72J358k09
1694E10J397o64p07J842j397k65R79p08R38J08j235K211j787k435K308j105j551
1711a561J757K84m64J85j63L43j005m30J437j001J39P86o51L69o63j201O88n66
1729a717r84J459M11n18P80N91j11n48p8P55m93l22R35K96n87O1J4m29l03k08
1749i96P31m7N00R33L10j30j95m5k01O6m28P36Q9l89J45m8j068l04J20P0J34M87
1771D70M61N3k5n5n81j28j03o69O49j07p83Q91j61j072Q3J42p53M85P15m0M29
1792i9N21p1p15j7p5q00K39R35j263Q93R83k033N74O67j569J083J020n34J409
1811A148j5l62J43k05o5n09k23J006p14J63J378j763P5J335j886O70J683k190
$$ plain form
1829 -331 1208 2441 130 1795 1156 -244 652 -791 -136 523 -852 775 145 -1072 1567 -897
1845 -897 -1393 1566 -1220 -322 2244 -915 622 1384 -1998 74 -875 -2189 547 -1653 -717 942
1861 942 -2120 312 -252 -2923 1260 -514 -1495 2699 -853 -49 2553 -2292 -327 635 -2758 799
1877 799 -308 -1997 2175 -873 -229 2062 -2100 901 1511 -1677 2839 828 -1320 3352 -605 -1059
1893 -1059 2402 -2682 -372 1419 -2174 1678 757 -1579 2868 -747 -760 1951 -2221 1379 2387 -2197
1909 -2197 2047 604 -2454 2246 -1801 -2812 2204 -2041 -12 1620 -2962 1402 886 -2088 1864
1924 1864 -1405 -1477 2672 -1778 -88 1496 -3010 1390 388 -3908 1376 -845 -1575 3334 -1473 -760
1940 -760 2632 -1700 1527 726 -3300 2728 905 -1042 2532 -2340 -853 2871 -2958 146 651 -3029
$$ packed form
1829c31J539J233k311J665o39j400Q96j443O55O59j375J627o30j217K639k464
1845h97m96K959k786Q98K566l159J537P62l382K072r49j314K736k200R36J659
1861I42l062K432n64k671M183j774r81M194l552Q04K602m845J965R62l393L557
1877G99j107j689M172l048O44K291m162L001O10l188M516k011k148M672l957m54
1893a059L461n084K310J791l593L852r21k336M447l615j3K711m172L600J008m584
1909b197M244j443l058M700m047j011N016m245K029J632m582M364n16k974L952
1924A864l269p2M149m450J690J584m506M400j002m296N284k221p30M909m807P13
1940g60L392m332L227q01m026O028j823j947L574m872J487L724n829L104N05l680
$$ plain form
1956 -3029 3331 1691 -1952 2805 -1311 -375 3427 -2729 -112 1803 -1569 2819 -168 -3488 2275
1971 2275 -1322 -861 1877 -3690 347 3293 -1556 1759 -595 -2827 3753 -391 -2352 1140 -2640
1986 -2640 1363 2763 -3468 -70 -210 -1855 3263 -1488 -2478 3066 -577 1255 1884 -3171 1304 1520
2002 1520 -1488 2174 -1665 -1335 3745 -1086 -673 600 -3113 1782 1848 -2500 1306 -336 -501 4044
2018 4044 -1026 -1654 852 -1535 1315 630 -2944 586 92 -607 1378 -2825 -1674 1758 -1398 633
2034 633 293 -2914 2165 1288 -2294 625 -1623 -1154 2064 -1500 -1188 726 -1540 1422 268 -2733
2050 -2733 947 -223 -30 2292 -1619 174 2186 -1451 1158 551 -2444 2086 621 -1514 1878
2065 1878 -705 -196 2451 -1188 230 1061 -993 2194 828 -854 2061 -506 164 1744 -2448 394
$$ packed form
1956c029O360j640l643M757m116R36L802o156K617J915l372M388k987l320N763
1971B275l597M61K738n567M037K946m849L315k354k232O580m144j961L492l780
1986b640M003J400o231L398j40j645N118m751r90N544l643J832O29n055M475K16
2002A520l008L662l839L30N080m831M13J273l713M895O6m348L806j642j65M545
2018D044n070o28K506k387K850o85l574L530m94o99J985m203J151L432l156K031
2034F33l40l207N079q77l582K919k248M69L218l564L12J914k266K962j154l001
2050b733L680j170J93K322l911J793K012l637K609o07k995M530j465k135L392
2065A878k583N09K647l639J418Q31k054L187j366j682K915k567O70J580m192K842
$$ plain form
2081 394 1057 -1851 1567 225 -1805 2162 -709 -1120 1670 -1396 518 1450 -1277 1297 -98 -1281
2097 -1281 1388 -1723 -962 1050 -1857 533 606 -1992 1389 -148 -1600 1432 -1083 -723 1761 -1017
2113 -1017 293 807 -1369 913 -440 -1307 1093 -676 -19 1167 -896 775 776 -921 1125 -252
2129 -252 -817 1574 -493 -508 1068 -567 -73 202 -1258 26 -187 -511 719 -338 43 384 -364 62
2147 62 -3 -637 577 -46 -237 742 -367 -330 326 -828 -41 -75 -356 441 296 -247 599 282 -86 317
2167 317 19 100 208 135 690 123 -272 241 -173 -109 32 150 271 484 425 609 448 87 352 19 -429
2188 -429 125 193 63 -153 -248 -511 -401 -402 -428 -218 -282 -78 -168 -318 12 -318 -399 -224 -615 -255 -60 -233 -291
2211 -291 -9 -294 -246 -282 -156 -95 -84 149 342 98 373 322 232 -177 315 -185 276 349 75 498 245 318 78
$$ packed form
2081C94O63k908L418j342k030L967k871m11K790l066J914R32k727K574j395j183
2097a281K669l111P61K012k907K390P3k598L381j537j452L032k515L60K484k778
2113a017J310N14k176K282j353q67K400j769O57J186k063J671Jj697K046j377
2129b52n65K391k067j5J576j635M94K75j460J284k13l24J230j057L81L41p48M26
2147F2o5o34J214o23j91R79j109L7O56j154P87l4k81P97j45n43Q46l17l68M03
2167C17k98Q1J08p3N55n67l95N13m14O4J41J18J21K13n9J84j61l61K65l33m48
2188d29N54O8j30k16r5k63J10jk6K10o4K04r0j50L30l30q1J75l91L60J95j73n8
2211b91K82k85M8l6J26O1J1K33J93k44K75n1r0m09M92n00M61P3k74M23k53P3k40
$$ plain form
2234 78 111 403 136 426 754 532 694 644 448 381 235 -193 127 285 -100 282 113 -55 -141 -208 38 -334
2256 -334 -26 1 -401 11 90 -795 -245 -298 -599 -372 -221 -194 -180 -393 -639 -193 -373 -461 -431 -136 296 -88
2278 -88 7 425 -340 165 111 -262 39 216 -301 253 209 -189 663 -67 71 384 -153 507 282 -109 622
2299 622 425 48 818 -376 45 602 -139 276 408 -307 355 206 -172 323 -401 33 330 -247 191 -36
2319 -36 -524 393 -213 -685 -137 -486 -409 101 -695 -140 146 -476 139 -256 -704 227 124 -40 7 -521 154
2340 154 28 -322 79 -243 -674 427 211 -605 450 -347 -22 635 -590 226 753 -4 579 334 -374
2359 -374 696 -84 -219 849 -539 339 836 -232 678 311 -563 1185 235 -361 1169 -616 -76 1188
2377 1188 -624 459 591 -994 920 60 -768 1001 -780 10 1156 -892 565 299 -1372 1144
$$ packed form
2234G8L3K92k67K90L28k22J62n0j96o7j46m28L20J58l85L82j69j68q6o7K46l72
2256c34L08K7m02M12P9q85N50n3l01K27J51K7J4k13k46M46j80q8L0K95M32l84
2278h8R5M18p65N05n4l73L01J77n17N54m4l98Q52p30J38L13n37O60k25l91P31
2299F22j97l77P70j194M21N57p41M15J32p15O62j49l78M95p24M34K97n77M38k27
2319c6m88R17o06m72N48l49P7N10p96N55K86o22O15l95m48R31j03j64M7n28O75
2340A54j26l50M01l22m31J101k16q16J055p97L25O57j225Q16N27p57N83k45p08
2359c74J070p80j35J068j388Q78M97j068R10l67q74J748r50n96J530j785N40J264
2377A188j812J083J32j585J914q60q28J769j781P90J146k048J457k66j671K516
$$ [...]
8191B23
##END NTUPLES=NMR FID
##END=
