##TITLE=1H_LR-733-CR4A
 CDCl3,8 sc, 
 3.03.2021
##JCAMPDX= 6.0         $$ Bruker NMR JCAMP-DX V2.0
##DATA TYPE= NMR FID
##DATA CLASS= NTUPLES
##ORIGIN= UXNMR, Bruker Analytische Messtechnik GmbH
##OWNER= root
$$ XWIN-NMR		Version 3.5
$$ Wed Mar  3 13:28:32 2021 Russian Standard Time (UT+4h)  she@DPX200
##.OBSERVE FREQUENCY= 200.1315066352
##.OBSERVE NUCLEUS= ^1H
##.DELAY= (6, 6)
##.ACQUISITION MODE= SIMULTANEOUS
##.ACQUISITION SCHEME= undefined
##.AVERAGES= 8
##.DIGITISER RES= 18
##SPECTROMETER/DATA SYSTEM= spect
##.PULSE SEQUENCE= zg30
##.SOLVENT NAME= D2O
##.SHIFT REFERENCE= (INTERNAL, D2O, 0, 15.7039)
##AUDIT TRAIL= $$ (NUMBER, WHEN, WHO, WHERE, WHAT)
$$ ##TITLE= Audit trail, XWIN-NMR		Version 3.5
$$ ##JCAMPDX= 5.01
$$ ##ORIGIN= Bruker BioSpin GmbH
$$ ##OWNER= she
$$ F:/spectra/data/she/nmr/H-F/1/audita.txt
$$ ##AUDIT TRAIL=  $$ (NUMBER, WHEN, WHO, WHERE, WHAT)
(   1,<2021-03-03 13:27:41.95 +0400>,<she>,<DPX200>,
      <created by zg, POWCHK disabled, PULCHK disabled
       configuration hash MD5:
       00 E9 B6 7A A2 85 ED C7 34 08 36 98 17 FE 4E 26
       data hash MD5: 16K
       FF DF CC B6 46 F0 64 C9 E6 5B DC 42 24 00 51 5E>)
$$ ##END=
$$ 
$$ hash MD5
$$ C6 0D 92 68 0B 95 50 9D 05 10 68 12 DA FB 44 0A
##$RELAX= 
##$RELAX= 
##$RELAX= 
##$RELAX= 
##$RELAX= 
##$RELAX= 
$$ Bruker specific parameters
$$ --------------------------
##$DU= <F:/spectra>
##$EXPNO= 1
##$NAME= <H-F>
##$PROCNO= 1
##$TYPE= <nmr>
##$USER= <she>
##$AMP= (0..31)
100 100 100 100 100 100 100 100 100 100 100 100 100 100 100 100 100 100 
100 100 100 100 100 100 100 100 100 100 100 100 100 100 
##$AQSEQ= 0
##$AQ_mod= 1
##$AUNM= <au_zg>
##$AUTOPOS= <>
##$BF1= 200.13
##$BF2= 200.13
##$BF3= 200.13
##$BF4= 200.13
##$BF5= 200.13
##$BF6= 200.13
##$BF7= 200.13
##$BF8= 200.13
##$BYTORDA= 1
##$CFDGTYP= 0
##$CFRGTYP= 5
##$CHEMSTR= <none>
##$CNST= (0..31)
1 1 145 1 1 1 1 1 1 1 1 1 1 1 1 1 1 1 1 1 1 1 1 1 1 1 1 1 1 1 1 1 
##$CPDPRG= <>
##$CPDPRG1= <>
##$CPDPRG2= <>
##$CPDPRG3= <>
##$CPDPRG4= <mlev>
##$CPDPRG5= <mlev>
##$CPDPRG6= <mlev>
##$CPDPRG7= <mlev>
##$CPDPRG8= <mlev>
##$CPDPRGB= <>
##$CPDPRGT= <>
##$D= (0..31)
0 1.2 0 0 0 0 0 0 0 0.06 0 0.03 0 0 0 0 0.0002 0 0 0 0 0 0 0 0 0 0 0 0 
0 0 0 
##$DATE= 1614763661
##$DBL= (0..7)
120 120 120 120 120 120 120 120 
##$DBP= (0..7)
150 150 150 150 150 150 150 150 
##$DBP07= 0
##$DBPNAM0= <>
##$DBPNAM1= <>
##$DBPNAM2= <>
##$DBPNAM3= <>
##$DBPNAM4= <>
##$DBPNAM5= <>
##$DBPNAM6= <>
##$DBPNAM7= <>
##$DBPOAL= (0..7)
0.5 0.5 0.5 0.5 0.5 0.5 0.5 0.5 
##$DBPOFFS= (0..7)
0 0 0 0 0 0 0 0 
##$DE= 6
##$DECBNUC= <off>
##$DECIM= 32
##$DECNUC= <off>
##$DECSTAT= 4
##$DIGMOD= 1
##$DIGTYP= 9
##$DL= (0..7)
0 120 120 120 120 120 120 120 
##$DP= (0..7)
150 150 150 150 150 150 150 150 
##$DP07= 0
##$DPNAME0= <>
##$DPNAME1= <>
##$DPNAME2= <>
##$DPNAME3= <>
##$DPNAME4= <>
##$DPNAME5= <>
##$DPNAME6= <>
##$DPNAME7= <>
##$DPOAL= (0..7)
0.5 0.5 0.5 0.5 0.5 0.5 0.5 0.5 
##$DPOFFS= (0..7)
0 0 0 0 0 0 0 0 
##$DQDMODE= 0
##$DR= 18
##$DS= 0
##$DSLIST= <SSSSSSSSSSSSSSS>
$$ [...]
##$SUBNAM2= <"">
##$SUBNAM3= <"">
##$SUBNAM4= <"">
##$SUBNAM5= <"">
##$SUBNAM6= <"">
##$SUBNAM7= <"">
##$SUBNAM8= <"">
##$SUBNAM9= <"">
##$SW= 16.9725356469052
##$SWIBOX= (0..15)
0 0 2 0 0 0 0 0 0 0 0 0 0 0 0 0 
##$SW_h= 3396.73913043478
##$TD= 16384
##$TD0= 1
##$TE= 0
##$TE2= 300
##$TE3= 300
##$TEG= 300
##$TL= (0..7)
0 120 120 120 120 120 120 120 
##$TP= (0..7)
150 150 150 150 150 150 150 150 
##$TP07= 0
##$TPNAME0= <>
##$TPNAME1= <>
##$TPNAME2= <>
##$TPNAME3= <>
##$TPNAME4= <>
##$TPNAME5= <>
##$TPNAME6= <>
##$TPNAME7= <>
##$TPOAL= (0..7)
0.5 0.5 0.5 0.5 0.5 0.5 0.5 0.5 
##$TPOFFS= (0..7)
0 0 0 0 0 0 0 0 
##$TUNHIN= 0
##$TUNHOUT= 0
##$TUNXOUT= 0
##$USERA1= <user>
##$USERA2= <user>
##$USERA3= <user>
##$USERA4= <user>
##$USERA5= <user>
##$V9= 5
##$VALIST= <valist>
##$VCLIST= <CCCCCCCCCCCCCCC>
##$VD= 0
##$VDLIST= <DDDDDDDDDDDDDDD>
##$VPLIST= <PPPPPPPPPPPPPPP>
##$VTLIST= <TTTTTTTTTTTTTTT>
##$WBST= 1024
##$WBSW= 4
##$XGAIN= (0..3)
0 0 0 0 
##$XL= 0
##$YL= 0
##$YMAX_a= 529500
##$YMIN_a= -376616
##$ZGOPTNS= <>
##$ZL1= 120
##$ZL2= 120
##$ZL3= 120
##$ZL4= 120
##$ABSF1= 10
##$ABSF2= 0
##$ABSG= 5
##$ABSL= 3
##$ALPHA= 0
##$AQORDER= 0
##$ASSFAC= 0
##$ASSFACI= 0
##$ASSFACX= 0
##$ASSWID= 0
##$AUNMP= <proc_1d>
##$AZFE= 0.1
##$AZFW= 0.1
##$BCFW= 1
##$BC_mod= 2
##$BYTORDP= 1
##$COROFFS= 0
##$CY= 11.3945322036743
##$DATMOD= 1
##$DC= 2
##$DFILT= <>
##$DTYPP= 0
##$F1P= 15.9154993809931
##$F2P= -4.1035820241983
##$FCOR= 0.5
##$FTSIZE= 0
##$FT_mod= 4
##$GAMMA= 1
##$GB= 0.15
##$INTBC= 1
##$INTSCL= 1
##$ISEN= 128
##$LB= 0.24
##$LEV0= 0
##$LPBIN= 0
##$MAXI= 10000
##$MC2= 0
##$MEAN= 0
##$ME_mod= 0
##$MI= 1.114404
##$NCOEF= 0
##$NC_proc= 0
##$NLEV= 6
##$NOISF1= 3.799351
##$NOISF2= 2.8
##$NSP= 1
##$NTH_PI= 0
##$NZP= 0
##$OFFSET= 15.70392
##$PC= 1
##$PHC0= -10754.09
##$PHC1= -0.1990623
##$PH_mod= 1
##$PKNL= yes
##$PPARMOD= 0
##$PSCAL= 0
##$PSIGN= 0
##$REVERSE= no
##$SF= 200.130013532006
##$SI= 16384
##$SIGF1= 3
##$SIGF2= 2
##$SINO= 400
##$SIOLD= 16384
##$SREGLST= <1H.CDCl3>
##$SSB= 0
##$STSI= 0
##$STSR= 0
##$SW_p= 3612.71676300578
##$SYMM= 0
##$S_DEV= 0
##$TDeff= 0
##$TDoff= 0
##$TI= <>
##$TILT= no
##$TM1= 0
##$TM2= 0
##$TOPLEV= 0
##$USERP1= <user>
##$USERP2= <user>
##$USERP3= <user>
##$USERP4= <user>
##$USERP5= <user>
##$WDW= 1
##$XDIM= 8192
##$YMAX_p= 0
##$YMIN_p= 0
$$ End of Bruker specific parameters
$$ ---------------------------------
##NTUPLES= NMR FID
##VAR_NAME=  TIME,          FID/REAL,        FID/IMAG
##SYMBOL=    X,             R,               I
##VAR_TYPE=  INDEPENDENT,   DEPENDENT,       DEPENDENT
##VAR_FORM=  AFFN,          ASDF,            ASDF
##VAR_DIM=   8192,          8192,            8192
##UNITS=     SECONDS,       ARBITRARY UNITS, ARBITRARY UNITS
##FACTOR=    0.0002944,     1,               1
##FIRST=     0,             0,               0
##LAST=      2.4114304,     0,               0
##MIN=       0,             -376616,         0
##MAX=       2.4114304,     529500,          0
$$ Real data points
##PAGE= N=1
##DATA TABLE= (X++(R..R)), XYDATA
$$ [...]
1900A37n61J900j826L13J154k120J179O94j524J121j28j234J261q88K34M41r73
1917h20Q64j08n87J128o25l57J214j144o60N14k90L29L36m69K86j62O11k85m52
1936f77O3L08O76po65P6O4K34r7o87N32K88J53L90j251L95P24m62L55j64q84J680
1958A044k06o64N84j157N74J263j642L86n0n82J892q97q63J290q24N56L28k181
1976a149J537N92j358J486j298l00J672j907J04Q08j404J516L27j422J274o12
1992a34l25J363j791M52Q83j356R00K36j185J283q30l75J590j055n2J030j539
2009i05Q44Q76j228Q33l65o79J311p74l81J061o19M35M06j020P16k00n63J149
2027H97q60m3J026m73m65M30j228P16P65j084L39L11p56P05l71o68N98k54K96
$$ plain form
1900 137 -424 1476 -350 -37 1117 -1003 176 870 -654 467 339 -895 366 -522 -288 153 -820
1917 -820 44 -64 -651 477 -148 -505 709 -435 -1095 -581 -871 -542 -206 -675 -389 -551 60 -225 -677
1936 -677 -614 -306 370 363 -302 -226 -162 72 -25 -712 -180 108 261 651 -600 -205 519 57 412 248 -636 1044
1958 1044 838 174 758 -399 175 1438 -204 182 132 -450 1442 545 -318 972 148 704 1032 -1149
1976 -1149 388 980 -378 1108 -190 -490 1182 -725 -621 187 -1217 299 626 -796 478 -134
1992 -134 -459 904 -887 -435 448 -908 -8 228 -957 326 -504 -879 711 -344 -396 634 -905
2009 -905 -61 815 -413 420 55 -624 687 -87 -468 593 -26 409 815 -205 511 311 -252 897
2027 897 37 -6 1020 547 82 512 -716 0 765 -319 20 331 -425 280 -91 -759 -161 -415 -119
2046a19M42j204N81O15r52P57j93j117J241n21n17J167j133M60J285j553O04o9
2064b26r36J871n53p90J488j299K25J245k315J296L01j302J578n69p98K062j434
2081a56p6J434j833J358K92j616J376o36n87J589j725L11Q30j477J336L3j586
2098a133K026p09n35J504j858M12R59j505R85K17j063J452r97n13R59o28L52O65
2116E90j512J385j9n96R50q71k24O44n91J39O88j009Q20J21r21N52k03m5O26o73
2136a49L48J2m91R67o11j79L73j66mM67j017M73O74n22J90k63NK00m03R3Ll14
2158c14M72no42L34o4j78J67Rk13Q8J45J21l49R0J9n1L01r9N2J23n34M59j2k32
2182c13P6J60n28O32k86L2L33l40J50j1R6Q7l21K63J46j01K71j89k38J87J36j23
$$ plain form
2046 -119 323 -881 -300 315 -637 120 -73 -1190 51 -470 -987 180 -953 -493 792 -761 -157 -226
2064 -226 -1162 709 156 -634 854 -445 -220 1025 -1290 6 307 -995 583 14 -784 1278 -156
2081 -156 -232 1202 -631 727 1019 -597 779 143 -444 1145 -580 -269 561 -916 420 453 -1133
2098 -1133 893 184 -351 1153 -705 -293 666 -839 146 363 -700 752 -245 -758 201 -427 -75 590
2116 590 -922 463 444 -152 798 -73 -297 347 -244 -105 583 -426 394 515 -406 146 -57 -102 524 -149
2136 -149 199 211 -280 687 76 -103 270 104 100 567 -450 23 697 175 365 102 107 307 -96 -3 0 -314
2158 -314 158 153 -489 -155 -219 -397 -230 -221 -434 -346 -201 -80 -429 -339 -320 -371 -70 -169 -117 6 -528 -69 -81 -313
2182 -313 -237 -77 -605 27 -259 -227 106 -234 -84 -95 1 88 -233 30 176 75 346 157 -81 106 242 119
2204A19J53J48o1J39j17J65m12L7q2K11k86J87j84k8J34m79L59p1Q6Q2j69J24
2226E5K17k54j63K60k58k30K72j57n7k1K68k1r8qL%J2k21oO99m25N5K0r3k2O4
2252a09j80N9K36j19pj84L14o3RK69k67nJ54o4NL26j28j88K46n14L75J95n42J96
2276A4K06j54K42l39J99qk44J68J40r9M93m94j86K97l73J63j51l36P29k3o37O63
2298B70k79m45P48k17q9K66k28P9j70r6L37m03J16m9l31N11j71K03M70m52j87
2319a17N10k36L8j32j62L98j45%n4k02J30j07j91K98j64J85M39n97L6K44k72P8
2341b3j76j63L80k82M40j96p19Q52k4k02L49p07J95P44p78K13K47m92Q39o65k71
2362d39R37q17L73N49j430J103J59j017J100j107J77J635j560M45L62q91J195
$$ plain form
2204 119 272 420 359 498 381 546 134 171 89 300 14 201 17 -11 123 -356 3 -68 18 100 -69 55
2226 55 272 18 -145 115 -143 -373 -101 -258 -315 -336 -68 -89 -187 -195 -192 -192 -180 -401 -407 292 -133 -78 -58 -151 -173 -109
2252 -109 -289 -230 6 -113 -120 -304 10 -53 -44 225 -42 -47 107 43 48 374 246 58 304 -210 165 360 -182 14
2276 14 220 66 308 -31 168 160 -84 84 224 125 618 124 -62 235 -138 25 -126 -462 267 244 -393 270
2298 270 -9 -454 294 77 -12 254 26 105 -65 -161 176 -227 -111 -160 -491 20 -151 52 522 70 -117
2319 -117 393 157 195 63 -99 299 154 154 100 -102 28 -79 -270 28 -136 49 488 -109 -73 171 -101 -23
2341 -23 -199 -362 18 -264 176 -20 -739 113 89 -113 236 -471 -276 468 -310 -97 150 -342 497 -168 -439
2362 -439 498 -319 54 603 -827 276 435 -582 518 -589 -412 1223 -337 108 470 -421 774
2379G74n48j282J539m29o7J051k022J291P96j718J273p02q13K325j378o51J318
2396G57j924J727L74k095J589m99l93K176k449K04J507j910J706j68k105K525
2412A022p35r95J595j890P97J276k101Q33K05j325K536j710l06J595j728J093
2428A62P69k261J863m25j017J744j352J00J523k147R92O05j450J534p61q15K019
2445A083j617N90N76j535J519k84j070J587j079L17R47j657Q60L27q61R61j62
2462E02r04J338p27J78Q3p73Q41R3o78N46r78M44O49j101P89j93l55O88o14K69
2482I7P4m33O06l10k88O87q77J97P06j090Q20j00p49R51o65l00J198j384R04l7
2502Gq37R28m61k45J142j139K85O35j230J111Q9j348J504o13j03J010j414N84
$$ plain form
2379 774 226 -1056 483 54 -13 1038 -984 307 1103 -615 658 -44 -857 1468 90 -561 757
2396 757 -1167 560 934 -1161 428 -71 -464 1712 -737 -533 974 -936 770 602 -1503 1022
2412 1022 287 -708 887 -1003 -206 1070 -1031 -198 7 -1318 1218 -492 -798 797 -931 162
2428 162 931 -1330 533 108 -909 835 -517 -417 1106 -1041 -49 556 -894 640 -121 -936 1083
2445 1083 -534 56 632 -903 616 332 -738 849 -230 87 1034 -623 237 564 -297 664 502
2462 502 -402 936 209 387 470 -303 538 631 -47 499 -479 -35 614 -487 302 109 -246 442 -172 97
2482 97 171 -262 344 34 -254 433 -444 -247 459 -631 189 89 -660 291 -374 -674 524 -860 44 7
2502 7 -830 98 -363 -608 534 -605 -320 315 -915 196 285 -1063 441 -172 -275 735 -679 -95
2520i5P23j145O88R6r15J820j501j31J186j054P34L45j363R49l81m52J509j243
2538b30k28J360j036N27K55j236J251n88n27J170q68r3O91r86O23l0n55R97o60
2557a63l23O73m80R8L66q09L81K82m59L62j38k1L48m55QJ63j15L17O6k95J48Q0
2579C4l22L57J62m7j38j85J66J85k85Q5L57k80N6L2j34J22K33q3J1K82m75K17
2601C50o5k05J87o4jj57N3R4M6o16P29k37j12J53l96K87J59m64L08K43p37N70
2623A25j01l26M68l58KK94l33L36n5m90O28n78J59N35p76M29p8l03J91J79j30
2644a82K78m7j79L52m21M9N2k98L13N3k78N87n40J71N05m89K49jj88J91%l37P6
2667h4J66o5K09L6j71L0J1J46l40q7N19l07J14j22p7J97Q5j22jJ34k70k52K39
$$ plain form
2520 -95 628 -517 171 267 -648 1172 -329 -460 726 -328 406 751 -612 337 -44 -496 1013 -230
2538 -230 -458 902 -134 393 648 -588 663 75 -452 718 -150 -243 448 -538 85 55 -500 497 -163
2557 -163 -486 187 -293 -195 171 -638 -257 25 -434 -72 -210 -231 117 -338 -330 -167 -282 35 101 -194 -46 34
2579 34 -288 69 231 184 46 -139 27 212 -73 12 369 89 145 177 43 165 398 315 326 608 133 350
2601 350 285 80 267 203 202 45 98 192 238 -378 351 114 2 155 -241 46 205 -259 49 292 -445 125
2623 125 24 -302 166 -192 -190 104 -229 107 52 -438 190 -388 -229 306 -470 -41 -119 -422 -231 -52 -182
2644 -182 96 49 -130 222 -199 -150 -98 -396 -83 -30 -308 279 -261 -90 415 -74 175 174 -14 177 177 -160 -84
2667 -84 82 17 226 262 91 121 132 278 -62 -149 370 63 177 55 -22 175 260 138 137 271 1 -251 -12
2690a2r5J10R0o2J10J01m08K5Q0R2k4Q8j20P4o0J29k61J9J55l06K03K59k30K5
2714a8n8j8J01j7o4J11j25N2K12j15j69j65K91lo1j21J21p6J16K19l00R8l8Jk41
2739b67K80Jl6K07J96l05j03p0K29RK37k94m7r0K5L1K22j00l27L96k78L7K87l80
2763a40j16K98j39L30J2k88J47m7J9K15l38J77L7j81L75j73l98L97j30j34L07
2784B30m68J24J91m88O51n8j52N4l47P9L96l69K06M1n46O91j04m93O24l17j06
2805a61Q03r36O86l44l80O29n59O6O60p20K60M40j030R22j65o42J043p27J39O28
2825F12j031L09M63o04M46o7m75J102o41l00O79r04O16O8l00K67j62l10P89r51
2845c94L32K88n81O38k50m12Q26n19j12K80k70J44m8k67L52j42o1O06o80J55L60
$$ plain form
2690 -12 -107 3 93 31 141 242 -166 -141 -61 31 7 95 -25 49 -11 118 -143 -124 31 -275 -72 187 -43 -18
2714 -18 -76 -94 7 -10 -74 37 -88 -36 176 61 -108 -273 18 15 -46 -167 -46 -122 -6 213 -87 11 -27 -26 -267
2739 -267 13 14 -22 185 381 76 -27 -97 132 141 378 84 37 -53 -28 3 225 125 -202 194 -84 -47 240 -140
2763 -140 -256 42 -97 233 245 -43 104 57 76 291 -47 130 167 -14 361 188 -210 187 57 -77 230
2784 230 -238 -114 77 -411 240 182 30 84 -263 -184 212 -157 49 90 -456 235 131 -362 262 -55 -161
2805 -161 642 -294 392 48 -332 297 -262 -196 464 -256 4 444 -586 336 171 -471 572 -155 -16 612
2825 612 -419 -110 353 -251 195 128 -347 755 114 -186 493 -411 205 273 -27 240 78 -232 557 -394
2845 -394 -62 226 -355 283 33 -379 447 -72 -184 96 -174 -30 -78 -345 7 -135 -196 410 -270 -115 245
2866B45p09M67L9m17N01l92K15K40o80L96M0l20O69n39L32K10o51M55l90j82Q58
2887C87l28r2L74r05Q09J66o42O48n70r0O58j009N73K35n06O81l16m15J076j197
2907d63L76P80j248Q70J13r37J216n68l76J013j168M59M30j282J444m14r85J291
2925E51o78k07J216j491J96R77j331R60j5q72J631j386j89J416j784J348j4j372
2943a044J473m10o10J636j649P2J512j504M85K62j017J287m30n94J058q54L93
2960F6O66j467R93j7p73J011o48l17J291j015r3Q27r98Q65j23n25O43k50p6L55
2980D15p46K49P76j054P57l00l79P54n41l3N05n29p1L68n41Q1J86j97K78L04p42
3001d60N02k73J69j22k9K52k51J72J59m08J17L57m95J47J28J19K19j35O2n72K66
$$ plain form
2866 245 -464 3 42 -375 126 -266 -51 189 -491 -95 -55 -375 294 -245 87 297 -354 101 -289 -471 387
2887 387 59 -33 341 -564 245 411 -231 417 -153 -243 415 -594 -21 214 -292 389 73 -342 734 -463
2907 -463 -87 693 -555 315 428 -509 707 139 -237 776 -392 67 497 -785 659 245 -740 551
2925 551 -127 -334 882 -609 -413 564 -767 193 178 -694 937 -449 -638 778 -1006 342 328 -1044
2943 -1044 429 19 -591 1045 -604 -532 980 -524 -39 223 -794 493 63 -531 527 -327 66
2960 66 732 -735 258 241 -532 479 -169 -486 805 -210 -303 524 -474 391 268 -257 386 136 60 415
2980 415 -331 -82 694 -360 397 97 -282 472 -69 -102 403 -126 -197 171 -370 -289 -103 -300 -22 282 -460
3001 -460 42 -231 -62 -184 -213 39 -212 -40 119 -289 -172 185 -310 -163 -35 84 303 168 230 -342 -76
3022g6J82n84O74j05k4p5K07k78J44k00L38Mj42L4j11K70K8k66J59J83p80N51
3044A33J83l63L39l24k77N30j81n4q0j58M06J50k90Q3j50L49Q1q35M93L83p28
3065c10N84j14n28M97N3m89N45m36M8M13l23r4K57l73M75l44l4P7j49M20P3r04
3087f56P54lk06K27k98l1M44k86l8L0Q6O2L2j90R8R3q0Ok80L35r6j15l1j36m4
3112c23N77m53O4K12k22J72p8j68L95k47K7K6J81l43K90J9q1KJ13r3j01MK65j57
3136H1l14L02j82J38pJ16k53M9J19j13J18p0P3j15J05j56J29K2K02j93l6l1l27
3159c43M04j03J45r2n9J66j42r2j28K20l05P2M26j62j9k46K51k78J14p4L35p3
3181A7Q4j11R8Ll0k99L10O3k26J49k35J00J95l1J13p9j85LL14k46MJ44j7j42J86
$$ plain form
3022 -76 106 -478 196 91 67 -8 199 -79 65 -135 203 207 65 99 -12 258 286 20 179 362 -418 133
3044 133 316 -47 292 -32 -309 221 40 -14 -94 -252 154 304 14 97 -53 296 377 -458 35 418 -310
3065 -310 274 160 -368 129 182 -307 238 -198 -150 263 -60 -154 103 -270 205 -139 -173 -96 -245 175 248 -656
3087 -656 98 95 -111 116 -182 -213 231 -55 -93 -63 23 85 117 -73 25 118 38 44 -236 99 3 -112 -143 -279 -323
3112 -323 254 -199 -135 77 -145 27 -51 -219 176 -71 -44 -18 163 -180 110 129 48 50 163 70 -31 -27 238 81
3136 81 -233 69 -113 25 18 134 -119 -70 49 -64 54 -16 57 -58 47 -109 20 42 244 51 15 -16 -343
3159 -343 61 -42 103 11 -48 118 -24 -116 -244 -24 -329 -257 169 7 -12 -258 -7 -285 -171 -245 90 17
3181 17 101 -10 88 91 61 -238 72 135 -91 58 -177 -77 118 87 200 121 -64 -61 253 7 11 155 138 -4 182
3206A82n6j03o3J16J3M6K94l47j25J52k23K56R2l62P1N0n7N43n67J4J55k31K53
3229A03j80q2R6m7L9L26j61j34Nk94L68o5l3L91m40n4q5oM55k2l88R9j9J02J35
3254A09k78J96k29K13L7l12K80J69n47L97P5m2L29k63j74J06O7nl8pN1Mp0l1j06
3279f9K73j48k39M67l49P5Rk61K72Qk8J19P2j25K4k20Q7L29m33J37k33J19K33
3302A19m21k4N50k73l35O79n81L79on33N81m03J37J73j34j44J48l20K96J93o83
3323f02O41m3j23M55o30K10L51q05P04J72p35R55n53j34N40o87J19M23o06L36
3343a2K21m28O89n99k59Q84q17M61J26q05P53O8o60R48n48l75P95o96K93M57p53
3364b57M72n2l14N27n73j06P16p76N7P33q56Q60m66l52P12o26K9P45q64L36L22
$$ plain form
3206 182 126 23 -40 76 89 135 429 82 -43 109 -114 142 234 -128 -57 -7 -64 479 -88 -74 81 -150 103
3229 103 -77 -159 -63 -110 -71 255 94 -40 -35 -329 39 -26 -59 332 -108 -162 -247 -253 202 180 -208 -109 -128 -26 109
3254 109 -169 27 -202 11 48 -264 16 185 -362 35 110 68 397 134 -40 66 133 128 90 83 134 138 68 37 -69
3279 -69 204 56 -183 284 -65 10 19 -242 30 38 10 129 201 76 100 -120 -33 296 -137 0 -233 -114 119
3302 119 -302 -326 224 -49 -384 295 -286 93 87 -446 135 -268 -131 42 -92 -236 -88 -408 -112 81 -602
3323 -602 39 -4 -127 328 -302 -92 259 -546 158 330 -405 550 -3 -137 403 -284 -165 258 -348 -12
3343 -12 209 -219 470 -129 -388 496 -321 140 266 -539 214 282 -378 570 22 -353 442 -254 39 496 -257
3364 -257 215 163 -151 376 -197 -303 413 -363 -306 427 -429 431 -35 -387 325 -301 -272 473 -391 -55 267
3385B67q10P14j90k99O66n25k91P19p99O73k43k77O59m63L4O07n87l0K75k55M67
3406C12l25k40M76j24k22M62m44K94L9m18L43k53j00O16o42M68J02m05K54r7j86
3427i0L01k01J10p4m87O47j65j22K31k28Q7J31m25M63m36p2N37m68j16L97l36
3448c16N25j75k60L83k37K15L44q60M63L0m89N21j66j74P32p72J19N99r69N72
3468H5q4m48J044m42l67N66m45J99k7p88P47J43q59J228p97j21Q77o70R0N63r40
3489d46Q42j10p95R47o37P6O56j003N61K98q15O67m00m90J135l53l62P41q17M16
3509A11J51l31M67n39K03K19l00P3N9l61N19J25n29M33m81q2N66m88l1L94k19
3530d1P2J15m37L80j39M8J69m44L27K00m32K81M7k26L09j42q9j45j19L25mj9N1
$$ plain form
3385 267 -543 171 -19 -318 348 -177 -468 251 -548 125 -118 -395 264 -199 -165 442 -145 -175 100 -155 312
3406 312 -13 -253 223 99 -123 339 -105 189 228 -190 153 -100 -200 416 -226 242 344 -61 193 96 -90
3427 -90 211 10 120 46 -441 206 41 -81 150 -78 9 140 -285 178 -258 -330 207 -261 -377 20 -316
3448 -316 209 34 -226 157 -80 135 479 -381 82 112 -377 144 -22 -196 536 -236 -117 482 -487 85
3468 85 1 -447 597 155 -212 354 -91 108 81 -707 40 183 -676 552 -245 -366 511 -159 -69 494 -446
3489 -446 396 286 -509 438 -199 -123 533 -470 91 389 -426 241 -159 -649 486 133 -229 512 -305 111
3509 111 262 -69 398 -141 62 281 -19 54 113 -248 271 396 -133 300 -181 -263 303 -185 -216 178 -41
3530 -41 31 146 -291 89 -50 -2 167 -277 50 250 -182 99 146 -80 229 87 -2 -147 -266 59 55 36 87
3553H7k54j23K15l7k42P0K92j64M55o28J25L63j96m9P2J4k01m5L56l27L24k04
3575i7j9N0k82M36j18m7J27j6J7j29j58J86j7K31q3j8j99K49m8o5K19l88J17j8
3599g0M7Q1l2KJ06k32J13N2j23K45j90O0k17M2O7L6OJ12q2q6R8j02j13K25J23
3624A68j39p5L2j15K20j70l7L26j02k45M7L16j94K4r8J37o7j16R4l2k3l8p3K54
3648I4O8k21n7J94j01J6K0m1j61L22k42n5r2K86k0k14L81Kk70K7M0J14k27P0J30
3673F3k1P9m9k05j42M41k60o9J36J95l8k60J55J25k08N8P7j41M5J31k03jJ37o4
3697a9J61j95K23k62J23j00R5N7j3j5LK39m86P6J87l32L35j76N8M1NK27k87L0
3721b5Q4J94k29n6K96j14j23l8Q4J77j97m09L36j28J35J32j16Q6Qk62K55k9l15
$$ plain form
3553 87 -167 -290 -75 -112 -354 -284 8 -156 299 -329 -204 159 -37 -86 -14 0 -201 -246 110 -217 107 -97
3575 -97 -116 -66 -348 88 -30 -77 50 34 51 -78 -236 -50 -67 164 81 63 -136 113 65 0 219 -169 -52 -70
3599 -70 -23 58 26 28 134 -98 15 67 -56 189 -1 59 -158 -116 -49 -13 -7 105 23 -63 35 -67 -180 45 168
3624 168 29 -46 -14 -129 91 -79 -116 210 108 -137 -90 226 32 56 -42 95 28 -88 6 -26 -49 -87 -160 94
3648 94 162 -59 -116 78 -23 -7 13 -28 -189 133 -109 -164 -256 30 10 -204 177 179 -91 -64 -24 90 -137 -67 63
3673 63 42 121 72 -133 -275 166 -94 -163 -27 168 130 -130 25 150 -58 0 77 -64 -19 112 -91 -92 45 -19
3697 -19 142 -53 170 -92 31 -69 26 83 70 55 58 297 -189 -113 74 -258 77 -99 -41 0 5 232 -55 -25
3721 -25 59 253 24 -32 264 150 27 -11 73 250 53 -356 -20 -148 -13 119 3 89 97 -165 90 61 -254
3744b54M17m00J87J03k26Q8J53r8J24j12k23M30j92j46K08j02J06J81j74J09j18
3765F1q4J19j33k4J28j81l8L48l00O0J28j25K12j49O7J50K9j72M0K0l9n0k17K27
3789G7K4J12K3l05OL3M8J06l6j10J71r3P6j00k96K77j09K50k55K49l0n9K4Q8k85
3814a14J05J42k19J35j27J26J03k58N6K08l09Q0o2j49M26k83R6K84l39jK76m42
3836b66L57j31l8R5rj42J42k61L09R0m34L57j66J38J8k94L44j19k95O20k81l47
3858c13O10l34LM08m52L9L35p08P14k74k69M80l65l89Q90m65j54M99n57P83k96
3879A85n31P44n12P7N52j063O36K90p91P53j83n14R53o55k09P33q71P34j11o90
3899d73Q27j69l19N66p92K14N33o32M79j30m27N67l45q7M32o86N45L23q26P68
$$ plain form
3744 -254 163 -237 -50 53 -173 -85 68 -30 94 -18 -241 189 -3 -149 59 -43 63 244 70 179 61
3765 61 -23 96 -37 -61 67 -114 -152 196 -104 -44 84 -41 171 22 89 239 268 96 136 156 117 67 -150 77
3789 77 101 213 236 -69 -63 -30 18 124 88 -22 149 56 132 32 -264 13 -96 154 -101 148 118 59 83 171 -114
3814 -114 -9 133 -86 49 -78 48 151 -107 -51 157 -152 -72 -134 -283 143 -140 -44 240 -99 -100 176 -266
3836 -266 91 -40 -78 17 8 -134 8 -253 56 146 -288 69 -97 41 59 -235 109 -10 -305 315 34 -313
3858 -313 297 -37 -34 374 -78 -39 296 -412 302 28 -241 239 -126 -515 375 -90 -244 255 -302 481 185
3879 185 -346 398 -114 -37 515 -548 88 378 -413 340 157 -357 596 -59 -268 465 -406 328 217 -473
3899 -473 354 185 -134 432 -360 -146 387 -245 234 104 -323 244 -101 -188 244 -442 103 426 -400 368
3919C68m61j38O27l39j55L02l73J36L02p75Q75m68o8N10l52R2K19l26K6K93p03
3940d08N81j79j92K01q5J4J26o7k9Q9k78K76k93K40K30l47J63K4j09K03l5m44
3962c19L18n6L72k20m63N67k82j39P2j25M43j97j62K42k3o9N30n27j24J12k1L51
3984B80j76k77N13m04K8J99m25J57J96k54K95j8j41L07k16k00K58k34K67j2m19
4005b76M03m31L31J94l14K88K01m88L69j78J78L5l27k22M51l52M95k65k99L65
4025A58k32p7M42j53j37J26k69J47j84j50N41k76RK91l77%O7k05J03M38l85L18
4047A95r3k27K91l50J11K22m92M30P6n84O01j83k24K69k62J14J14j50J17k28J01
4068a52K11k1j56PO2K29k45J71j9L5j13l2N5o9K16n6k46L51j23j4L20l82K11J1
$$ plain form
3919 368 -93 -231 396 57 -98 204 -169 -33 269 -506 369 -99 -167 343 -9 83 302 -24 2 295 -408
3940 -408 173 -6 -198 3 -82 -68 58 -9 -38 51 -227 49 -244 -4 226 -121 42 66 -43 160 125 -319
3962 -319 -1 -57 315 95 -368 199 -83 -222 -150 -275 168 -29 -191 51 28 -41 489 -38 -162 -50 -71 280
3984 280 104 -173 340 -64 -36 163 -262 -105 91 -163 132 114 -27 280 64 -136 122 -112 155 143 -276
4005 -276 127 -304 27 221 -93 195 396 -92 277 99 277 312 -15 -237 214 -138 357 92 -207 158
4025 158 -74 -151 291 138 1 127 -142 5 -179 -329 212 -64 -55 236 -141 -141 -74 -279 -176 262 -123 195
4047 195 102 -125 166 -184 -73 149 -343 87 163 -421 180 -3 -227 42 -220 -106 8 -142 -25 -253 -152
4068 -152 59 38 -118 -111 -49 180 -65 106 87 122 9 -23 32 -37 179 123 -123 228 105 91 411 29 240 251
4092B51j38l9j7q4K17k26K67k91j23N34l74j61K00J72J34l40K32k36J57j67K39
4113B07k53l2M8Q6J29o4k52K62j57J44k38j40L10j25l6J09M8r8P6j97Qj1J76R1
4137I1O2m12L03j02R2k10K29M9o2n1J66mo3qj21J46P2k00J59l8p1K41k31K30m00
4162a33J13j59J61J1r2R7Qj14K56J90k02o3l1l7L3j38K46j55J49l00J37N7O8M
4186A06k20P7K7Q0j18j5m2J82p8J53j94m1N1m8k5j26L6K41M0l18RL62k41n3q1
4211b36R2J1O4K6J56o3j23n0p1M99m63J22n9K34l85K93R8j10K04k09rR0j30nK47
4236B23j23N8l80O3L04j74N0k00L32j81J54j51J84k09j87J21J99j32P8J07j81
4257d5K75k77J58j94J04L99m27J22k09K08j81L63m58L02Q4n25J44J38j56L81k07
$$ plain form
4092 251 113 74 57 -27 190 -36 231 -60 -183 351 -23 -184 16 188 322 -18 214 -22 135 -32 207
4113 207 -46 -78 -30 56 185 121 -131 131 -26 118 -120 -260 50 -75 -111 -2 46 -52 24 -173 -165 -176 0 91
4137 91 153 -259 44 -58 34 -176 53 102 40 -11 155 151 88 80 -41 105 177 -23 136 98 27 268 37 267 -133
4162 -133 -20 -179 -18 -7 -99 -2 6 -108 148 338 136 73 42 5 38 -100 146 -9 140 -160 -23 34 102 106
4186 106 -114 -37 -10 70 -48 -63 -105 77 -1 152 -42 -83 -32 -80 -105 -231 -195 46 86 -232 -223 139 -102 -155 -236
4211 -236 -144 -133 -69 -43 113 50 -73 -123 -194 305 -158 -36 -95 139 -246 47 145 35 239 30 21 111 -19 -24 223
4236 223 100 158 -222 -159 145 -29 21 -179 153 -28 126 -25 159 -50 -237 -116 83 -49 29 136 -45
4257 -45 230 -47 111 -83 21 420 -7 115 -94 114 -67 296 -162 140 224 -301 -157 -19 -175 206 -1
4278aq7K35k88O7p6M4J16q3j9L8M6M3K01r2j25L52n32J78Pk39K19o7%J27j00l2
4304f8L7K01p4k3j26J3K51j68R8n9p9K28l28K65j99j68K99r6l7N4j04q5J98M6
4328G6Oq1p8P9r6R1J73l01n6L67j88l47M32k40J22K09l30k5N7K9L8J42l15J43
4352i3o8Q8J6k7K16j75K6n3j3q1K07q9j27RJ20J9R1rj70J75n6J50l44ML29j38
4378Gm0J69k84K98l7l79R1L09j38Q3M1j94K06j77j29N16l67jM28l50pl6k37M29
4402B01j40l70K94m4n0L70k03M1L6n25O03l28%M64n15L09j00k84M51k64j05K56
4424I7p7l22N27m33J78K43o59M76J84n01L51m46K92K97j91J78j09l87O15m16j50
4445b53N26o87M29Jm23O61j60k35N25m64J8J44m27L72J60l52K90J9j93O8l10K12
$$ plain form
4278 -1 -88 147 -141 -74 -150 -106 10 -73 -92 -54 -8 35 236 144 19 371 -161 17 24 -215 4 -63 -63 64 -36 -68
4304 -68 -31 170 96 73 -53 -40 211 43 141 82 3 231 -97 168 -31 -199 100 4 -33 21 -83 -168 30 76
4328 76 82 1 -77 2 -94 -3 170 -131 -187 180 -8 -355 77 -163 -41 168 -162 -187 -130 -101 -63 79 -236 -93
4352 -93 -161 -73 -57 -84 132 -43 -17 -70 -83 -164 43 -46 -173 -164 -44 -25 66 57 -113 62 6 156 -188 -184 145 7
4378 7 -33 136 -148 150 113 -266 -175 134 -4 79 120 -74 132 -45 -174 342 -25 -26 402 52 45 9 -228 201
4402 201 61 -309 -15 -59 -109 261 58 99 135 -390 213 -115 -115 349 -166 143 43 -241 210 -54 -159 97
4424 97 20 -302 225 -208 -30 213 -446 30 214 -287 64 -382 -90 207 16 194 85 -302 313 -103 -253
4445 -253 273 -414 15 16 -407 254 94 -141 384 -80 -62 82 -345 27 187 -165 125 144 -49 19 -291 -79
4467g9L84l86J53N0k93N37m60j00Q8j6J60L6k04R9J55l28K75j0N4J2k74N7L70
4490B80k35J62j49j47K24k38N1J59j95J48O2k09l8j1L5K79j79N6K4o0K72l66R0
4513A5r6J55l57N83m62L21j40J71r8k34J59J73j69L8k8k1k10J54J28P6l39J47
4535c4rr4L30j28j86K43K1j24p7R5J04k35O8J67j26j17J99k43J61K7p8N5k72J51
4559a02j3K8J0P9Q6j68L43l81NJ32n5Nm9j0K44l33J02j77J19K17j30J92j7k29
4583a02L03j7j62j26J25q2J12l5j40K63r9J05j10j21J9J45k51L14qq8j91J71K23
4606B48j50j13p3K56k52J66j18n6M1K2k9l4J52j83J81j8l6j21K37J63m63J39j82
4629b23K08J6j21P8j44K10m1o3O2L9l6L02l22Nj82J66R8P1J41l41J71j59K19j00
$$ plain form
4467 -79 305 -81 72 122 -171 366 -94 -194 -106 -122 38 74 -130 -31 124 -204 71 61 115 127 -147 -90 280
4490 280 45 207 58 -89 135 -103 -52 107 -88 60 122 -87 -125 -136 -101 178 -1 55 79 19 291 -75 15
4513 15 -81 74 -283 300 -162 159 19 190 92 -142 17 190 21 59 31 10 -200 -46 82 158 -181 -34
4535 -34 -43 -137 193 65 -121 122 143 19 -58 37 141 -94 -26 141 15 -102 97 -146 15 42 -36 19 -253 -102
4559 -102 -115 -87 -77 2 88 -80 263 -118 -113 19 -36 -31 -80 -90 154 -179 -77 -254 -135 82 -48 144 127 -102
4583 -102 201 184 22 -104 21 -61 51 16 -124 139 40 145 35 -86 -67 78 -173 141 133 45 -146 25 248
4606 248 98 -15 -88 168 -84 82 -36 -92 -51 -29 -58 -92 60 -123 58 40 4 -117 120 283 -180 -41 -223
4629 -223 -15 1 -120 -42 -186 24 -17 -80 -18 21 -15 287 -35 -30 -212 -46 52 123 264 -77 94 -65 154 54
4653E4Q5k68J43j68K7J98kj28p8mpJ49m0J33j32N8k29K39J03K2m15K83k7J04k24
4678a24J37M8j15P7J77jj23M7l20J49K55N6k45K1j78J21K0r0j21K30N8J23j82
4701B0J51k10J07j02J99j93j01r1K37l8Nj62j1J13J23j85K13j25J80n3j94J89
4723G2j40j54R1J54k96K28m7N4O8k54Q4K14j61K54k72M7Q3j03K6R6j59K00k23
4746a38J10J73J4j04j3K31k04m9nJ4J67j72J15j36j06K78j19j9l2p1j4J8J95j12
4770B1k24P1J58j19J06j81K16l6J8k12J09K2QJ55j65k11K99l58K34J39L5k83O7
4793a31J81j24J0j68L54j44j06p9J13J43M7j00K34n6j85o0J29k25L2K71j72J32
4815I6m05N32j8k22J63q8k17M86l96k75L40j57J22L57m50O1J64j41N3j71K46J03
$$ plain form
4653 54 139 -129 14 -154 -127 71 69 -59 -137 -141 -148 1 -39 94 -38 20 -209 30 133 155 -260 23 -4 100 -124
4678 -124 13 61 -54 23 200 199 76 123 -197 -48 207 263 18 39 -139 -18 2 -88 -209 21 79 202 20
4701 20 171 -39 68 -34 165 -28 -129 -220 17 -21 -16 -178 -189 -76 47 -138 75 -50 130 77 -117 72
4723 72 -68 -222 -131 23 -273 -45 -92 -38 30 -224 -140 74 -87 167 -105 -58 25 -78 -52 44 -115 85 -138
4746 -138 -28 145 159 55 42 273 69 20 15 29 196 24 139 3 -103 175 56 37 5 -66 -80 -62 133 21
4770 21 -203 -132 26 -93 13 -168 48 12 30 -182 -73 -51 -43 112 -53 -264 35 -323 -89 50 85 -198 -131
4793 -131 50 -74 -64 -232 122 -22 -128 -207 -94 49 96 -4 230 174 -11 -71 58 -167 -135 136 -36 96
4815 96 -309 223 205 -17 146 58 -159 327 -69 -344 -4 -161 -39 318 -132 -71 93 -48 5 -166 80 183
4837A83q4k8K16k24l2j1j33J2r2p7L60j92J01j02l16O80k80j80L88l04R9K38k00
4860B2NJ27m20M43l5j19K03R1m15K05j28j38L26k74J00K3j75M24m63j5O19m66
4882f0J35j42K03l00L71k29K07l39p8N00l06L9q9J52j3rm7k8J77J2k39P8J01j9
4906G7j92J41j65k9K16q2K50k53L2K0k72M34j18r7o4J16K28m7j16J8q5j7n1j37
4930a93j1K32K6m8J7k20K54L8j95J37j08K40l06J29J35j71M1N6Qm7N7j75R1O8
4954E5l05M50M8l14K63k54k11L54j9o2r9j9M41j95j91M18m31J36J41k65K26m0
4976A27k26J81j10k4J52Nr6J78k40J12m7r2J68l37L45J16n04L15K22n39L18J5
4998C9l84N98n17J34K44j44J06pl9k37J50k82J81J23k7ll3j42J49j54K28q0J20
$$ plain form
4837 183 99 71 287 63 31 20 -113 -101 -193 -270 90 -102 -1 -103 -419 261 -19 -199 189 -115 -16 222 22
4860 22 27 154 -266 177 142 23 226 317 -98 107 -21 -159 167 -107 -7 16 -159 265 -198 -213 406 -60
4882 -60 75 -67 136 -164 207 -22 185 -154 -232 268 -38 1 -88 64 51 42 -5 -33 144 156 -83 -5 96 77
4906 77 -115 26 -139 -168 48 -34 216 -37 -5 15 -257 177 59 -38 -102 14 242 195 79 97 12 -5 -56 -193
4930 -193 -204 28 54 6 23 -197 57 95 -100 37 -71 169 -137 -8 127 -44 -3 53 61 14 71 -104 -13 55
4954 55 -250 200 248 -66 197 -57 -268 86 67 5 -94 -113 328 133 -58 360 -71 65 206 -59 167 127
4976 127 -99 82 -28 -52 100 105 9 187 -53 59 12 -80 88 -249 96 212 -292 23 245 -294 24 39
4998 39 -345 253 -264 -130 114 -30 76 69 30 -207 -57 -339 -158 -35 -62 -65 -98 -240 -91 -245 -17 -97 23
5021B3p4k02K95Oj23n3LJ00J12j07j29L10j22J7rj51K06K86m24J8J59p9mp7j14
5046a33L4Kn7M2J43J72k31J62k11K07l51K93l41N18k77j8p0R0L03k28k51L73K53
5069D24p75M17l17K46R3j43J19k9j04j68J62P7p6j5qpJ59j1l44L53l27J77M4K90
5093B37k74q1M00n9k38jJ30j69rJ84j50K76k52J15j21j74K03Q2M4j42N2k80J56
5116g1J74p5P1Q2m7k29N0k0J58lnl77K15LL6K40j98k3j8K68m14L12k14J15Q4j59
5142d5M7j65J03O2j1K9p3J76j95K62j17P1k03J86j14M8m1j02K28k66m9j44K08
5165a05L12l01Mm7p0M7J33l45K57j41m2L22n6K28j40J60l03K06k44n9K23j85K84
5188A38j84J16pJ72j74O7k16J23J09j75o9n8l6J20p8J21Ro9K68N3k20M9k40K82
$$ plain form
5021 23 -51 -253 42 48 -75 -128 -125 -25 87 -20 -149 161 39 56 47 -104 102 388 -36 -18 141 62 58 -19 -133
5046 -133 -99 -97 -154 -112 31 203 -28 134 -77 130 -221 72 -269 249 -28 -46 -116 -26 277 49 -202 171 424
5069 424 -351 66 -251 -5 88 -55 64 35 -69 -237 -75 2 -74 -89 -97 -104 55 44 -300 53 -274 -97 -53 237
5093 237 -37 -118 282 223 -15 -16 114 -55 -64 120 -30 246 -6 109 -12 -186 17 99 143 1 53 -227 -71
5116 -71 103 28 99 181 134 -95 -45 -65 93 90 85 -292 -77 -74 -38 202 4 -19 -37 231 -183 129 -85 30 114 -45
5142 -45 2 -163 -60 2 -9 20 -53 123 -72 190 73 144 -59 127 13 61 20 -82 146 -120 -169 -313 -105
5165 -105 207 -94 -90 -137 -207 -160 -27 -372 -115 -256 -298 24 -32 196 56 216 -87 119 -125 -184 39 -146 138
5188 138 -46 70 63 235 61 128 -88 35 144 -31 -100 -158 -194 -74 -152 -31 -22 -91 177 230 10 59 -181 101
5212A01j92K78j89L5M9j44L5M7k6J31j12J75l30J47j71J32j58P9K83k5j09K8l47
5235b83M13j83k0J26j29J55j47M1k4J03j04j2N0K08j57j5M2j47O2J6K92Jl2J6
5259B72j58k21J28m2j10N3K70k97J17L8j43J86J23k11K12k05Q1J66k22j22K14
5280A29j69K21k68L2j04J25J34j28J19J38j44q0J65l13K96j83l4p8J64j17J13
5301A8j70L60j99n4k64L37j51L92j20j44j19P2o7p6J68J1k78K28J23l42N00m77
5323b52R6L90j72j7j5K30k46j47K00k3K06m09K2J18m6J51j28k2J13QoK02k31K12
5347B34k24K5P6k82J91K1k13K17r5j40K94M9l61L70O2k55L5j68L24j83o8J19n0
5370b2J6K10l03J81k10N6QJ11m16O11k17J09J20l26J25J09P2j71j03p7K52N1j22
$$ plain form
5212 101 -91 187 -2 33 82 -62 -27 20 -6 125 13 188 -142 5 -166 -34 -192 -113 170 145 36 64 -283
5235 -283 130 -53 -73 53 -76 79 -68 -27 -51 52 -52 -64 -14 194 37 22 64 -83 -21 -5 287 288 256 272
5259 272 114 -107 21 -21 -131 -78 192 -105 12 50 -93 93 216 5 217 12 93 259 37 -85 129
5280 129 -40 181 -87 -55 -159 -34 100 -28 91 229 85 5 170 -143 153 -30 -64 -142 22 -95 18
5301 18 -152 208 9 -45 -309 28 -123 269 149 5 -114 -42 -109 -185 -17 -6 -284 -56 67 -275 225 -252
5323 -252 -156 234 62 45 30 260 14 -133 67 44 250 -159 -137 -19 -65 86 -42 -64 49 57 51 253 22 234
5347 234 10 35 111 -171 20 41 -172 45 -50 -190 104 153 -208 162 224 -31 4 -164 160 -23 -91 28 -22
5370 -22 -6 204 -99 82 -128 -72 -64 47 -369 242 25 134 254 -72 53 162 234 63 -40 -117 135 186 64
5393F4j6j09j0K87k70J20rk68M33j82J70j28k22K26m9r9L9j14L45j91M9p6j62
5416a72J29L7J92l12L40p0k7q9p4L7Jr0J22k05J83J36k71J84j04P4Mj54J30M5
5440D6J59k06j3P3k45o1K61J63j76r1n2j06K88L8j35J23J14l07J86k43J55j09
5462a38J70J41j93nj32K11J18k72j5K69K9k9k77J96p8m1J38j03L0J40j86Q9L21
5485C83l66qJ46k0l07J61M3j9j56L8j2P0J84j87N9n8r6J22j8n6k79K22J42J91
5509A79o4p5k21L67l00L03j58N8l53K84n0O7j80K67q5Rk29J77O6J2j61J30J66
5532B09k92J42Qj44J45j6k6m1J25k09R6j18j99L74J9j2o0k29J85k46j0J9J88J07
5556A5l2nK7K00l62M99p2k55o9J62k77K19j61J74oj46J88k56J32J67j48k80L41
$$ plain form
5393 64 48 -61 -71 216 -54 66 57 -211 222 40 210 82 -140 86 37 -62 -23 -137 208 17 66 -10 -172
5416 -172 -43 -6 186 -126 214 144 117 28 -46 -9 -8 -98 24 -181 2 138 -133 51 -53 21 25 -129 1 46
5440 46 205 -1 -14 59 -186 -247 14 177 1 -90 -142 -248 40 78 -57 66 180 -127 59 -184 -29 -138
5462 -138 32 173 -20 -25 -157 54 172 -100 -115 154 183 154 -123 73 -5 -46 92 -11 19 159 -27 62 383
5485 383 17 9 155 135 -172 -11 32 13 -143 -105 -117 -47 137 -50 9 -49 -145 -23 -41 -97 -376 -154 -12 179
5509 179 115 40 -181 186 -114 189 31 89 -264 20 -30 37 -143 124 39 48 -181 -4 62 74 -87 43 209
5532 209 -83 59 67 -77 68 52 26 -15 110 -99 -3 -121 -320 54 73 61 1 -228 -43 -289 -299 -280 -92 15
5556 15 -17 -22 5 205 -157 342 270 15 -54 108 -169 50 -111 63 57 -89 99 -157 -25 142 -6 -286 55
5579E5q1L50l25n3J16o0K0l15K55J48k24r4n3M26j68N3r8K23k50R7j55K19k9M
5603F1j43RQ4k0R8j67m1K12J14j43M7k20l0K22j56K33K4l3r7k32L01j21l1ml9
5628g2n4K82q6%m9M5j54P7j2L09q0n49K32N1Q1J27p5k24J22qO9j49m0K13j01N9
5654A4J8m3O9R7j82J16j99m1K10m8m6J5k12K01J19j50K71j88k9n8J9K02r0l61
5678b96L39j61j61L59j0o4j95N6N73n94R4R9j29j0K90k26L9j6N6M4j47j50M04
5701A94k11j70K38ll7K95m77K35j38j5K99k6K5j31M0j09K40j98L2n9j51O5K17
5724A55L2j81j73M19k86L8kJ80r4j52L82j22j76J31J69k21j58K19j79O5L3j32
5746e3j83J31O0j22K33m11M77k32P6J86L7k27L22n29K87o7j10J36J26l8j26r7
$$ plain form
5579 55 -26 324 -1 -54 62 2 22 -293 -38 110 -114 -208 -261 165 -3 50 -48 175 -75 22 -133 86 57 61
5603 61 -82 -73 11 -9 89 -78 -119 93 207 64 111 -109 -139 83 -73 160 184 151 54 -178 123 2 -29 -33 -72
5628 -72 -126 156 70 70 21 66 -88 -11 -23 286 206 -343 -111 -60 21 148 73 -151 -29 -37 32 -117 -157 56 -45 14
5654 14 32 -11 58 155 -27 89 -110 -151 59 11 -35 -20 -232 -31 88 -62 209 21 -8 -66 -47 155 65 -296
5678 -296 43 -118 -279 80 70 6 -189 -133 440 -154 -60 39 -90 -100 190 -36 3 -13 43 87 -60 -210 194
5701 194 -17 -187 51 48 11 306 -171 64 -74 -89 210 184 209 78 118 9 249 51 83 24 -127 -62 155
5724 155 187 6 -167 252 -34 4 2 182 88 -64 318 196 20 151 320 99 -59 160 -19 46 79 -53
5746 -53 -236 -105 -45 -167 66 -345 132 -100 -24 162 199 -28 294 -235 52 -15 -125 11 137 99 -27 -124
5768a24J86N6p9j48j50K66Q3j32N7k2J36l50K41j38N7J17n1j09J53L4l48M51j25
5791F1j81K2p5J51J94k64O7Om5N4qNL0M6j70K92j11n0Kj43j8J12m4k67K73j01
5817a62N26m67Q9J56k84J70J1M3J41k54o8K88k36j91L42j98N1K2j99N39l68K14
5839A65L8n00J67J92k02K8P5n7J55J41l03J28R5n9j08j99J03k1N4K54j03k59M38
5862B22j07j50J89p9k35J07L2j3J41O3q8PK49k42l97K67K86j21k1p4j55Q4k3q1
5886a39L55k86O5N2l6l06J98K26l04K23J6m5k52K14j53K59q0J50j85L20j33k88
5908a29J65k7R5k54p5L88J1k94L5K4J56j72J57j20R5P3q5j20k6P8Q5k50K26J69
5932B05l60L63j05j86J0J26r5j33M5J72p6P4Jj42L08l12k1J85j79K65J00k26J92
$$ plain form
5768 -124 62 118 39 -109 -259 7 90 -42 15 -7 129 -221 20 -118 -61 56 5 -104 49 83 -265 186 61
5791 61 -120 -98 -173 -22 172 -92 -25 -19 -64 -10 -18 -13 17 63 -107 185 74 24 26 -117 -135 -23 -67 -334 -61 -162
5817 -162 364 -103 -14 142 -142 28 39 82 223 -31 -99 189 -47 -238 104 -94 -43 -21 -220 319 -49 165
5839 165 203 -297 -130 62 -140 -112 -37 -94 61 202 -101 27 122 63 -45 -244 -141 -162 -108 146 43 -216 222
5862 222 115 -35 154 75 -160 -53 -21 -34 107 170 82 89 338 96 -301 -34 252 131 110 36 -119 -35 -58 -139
5886 -139 216 -70 -5 47 11 -295 -97 129 -175 48 64 19 -233 -19 -172 87 7 157 -28 292 159 -129
5908 -129 36 9 104 -150 -225 163 174 -120 -85 -61 95 -77 80 -40 55 128 43 -77 -103 -25 60 -190 36 205
5932 205 -155 208 103 -83 -73 53 -42 -175 -130 42 -34 40 41 -101 207 -105 -126 59 -120 145 245 19 211
5955B11j13j92N2L08k7k82K06k22M4j6k6J98K7k27K60j73n0J41k94L03r2q1K53
5978B08j53q3q0K4P9p2j5J07K5j07K2J66J85l45n7J28P8K50m69K01j10M6K4N8
6002A10r4j1j26J43O7o7j26J51jj2j56K99j57n4L9j95J04J67j88J27p7J32m8L3
6026F0q6m8J15l0J88m1k66Q2k7j22L28jj29q8MO0l9R2R1k74K44P1l17qK13n6j30
6053a14R1J72j40l6J91p5r8j94K83l1n2J84o5J05k56L6N8j76p5J12L49m64J1L40
6077A56L0O2j25K9j59n9J94m1l65J77q3j4L3M04k24l3Q2J40l21K00j59p7K08R
6101F4k88L44j9o2rr2J08N0j17J83o9j29L4j63L85j46j3m5K31j81K3pj17J11m3
6126C3J57l90J43J78j61K21k34J47J19j54Q9j05R6j67n7M2J29J07k10L6pJ5j56
$$ plain form
5955 211 98 -94 -42 266 239 -43 163 -59 -15 -31 -57 141 168 -59 201 28 -22 119 -175 128 36 -45 208
5978 208 55 -28 -108 -84 -5 -77 -92 15 40 -67 -45 121 306 -39 -96 32 110 360 -109 92 -18 28 52 110
6002 110 16 5 -121 22 89 22 -104 47 46 34 -122 177 20 -34 5 -190 -86 81 -107 20 -57 75 27 60
6026 60 -26 -74 41 11 199 158 -108 -26 -53 -175 153 152 23 -65 -61 -1 -40 52 143 -131 113 184 -133 -141 72 16 -114
6053 -114 -23 149 9 -27 164 89 -9 -203 80 49 -3 181 116 221 -35 1 59 -117 -192 -80 269 -195 -184 156
6077 156 186 248 123 152 -7 -66 128 87 -278 -101 -184 -198 -165 239 15 -18 64 204 -117 83 -76 -153 55 64
6101 64 -224 120 101 39 30 -62 46 96 -21 162 93 -36 -2 -165 220 74 61 16 247 66 89 82 -35 76 33
6126 33 190 -200 -57 121 -40 181 -53 94 213 59 148 43 139 -28 -85 -43 86 193 -17 19 12 27 -129
6149a29Q5N6J19O5j60m2o7L9M9J1J61k13KL0q3M2K09k7k46J47O8k4q7k2jN9K93
6176C34l00J75q1k73J08L84k96m7k39K42J4j65o0L08M6k15j29M09N0k80j14J00
6198b9J48j98J95k57J70J1q8P1J00k07K96%o2k57n5K63j61j04K29k18o9L41m55
6221c36N28q7l86K65k43J41K25o4j51R6j42J90n4J14j27q9K46j7j4k40L03j29
6243B9J80k34n0P3q8J22n8n6MM24n21L59J7q3j70njK49j13k47%P4J97k50P8J61
6269I1l39L99l8m67N43j48j02P2N4j94J10J10p4J31k83K90o34M17R8M0n5L5j82
6292a26J57R8n2o8M6J98k29o3K39k38K77j96k10L71k73J90M4l12L5K82j51j5o3
6315e9J9J84j36M0K20l43M5j13J19j3o9R9PM4j39L34n65K80J41q8m5K47k78j37
$$ plain form
6149 -129 -44 12 131 196 36 -6 -73 -34 15 26 187 -26 -24 6 -77 -35 174 147 -99 48 116 92 5 -17 -18 41 334
6176 334 34 209 128 -145 -37 347 51 4 -235 7 21 -144 -204 104 150 -65 -194 215 265 -15 -129 -29
6198 -29 119 -79 116 -141 29 40 -48 23 123 -84 212 212 150 -107 -162 101 -60 -164 65 -153 -222 119 -336
6221 -336 192 105 -281 -16 -259 -118 107 43 -108 -12 -154 36 -18 96 -31 -120 126 109 95 -145 158 29
6243 29 209 -25 -75 -2 -90 32 -26 -82 -78 346 -175 184 201 118 -52 -57 -58 191 78 -169 -169 -95 102 -148 -70 91
6269 91 -248 151 113 -354 189 41 -61 11 65 -129 -19 91 17 148 -135 155 -479 -62 36 76 21 56 -126
6292 -126 31 129 77 9 55 253 24 -39 200 -38 239 43 -167 204 -69 121 165 -147 -112 170 19 4 -59
6315 -59 -40 144 8 48 268 -75 -30 -143 -24 -37 -106 -7 0 44 -95 239 -326 -46 95 7 -38 209 -69 -206
6339b06J9J70K61l07J41N3k51J58j29J65k4j99R9j16J31K28k67L6J61n6p7m0N3
6362Ck3j12N7J38j61l9K24k22Q1K08l7m46N09j01Nl00J20K1J58j97P5J84l54K95
6386H6k83n3R9J98J43j10r2R2k07P9K89m92p0K94p7J26j0L5l78M11J3L6j00q9
6410f0J90k36J2L66k71k7J56Ll41K37k16L15q7M2L2j76K41j35J56L0q5j75l12
6433c41J95o2J46J33j05K51k57K49n6j62j1j1r9K81l9K5k00k50M41q6r3P5R8R3
6457B15k88L0N0m8J64l46L62K04l51L9Nl2K41j86L2j44K46K3l56L64k85k2J23
6480D0K3k12m7J34N9J6omj28J27l8m6J63J26j58k21p6J65J34n4J18j32o8j4J3
6505h6J64j08KP7K6k01N7J16Om2j24N0j37J88J58q7pk0J55l56J03p0j4K95k62
$$ plain form
6339 -206 -187 -17 244 -63 78 131 -120 38 -91 74 50 -149 -50 -166 -35 193 -74 -38 123 67 -10 -50 3
6362 3 -20 -132 -75 63 -98 -137 87 -135 -54 154 117 -329 180 79 84 -216 -96 -75 83 -114 -39 145 -209 86
6386 86 -197 -250 -151 47 190 80 -12 80 -127 -48 241 -251 -321 -27 -104 22 12 47 -331 80 93 129 29 -60
6410 -60 130 -106 -94 272 1 -26 130 133 -208 29 -187 128 41 83 115 -61 180 45 201 231 146 -29 -341
6433 -341 -146 -208 -62 71 -34 217 -40 209 153 -9 -20 -31 -130 151 112 137 -63 -313 128 42 -51 24 122 215
6457 215 -73 -43 7 -41 123 -223 139 343 -8 31 36 4 245 59 91 -53 193 216 -140 224 -61 -83 40
6480 40 63 -149 -196 -62 -3 13 7 3 -125 2 -36 -82 81 207 49 -172 -248 -83 51 -3 115 -17 -85 -99 -86
6505 -86 78 -30 -28 49 75 -126 -69 47 53 11 -113 -63 -200 -12 146 59 52 32 187 -169 -66 -136 -150 145 -117
6530a17J73j51M3K34k69R9L8L4q0j19J59J78k16l6%N6O4k2l3j07J59k06O0O0J06
6555A07q3J91m97J68K8K34j8k34L7K27j20l5M7qj41J14J58l00L83k70L1l7J1J14
6579A07m2Mj0L5j78J06R8r5j46L03j46r7J14n3o1r6P2k13M82k5k06J20J14l39
6603a52L48l1k01L3J4J07MO5k45J09O2k24K63P3l16K11j67L7J14j20J14N1P4j30
6627I3j9p5Ro2J71j57R9k53J79l0J70j96J94j13Q7j86M5j03N0J24L9J45p2l23
6651a84NK42j4J1q2Oj57l8J81k8J07Q1Q1j15q5p4J38J48j51j93K5J69ko2l6P8
6677E1p1K2j06R4j07J46n5j10P8K0p6L3R8q7J02k83J85P1K07j84M7J62j8o9k88
6702a38J97j01j7o3r4J32%J56O1j85l0R8k12L63j6l06o4J22Q9R0L7k60L00j16
$$ plain form
6530 -117 56 -95 -52 182 -87 12 50 84 4 -115 44 222 6 -30 -30 26 90 68 35 -72 87 -119 -59 1 107
6555 107 24 215 -282 -114 -86 148 130 -104 -67 160 40 5 52 44 -97 17 175 -125 258 -12 19 -18 -7 107
6579 107 65 69 59 94 -84 22 120 25 -121 182 36 -61 53 0 -61 -157 -85 -298 184 159 -47 73 187 -152
6603 -152 196 165 -36 -3 11 118 122 187 -58 51 113 -111 152 225 -91 120 -47 -10 104 -16 98 149 223 93
6627 93 74 -1 8 -54 117 -40 59 -194 -15 -45 125 -71 123 10 97 -89 -44 -147 -97 27 66 211 139 -184
6651 -184 -179 63 49 60 -22 -16 -173 -211 -30 -58 49 130 211 96 11 -63 75 223 72 -121 -96 73 71 9 -27 51
6677 51 -20 2 -104 -10 -117 29 -26 -136 -58 -38 -114 -81 17 -70 32 -251 -66 5 212 28 75 237 219 150 -138
6702 -138 59 -42 -59 -122 -216 -84 -84 72 133 -52 -82 16 -196 167 151 -155 -219 -97 -8 82 119 -141 159 43
6726D3q3k7R2J01k66J02K28k14m5J0j05L44j59o3K1m8Q6l6O7J47l16J2K39j90
6750f0p6L07k96k5K73P4k78j5M8K27j66o6j1O5kK31j53l04K94n3L21m93J1P6J42
6775G1k02L10rK2q2N5J5j75R1K4j97r5J13r4L49k81Q7M94q93L15L7J72j06k26
6799b05L25j01j74Q2J74j30J11j98n5J0L81l65K22j09J10r6K18k36r6R7J13j16
6821c8R5j8lj13J89l9l98L31K9l9p6J54p2N0k36J45K87k13K4j08J60j49p0R3J07
6846I2o1K2P3L3j55n3k7j17L02j31J47k96Q9J26R4k96J24J09j65n9K27K35l49
6869c6n4R1k10K07q6R7J8k13R8R0j2O4j13p8L45j68j7J22j14P4j40O4o1r5J80
6894E3J7j9L2qj48o0j9K42j51K6K50j99N3q2K04j15J96k65kL6K1j3m6p8J48k86
$$ plain form
6726 43 -40 -67 25 126 -140 -38 190 -24 -69 -59 -164 180 21 -42 -21 -69 17 -19 48 195 -121 -109 130 -60
6750 -60 -136 171 -125 -150 123 197 -81 -96 -48 179 13 -53 -64 1 -1 230 77 -227 67 14 335 -158 -147 -71 71
6775 71 -131 179 170 192 110 165 180 5 96 120 -77 -172 -59 -153 196 -85 2 496 -397 -82 -45 127 21 -205
6799 -205 120 19 -155 -73 101 -29 82 -116 -171 -161 220 -145 77 -32 78 -18 200 -36 -132 -35 78 -38
6821 -38 57 39 36 -77 112 73 -325 6 35 -4 -80 74 2 52 -184 -39 248 35 59 -49 111 -38 -108 -15 92
6846 92 31 53 126 159 4 -49 -76 -193 109 -22 125 -171 -82 44 138 -158 -34 75 -90 -149 78 313 -36
6869 -36 -90 1 -209 -2 -88 9 27 -186 -88 2 -10 54 -59 -137 208 40 23 145 31 105 -35 29 -32 -127 53
6894 53 70 51 83 75 -73 -133 -152 90 -61 -35 215 16 69 -13 191 76 272 7 5 41 62 49 3 -75 73 -213
6920b13J90P0l7J24j19r9K39l3j84k41L06K7j64K96o9k26J21O7J36l16N5K36j55
6943A1m9r1J15j20J61p0O3M2l8J01j95Q9N2j44L11j31nk25J18L3r3K48j67j44
6967a28J23J43j72J03l01K68Q9j83K85l11k5P7K94k34L52l16Rk6r6K62j42j90
6989a19L05j46J4k28J75o0J91k57K52J23k50M4j0P7k05j1k41L94R7j76J74j99
7011e6J60k02J5J5N1j26K12j21J13j2n4P9k00Q1O1N3j79M7k0l4N3J93L6l31J09
7036e7j87L07q2ll2j14J22J86j04L1R4j9m29L30m7n5J95j80j5J67k64L37k30j1
7060f0J82l46K01K4n8l9J62j67J81j24K21j94r4JN6Q3l07M12k45K27j28k0J88
7083A56M8m19K14P0k3K0k49J23N5L9o4N9l8J40p9j71J97j77p7K50N2j24j72J12
$$ plain form
6920 -213 -23 47 10 134 15 -84 155 122 -62 -303 3 30 -134 162 93 -133 -12 55 191 -125 -70 166 11
6943 11 -38 -129 -14 -134 27 -43 20 62 24 125 -70 19 71 -73 238 107 102 -123 -5 28 -65 183 16 -128
6967 -128 -5 138 -34 69 -232 36 125 -58 227 -84 -109 -32 262 28 380 64 73 47 -49 213 71 -119
6989 -119 186 40 54 -174 1 -59 132 -125 127 250 0 44 34 111 -94 -105 -346 48 145 -31 143 -56
7011 -56 104 -98 -83 -68 -17 -143 69 -52 61 49 -5 74 -126 -45 16 69 -110 -63 -83 -117 -64 129 165 -166 -57
7036 -57 -244 63 -19 -22 -54 -168 -46 140 36 67 161 142 -287 43 -4 -59 136 -44 -59 108 -156 181 -49 -60
7060 -60 122 -224 -23 1 -57 -96 66 -101 80 -44 177 -17 -111 -110 -54 29 -278 134 -111 116 -12 -32 156
7083 156 204 -215 -1 69 46 66 -183 -60 -5 34 -30 29 -9 131 52 -119 78 -99 -176 74 126 2 -170 -58
7107e8K43m9p2k64J47J23j00J02r0P7K34j95j80J54k16J80k53K91J35k79M3J41
7129A14o5J9R1k30K04j77k4J68J29J68l37m8o3R9m4j01J9J25N4j01L7l0q3P8L3
7154C5p8Q3M4j39K14k64j7J68q3J4p3J57O7Lk8k50K03J21m22R5R0L1M4j4JRN4
7181F5m4j41L1J2K26q7m6p9j37K29k8L4N5j64J33q1K9QJk3l31K76k2j83L04nK36
7208B68k77J34m2j49P8L8k74L4L36k56K11m6j55J14J62j89q2R0l5J18N3J9j32
7231A8r8O4j5J45r1n6J4J03O8j5l27K08J60n1k05J49q7J98o8K2J10k81J70k12
7255g7J84o5n7j67K38j89o7OJ25j63J12J12J32l40N3K40j18J38J08k44L4q0K04
7278A19j04nq3J1k27L82j20Q3j1k37K84j4J61q4k32J79l2J7r3J53j5q8j34J2j0
$$ plain form
7107 -58 185 136 64 -200 -53 70 -30 72 -18 59 293 98 -82 72 -144 36 -217 74 209 -70 -27 114
7129 114 49 68 159 -71 133 -44 -68 100 229 397 60 12 -51 48 4 -97 -78 47 101 0 37 7 -76 2 35
7154 35 -43 40 84 -55 159 -105 -122 46 -37 -23 -96 61 128 131 103 -147 56 177 -245 -150 -60 -29 15 1 2 11 65
7181 65 21 -120 -89 -77 149 62 16 -63 -200 29 1 35 90 -74 59 -22 7 15 16 -7 -338 -62 -84 -267 37 32 268
7208 268 -9 125 83 -66 12 50 -224 -190 146 -110 101 55 -100 14 176 -13 -95 -5 -40 78 131 150 18
7231 18 -80 -16 -31 114 23 -33 -19 84 152 137 -190 18 178 127 -78 71 -16 182 114 136 246 -35 135 -77
7255 -77 107 42 -15 -182 56 -133 -200 -194 -69 -232 -120 -8 124 -216 -163 77 -41 97 205 -39 -5 -85 119
7278 119 15 10 -73 -62 -289 93 -27 56 45 -192 92 78 239 155 -77 102 70 87 -6 147 132 44 -90 -78 -88
7303h8o5J93J68k38k27l7K35Q8j25M6n9Q7L9Q6r8n1o2k6J32k42J42l7M1m8L02
7328A56k91J24P6j26M3l6o4R8J7Q5O7j00k15K54j65J57k21k9M07l30J15k44K34
7351A2J47J67o60L13J13j08j56L05k16N7N6j3Q0l36K44m2J44k33J49M8J89n47
7373b87K63P3J19j83m4K4J06j80r1K03N0j83L64n42J29j9J05J57m13M07mJ36p
7396A83o1k56K39r0J32p4K1N5n57L37J8J07m6j43K40q5N7q7J04k48J36p6J02j38
7420a30P4L10k85j28M4J1M10m02J95L4m94L6N32l05P5K50k72J19r5j18K22p6N
7443A2j7n3p0K76j17j37o4J68lj51J16j19K98j06N4M7j92J99j91j38K48L8N1O7
7467B16m87L50P3M2m24J61p8K78j41O0k33K60r0L8k63J63L4R8j30L7j18L12k56
$$ plain form
7303 -88 -153 40 208 -30 -257 -294 -59 29 -96 -50 -109 -22 17 103 5 -46 -108 -134 -2 -244 -102 -139 -98 -146 156
7328 156 -135 -11 65 -61 -18 -54 -118 -20 -3 82 149 49 -166 88 -77 80 -141 -170 237 -93 22 -222 12
7351 12 159 326 -334 -21 92 -16 -172 133 -83 -26 30 17 97 -239 5 -37 107 -126 23 71 260 -287
7373 -287 -24 49 168 -15 -59 -35 71 -109 -200 3 53 -130 234 -308 -179 -198 -93 64 -349 58 54 190 183
7396 183 122 -134 105 15 147 73 94 149 -408 -71 -53 54 8 -135 105 20 77 -10 94 -154 -18 -94 8 -130
7420 -130 -56 254 -31 -159 -115 -104 306 -96 99 133 -361 -325 207 -98 -23 227 -45 74 -21 -139 83 7 12
7443 12 -5 -58 -128 148 31 -106 -170 -2 -5 -156 -40 -159 139 33 87 134 -58 141 -50 -188 60 98 149 216
7467 216 -271 79 152 194 -230 -69 -147 131 -10 50 -183 77 -13 25 -238 -75 -41 57 -73 -36 -154 158 -98
7490i8J33k00L13J69j31j32n7N3k1L1O2j1k91j2L22K5q1n9%J11j02p0l3J23j26
7515h2L00j80J89jk40j38p0K38M1k28K49q5J2J40j61n4N0J74m06L49N2j70J33
7538A12p6O1J15k77J41p6J28j35K2J20l06N1P7P0o9P0j5J28k2j3m4L7k17J24k7
7563b1J05ok5j45J22J33j10m9K08K9k80mK1J11J06l03M47m55M18l20j62J41R4
7586E5n8N8j17J31j26o0j3M3J49J56l07J28n0Qp0J84P8k32j90L06j7j08L9q2J25
7611C0pJ31O8k24L0J69o0r6j91M42m37L31j46N7j03l07M2K68N3Jj9Q4J3k7j69
7636f7L46j55j51m3Rj58L58k9j03q8q2K73lj99O7K32k18P6P2k8j25j32Q0L4L06
7661B72k63q1J93k90J94j1J45l02J11K15J9j8k56J92P7k97J32q5N4j25j79M33
$$ plain form
7490 -98 35 -165 148 317 186 54 -3 50 29 60 122 111 -180 -192 130 155 74 15 15 126 24 -46 -79 44 -82
7515 -82 218 38 227 226 -14 -152 -222 16 57 -171 78 -7 5 145 -16 -70 -20 154 -252 97 149 -21 112
7538 112 36 97 212 -65 76 0 128 -7 15 135 -171 -120 -43 27 -42 28 13 141 119 106 62 99 -118 6 -21
7563 -21 84 78 53 -92 30 163 53 4 212 241 -39 -43 -22 89 195 -108 339 -116 302 -18 -180 -39 55
7586 55 -3 55 -62 69 -57 -117 -130 -87 62 218 -89 39 -11 -3 -73 111 189 -43 -233 73 56 -52 -13 -95 30
7611 30 23 154 222 -2 28 197 137 41 -150 292 -145 186 40 97 -6 -313 -271 -3 50 51 32 116 129 102 -67
7636 -67 279 124 -27 -70 -61 -219 139 110 7 -81 -163 110 107 -92 -25 207 -11 65 137 109 -16 -148 -68 -34 272
7661 272 9 -72 121 -169 25 14 159 -143 -32 183 202 184 -72 120 197 -100 32 -53 1 -124 -303 130
7683A30m21K60j41J85j52N16k49j27kn5J71k07J66k91J56n8K08j92p0J26p5j22
7705b44J58M1K29o5J4j52NL7j70K36j99q6K37n8L2l11J98J2K75j94p0L13j91n1
7729dj84J48j9K73j11k64K25R1j15k50K55j63J77n3l0k4K25j50j86J49J45k73
7751a38L48k37j52J86J90j76r8J00j83KJ18q1J90k1j10o3P5J11r2J44k28K53p0
7774F8p9j85J42O9o2Q1o3j00O3K95L2j60l43K94j7n8J67k3k66K27P9k11J48j65
7798f7k89M92k07Q8j38N9R5L1l4P8j12P5J36r2J03j29j8J42k42J52j68j85L09
7821G9J61l72P4L3k4P5O5j54N4J35k57J68j44m6K35J3j62k5J13Oj9J72k16r5K04
7846G3q9m8qp8j01J22K29m2p7j01J39k06K27j67k8K98n8j87J94j94J46m2J31j11
$$ plain form
7683 130 -291 -31 -172 13 -139 377 128 1 -1 -56 115 -92 74 -217 -61 -119 89 -103 -173 -47 -122 -244
7705 -244 -86 -45 184 119 133 -19 -14 23 -147 89 -110 -196 41 -17 15 -296 -98 -86 189 -5 -75 238 47 -4
7729 -4 -188 -40 -59 214 103 -161 64 155 40 -210 45 -118 59 6 -24 -48 177 27 -159 -10 135 -138
7751 -138 210 -27 -179 7 197 21 -77 23 -160 -158 -40 -121 69 48 -62 -125 -50 61 -31 113 -115 138 68
7774 68 -11 -196 -54 15 -47 34 -29 -129 -66 229 261 101 -242 52 35 -23 144 121 -145 82 161 -50 98 -67
7798 -67 -356 136 -71 17 -121 -62 33 64 30 108 -4 71 207 115 218 89 71 213 -29 123 -45 -230 79
7821 79 240 -132 -58 -25 -49 26 91 -63 -9 126 -131 37 -107 -153 82 95 -67 -92 21 27 8 180 -36 -131 73
7846 73 -16 -64 -72 -150 -251 -129 100 58 -19 -120 19 -187 40 -127 -155 143 85 -102 92 -102 44 2 133 22
7870B2J5M8l56M65l78M27l85J33L20l11l3Q0k57L59n6j56K04k60J54k60J41p4
7892a58K6jLK15j00J20M23o00P2J04j45k5K4J66R5k06j67K29k43K68n1mR4k02
7916f3L79j82j25j6j1K11j58l1K7j39J75OL0l34Q6R1K83m33P6J17p1j10K73r9
7940a8j08K31r7p3K20n3R6p0k38J65j89N2K94l36J69j73O4Lj57K80p5J02k09P2
7964d8K70j96j26J44o2N2r2q9J44p2J95pK2k16J63OJ52k87j61L25k07K0K39l67
7988a98K44k17K33j86Q8r1O6j07L60m64K60N3o2K20k88P8r4R5r7K95k18k4P2O1
8012G9mR9k95K3m0K54K7l34J76%l5J36L7j22k18M19m87p7J74J08J29l9kj92J90
8037FN4j21K43j9k57P8K0J79l6N8k2j13m7k4Q7O2j70n6J21k8M8K9k17K97N7k90
$$ plain form
7870 22 37 85 -271 194 -184 243 -142 -9 311 0 -33 47 -210 149 93 -63 141 -119 35 -225 -84 -158
7892 -158 -132 -133 -130 85 -15 105 528 -72 0 104 -41 -66 -42 124 219 13 -154 75 -168 100 49 45 139 -63
7916 -63 316 134 9 -7 -18 193 35 4 31 -108 67 73 103 -231 -145 -54 229 -204 -128 -11 -82 -192 81 -18
7940 -18 -126 105 8 -65 155 102 198 128 -110 55 -134 -82 212 -124 45 -128 -64 -61 -218 62 -13 89 -120 -48
7964 -48 222 26 -100 44 -18 34 -58 -147 -3 -75 120 113 135 -81 82 88 240 -47 -208 117 -90 -70 169 -198
7988 -198 46 -171 62 -124 -36 -127 -61 -168 192 -272 -12 41 -21 199 -89 -11 -105 -10 -107 188 -30 -54 18 79
8012 79 75 174 -121 -98 -138 116 143 -191 -15 -15 -50 86 123 1 -217 202 -285 -362 -188 -80 49 10 8 -184 6
8037 6 60 -61 182 163 -94 -16 4 183 147 205 183 70 23 -1 86 148 -22 -78 43 15 63 92 -125 172 229 -61
8063f1J52j55j81J69J15j86O6pK14p1J03k6k64J54M9m6o1L9Jj27J17R4L4k19N6
8088d1J65k90K10j1J24J19l12R2j76M7l3QK41r3m0P0k21q8K85rNj59nK9J32rj86
8115a46j73J63K13j5N3j66M6J5J0j51J48nJ48k20R0N2l21J98KJ89J8k25p5J51
8139aJ11L2oJ1p2J66l14l3LJ27O1n5j05J76j91R3J53p9j1Q9j71J8O4K01j58j46
8165c7j40J22J46j19J99k36Q5NJ4on5J23k40r7L53K8j70r6J36J32Q2j52q0P7k8
8190D6J23
$$ plain form
8063 -61 91 -64 -245 -76 39 -147 -81 -88 126 55 158 132 -132 22 71 25 -36 3 4 -123 -6 88 122 -97 -41
8088 -41 124 -166 44 33 157 276 -36 56 -120 -73 -106 -98 143 50 10 80 -141 -229 56 47 52 -107 -112 -83 49 40 -146
8115 -146 -319 -156 57 42 95 -71 -25 -10 0 -151 -3 -8 140 -80 10 62 -259 -61 -59 130 148 -77 -152 -1
8139 -1 110 142 136 147 75 241 -73 -106 -103 24 85 30 -75 101 -90 3 156 77 66 155 -16 2 66 267 109 -37
8165 -37 -177 -55 91 -28 171 -65 20 25 39 33 -22 101 -139 -236 117 145 -25 -121 15 147 229 77 -3 74 46
8190 46 169
8191A69
$$ Imaginary data points
##PAGE= N=2
##DATA TABLE= (X++(I..I)), XYDATA
0@%%%%%%%%qJ6j6J6j6K4l2M0n6P2q8J04j21J45j76K09k46K90l38L92m54N22n99
31c20O86p81Q87j002J131j275J432j605J792j998K224k471K741l035L357l708
47a945M090m511M971n475O031o644P324q082Q932r891J0983j2238J3696j5419
61h178J7494k0047K3272k7503L3341m1984N6319q6097K64082k53052J21782L45744
73D25173m40739J84043k7560k12715R1167L6559o9434j25886p6370J77711j42236
84a80287K1339P8910k96578J78967J95667l63925J23653J18314j66058J65038
94a24960m2953j17799J65196p3540L0189J06121j23455M8326O4162k1014K9810
105e9917p8120J02392O4409j50397J40387J7505j72445J77871n015j44334J53367
$$ plain form
0 0 0 0 0 0 0 0 0 0 -8 8 -8 8 -8 16 -16 24 -32 40 -48 56 -65 80 -96 113 -133 157 -181 211 -243 279 -320
31 -320 366 -415 472 -530 601 -674 758 -847 945 -1053 1171 -1300 1441 -1594 1763 -1945
47 -1945 2145 -2366 2605 -2870 3161 -3483 3841 -4241 4691 -5200 5783 -6455 7241 -8178
61 -8178 9316 -10731 12541 -14962 18379 -23605 32714 -53383 210699 -42353 79429 425173
73 425173 -15566 168477 140917 -71798 19369 55928 -13506 -139392 -215762 -38051 -180287
84 -180287 -158948 -80038 -376616 -197649 -1982 -365907 -242254 -123940 -289998 -124960
94 -124960 -167913 -285712 -120516 -194056 -163867 -57746 -181201 -132875 -68713 -89727 -59917
105 -59917 -138037 -35645 28764 -121633 18754 36259 -136186 41685 36670 -107664 45703
116D5703K709p4599P0453j2611j9065N075K9148K0715o7723O5406M5749j12524
128a564O2768L6847r5358O3464J6160o2100M0706K701j2485J630k5379L4502K910
141F4802l4757K0948o636j1794L544n966J4519k7119m746L6663n0328j1238L9705
154B7597m2887M29K7085k7594P444k637j7359n56j6024J6061p223k1479M1407
167a5736k1657l0404M3034k2296j3412L4758j2554J2300Q768o704K9026j9029
179a3906l295L8814k2777P603K6441k4896J4729L789j0442K4798j8622L740K1684
192D7660l7674J8303J8476m1794K4489J3336l4399J6027l345j9710M286r553Q371
205D473m460j1181K4261k0893j7733L0009k3140p418L2076j9588j349J6763j6343
$$ plain form
116 45703 48412 -26187 44266 31655 12590 17665 46813 67528 -195 65211 110960 -1564
128 -1564 61204 98051 2693 66157 82317 20217 60923 63624 51139 52769 27390 61892 64802
141 64802 30045 50993 44357 32563 36107 30141 44660 17541 12795 49458 -870 -12108 27597
154 27597 -15290 -14861 12224 -15370 -7926 -10563 -27922 -28478 -44502 -28441 -35664 -57143 -15736
167 -15736 -37393 -67797 -24763 -47059 -60471 -25713 -38267 -25967 -17199 -23903 5123 -13906
179 -13906 -17201 21613 -1164 6439 32880 7984 22713 26502 16060 40858 22236 25976 47660
192 47660 9986 28289 46765 4971 29460 42796 8397 24424 21079 1369 5655 -3898 4473
205 4473 13 -11168 13093 -7800 -25533 4476 -18664 -26082 5994 -13594 -14943 1820 -14523
218a4523L490j295n653J1842j1101N557J3933j8622R883R282j6420J5225L006
231D604r801J0747n852O32Q259j1232Q518L734j6382Q664j133j1414J0201m71
245i26k857M949j389J678n672m127Q803q089j135J4962r884m391J1243r797m329
260a0961R298k130k843O477M330m229J103Q089n403n249J1792m410q795J1930
274H999q26r876Q760L079r956J335M871n764j811P242M08l976N014n04p478J884
290A401k3n255K193K947k945r01K262o25l955P90L866k117p79N754p60l137L704
307B420J671o068K14L868m658l225O522o07n096P065Q46p607L882K336p079L849
323a667O570n460R76N919o404m419O054l326m429Q207J187n660O882J339r180
$$ plain form
218 -14523 -11033 -12328 -17981 -6139 -17240 -11683 2250 -16372 -6489 2793 -13627 1598 4604
231 4604 -5197 5550 -302 330 8589 -2643 5875 9609 -6773 1891 758 -10656 -455 -926
245 -926 -3783 1166 -223 1455 -4217 -8344 459 -7630 -8765 6197 -3687 -8078 3165 -6632 -10961
260 -10961 -1663 -3793 -6636 -159 4171 -58 1045 9134 3731 -1518 10274 5864 -2931 8999
274 8999 8173 -1703 7057 10136 180 1515 6386 622 -1189 6053 6461 2485 7499 6995 -483 1401
290 1401 1378 -3877 -1684 1263 -1682 -2583 -321 -946 -4901 -4111 -245 -2362 -3141 2613 1853 -1284 2420
307 2420 4091 -1977 -1763 2105 -2553 -5778 744 137 -4959 2106 2952 -4655 -773 1563 -5516 -1667
323 -1667 4903 -557 419 6338 -66 -4485 1569 -1757 -6186 2021 3208 -2452 4430 5769 -3411
338c411L987M211o566Q37N437l495m059K552l83n644J407J634m563J332J275j656
354g105K313J016k01K166j043P92K05l560M075J347l630P292J722q619K885M590
370D245n303j262Q542L016q194M998R635j3718l517J3778p656n880J2565k411
384H838q858O038J167p599j9O889k568m781O886k801r375R853K773j6316N057
399d816R116j4221k077J1328p434p895J1685N568j1228k927J1332k083j0169J3026
413g95O258j3074Q329R268j5137M50P571l924K285J236l74j4k032P074p164j0994
429a1037J7670l200j2535J7209p052j3993J4375o65m773k845k27J4957j4305l647
443a0068K5547k2145m84L1274k5529k904K4346j6455K619N883n613R434q173Q626
$$ plain form
338 -3411 576 4787 -1779 -942 4495 1000 -3059 -507 -890 -6534 -5127 -3493 -8056 -6724 -5449 -7105
354 -7105 -4792 -3776 -3977 -1811 -2854 -2062 -1857 -5417 -1342 5 -3625 3667 5389 -3230 -345 4245
370 4245 -1058 -2320 6222 9238 1044 6042 15677 1959 -1558 12220 4564 -1316 11249 8838
384 8838 -20 6018 7185 -414 -433 6456 3888 -893 5993 3192 -6183 3670 6443 -9873 -4816
399 -4816 4300 -9921 -11998 -670 -8104 -15999 -4314 1254 -9974 -12901 -1569 -3652 -13821 -795
413 -795 5463 -7611 718 9986 -5151 -4701 2870 -1054 1231 2467 2093 2079 47 7121 -43 -11037
429 -11037 6633 3433 -9102 8107 1055 -12938 1437 772 -4001 -6846 -7073 7884 -6421 -10068
443 -10068 15479 -6666 -7150 24124 -1405 -4309 20037 3582 6201 12084 6471 15905 7732 16358
457A6358K411k6824K4513O353k9789K6213j863j9012K4774j4802q501J2680j5370
470b859J4565l381k3783K6942q437j7047J9808k2209N74K1974k0971L943l304
483a4185r053K5769k0111r177K3538k5143J0121K1077l4775P826J8913q957M954
496i203q002O359R012j3393J9898m205k1686L4897O87k2142J7970p430l380J7818
510A7200r739l432K339J796J0907j1552n272Q788q240N598N568j2593P14L516
524E598K081l965j1131R588M70j0457J1516l680j2652J1570N351o928p709O103
538d245R810j4067M412J2053j9734P627J4105j5590N069K477n645P584n307O619
552E168N61j2688K1284p249j7068K7828j3986j3773K5654j2457m067R706j0220
$$ plain form
457 16358 18769 -8055 16458 22811 -6978 19235 17372 -1640 23134 8332 -169 12511 -2859
470 -2859 11706 8325 -15458 11484 3047 -14000 5808 -16401 -15827 6147 -14824 -10881 -14185
483 -14185 -23238 2531 -17580 -26757 -3219 -28362 -18241 2836 -31939 -24113 -5200 -14157 -9203
496 -9203 -17205 -10846 -1834 -15227 4671 466 -21220 13677 14364 -7778 10192 2762 -618 17200
510 17200 7461 4029 6368 8164 19071 7519 2247 11035 2795 8393 13961 1368 2082 5598
524 5598 7679 3714 -7417 2171 2641 -7816 3700 20 -12632 -1062 4289 -2639 -10348 -4245
538 -4245 5565 -8502 -4090 7963 -11771 -4144 9961 -5629 -560 1917 -3728 3856 -1451 5168
552 5168 5729 -6959 14325 7076 -9992 17836 3850 -9923 15731 3274 -793 8913 -1307
565a307J0798j0210n044K3213k4856L309K7655l2982Q328K0123k7487J5057L100
578I697j5493J6830j1664M413J1920k8106K1364M443k9255L2110j0241k2668L4013
591A7363j9477p685K2367k4609J2049K999k3509K7471j5456j2725L1758k9302
603a8756J824K4528l0589J4952N595k2709K5322j1110o232K4131k7196J0886J6724
616G370l1589K3375M960k4887K7260p165r496K1027j7989Q158R761k0142K1483
629A2126k983j5147K4656j4979m828K1423k0159N640J0959j9138J3663q54j0436
642e7J4033j1796J874J0138j8892J0816L840j7500J4147k945r779J2826q570j678
656c543O060j0607P600J681q116Q445l978j454P481r624L180N345q745O901J965
$$ plain form
565 -1307 9491 -719 -5763 17450 -7406 -4097 23558 -9424 -1096 19027 -8460 6597 9697
578 9697 -5796 11034 -630 3783 15703 -12403 8961 13404 -15851 16259 6018 -16650 17363
591 17363 -2114 -9799 12568 -12041 8 3007 -20502 6969 -8487 -21212 10546 -18756
603 -18756 -16932 7596 -22993 -8041 -2446 -25155 167 -10943 -17175 6956 -20240 -9354 7370
616 7370 -24219 -844 4116 -20771 6489 -676 -10172 10855 -7134 1024 10785 -9357 12126
629 12126 9143 -6004 18652 3673 -1155 20268 109 5749 16708 -2430 11233 10379 -57
642 -57 13976 2180 4054 14192 -4700 6116 9956 -7544 6603 3658 -6121 6705 -1865 -3543
656 -3543 2517 -8090 -490 1191 -6925 1520 -2458 -3912 3569 -6055 -2875 2470 -6275 626 2591
671B591o111L830j393N56J287l961N782p86m226O047l967j333N871m393k36K591
687B149k813J259q81K74Kk236M524j490m072N612l599k445N832l560k98L511k538
704g69j78j554L32K891m870K625L185n231L669K77l908L495j604J94L707l738
720a477J270J484l612K934j136j324M797m123p13M081l797L15J449o20J027k056
736a501P81K499m499Q07K831k486J644L68k078K181j186r43J971k57O05J84q67
753E4J969j553j908L651l71k108J937Q74j437j749J497Q04k403J344K551k894
769B58K95K137k925L90L032k521l65L276j552l496L403J513m263K020L457l994
785F65j269L971k522j933L004J23k811K074J95l022P83J546k189K26K308k154
$$ plain form
671 2591 -3520 310 -1083 -527 760 -3201 2581 1795 -2431 3616 -351 -1684 4187 -206 -442 2149
687 2149 -664 595 -286 -12 -10 -2246 2278 788 -3284 2328 -1271 -3716 2116 -1444 -1742 1769 -769
704 -769 -947 -2501 -2169 722 -4148 -1523 1662 -3569 100 377 -3531 -36 -1640 -1446 2261 -1477
720 -1477 -207 1277 -2335 599 -537 -1861 2936 -1187 -1900 2181 -1616 -1301 148 -472 555 -1501
736 -1501 -720 1779 -2720 -1913 918 -1568 76 444 -1634 547 -639 -1582 389 132 737 921 54
753 54 2023 470 -1438 2213 1842 -266 1671 2545 1108 -641 856 1660 -743 601 3152 258
769 258 553 2690 -235 155 3187 666 301 3577 2025 -1471 1932 3445 -818 1202 4659 665
785 665 -604 3367 845 -1088 1916 2039 -772 1302 1497 -1525 -742 804 -1385 -1159 1149 -1005
801a005p39J615j445o15K104p71p02K072j483j625K308n52j917K142J075k590
817b128O43R69k128N41K003k274O12K364k749j373L536k045j993M840K37m639
833c584K199L135m409k25M697j664k066L017J73k078Q63J48J49Q39l75O81O1j273
851B88j45J041N21j419P01K251j890o55J364j586J993J025m177M050J757o826
867a707L838L313p072J288O250k893n481L477L414p039M69P500p478j856Q383
882D406o293l144O467m215l06L858l384L71Q60K32m97k976M498J002n510O089
898A458M87p500M895K770l633P18l66L258j721m712P233k169o628R280j161o417
914d208O076r79k501J738m47J789j319r9L033m936J265N347o795K738M933p384
$$ plain form
801 -1005 -1744 -129 -1574 -2189 -85 -856 -1558 514 -969 -2594 -286 -838 -2755 -613 462 -2128
817 -2128 -1485 -516 -2644 -2103 -100 -2374 -1762 602 -2147 -3520 16 -2029 -4022 818 1055 -3584
833 -3584 -1385 1750 -2659 -2884 1813 149 -1917 1100 1273 -805 58 206 355 1194 819 1500 1561 288
851 288 143 1184 1705 286 987 3238 1348 693 2057 471 2464 3489 -688 3362 5119 -1707
867 -1707 2131 5444 -1628 -340 5910 3017 -2464 1013 4427 -2612 -2143 5357 -2121 -3977 4406
882 4406 -1887 -5031 1436 -2779 -3085 773 -2611 -2240 -1380 -1148 -1645 -4621 -123 879 -4631 1458
898 1458 1945 -5555 -660 2110 -1523 -805 -1171 2087 366 -4346 2887 718 -5910 3370 2209 -4208
914 -4208 1868 889 -1612 126 -321 1468 149 50 3083 -1853 -588 4759 -2036 702 5635 -1749
930a749J728M450m275m58J950M55j180j682M039j963n128N498P52n450L585J747
946B319l851L3J815n06j441J127Q90j534J06J595k073o86K512j07k509J537K255
963A482m292J601K218n213L381L215m105Q79r72M73L722m648J928K364n165O776
979C644j302p196Q564k355k019N561o694L603L136p770P314l309m937J2089q488
994a59k537R042j0183M581M521j1201R088k197n396J0353r848K90R133j2353P803
1009I37K626j1587J2342n057n798J2018j0521K595Q580j3915R128J491j1400J3666
1023E105n613n826J1930r885L119N829j2009R696j293p664J3566q542l219J1458
1037F652j1337M074N745j0648R034r26o710R354o775M5P946j0268N465L712r643
$$ plain form
930 -1749 -21 4429 154 -304 1646 2101 921 -761 3278 1315 -3813 1685 2437 -3013 572 2319
946 2319 -1532 -1499 316 -190 -1631 -504 386 -1148 -1042 553 -1520 -2206 306 199 -2310 -773 1482
963 1482 -2810 -1209 1009 -4204 -823 2392 -1713 -834 -1806 -1333 2389 -2259 -331 2033 -3132 3644
979 3644 2342 -4854 3710 1355 -664 4897 -1797 1806 4942 -2828 4486 1177 -3760 8329 -159
994 -159 -2696 6346 -3837 744 5265 -5936 3152 955 -4441 5912 -3936 -3646 5487 -6866 937
1009 937 3563 -8024 4318 -739 -6537 5481 -5040 -2445 6135 -7780 1348 2839 -8561 5105
1023 5105 -508 -6334 5596 -4289 -1170 4659 -7350 2346 1053 -6611 6955 -1587 -4806 6652
1037 6652 -4685 -611 5134 -5514 3520 2594 -4116 5238 -1537 -1492 6454 -3814 1651 5363 -4280
1052d280P860j622m792P072n219J096M763p432M408K67n736P787k819l406N314
1067C261m233P14K649l569J829m19l07K467l784J846Q55m380L975K98k966J916
1083A52q68M13p75p40J822k257J403K629m885J267J954k138L041k714j535N100
1099A869k802J037Q7m371N562q10k794N132n497N45N995o811J928J825l191N773
1115C477m195k108O450o352K015M948q115M824J755n687O478l630k772P157n365
1130a120K088K920p348O251r02m188P410o090j332Q445q314J480M109o722M966
1145A653J19m437N871m154j30M508p307L730K868o355N744j967m117O572m287
1160a689q53N068n457K193K304m563L877j501k272M906l727N26L892n576K427
$$ plain form
1052 -4280 3580 1958 -2834 4238 -981 115 4878 -2554 1854 2121 -3615 4172 1353 -2053 3261
1067 3261 -972 -258 2391 -1178 651 232 -75 2392 -1392 454 1309 -3071 904 1202 -1764 152
1083 152 -716 -303 -1078 -1818 4 -2253 -850 1779 -3106 -1839 115 -2023 1018 -1696 -3231 1869
1099 1869 -933 104 191 -4180 1382 572 -2222 2910 -2587 -2042 3953 -2858 -930 895 -2296 3477
1115 3477 -718 -2826 3624 -2728 -713 4235 -3880 944 2699 -2988 3490 -140 -2912 4245 -1120
1130 -1120 968 3888 -3460 2791 1889 -2299 5111 -979 -2311 6134 -2180 -700 3409 -3313 1653
1145 1653 1772 -2665 3206 -948 -1078 3430 -3877 -147 2721 -3634 2110 143 -3974 2598 -1689
1160 -1689 -2542 2526 -2931 -738 1566 -2997 880 -621 -2893 2013 -1714 -1188 2704 -2872 -445
1175d45K198m024L745r91j341L567l421M50L128l592K058J342k867K702q79j807
1191a77K733k134Q8J736j860J220n47j627K397j820j089L007k182q92K285j820
1207f82m65R32r74J53K16j8k91r51J534m19j961K130M87j854J135K06j028N47
1225a303L82p4P3K25j22l66L96L08p38P19R78r23kJ122q6j518R06J447j366l31
1245b73J747k97j732J328N87j414P06P29m02n58J131o13m92J434m63j697J511
1262A232N05j966P44R95j326m63J141j48j020P12L00r73K46P26o7o67P4J00l51
1281b06k11L27k51m01N25O03j047K10P98j108r5J279l06q30P73L94j740L32J647
1300F93j399o98J959r86r50J937o51r48J268k65o28R61K2l20j34M22k52n93J057
$$ plain form
1175 -445 1753 -2271 1474 483 -858 2709 -712 -262 2866 -726 1332 2674 -193 2509 1630 -177
1191 -177 2556 422 510 2246 386 1606 1059 -568 1829 9 -1080 1927 -255 -1147 1138 -682
1207 -682 -1147 -215 -1189 -1036 -820 -838 -1129 -2080 -546 -965 -2926 -796 -309 -2163 -1028 -822 -1850 -1303
1225 -1303 -921 -995 -922 -697 -819 -1185 -789 -481 -1219 -500 478 -445 -447 675 589 -929 -23 1424 58 -273
1245 -273 1474 1177 -555 773 1360 -54 652 1381 979 421 1552 939 447 1881 1418 -279 1232
1262 1232 1737 -229 515 1510 184 -279 862 714 -306 406 706 -267 -21 705 638 -29 45 145 -206
1281 -206 -417 -90 -341 -742 -217 386 -661 -451 347 -761 -856 423 117 -713 60 454 -1286 -954 693
1300 693 -706 -1404 555 -431 -1381 556 -95 -1043 225 -40 -668 293 315 -5 -139 283 31 -562 495
1319D95l69o67Q57m44o48J410q03O6J062j493M70J024j457M01J042j295K69J89
1337A09K38l31r88J278l42j098K055p56j130J936j081m83R24p72j17N93m04L57
1355a2m30j36O14j184O83P50r45M56Q23p55k2O74J47o95n8Q09n15o48J060J32
1375G48j310O40O82j050j6J084j177Q3J285n81m77J068r93k7N89n83K70j42N41
1394F34P46j543P91R48k363J334L94j237J778m57o18Q24k070J117Q39k714J979
1411C82K9k181K708j167j276K114j793L34J059j471J800j338j055L003k546j36
1427a534L284m228P29K484l024J970L11j847K768j626l29J900k540J478J187k257
1443a274K880j065j745L094k177j030K584j219O81O33j655J637m68j300K800k119
$$ plain form
1319 495 126 -541 316 -128 -776 634 -169 -103 959 -534 -64 960 -497 -96 946 -349 -80 109
1337 109 347 16 -972 306 -36 -1134 921 165 -965 971 -110 -593 331 -441 -558 35 -369 -12
1355 -12 -442 -578 36 -1148 -465 285 -660 -204 619 -136 -158 516 663 -32 -90 719 204 -444 616 748
1375 748 -562 78 760 -290 -306 778 -399 -316 969 388 -89 979 -14 -41 548 -35 235 93 634
1394 634 1380 -163 628 1576 -787 547 941 -296 1482 1025 407 1231 -839 278 1117 -1597 382
1411 382 411 -1770 938 -229 -1505 609 -1184 -850 209 -1262 538 -800 -1855 1148 -1398 -1534
1427 -1534 1750 -2478 -1749 735 -2289 -319 -8 -1855 913 -713 -1042 858 -1682 -204 983 -1274
1443 -1274 1606 541 -1204 1890 -287 -1317 1267 48 729 1362 -293 1344 876 -424 2376 257
1459B57q44K340j601K76M63j720R36J86n96Q80p63o57J210n91N88K57j549J286
1477C58N72j897M61O49n52N93L73j231J43J143n31n17j92K42J381l44k25J79q34
1496b29M44J003k027J018N60j360K412j112k048L231j863n67K270k854J974R60
1512A812l405K270p54j733L960l402o64L112l836K743O57m310M864j397k738M842
1528B021m084J28M625n342K618J952m796M956k144l572N433l199R39L371o257
1543c351M673Q08n100N795l237k699P830o116M31M788o960M207P41n176N804k392
1559D6j334N027o033K369L414o357N023r10m763O847l389k106N229n506K037K876
1575B470n556M160q37l274N716l697n22N038m871J581J524m644M120p36k539L881
$$ plain form
1459 257 -587 1753 152 428 891 -829 107 293 -303 577 -186 -843 367 -224 364 621 -928 358
1477 358 930 -967 -506 143 -409 184 557 -674 -531 612 81 -436 -628 -386 995 651 426 605 -229
1496 -229 215 1218 -809 209 769 -591 1821 709 -1339 1892 29 -538 1732 -1122 852 1812
1512 1812 -1593 677 -77 -1810 2150 -1252 -1916 1196 -2640 103 760 -3550 1314 -83 -2821 2021
1528 2021 -2063 -1935 2690 -2652 -34 1918 -2878 2078 -66 -3638 1795 -1404 -465 2906 -3351
1543 -3351 1322 2130 -2970 2825 -412 -3111 4719 -1397 -966 3822 -3138 1069 1810 -3366 2438 46
1559 46 -1288 3739 -2294 75 3489 -2868 2155 1245 -3518 3329 -60 -2166 3063 -2443 -406 2470
1575 2470 -3086 1074 237 -3037 2679 -1018 -1540 3498 -1373 208 1732 -2912 1208 472 -2067 1814
1591A814l026L32L263m576J991J456l549L937j379j464L535k906L16J780l155
1606a631K451k2k270K756j597j50J999k270P66J142j654J820j147m20J660j539
1622a06P06L70j782J231k77j448J378o95N58Q08j103P37n30m15J364j593M85O56
1640C44j050J360n50j404J418j115J83R56j629J385N23j273J111q55N1J750j872
1657f67O96N39j354J789j126p10K110j335j75J433k059J333P48j156J436p99m42
1674B61J372k052N80R53j829J416j05j132J384r11p32J556j581L23J168j189Q93
1691C75j82r49J188j061l55O86q57M44J72o39R71l95r41J494j081j20J336p24
1709f38j05N69m2J00l06J6K87m17K94M56n70Q27J28p33O73l93n15O82j09p3M54
$$ plain form
1591 1814 -1212 -880 2383 -2193 -202 1254 -2295 1642 263 -1201 2334 -572 -256 1524 -1631
1606 -1631 820 798 -1472 1284 -313 -463 1536 -734 32 1174 -480 1340 193 -227 1433 -106
1622 -106 600 970 -812 419 142 -1306 72 -623 -65 743 -360 377 -153 -568 796 -797 -312 344
1640 344 -706 654 104 -1300 118 -997 -814 142 -1487 -102 421 -852 259 -596 -545 1205 -667
1657 -667 29 568 -786 1003 -123 -833 1277 -58 -233 1200 -859 474 1222 66 1502 703 261
1674 261 1633 -419 161 1114 -715 701 596 -536 848 -63 -795 761 -820 -497 671 -518 375
1691 375 193 -756 432 -629 -984 -298 -1155 -711 -539 -1178 -207 -602 -1543 -49 -1130 -1250 86 -638
1709 -638 -743 -174 -216 -116 -422 -406 -119 -536 -242 214 -356 471 599 -134 539 146 -369 313 204 131 585
1730E85Q1k72l67o8j37j92K25O76k93L9L44l7k18j09K02L6l98N79L75o70O2K79
1752G22n18m07K42j70J52L59k39j72K27L9j44k8l1k82J41K41n91K89J03j84m2
1773b93q8k55L45K03J89nJ86m4R9R2l71q1k9q5k81M14M58o47K57k10m75R80J1
1796C70n31L83L07l5l06L53l01l30M66k10n90O47p4n99O42m06j90N44n79J37N9
1817b43j26N81p27K41L20j044K60L93j012J024L4q22J100k71k26O91q31L53K48
1836e7n39R65n20l10J359j493mR73j791J219Q52j412J259M7j174J640j204J22
1854f8J092j141J016j39j134J645j009j006K318k173J88K167k442J385N83k062
1870g80K211q29p68J353j934P36O50j898K143l58j660K423j423n38J825k099J084
$$ plain form
1730 585 666 394 27 -41 -178 -370 -145 531 238 277 621 584 366 257 459 495 97 676 1051 381 443 722
1752 722 204 -203 39 -131 21 380 141 -31 196 235 91 63 32 -250 -109 132 -459 -170 -67 -251 -293
1773 -293 -381 -636 -291 -88 101 96 282 238 337 429 58 -23 -52 -137 -418 -4 454 -193 64 -146 -621 359 370
1796 370 -161 222 529 494 188 541 240 -90 376 166 -424 223 149 -450 192 -214 -404 140 -439 -302 -243
1817 -243 -369 212 -515 -274 46 -998 -738 -345 -1357 -333 -299 -1121 -21 -292 -518 173 -658 -305 -57
1836 -57 -596 369 -151 -461 898 -595 -599 374 -1417 -198 654 -758 501 548 -626 1014 -190 -68
1854 -68 1024 -117 899 760 -374 1271 262 -744 1574 -599 -411 1756 -686 699 1282 -780
1870 -780 1431 602 -166 1187 -747 -11 639 -1259 884 526 -1134 1289 -134 -672 1153 -946 138
1887A38J714k801J639kj598J460j170m01J669j325Q94L2k035K148r49p72J986
1904F27j441j50J844j768N33O38j307Q80j34j91N35o52L59L08o30O54l79m00J258
1923E84o97l99N58OK50J43m26l72O0K88q1l30J59L64O18M4q24J14L16q7L54o99
1945e7M04O38n37O86r57p68J741n06o12M05q58J139M11j391P15k35l59J558j640
1964b23n85J282q96R81p0j789J345l9p23J060j536N27J733j549O34n9j412K078
1982G59j070j101J605q93M79J056k096O76N88j181J744o30p64J747j327J50R17
1999F59j079M35K99j072J715o31q47J499j224R9J228j482N11O12j209J101j21
2016D93q45J185m52l73K89q83K03P57r25N10L75p58Q08k80j003P49l02j35J370
$$ plain form
1887 138 1852 -949 690 688 -910 550 -620 -1021 648 -677 217 249 -1786 362 -587 -1359 627
1904 627 -814 -964 880 -888 -355 283 -1024 -144 -278 -469 66 -586 -227 81 -549 105 -274 -674 584
1923 584 -113 -512 46 52 302 445 19 -353 -293 -5 -86 -416 -257 107 725 769 -55 59 375 288 642 -57
1945 -57 347 985 448 1134 177 -591 1150 644 32 437 -421 718 1129 -262 453 218 -141 1417 -223
1964 -223 -808 474 -422 559 489 -1300 45 6 -717 343 -1193 -666 1067 -482 152 93 -1319 759
1982 759 -311 -1412 193 -700 -221 835 -1261 -585 3 -1178 566 -64 -828 919 -408 -258 659
1999 659 -420 15 314 -758 957 326 -521 978 -246 -147 1081 -401 110 722 -487 614 493
2016 493 -352 833 381 8 297 -586 -383 374 -551 -41 334 -424 384 104 -899 -150 -452 -587 783
2035G83j161p3Q12j027M21k16n42N13K00j26O80q56Q5R65j201L39P30j029R60
2054B57Oj245J565l95m10J205j290m7Q77p19O07O00j417J375m15p04J459j312
2072cl56J274j361J024J46j615J662k95j271J806j448l5J783j729L47P49j351
2089f73J553p62j185J822j051M32O73j964J405L94j773J984r02o22J766j231r9
2106b33J191j356Q84k63j231J441l76l90J031j187L50R91j308O26J09p97J279
2123G61l16m17P91r68N31N18j277L77K11n56O62n04m5N41n92J40J88n16O38j70
2143ck63N79o03p7K87o08J35L75l79O32j16n72P12k59K07l0o11M40M3l67N99j83
2165f2j89K89k74j4p9j21J51l6J84K24k92L75j01j51K17R9q2P6n8j03K18o8J88
$$ plain form
2035 783 -378 -451 361 -666 -245 -461 -1003 -490 -290 -416 264 -592 -507 458 -743 -404 326 -703 257
2054 257 263 -982 583 188 -222 983 -307 -354 523 -196 411 1011 -406 969 554 -150 1309 -3
2072 -3 -359 915 -446 578 724 -891 771 476 -795 1011 -437 -472 1311 -418 -71 678 -673
2089 -673 880 118 -1067 755 -296 136 809 -1155 250 644 -1129 855 -47 -669 1097 -134 -233
2106 -233 958 -398 486 223 -1008 433 57 -333 698 -489 -139 852 -456 170 279 -518 761
2123 761 445 28 819 -149 382 900 -377 0 211 -345 317 -187 -232 309 -283 -143 45 -471 167 -3
2143 -3 -266 313 -290 -367 -80 -688 -553 -178 -557 75 -41 -613 99 -160 47 17 -594 -154 -111 -478 121 -62
2165 -62 -251 38 -236 -250 -329 -450 -299 -335 -151 73 -219 156 55 -96 121 220 138 214 156 53 271 203 391
2188C91k68J5K15p9Jj62M00j64j37K4J69l81o4K10k86L20m7p0k3k02r8M31k62
2211f7k37L41k00J50k49ML63j78k10J60k72M00j46k56M97Q8m78M25k00j82L07
2232F0J0m1K05l66J40J19l2j05k77L87J19r2JJ67m85N08k64j4j58J92O1l8l4j87
2256a24J11p0j8K75m8j4j43K63q4l18M99k32j60M96l42n6L36k28R0j04j33r1J26
2279C1k33K87l33J0L52l30K92m06N6M10l84R0J82m22N93J62p44N48n0l96N02j13
2301A04l8J87j65J01j53JK69k90j28K30m14M20K07m74J63j35j07M30q0l47L50
2322A31l88K90K48l84J51l72J35K84l91K23K97n29M91l17q9K54k73J01N7k44P00
2343C75l40j01R6o65M42L70p91P14J14n49P00m98M3P14j033P40K14j123J194l42
$$ plain form
2188 391 123 138 353 274 275 113 513 349 212 236 405 24 -40 170 -116 204 157 87 64 -138 -236 195 -67
2211 -67 -304 37 -163 -13 -262 -258 105 -73 -283 -123 -395 5 -141 -397 100 188 -290 135 -65 -247 60
2232 60 70 29 234 -132 8 127 95 -10 -287 100 219 127 128 295 -190 318 54 40 -118 74 135 97 63 -124
2256 -124 -13 -83 -101 174 126 112 -31 232 148 -170 329 97 -63 433 91 35 371 143 233 129 -4 -95 31
2279 31 -202 85 -248 -238 114 -216 76 -330 -274 136 -248 -158 24 -398 195 357 -387 161 111 -285 217 104
2301 104 66 253 88 189 36 37 306 16 -112 118 -296 124 331 -143 20 -115 -222 208 128 -219 131
2322 131 -257 33 281 -103 48 -324 -189 95 -296 -73 224 -305 186 -131 -220 34 -239 -138 -81 -325 375
2343 375 35 -66 30 -635 -193 177 -614 100 214 -335 365 -133 -90 624 -409 331 545 -578 616 274
2363B74l15O33j185O03Q54j570Q95j4p62J594q60r49J362q72P78R6j547J257L27
2382E99j081J297j378j00J868j747L61N19j243K035n38j901J988j288M56J099
2398I46k086P94R15j688J717q32j172K445j504Q9J289k286J706O47k037J695r12
2415b74l00J896k046J24J536j840J651m21j857K384r81m27J455j701P43J222j976
2432h12J546j44j588K292j565j99J609j648O04P05j617J687j56j256J403j304
2448d43P15J028k030J017J17r19J402q08n69J244q86J31L38r85J232j10p52P38
2466D60q57J10P47o59M85l21m27N31m71J94J81o45Q16k16n66P66n82K23K58q07
2486g80Q30j35j88O72q48M25L45j249R32j0p68J112o99J4Q18j197N43L60q34J265
$$ plain form
2363 274 -41 592 -593 10 864 -706 189 175 -587 1007 147 -802 560 -312 466 562 -985 272 599
2382 599 -482 815 -563 -663 1205 -542 -181 338 -905 1130 592 -1309 679 -609 -153 946
2398 946 -1140 -346 569 -1119 598 -234 -1406 1039 -465 -376 913 -1373 333 980 -1057 638 -274
2415 -274 -574 1322 -724 -600 936 -904 747 326 -1531 853 -128 -555 900 -801 -58 1164 -812
2432 -812 734 590 -998 1294 -271 -470 1139 -509 95 800 -817 870 714 -542 861 -443
2448 -443 272 1300 -730 287 404 -515 887 79 -490 754 -132 -1 337 -648 584 474 -278 460
2466 460 -397 -287 460 -199 286 -35 -462 69 -402 -208 -27 -672 144 -72 -638 128 -454 -231 27 -780
2486 -780 50 -85 -273 399 -449 -24 321 -928 4 -6 -774 338 -361 -347 471 -726 -183 177 -657 608
2506F08n61n61J252p94%Q09j525J162K69j262J472p95n62J616j233j33J267j443
2524d14J069m3j372J412q96M5J030j392M94O30j338J328m83p49J284p11l43J048
2542E99j521R01L13j089Q85j17p02J013o03J51M56o91J58J76o54O83j94k74Q67
2561C57n32o8N50o49K85J37m81N64j65M3L08k96L1l6j66L23J71m21L81j57j97
2582a8J86lJ29k10J87m51L25Qj87J79Q4l73M76k21J39O0l94J22l4m0K62l85K9
2605a30J21l02P6L53m52K83j8m79P05n16N7L42l11J14J01j61J62p0m95P67n16
2626c69q7O68m93J59J87l14L41J65n11M02r4k84N78n22K03K99l26K09k56R5J77
2647B27l05k8M89m73K73O2n36M49q6n9K31k87J07M05k58l3j1l87M50j49j07L02
$$ plain form
2506 608 47 -514 738 -56 -56 753 -772 390 659 -603 869 74 -488 1128 -105 -238 1029 -414
2524 -414 655 612 -760 652 -244 -199 831 -561 -67 563 -775 553 70 -679 605 -106 -449 599
2542 599 -922 -21 292 -797 88 -29 -731 282 -321 -170 286 -405 -247 -71 -725 -42 -236 -510 357
2561 357 -175 -243 307 -342 -57 80 -401 163 -2 41 349 53 84 48 -118 205 376 -45 336 179 -18
2582 -18 168 165 294 84 271 -180 145 153 -34 145 229 -144 332 111 250 310 -84 38 4 -36 226 -159 -130
2605 -130 -9 -311 -235 118 -334 -51 -69 -548 157 -359 -302 40 -271 -157 -56 -217 -55 -125 -620 147 -369
2626 -369 -456 212 -281 -122 65 -249 92 257 -254 148 54 -230 348 -174 29 328 2 211 -45 50 227
2647 227 -78 -106 383 -90 183 245 -291 158 72 13 244 -43 64 469 211 178 167 -220 230 81 -26 276
2669B76n1J4k55k6K09l38M5K16j78J83n9k52M5J84j83J29m3M7o3l3K76k78J22
2692a3m9O2j73J67mJ5j23J79Lo5n7k09J24k5J32l3R4N1j12K3k62J24K52jj58Q1
2718B3K3j02k78K74N1NJ52k58J44j2J45k52L3J00R4nj25j27J34j25K16m9K2J19
2742B02j40j15P0P5j49J82j9Oj71J73k64K37k48L78j64j8J49k80J31j76L0L27
2764B16k39K4j12k44M06j03N2J97n9k96K58l59J52J74k85O2J13k11M25j32k43
2785b04K30r7m4J32j57L16j64k72M08n15M68j4m07K19J62m68N77l05j20N54n60
2806b61K49O21r40L26K31m57P04k72m73P00p46N33M27j170P48k24l57O62l14l55
2826c68J175j006L45J77q05R15m51m49Q98n26j30Q19j163N50K30p30R18m68m15
$$ plain form
2669 276 225 239 -16 -42 167 -171 -126 90 -88 95 36 -216 -171 13 -170 -41 -84 -37 -100 -133 143 -135 -13
2692 -13 -62 0 -173 -6 -10 5 -118 61 64 -1 -58 -267 -143 -168 -36 -69 25 76 -36 -13 -275 -151 101 100 -58 23
2718 23 46 -56 -334 -60 -9 -4 148 -110 34 22 167 -85 -52 48 142 137 12 -115 19 -106 110 61 83 202
2742 202 62 -53 17 92 -57 125 106 112 -59 114 -150 87 -161 217 53 35 184 -96 35 -141 -111 216
2764 216 -23 1 -111 -355 51 -52 0 197 138 -158 100 -259 -107 67 -218 -156 -43 -254 171 39 -204
2785 -204 26 -71 -115 17 -140 176 12 -260 148 -367 101 87 -320 -101 61 -407 170 -135 -255 299 -261
2806 -261 -12 609 -331 -5 226 -231 473 201 -272 428 -318 215 642 -528 220 -4 -361 301 -13 -368
2826 -368 807 -199 146 323 -482 433 -18 -467 431 -95 -225 594 -569 -19 211 -519 399 -69 -484
2845d84M80j77m3L82p70O74R3p92Q41m60j25M35m33L36o6j20L99q4l67M50m25
2866b56L32J75n92N60j34k13L60l63R8J76l1k6j82J20J44r9o6M16r90J007k27
2887B09n86P06m87J07O72q49M29L4m87O38o0m03Q16r60N18M26j343J211m83o37
2907e29J314r75k28J036j301P83J73r05J234p53m75J193j015L99N61j434J089
2924A67K20j037J440q61p61J564j138J33R69j436J270k90j008J213p68J62J026
2941H65j468O25M78j590J727o46q35J643j005k61J275j485Q61K14r60J012J0q89
2959d29J131j150L09Q45j181P48M1o69J105o54o34J158q05P0N97j089O50J31o12
2978d38O74l07k68O49n37L20Q4p58Q43m2o41P45m82p9O73p08J92J56K3m0K11n37
$$ plain form
2845 -484 -4 -181 -224 158 -612 62 155 -637 204 -256 -381 54 -379 -43 -109 -229 170 86 -281 169 -256
2866 -256 76 251 -341 219 85 -128 232 -131 -33 143 112 86 -96 24 168 69 3 419 -571 436 209
2887 209 -377 329 -158 -51 621 -228 201 235 -252 386 326 -77 739 -221 297 723 -620 591 108 -529
2907 -529 785 -190 -418 618 -683 100 273 -632 602 -151 -626 567 -448 -49 512 -922 167
2924 167 387 -650 790 -71 -832 732 -406 -273 696 -740 530 240 -768 445 -323 -161 865
2941 865 -603 22 500 -1090 637 -9 -844 799 -206 -467 808 -677 184 398 -562 450 460 -429
2959 -429 702 -448 -139 706 -475 273 314 -355 750 96 -538 620 -185 -115 482 -607 43 174 -438
2978 -438 236 -71 -339 310 -227 93 177 -581 262 220 -421 324 -158 -237 436 -272 -80 76 99 59 270 -267
3000b67K91k8l13J26K8K09Lk19L99j30k7o5J27k61L45n8K3m6J07l89K49O8m17
3023b45L42L76n56j2K09k97J77mN3K55l33O2Q6k33K51J1M9K1k41nM33k74n8L8
3047A05n41N60J76o88K70J4k5N50p13N9K94p5M13o30J4N04k55k86K40l21K33L62
3069B60n70L19Q6l00L51k52j87L99p1J44k46j28L62j91J07O3k87P4L76l56j9K69
3091B03l62M67j70k82L11k39K90j40k35R3L88l31K44j75J85p7j47K6P1j22L00
3112B98m6j85N9k64Q3k3P7O3L6j30J21m49L61m0L1J01LM5k11j03R9m3K57j93K73
3137B20k32N3J3l22K1J35O4rM0r7N7j49K17Q4k05K52o8Q7k02l8J92l52M5J62J09
3162G7m7j79K42J09k22P9l4j30J79k00L47k27J5R9P8k08K3Oq6K32q2J75j36Q7
$$ plain form
3000 -267 24 -4 -317 -191 -163 46 49 -170 229 99 72 7 134 -127 218 160 183 137 244 -145 104 172 -245
3023 -245 97 473 -83 -95 114 -183 -6 -10 43 298 -35 27 113 -120 131 142 191 212 -29 -34 399 125 67 105
3047 105 -436 124 300 -388 -118 -104 -129 421 -292 -233 61 -14 399 -231 -217 287 32 -254 -14 -335 -102 260
3069 260 -310 9 95 -205 146 -106 -293 106 35 179 -67 -195 167 -24 83 146 -141 -67 309 -47 -66 203
3091 203 -159 308 138 -144 167 -72 218 78 -157 -64 324 -7 237 62 247 170 23 49 120 -2 298
3112 298 252 67 126 -138 -55 -78 -1 62 98 -32 89 -360 1 -39 -8 93 96 141 -70 -173 -74 -117 140 -53 220
3137 220 -12 41 54 -268 -247 -112 -48 -57 -17 -114 -57 -206 11 95 -110 142 74 161 -41 -79 113 -239 -194 -32 77
3162 77 30 -149 93 202 -20 59 25 -105 74 -126 221 -6 9 108 186 -22 1 7 -79 153 71 246 110 197
3186A97q5m2O4nJ6l1n7k9l3o8J38M8kj46O2P3j53J13rk12K96j2k43Q6J06j79J40
3213C3J16m39J59L35j12k01L5J05k54K18k02Q8p5l5Q6J62l54J71N8n7L79l06k09
3236b99L27j10p1J42L7q5Rj64M95j13j79K64l00n5L84k17O1J61j04j50r9K40k86
3259a12K30jJ14j74K59k41l8o1p9RK3J30m0J72k84j40r6J87J54m1J77m91K75N6
3283a2j28j6Kk88K98k8o5M70n23K21J6j72L79j91n6k3j96J41J82n53N32j70j81
3306c61M45j08m7L39l94L42N6m09L69j78l25N60m00K48K43r97Q26j55m73O84j25
3327A40n17R71n97K12J93n34M13j24m39P09o58K09O45r36Q9O12q56O23J55o17
3347c07O10l35m09R66q19J90M89o61M08Pq73J359o43o15J105p88J86N21q04K97
$$ plain form
3186 197 112 70 134 129 145 114 57 28 -5 -73 65 113 111 -35 27 100 -53 60 51 -161 135 123 -120 -34 72 -107 33
3213 33 149 -290 -131 204 92 -109 -74 31 -223 -5 -207 -119 -194 -229 -143 19 -335 -164 -106 -163 216 -90 -299
3236 -299 28 -82 -153 -11 26 -59 -50 -214 281 168 -11 253 -47 -102 282 65 126 287 183 33 -66 174 -112
3259 -112 118 117 231 57 316 75 37 -24 -103 -94 -71 59 19 191 -93 -233 -329 -142 12 -29 148 -343 -68 -12
3283 -12 -140 -156 -154 -442 -144 -172 -237 233 -290 -69 -53 -225 154 -37 -93 -116 -312 -171 11 -542 -10 -180 -361
3306 -361 84 -24 -71 268 -126 216 272 -137 232 54 -271 289 -111 137 380 -617 209 54 -419 265 140
3327 140 -377 594 -3 209 402 -132 281 157 -282 427 -231 -22 623 -313 -224 388 -468 155 310 -307
3347 -307 303 -32 -441 525 -294 -104 385 -276 132 139 -734 625 -18 -633 472 -316 -130 391 -413 -116
3367a16K88n58P26n33qM87o84L08L58r95O92L1l01Q56o37m68J154q36L22R0o31
3388d55N92J75l86L84o41K01M91n55K80J42m55P67n52j97Q18o13j5L55n66M49
3408B19j96M7K24n13K62J17n47L30K59j95J54n9j93L20l01K9j3k12M28j84K40
3429B16k25q8J94j99l08K40j23M50k02l15K25J64j63K41k26k81N85n99R5O56n06
3450a69M68q5n45P44o03j67P12q07M76M47r97R79m31n14Q14o43K66L48n40M93
3470B46J28q79R20m23k68Q97j080N15L55q41P31k10n36R50l84o33J018p49J69
3489g4M33p83Q12k48j74M61o58K1P74j017O69N2q73R53Mn37L25m67L52M25n66
3510a16J81J67n83M96k07k57P26n43o3O75n98j38M61m79N82m27j78N02l76J51
$$ plain form
3367 -116 172 -386 340 -193 -201 286 -398 -90 268 -727 -35 -4 -305 551 -86 -554 600 -236 86 176 -455
3388 -455 137 312 -74 310 -331 -130 361 -194 86 228 -227 540 -12 -209 609 -4 -19 336 -230 219
3408 219 23 70 294 -219 43 160 -387 -57 202 7 161 102 -91 229 -72 -43 -56 -268 160 -24 216
3429 216 -9 -97 97 -102 -410 -170 -293 157 -45 -360 -135 29 -134 107 -119 -400 185 -414 -319 337 -169
3450 -169 299 214 -331 413 -190 -357 355 -452 24 471 -526 453 22 -492 322 -321 -55 293 -247 246
3470 246 374 -505 415 -8 -276 621 -459 56 411 -430 301 91 -445 505 121 -512 506 -243 -74
3489 -74 359 -424 388 140 -34 427 -231 -210 564 -453 216 268 -605 348 352 -185 140 -327 25 450 -116
3510 -116 65 232 -351 145 -62 -319 407 -136 -199 476 -122 -260 201 -278 304 -123 -301 201 -175 -24
3530b4L64p33N68%l11K64m0n27N13l22L5L66m08J42p3j43M02j31Q3j84O9K26l78
3553b42K87q4J76%j03Q7K7j31p0j07J47o7J86M8Mj1J07Q1k24j74j38K69jJ69Q4
3578C20k11k37K67J5pk29k9R2J91k65K07J84j46k99M7j06L17k1m8M8j65J63m41
3601c53N45j62mK5M5j60j06L99l82K15j14P5r6M4k98M42J9j49l1P0j72J04k92
3624c36o5J08K04L8J07J5j26k26Q1J37J39mJ8j37K15j72Q8l31kJ43j53K19O6L2
3648E8M1j90j31J43P6J97k09J12J0R5k23J60k91M06l03m8pj26L83j79k9M2k7k44
3672b84J87Q6L4J39p4j50K40m0k57M62k37p4K2O9k65L9K11j57j19J08Q6k8L63
3695C61k47l3J03l07j1J41p8K7j59Q8J51Q3k47K6KK28j62M3K01k32Q4r8m1m6j52
$$ plain form
3530 -24 340 -393 175 175 -136 128 88 -439 74 -248 -213 153 -255 -113 -186 -329 73 -58 25 -159 -90 136 -242
3553 -242 45 -39 137 137 34 121 148 17 -53 -160 -13 -80 106 154 158 147 254 335 111 -63 -201 68 67 236 320
3578 320 109 -128 139 154 147 -82 -111 -19 172 -93 114 298 152 -147 -100 -206 111 90 42 90 -75 88 -353
3601 -353 192 30 26 51 96 -64 -170 229 -153 62 -52 23 -73 -29 -327 115 134 -15 -46 24 -148 -44 -336
3624 -336 -401 -293 -89 -51 56 71 -55 -281 -200 -63 76 72 90 -47 168 -4 84 -247 -249 -106 -259 -40 26 58
3648 58 99 -91 -222 -79 -3 194 -15 97 107 202 -21 139 -152 254 -49 -97 -104 -230 153 -26 -55 -13 -40 -284
3672 -284 -97 -11 23 162 88 -62 178 138 -119 343 106 32 54 123 -142 -103 108 -49 -168 -60 26 -2 361
3695 361 114 81 184 -123 -134 7 -71 -44 -203 -115 36 119 -128 -102 -100 128 -34 9 210 -22 62 -36 -77 -123 -275
3720b75K2L60o2j00J93j40m3m7j71M57j89j57K32l1J44k67J51o3O1k68P7J13l80
3743c83N08j53Q8J16k28K11j62p1N4q7PJ42J74m57K97lj13J97k51J0j41J28K89
3766A72j21L7K6j29R6j23q4L9J60j36J10Ok92M27j05j48L34k89M5k52M35j84j68
3789a44M07l14l29L67P4K58l13K09l91L22j68O7j31l4k1Q9J11J70j86k15K20q1
3811c3N4k4j23K80k91k7L06n00O39j04l32L07k97J70K85l93N7K98n80M05j35M5
3833GQ6k45L43J9k27R9k72p2M42l14P6L90p15L36n6j14M83l40m6M54l59P1K90
3856C36o50O58O6p29O19l08l09P41o88K15L26o66M92M2m93P39n34O4M25n81M26
3877A91N1n35N95k70n88J006m69j81L75n45N02J47p67Q34l37m59Q01p58N43L93
$$ plain form
3720 -275 -253 107 45 -55 138 -2 -45 -92 -263 194 5 -152 80 49 193 -74 77 14 75 -193 -116 -3 -383
3743 -383 125 -28 60 176 -52 159 -3 -74 -20 -107 -100 42 216 -241 56 53 -60 137 -114 -104 -245 -117 172
3766 172 51 88 114 -15 81 -42 -126 -87 73 -63 47 53 -239 188 83 -65 269 -20 25 -227 208 24 -144
3789 -144 263 -51 -380 -13 61 319 6 215 -176 146 -22 45 -86 -120 -141 -52 59 229 43 -172 48 -33
3811 -33 21 -3 -126 154 -137 -164 142 -358 281 177 -155 152 -145 25 310 -83 -26 272 -308 97 -38 7
3833 7 93 -152 191 210 -17 82 -190 -262 180 -134 -58 332 -383 -47 -103 -217 266 -74 -120 334 -25 46 336
3856 336 -314 344 410 -319 300 -8 -317 424 -264 -49 277 -389 103 145 -348 391 -143 -79 346 -235 191
3877 191 242 -293 302 32 -556 450 -19 -200 175 -370 132 279 -488 346 9 -450 351 -407 136 529
3897E29j272P56L3m62P73o48q3J111r31K78L01o68M40l8p80J058l94k83M66k90
3917a04Q1L51q79O45k61k80J018p85N8M18m84J09L62l53K44j83k29L82j34k04
3937b28L03m29L40J60o37O85k20K14nj67N8J52m95K3K58k02K94j95j13K35k11
3958a80K36j72J12K74j46j47K90l08J63O3k86K32m26R9Q3K95k51Q3JL39n27jK54
3981H0Jq6J61l68L68j63N6J59k31j58O62n76N7J14l91P20k53n60P62n02L05j19
4003C8l34L65J39k07J71l84j37O02l28q2K19j58J63J54m13K10l07R7J93l73K53
4024a19L79j83j25k7l08L65O4k11M74o27L53j42k69M88l49N1K66m43K50O6k14
4045b61M54k59m1NN8QK66n25K48J96k06N3K10k77K15j38k87L55k4M7j0j18N7L6
$$ plain form
3897 529 -743 13 46 -416 357 -291 -374 737 -194 84 385 -283 157 119 -661 397 3 -280 186 -104
3917 -104 -23 328 -551 94 -167 -447 571 -214 -156 262 -222 -113 249 -104 140 -43 -272 110 -24 -228
3937 -228 75 -354 -14 146 -491 194 -26 188 183 16 74 226 -269 -246 12 -190 104 -91 -204 31 -180
3958 -180 56 -116 -4 270 124 -23 267 -41 122 185 -101 131 -295 -196 -113 182 -69 14 15 354 -173 -174 80
3981 80 81 -5 156 -212 156 -7 49 208 -23 -181 481 -95 -38 76 -315 405 152 -408 354 -148 157 38
4003 38 -296 69 208 1 172 -212 -349 253 -75 -157 62 -96 67 221 -192 18 -289 -192 1 -372 -119
4024 -119 260 77 -48 -75 -383 -18 46 -165 309 -318 35 -107 -376 112 -237 -186 80 -363 -113 -47 -261
4045 -261 193 -66 -107 -102 -44 -36 230 -295 -47 149 -57 -4 206 -71 144 6 -281 74 50 97 87 -31 26 62
4069F2J30q6o9Kmk4N6L1k47K83j46O3K34j11k1J34j48j4j8j52J00N5j46L03l95
4094a28K62L9k35J52j22k7J13k18l9K28j10J85j1M2p7m8j01K77k53j01k9J29Q2
4117A0MN5l5k01j42L76j71M8j15J82p2K47j31l60L16M5k22M2L60k59M3qn4K09
4141A67j68J26j08k0K53k49J69k5j7ln8m9JL67k58M8j11k15J88J58l67K05p2j67
4165b05k6PR1J93m88L80L3m2P7Ml7Kr9o4K87l20L71q2j77m1J44r6K80k46k6j17
4191a97J09N9o9k24J49o2j00J04J28qJ8R3Rj36O3MNK19k51RK52k00J6J68j87r
4217c8J49j92l8Q0Q4N7r8J72j33o9J85O0k02J01l9K40l78Q8L7j25J96r6Qk15L20
4242A54m7j76R6J23k63K15o4j85M5L10k42J1J7j52n7K6J93q7J69j40MP6k23N3
$$ plain form
4069 62 192 106 37 39 35 11 67 98 -149 134 -12 51 285 174 153 287 139 125 107 -45 55 110 -36 267 -128
4094 -128 134 173 -62 90 -32 -59 54 -164 -203 25 -85 100 89 131 54 6 -95 182 -71 -172 -201 -72 10
4117 10 14 69 34 -167 -309 67 -104 -56 -171 11 -61 186 55 -305 11 56 -166 -124 236 -23 20 12 -42 167
4141 167 -1 125 17 -3 250 1 170 145 128 125 67 18 19 386 128 176 65 -150 38 196 -171 34 -38 -205
4165 -205 -231 -224 -133 60 -428 -48 -15 -57 20 24 -13 -11 -110 -174 113 -207 164 82 -95 -136 8 -88 192 -54 -80 -197
4191 -197 -88 -29 -98 -322 -173 -235 -335 -231 -103 -111 -93 0 9 -127 -64 -60 -55 164 -87 -78 174 -26 -10 158 -29 -38
4217 -38 111 -81 -119 -39 45 102 4 176 43 -26 159 219 17 118 79 319 -59 29 66 -59 137 41 49 -166 154
4242 154 107 -69 27 150 -113 102 38 -147 -102 208 -34 -23 -6 -158 -215 -189 4 -83 86 -54 -50 26 -197 -144
4266a44j1M17l22o4j41L61o6J9O5l40J46l4K40j25K4L2l43J96L9N3r7j39RK24
4290alj09J59L6j40P6j91J28J81l52K36M9jJ92j19k38K96j20j4O2j23R0q6j18
4314a10K84l79M3L86k82jm5k05M75j86Q0k9J4r3r8o7R9J59q8L5k45J33J33k02
4338a89pJ52J2K6R7l03L0J61N3J69l25R5p8P5K42n9l01J62K64l47L6O1p7J27n0
4363B6j71K78J07l01J75l84K15Q2J08j01L9k15L18j02l15L53N0m13L83M3k67O9
4385b3j1J84M3l65K08K55n60J41K48m33M90o8m8j68p7J80K09n23M79r9o2K78k85
4408gl75N45o41P13k05l00N68k66j59M15k07j79K24m95N21k77M2K05k05q7N98
4429D28n34K27J62l69L79j69m65N07l64R8M72n86M07J47n61K14Q6k94M28l81P4
$$ plain form
4266 -144 -155 262 -60 -124 -265 96 30 49 114 -226 -80 -114 126 1 25 57 -286 -90 -51 2 -95 -234 -225 -1
4290 -1 -4 -113 46 82 -58 18 -173 -45 136 -216 20 69 68 260 141 -97 199 79 65 127 4 94 8 -110
4314 -110 174 -205 -162 224 -58 -59 -104 -309 166 -20 60 31 45 -48 -146 -213 -114 45 -43 -8 -253 -120 13 -189
4338 -189 -196 -44 -32 -6 91 -212 -182 -21 32 201 -124 -29 -107 -32 210 151 -150 12 276 -71 -35 26 -51 76 26
4363 26 -145 133 240 -61 114 -270 -55 27 135 34 73 -142 176 74 -241 112 162 -251 132 175 -92 -23
4385 -23 -34 150 193 -172 36 291 -269 -128 120 -313 177 109 61 -107 -184 -4 205 -318 161 62 0 278 -7
4408 -7 -382 163 -478 235 30 -270 298 32 -127 288 81 -98 126 -369 152 -125 -83 122 -83 -170 428
4429 428 -106 121 283 -86 293 124 -341 166 -198 -100 372 -214 193 340 -221 -7 79 -215 213 -168 -94
4450i4M01o65K47K30k52K87l36n5N60l99q5L20k85J97K35n32N38l69r7L14l31
4471a71J80J35m13O2J38J63J9r1M8m3NO1J2j36N4N5j02J06j04j09J16R6N4j05
4495C0k4J19j40R6K7k26k6K50J05j09j88N5J17L7L3k43l6P5J21J29l73K10J94
4518B33p0j29j16o7j09L89j55J05J40l11J40j43o8K47j32j09L42l01J3J70k38
4539a69K70j8j2q7Q0k8J36l03J19J08j60O7K75k71K43l42Q8L45k93N5P6r7M4j43
4563a7j00K33l27J60K88l56J98m0J46r5k7K83l24r4o7J34j49J35P6J2k92J66K00
4586A43j9j24J99j1j22k6k04J19O6l5K9n4O0M1j14RoJ38k51L57k60J39j93J45
4610B6lk6j20J27p8r6K98j86P0P1k39L76l56J67j28P1L5K1K7j54L00l06J64o7
$$ plain form
4450 -94 307 -358 -111 119 -133 154 -182 -237 323 -76 -161 159 -126 71 306 -226 312 -57 -154 160 -171
4471 -171 9 144 -269 -207 -69 94 113 22 70 27 32 93 105 -31 23 78 -24 82 -22 -131 -15 81 135 30
4495 30 6 125 -15 81 108 -118 -144 106 211 102 -86 -31 86 123 156 -87 -123 -48 73 202 -171 39 233
4518 233 163 34 -82 -149 -258 131 -24 81 221 -90 50 -93 -161 86 -46 -155 187 -114 -101 69 -169
4539 -169 101 83 71 -16 64 36 172 -131 -12 96 -64 3 278 7 250 -92 -4 341 48 103 179 82 126 -17
4563 -17 -117 116 -211 -51 237 -119 79 39 185 90 63 346 22 -72 -139 -5 -154 -19 57 69 -223 -57 143
4586 143 124 0 199 188 66 40 -164 -45 21 -14 15 -39 21 62 -52 -43 -49 89 -162 195 -65 74 -119 26
4610 26 23 -3 -123 4 -74 -170 128 -58 12 83 -156 220 -136 31 -97 -26 9 30 57 -97 203 -103 61 -6
4634fJ48l6j73j31L56J38j40k6pk9J12j14j41P6rQ5l28M05j44q7j21R0Q2QO6N
4660G9o5K28m26J74Q7P8j3k73k8J01o3K32j18p1K12n4j17l4oj13J94L4j97Q0K55
4685A76k39j44K27j90K20k1R2k10j00L14l2l7l09J33O8R4k04L15j31r2K4K3j7
4708d0K2k08J94j41J69P2K02n76L43j3j97L88q4j97L37l18K50m8j05R9J4j50k
4731A1q8q4M14l15P4J54j10J34j86J95j47k25K29j70L54j75N6N3n7k51L9J65k9
4754D1k58J53L46j07j01j22L3K13j84j23n1O3L10m48K28k9K7j57j15M07k89J03
4776f0J08j46J08o5L7J2J79k97J32K0J05k44NJ75o1j0o1K1J49k63J40RNL3J83
4801B14Oj39mk29J98L3j21N9j78J65L1n3L70k32K2K57l77j93o0L03J42j55k64
$$ plain form
4634 -6 142 106 -67 -198 158 296 156 130 123 94 206 92 -49 27 18 103 -225 180 36 -51 -172 -82 0 8 74 79
4660 79 14 242 -184 -10 77 155 142 -131 -159 -58 -121 111 -7 -78 134 80 -37 -71 -77 -190 4 38 -159 -79 176
4685 176 -63 -207 20 -170 50 29 121 -89 -189 125 93 56 -253 -120 -52 42 -162 153 22 -70 -46 -23 -40
4708 -40 -18 -226 -32 -173 -4 68 270 -306 37 24 -173 215 131 -66 271 -47 203 155 50 149 163 13 11
4731 11 -77 -161 253 -62 12 166 56 190 4 199 52 -173 56 -114 240 65 121 174 117 -134 -95 70 41
4754 41 -217 -64 282 175 74 -48 -15 198 14 -109 -160 -97 213 -235 -7 -36 -9 -166 -281 126 -163 -60
4776 -60 48 -98 10 -55 -18 -6 173 -124 8 28 133 -111 -106 69 8 -2 -63 -42 107 -156 -16 -7 -2 31 214
4801 214 220 81 77 -152 46 79 -42 17 -161 4 35 -18 352 120 142 399 22 -171 -231 72 214 59 -205
4824b05N3Jk9M53m66J53K52m33J95K17m14M14q2k32K49l96K76K12m85K05K45n10
4846c27M53k94o7K55j08j94M69m09L97j93J47l55K20o6M48n95K00J04l26M74j82
4867E1n3R6n5r5J74k08J96P1n04N52k01j85L63j73j09K37k6j30K13J9J10m16K00
4890A27l5r4j53L25Nl27J47o9J91J9l28K51k60L58k23K03r6j37J32j46l7M0j20
4913b27L14j63jR9j44j53K77j8j80K05k22M33o4m10L31K8j29R1J37k32k16K34
4935a0N2j56Q6K2m1J28J79m05K05J35k15M6j31J8K59r7k62L42j05l8K92l32N1
4958B3J61j35O6r7j66L27j05K26q1k53K60Ll42L79l13J07J26k10J79j50j84M33
4980B54l53J20O9mQ7k33J0K9L0l32L06K2k70L43m0j84M80n40K12j79J17K17k32
$$ plain form
4824 -205 -152 -151 -180 273 -193 -40 212 -221 -26 191 -223 191 109 -123 126 -270 6 218 -267 -62 183 -327
4846 -327 126 -168 -235 20 -88 -282 187 -222 175 -18 129 -226 -6 -72 376 -219 -19 85 -241 233 51
4867 51 -2 94 39 -56 118 -90 106 177 -327 225 24 -161 202 29 -80 157 131 1 214 233 343 -73 127
4890 127 92 -2 -155 170 175 -152 -5 -74 117 136 -192 59 -201 157 -66 137 41 -96 36 -110 -147 -107 -227
4913 -227 87 -76 -77 22 -122 -275 2 -16 -196 9 -213 220 156 -254 77 105 -24 67 204 -28 -244 -10
4935 -10 42 -114 -28 -6 -47 81 260 -145 60 195 -20 26 -105 -87 172 75 -187 155 50 12 304 -28 23
4958 23 184 49 115 18 -148 179 74 300 219 -34 226 229 -113 266 -47 60 186 -24 155 5 -179 254
4980 254 -99 21 90 86 173 -60 -50 -21 9 -323 -17 5 -265 78 38 -146 334 -206 6 -173 -56 161 -71
5003g1j40K68j5j49J59j39P5K43j09Nq7n9k8r8K70p7k23J95k26R4K46l46JL16
5027A05J37k2O5k15k8lj90K52j0n2P2j15J8m2J02j99QJ20J27j48P2l42M24k46
5051a10K19k99j4J14O1J02q8j54J23O9Om0J89j55J41r9m66M71l6L6k08J29q3K26
5075A34l9L8k76K15k12J61M0m4j37j52J33K84k79Q2L9lj47K68Q3j85J10j87j8
5098i2J60j60J70n0M9j96J86k51Q3M32j86j47J50k86J46J91l88M06m9m8j51J25
5120I4j19on8M5J73l0j00k7J31j13M9j30o3M8K75o6k19K94L1l33J72q8QR0o3J6
5146A1q8j8J59j4j89K85k29O9o7l6R7j5J69M4k7l34J31p5J39o0M2m1j90K25N0
5171C8PP1m6p6Q7J04k38K5Q4pjn7R2k61J14k10M95j15j07j55M9M7P3J44p6j03
$$ plain form
5003 -71 -211 57 42 -107 52 -87 -12 231 122 127 40 -19 -47 -145 125 48 -175 20 -206 -112 134 -212 -211 105
5027 105 242 220 285 70 42 39 -151 101 91 39 111 -4 14 -28 74 -125 -117 3 130 -18 54 -288 136 -110
5051 -110 109 -190 -204 -90 -29 73 -15 -169 -46 23 29 -11 178 23 164 65 -401 70 34 70 -138 -9 -92 134
5075 134 95 133 -143 72 -140 21 61 17 -120 -272 -139 145 -134 -52 -13 -16 -163 105 188 3 113 -74 -92
5098 -92 68 -92 78 28 77 -119 67 -184 -101 331 145 -2 148 -138 8 199 -189 217 168 120 -31 94
5120 94 -25 -31 -89 -44 129 99 -1 -28 103 -10 39 -91 -154 -106 169 103 -116 178 209 -124 48 -40 -32 58 -5 11
5146 11 -77 -95 64 50 -139 146 -83 -14 -81 -117 -20 -35 134 178 151 -183 -52 -127 12 -48 -6 -47 -237 -12 38
5171 38 45 116 70 -6 81 185 -53 -28 56 49 48 -9 83 -178 -64 -274 221 106 -1 -156 -107 -60 13 157 81 -22
5197b2K22j03m2N4j10J65j49P5q5J2k57K80j06%J13Kp6p2J67J33k65K40j64j39
5221a27K01o4M7n7J02r1n3J6N1O1Oj9m7l5K12j44j3j41K02J06o4r0NJ20j45J77
5247B16j76n1J52j67R9k1J23J43m26M43k23j04J6J00j61Q5r9J39L56n35J00%K27
5270B36K8l03j42M01j97l3K32k04j24M5j29M76k73j04M1P1LR0L4j20J61l13Q1
5293d3j97J36J62j04LO8j67K3n7J89P0J7k85J57J28j98n7r9M12j33M2nn7p2k0
5318h7J19j7K40l05n8J37k9j0O8L06n76L24O5l17L19j51J9N7k37J06m2N3K50m63
5342b29L00O2l76M94N6m73K54K3N7k6k61M2L93l23J24Pl94K27r0M9L10n51K35
5365i0K82k52l3L26j79J42j68j13Q5r2M5J64k06O3k24O7L13j64n4L34l08J77Q4
$$ plain form
5197 -22 200 97 55 109 -1 164 15 90 5 17 -240 40 -66 -66 47 49 -27 -99 68 201 -64 176 12 -127
5221 -127 74 10 57 0 102 11 -42 -26 25 86 92 73 26 -9 203 59 46 -95 107 213 149 59 64 184 39 216
5247 216 40 -11 141 -26 73 52 175 318 -108 335 112 8 24 124 -37 48 -51 88 444 -91 9 9 236
5270 236 264 -39 -181 220 23 -10 222 18 -106 -61 -190 286 13 -91 -50 21 24 114 148 28 189 -124 -43
5293 -43 -240 -104 58 -46 -43 25 -142 -119 -176 13 83 100 -185 -28 100 -98 -155 -254 158 25 67 62 5 -67 -87
5318 -87 32 15 255 -50 -108 29 0 -10 58 364 -212 112 177 -140 179 28 47 104 -133 -27 -69 -16 234 -229
5342 -229 71 133 -243 251 307 -166 88 111 168 142 -119 -77 316 -7 117 124 -270 -43 -133 -84 226 -325 -90
5365 -90 192 -60 -93 233 54 196 28 -85 0 -92 -47 117 -89 -26 -250 -183 130 -34 -88 246 -62 115 199
5388A99m26N67l52k69M44k12J25N4r3j26J08k82J87or1M27j96o4n2n1J51J00K1
5411A63J9k19J08J08l73Q1J96k61J29J97j47R9j88K3J7j86L88k72J12n8J76M1
5433A53j82K8R8Q9l82K65k27K66J8j20J79j21j88J39J1j71K00j47L0J25j78L52
5455B37r8k66J69k18J56j65L06r0nR0R3k71J69r6N0j12N6p5Q3j68M86k87m3j01
5479a00J69m1L0j62L1L54n22M9o7J02K37J13j87R7j21J57j25K1l1L45m94J48P0
5502G3k5j67P6l1N3J2j37L25k37K78p1k26K07l6l13L68k36L06m2m45J54K48j42
5525hl9L5j10J68J14OJ11j92j07j0o6j3K40j73J97k42j4J92p4j36L09k79j6j29
5549b36J85J76l72K31j15J30p2K37n62L29nK4J41j83K46k39p5N47l79Rj2J44m8
$$ plain form
5388 199 -227 340 -12 -281 163 -49 76 130 37 -89 19 -263 -76 -82 -173 254 58 -6 -58 -109 42 142 163
5411 163 182 -37 71 179 -194 -113 83 -178 -49 148 1 100 -88 -65 -48 -234 154 -118 -6 -64 112 153
5433 153 -29 -1 97 186 -196 69 -158 108 126 6 185 64 -124 15 26 -145 55 -92 -62 63 -115 237
5455 237 139 -127 42 -176 -20 -185 121 31 26 116 209 -62 107 11 61 -51 5 -70 13 -155 331 44 1 -100
5479 -100 69 28 58 -104 -73 281 -241 -192 -259 -157 80 193 6 103 -18 139 14 35 4 349 -145 3 73
5502 73 48 -119 -43 -74 -21 -9 -146 179 -58 220 149 -77 130 94 -219 149 -87 219 177 -268 -114 134 -8
5525 -8 -47 -12 -122 46 160 166 277 85 -22 -32 -98 -111 129 -44 153 -89 -103 89 15 -121 188 -91 -107 -236
5549 -236 -51 125 -247 -16 -131 -1 -73 164 -398 -69 -74 -50 91 -92 154 -85 -160 387 8 17 5 149 101
5572A01o2k51J14P5J82k5k37J52n8Q7J0r5L3K2l0j07J24j23P0o8J51k6J98k22
5596A5o2K66r4l18K05%R8j12m1K17m05J63K23m28K88rJ16m0k73J54j36J53Q4j09
5620d5J48n1J02j47J72k3j79r2J11L7m1J55j07m5j26J87J13R2j61J2k3k2J00l21
5644a54N8P2K3r2j66L33k00R1P3j1p0kK24k35O9M0k91J30J05o8J42k8O5k40K36
$$ plain form
5572 101 39 -212 -98 -23 159 134 -103 49 -9 78 88 -7 26 48 18 -89 35 -88 -18 -86 65 39 237 15
5596 15 -47 219 125 -193 12 12 110 -2 -43 174 -231 -68 155 -273 15 6 122 82 -191 -37 -173 -20 64 -45
5620 -45 103 52 154 7 179 156 -23 -115 -4 33 -8 147 40 -5 -131 56 169 261 100 112 89 67 167 -154
5644 -154 -96 -24 -1 -93 -259 74 -126 -35 38 27 -43 -45 179 -56 13 53 -238 -108 -3 -71 71 43 108 -132 104
$$ [...]
8191c6
##END NTUPLES=NMR FID
##END=
