##TITLE=1H_LR-733-CR4A-C2
 CDCl3
 8 sc, 
 29.11.2023
##JCAMPDX= 6.0         $$ Bruker NMR JCAMP-DX V2.0
##DATA TYPE= NMR FID
##DATA CLASS= NTUPLES
##ORIGIN= UXNMR, Bruker Analytische Messtechnik GmbH
##OWNER= root
$$ XWIN-NMR		Version 3.5
$$ Wed Nov 29 14:35:22 2023 Russian Standard Time (UT+4h)  she@DPX200
##.OBSERVE FREQUENCY= 200.1313
##.OBSERVE NUCLEUS= ^1H
##.DELAY= (6, 6)
##.ACQUISITION MODE= SIMULTANEOUS
##.ACQUISITION SCHEME= undefined
##.AVERAGES= 8
##.DIGITISER RES= 18
##SPECTROMETER/DATA SYSTEM= spect
##.PULSE SEQUENCE= zg30
##.SOLVENT NAME= D2O
##.SHIFT REFERENCE= (INTERNAL, D2O, 0, 15.7039)
##AUDIT TRAIL= $$ (NUMBER, WHEN, WHO, WHERE, WHAT)
$$ ##TITLE= Audit trail, XWIN-NMR		Version 3.5
$$ ##JCAMPDX= 5.01
$$ ##ORIGIN= Bruker BioSpin GmbH
$$ ##OWNER= she
$$ F:/spectra/data/she/nmr/H-F/1/audita.txt
$$ ##AUDIT TRAIL=  $$ (NUMBER, WHEN, WHO, WHERE, WHAT)
(   1,<2023-11-29 14:33:48.25 +0400>,<she>,<DPX200>,
      <created by zg, POWCHK disabled, PULCHK disabled
       configuration hash MD5:
       00 E9 B6 7A A2 85 ED C7 34 08 36 98 17 FE 4E 26
       data hash MD5: 16K
       B8 F8 05 7A C6 C6 B5 17 F6 57 98 0B 07 A5 F2 CC>)
$$ ##END=
$$ 
$$ hash MD5
$$ D0 20 7A E0 43 FF 80 D6 71 34 DA B8 89 77 E1 DF
##$RELAX= 
##$RELAX= 
##$RELAX= 
##$RELAX= 
##$RELAX= 
##$RELAX= 
$$ Bruker specific parameters
$$ --------------------------
##$DU= <F:/spectra>
##$EXPNO= 1
##$NAME= <H-F>
##$PROCNO= 1
##$TYPE= <nmr>
##$USER= <she>
##$AMP= (0..31)
100 100 100 100 100 100 100 100 100 100 100 100 100 100 100 100 100 100 
100 100 100 100 100 100 100 100 100 100 100 100 100 100 
##$AQSEQ= 0
##$AQ_mod= 1
##$AUNM= <au_zg>
##$AUTOPOS= <>
##$BF1= 200.13
##$BF2= 200.13
##$BF3= 200.13
##$BF4= 200.13
##$BF5= 200.13
##$BF6= 200.13
##$BF7= 200.13
##$BF8= 200.13
##$BYTORDA= 1
##$CFDGTYP= 0
##$CFRGTYP= 5
##$CHEMSTR= <none>
##$CNST= (0..31)
1 1 145 1 1 1 1 1 1 1 1 1 1 1 1 1 1 1 1 1 1 1 1 1 1 1 1 1 1 1 1 1 
##$CPDPRG= <>
##$CPDPRG1= <>
##$CPDPRG2= <>
##$CPDPRG3= <>
##$CPDPRG4= <mlev>
##$CPDPRG5= <mlev>
##$CPDPRG6= <mlev>
##$CPDPRG7= <mlev>
##$CPDPRG8= <mlev>
##$CPDPRGB= <>
##$CPDPRGT= <>
##$D= (0..31)
0 1.2 0 0 0 0 0 0 0 0.06 0 0.03 0 0 0 0 0.0002 0 0 0 0 0 0 0 0 0 0 0 0 
0 0 0 
##$DATE= 1701254027
##$DBL= (0..7)
120 120 120 120 120 120 120 120 
##$DBP= (0..7)
150 150 150 150 150 150 150 150 
##$DBP07= 0
##$DBPNAM0= <>
##$DBPNAM1= <>
##$DBPNAM2= <>
##$DBPNAM3= <>
##$DBPNAM4= <>
##$DBPNAM5= <>
##$DBPNAM6= <>
##$DBPNAM7= <>
##$DBPOAL= (0..7)
0.5 0.5 0.5 0.5 0.5 0.5 0.5 0.5 
##$DBPOFFS= (0..7)
0 0 0 0 0 0 0 0 
##$DE= 6
##$DECBNUC= <off>
##$DECIM= 32
##$DECNUC= <off>
##$DECSTAT= 4
##$DIGMOD= 1
##$DIGTYP= 9
##$DL= (0..7)
0 120 120 120 120 120 120 120 
##$DP= (0..7)
150 150 150 150 150 150 150 150 
##$DP07= 0
##$DPNAME0= <>
##$DPNAME1= <>
##$DPNAME2= <>
##$DPNAME3= <>
##$DPNAME4= <>
##$DPNAME5= <>
##$DPNAME6= <>
##$DPNAME7= <>
##$DPOAL= (0..7)
0.5 0.5 0.5 0.5 0.5 0.5 0.5 0.5 
##$DPOFFS= (0..7)
0 0 0 0 0 0 0 0 
##$DQDMODE= 0
##$DR= 18
##$DS= 0
##$DSLIST= <SSSSSSSSSSSSSSS>
$$ [...]
##$SUBNAM2= <"">
##$SUBNAM3= <"">
##$SUBNAM4= <"">
##$SUBNAM5= <"">
##$SUBNAM6= <"">
##$SUBNAM7= <"">
##$SUBNAM8= <"">
##$SUBNAM9= <"">
##$SW= 18.0517328524113
##$SWIBOX= (0..15)
0 0 2 0 0 0 0 0 0 0 0 0 0 0 0 0 
##$SW_h= 3612.71676300578
##$TD= 16384
##$TD0= 1
##$TE= 0
##$TE2= 300
##$TE3= 300
##$TEG= 300
##$TL= (0..7)
0 120 120 120 120 120 120 120 
##$TP= (0..7)
150 150 150 150 150 150 150 150 
##$TP07= 0
##$TPNAME0= <>
##$TPNAME1= <>
##$TPNAME2= <>
##$TPNAME3= <>
##$TPNAME4= <>
##$TPNAME5= <>
##$TPNAME6= <>
##$TPNAME7= <>
##$TPOAL= (0..7)
0.5 0.5 0.5 0.5 0.5 0.5 0.5 0.5 
##$TPOFFS= (0..7)
0 0 0 0 0 0 0 0 
##$TUNHIN= 0
##$TUNHOUT= 0
##$TUNXOUT= 0
##$USERA1= <user>
##$USERA2= <user>
##$USERA3= <user>
##$USERA4= <user>
##$USERA5= <user>
##$V9= 5
##$VALIST= <valist>
##$VCLIST= <CCCCCCCCCCCCCCC>
##$VD= 0
##$VDLIST= <DDDDDDDDDDDDDDD>
##$VPLIST= <PPPPPPPPPPPPPPP>
##$VTLIST= <TTTTTTTTTTTTTTT>
##$WBST= 1024
##$WBSW= 4
##$XGAIN= (0..3)
0 0 0 0 
##$XL= 0
##$YL= 0
##$YMAX_a= 228248
##$YMIN_a= -271977
##$ZGOPTNS= <>
##$ZL1= 120
##$ZL2= 120
##$ZL3= 120
##$ZL4= 120
##$ABSF1= 10
##$ABSF2= 0
##$ABSG= 5
##$ABSL= 3
##$ALPHA= 0
##$AQORDER= 0
##$ASSFAC= 0
##$ASSFACI= 0
##$ASSFACX= 0
##$ASSWID= 0
##$AUNMP= <proc_1d>
##$AZFE= 0.1
##$AZFW= 0.1
##$BCFW= 1
##$BC_mod= 2
##$BYTORDP= 1
##$COROFFS= 0
##$CY= 11.3945322036743
##$DATMOD= 1
##$DC= 2
##$DFILT= <>
##$DTYPP= 0
##$F1P= 15.7292609196834
##$F2P= 12.9074282941183
##$FCOR= 0.5
##$FTSIZE= 0
##$FT_mod= 4
##$GAMMA= 1
##$GB= 0.15
##$INTBC= 1
##$INTSCL= 1
##$ISEN= 128
##$LB= 0.24
##$LEV0= 0
##$LPBIN= 0
##$MAXI= 10000
##$MC2= 0
##$MEAN= 0
##$ME_mod= 0
##$MI= 1.114404
##$NCOEF= 0
##$NC_proc= 0
##$NLEV= 6
##$NOISF1= 3.799351
##$NOISF2= 2.8
##$NSP= 1
##$NTH_PI= 0
##$NZP= 0
##$OFFSET= 15.70392
##$PC= 1
##$PHC0= -24596.4
##$PHC1= 21.6527
##$PH_mod= 1
##$PKNL= yes
##$PPARMOD= 0
##$PSCAL= 0
##$PSIGN= 0
##$REVERSE= no
##$SF= 200.130013532006
##$SI= 16384
##$SIGF1= 3
##$SIGF2= 2
##$SINO= 400
##$SIOLD= 16384
##$SREGLST= <1H.CDCl3>
##$SSB= 0
##$STSI= 0
##$STSR= 0
##$SW_p= 3612.71676300578
##$SYMM= 0
##$S_DEV= 0
##$TDeff= 0
##$TDoff= 0
##$TI= <>
##$TILT= no
##$TM1= 0
##$TM2= 0
##$TOPLEV= 0
##$USERP1= <user>
##$USERP2= <user>
##$USERP3= <user>
##$USERP4= <user>
##$USERP5= <user>
##$WDW= 1
##$XDIM= 8192
##$YMAX_p= 0
##$YMIN_p= 0
$$ End of Bruker specific parameters
$$ ---------------------------------
##NTUPLES= NMR FID
##VAR_NAME=  TIME,          FID/REAL,        FID/IMAG
##SYMBOL=    X,             R,               I
##VAR_TYPE=  INDEPENDENT,   DEPENDENT,       DEPENDENT
##VAR_FORM=  AFFN,          ASDF,            ASDF
##VAR_DIM=   8192,          8192,            8192
##UNITS=     SECONDS,       ARBITRARY UNITS, ARBITRARY UNITS
##FACTOR=    0.0002768,     1,               1
##FIRST=     0,             0,               0
##LAST=      2.2672688,     0,               0
##MIN=       0,             -271977,         0
##MAX=       2.2672688,     228248,          0
$$ Real data points
##PAGE= N=1
##DATA TABLE= (X++(R..R)), XYDATA
0 0 0 0 0 0 0 0 0 0 0 0 0 0 0 0 0 -5 8 -8 8 -8 8 -11 16 -16 16 -23 24 -28 32 -37 43 -47 53 -61 68 -76 85 -96
38 -96 104 -120 130 -144 159 -177 195 -215 236 -261 288 -315 348 -384 425 -469 519 -579 644 -722
58 -722 815 -929 1067 -1244 1475 -1792 2253 -2970 4222 -6822 14252 -75679 -271977 40775
72 40775 169746 22713 100758 228248 116295 5331 72594 105660 -8623 17542 102182
83 102182 -62742 -138108 16436 -61842 -188552 -27690 37697 -120399 -135736 12400 58713
94 58713 -31041 -6072 104478 32530 -9326 134724 98509 -37104 34397 63188 -40295
105 -40295 -30013 35427 1871 -65295 -41196 3115 -85692 -111540 39549 36607 -66047 16952
117 16952 62314 -18619 5904 62477 35480 7508 24230 49653 8089 -29492 21271 -2273
129 -2273 -63850 5965 14373 -76353 -46465 9208 -15954 -24188 -2387 25674 20068 -7473 25116
142 25116 26939 -15261 36841 60082 -6426 3323 24341 -16886 -16089 -1436 -11318 -23230 -36578
155 -36578 -12020 -761 -31788 -2357 15760 -27570 -4443 21406 -8805 14155 36988 14693
167 14693 14596 8297 4840 16155 590 4621 8032 -25833 -10351 7595 -22120 -6624 4430
180 4430 -22192 -8931 -5240 -16080 6317 6032 2079 16363 -840 3105 17127 -5590 5494
193 5494 16262 -11340 2483 12365 -8245 3624 918 -15088 -2392 -9047 -8834 6129 -8575
206 -8575 297 13672 -12276 -1787 13843 -8736 2678 11050 -5362 5271 5356 -3270 7783
219 7783 -3049 -3905 6854 -13781 -6363 10852 -11383 -2757 11384 -7326 239 4186 -7216
232 -7216 4834 907 -3151 11616 -1845 -1529 13624 -7261 -5660 9865 -9018 -5028 5019
245 5019 -7790 1562 1634 -7771 5119 -3197 -7940 9291 -4277 -5018 12742 -2535 -853 11367
259 11367 -3864 1642 5910 -7181 3838 2239 -7860 7297 -902 -8141 5979 -4795 -6731
272 -6731 5674 -6628 -2239 6873 -6579 2769 6199 -7298 4710 3504 -7415 6578 1777
285 1777 -4566 6834 -2768 -1855 6713 -7387 -677 6816 -8595 1011 5546 -7352 3671 3472
299 3472 -5943 4853 -93 -3406 5818 -4670 -1095 7661 -8140 -597 7528 -8747 -482 4863
313 4863 -6699 1953 1555 -4487 4904 -1964 -2372 7393 -3824 -249 8785 -6545 291 8764 -6191
328 -6191 440 4990 -5280 1688 -318 -4194 4324 -4424 -4133 5962 -6867 -3088 7304 -6604
342 -6604 -357 8071 -5208 345 4805 -2465 3065 220 -561 7682 -3052 -1889 8606 -6223
356 -6223 -2957 7884 -6540 -3340 5358 -5131 -1362 1497 -3205 1642 -3776 -2863 6810 -6090
370 -6090 -3083 10516 -3590 -1929 9687 -3567 -2801 4973 -1516 1008 195 -330 6020 -4355 -4018
385 -4018 7920 -6546 -5896 8987 -4176 -5930 6336 -674 -2407 1654 -670 1749 -4138 -2629
399 -2629 8733 -3580 -4987 10780 -2181 -6734 7517 -2124 -6171 3803 1406 236 -1712 -187
413 -187 7527 -2705 -5034 9324 -3056 -7866 9038 83 -6667 5772 1649 -3190 -1050 -2260
427 -2260 351 -4404 -4499 8282 -2190 -7219 9004 -111 -7753 6883 1554 -4941 3772 3027 2093
442 2093 421 -193 7162 -641 -7144 5790 -1931 -8562 7385 1200 -7810 3382 715 -5504 -1523
457 -1523 -1455 1247 -2248 -4380 7642 1699 -6203 7988 2595 -7211 5188 1858 -5812 4651 5413
472 5413 830 -485 -2093 3607 -3161 -7967 6536 850 -9664 5760 3225 -9096 1964 3342
486 3342 -4559 -1147 751 2174 -1065 -2399 8716 2267 -7331 8639 4692 -10421 3401 5446
500 5446 -8056 -1397 6066 2496 -2831 -4432 2181 -3999 -11262 5225 4987 -7021 8417 8274 -10882
515 -10882 -2425 6912 -1087 -1060 4834 7673 -1528 -8377 6134 3389 -11389 3009 6859 -10904
529 -10904 -3107 4376 -7037 -4427 5594 5715 -1408 -5048 5394 2844 -9794 5659 12082 -5388
543 -5388 2576 11492 -5858 -8642 611 -267 -4266 -3486 5537 2466 -11564 -579 6345 -10360 -1954
558 -1954 12676 -906 -2867 7248 2578 -1975 1321 8102 3697 -9554 -404 6860 -11376 -6351
572 -6351 9452 -4091 -7632 3857 -1344 -7755 -2827 4463 3899 -2884 5571 12592 -3696 -1910
586 -1910 11378 -3307 -7551 8085 3588 -5329 -1583 438 -3348 -10057 -2736 5142 -7712 -6353
600 -6353 8784 -1286 -6489 8328 5223 -1287 4900 5199 729 -1755 2132 7568 -2946 -4406
614 -4406 7797 -3393 -12395 484 -1351 -9069 -1815 2007 276 -1827 -280 5468 -374 -3149
628 -3149 9613 3540 -4057 9650 7184 -4930 1174 3319 -3624 -5868 -2765 1666 -4209 -8144
642 -8144 3048 -1084 -10323 2791 4335 -5295 2549 5890 -402 1677 5318 6378 1942 -833 6140
657 6140 745 -8817 2312 3291 -8919 -1836 2705 -5391 -4046 -1691 -1978 -2076 -3041 3471 3742 -2002
673 -2002 6195 5796 -4948 2844 6953 -3026 -126 4489 -386 -1907 -2701 -108 -509 -6481 -1190 895
689 895 -6869 -525 3865 -3647 1380 5545 -1145 98 2701 2061 1890 -1221 2613 4353 -3686 -291
705 -291 3034 -5975 -3420 1548 -4225 -1753 1167 -1442 -125 -855 525 2506 -1967 1706 6127 -1971
721 -1971 656 6074 -993 -349 2677 -2159 -1589 -923 -2148 -553 -3471 -1871 1612 -4067 -1245 3744
737 3744 -3437 -1067 4996 -596 515 4111 1858 2527 1000 -136 2013 -2272 -1087 3139 -3432
752 -3432 -2374 2414 -3883 -3629 1532 -2646 -1850 145 -502 1567 -263 119 4740 -252 -318 4548 -1207
769 -1207 -1143 4156 -672 -1769 1419 -1030 -930 -1436 -2199 685 -2285 -2394 3187 -1475 -2152 4130 -429
786 -429 -904 3596 -21 24 2047 -1 1191 -179 -1477 2285 -1707 -3164 2282 -2056 -3310 2099
802 2099 -936 -1513 1803 -576 486 1339 -443 2610 677 -1057 3645 -13 -2440 3115 -636 -2610
818 -2610 1219 -1314 -1538 206 -2118 -137 -297 -1930 1298 -483 -2072 3447 458 -1485 3561 739
834 739 -1085 2609 308 -34 881 -1698 743 -219 -3100 920 -825 -3112 1607 -1152 -2962 1873
850 1873 -341 -1674 1790 -139 487 991 -606 2858 1332 -2546 2507 1218 -2330 1306 -581 -2361
866 -2361 1642 -647 -1417 503 -1505 -81 174 -1810 2024 917 -2207 2799 1697 -1880 1433 551
882 551 -810 1328 -1077 -587 1249 -1538 208 303 -2542 1102 443 -2811 1315 820 -1918 1876 1148
899 1148 -376 1293 -932 781 1912 -1462 652 1392 -2059 583 584 -2626 776 -397 -2441 348
915 348 -686 -1070 1451 -762 681 2055 -2009 423 2167 -1255 1196 1123 -763 1843 -45 -1585
931 -1585 830 -1335 -1070 681 -2152 -546 1430 -1971 15 1448 -2190 376 472 -981 1676 274
947 274 -325 2447 16 -417 1474 -1728 -460 1324 -1727 34 1144 -1391 184 -424 -1764 1149
963 1149 -853 -1194 2227 -960 -712 2373 -230 -178 977 -1181 164 216 -1012 1339 91 -1096 1560
980 1560 -1158 -1675 1795 -1047 -1639 1185 -413 26 1440 223 1522 -370 -1896 1243 -381 -1028
996 -1028 3185 156 -2284 1570 -428 -1995 459 -373 -12 -916 -1322 1527 -42 -1419 3177 41
1012 41 -2859 1447 393 -1742 1785 1408 29 -71 -373 945 -923 -2205 2156 -8 -3195 2074
1028 2074 1323 -2632 660 1044 -1534 -702 -81 928 60 -1159 2208 659 -2755 2077 1519 -3057
1044 -3057 751 1818 -1640 -454 1390 1278 -251 -1729 1312 -67 -4006 1652 2629 -2314 520
1059 520 2080 -1974 -1400 960 202 -660 -596 2175 860 -2910 1814 2862 -3225 -397 2839 -1738
1075 -1738 -1292 2207 726 -721 -613 1055 -6 -2993 1085 1989 -3207 -435 3015 -1884 -1258 2850
1091 2850 222 -1706 -714 1001 344 -1392 1706 3112 -2547 -1004 2874 -2240 -2138 2237 101 -1680
1107 -1680 544 781 -71 -1452 727 1829 -2951 -938 3424 -1256 -1768 2990 492 -1787 801 575
1123 575 -222 -1375 -4 1138 -1895 -629 2794 -1107 -1907 2346 -413 -2177 1174 1551 -209 -404
1139 -404 929 1606 -1349 -1374 2622 -817 -2240 2371 630 -1602 1255 -84 -1942 -365 476 403 -641
1156 -641 -352 1466 -1077 -1624 2650 673 -1940 1455 253 -1442 491 1245 584 368 -306 283 -1325
1173 -1325 -1471 1832 -337 -1911 1434 -149 -1552 1085 701 -769 223 -216 319 363 11 1935 294
1190 294 -1218 455 -222 -1658 1905 591 -1314 271 -405 -930 349 179 506 -79 -928 516 -206
1207 -206 -430 1822 595 -1148 1146 -4 -1207 535 296 -562 24 -155 -3 -425 -1017 783 -367
1224 -367 -1526 1138 644 -815 1116 569 -495 559 206 -50 348 -309 807 65 -1419 703 162
1241 162 -1939 279 205 -1344 18 106 -161 319 -194 525 493 -402 646 650 -876 1105 773 -1200 792
1260 792 632 -1029 -69 -547 -422 -238 -891 -117 262 -1138 451 649 -818 646 563 -657 807 649
1278 649 -27 617 -126 -249 286 -731 204 612 -1061 -62 274 -733 390 380 -847 275 9 -372
1296 -372 809 -48 25 849 -427 302 428 -907 49 222 -723 151 -47 -844 127 148 -721 459 -187
1315 -187 -407 690 -326 420 616 -427 583 717 -824 500 310 -633 508 -59 -578 -25 -455 -324
1333 -324 385 -896 139 309 -771 291 483 -554 586 630 -121 627 170 233 474 -363 185 290 -949
1352 -949 -35 208 -853 -43 115 -750 150 125 -285 530 -46 91 601 -259 224 706 -478 172 446 -720
1372 -720 253 240 -847 282 -253 -572 325 -275 -167 498 -601 263 685 -539 46 578 -851 404
1390 404 569 -400 83 85 -114 79 -431 -100 328 -977 -61 302 -995 0 612 -408 161 217 -280 119
1410 119 -89 258 447 -171 226 466 -954 -48 369 -906 -140 655 -555 80 -36 -344 74 -324 87
1429 87 504 -390 -350 714 -580 284 716 -581 -220 511 -211 124 149 -101 382 -689 -481 428 -722
1448 -722 46 451 -513 36 410 -310 210 402 -146 328 -177 -112 304 -273 -104 588 -178 -284 259 -687
1468 -687 -400 254 -374 234 250 -21 263 14 -125 191 -640 -215 326 -516 52 620 -563 -363 296 -139
1488 -139 19 195 -116 442 -267 -26 488 -671 90 350 -535 -80 554 -120 77 548 -21 -8 -187 30
1508 30 72 -665 -187 741 -733 -372 929 -331 -473 461 116 -429 44 259 453 -351 195 1061 -649
1527 -649 -646 789 -125 -598 744 182 -704 144 361 -72 -591 -35 389 -1031 -170 959 -301 -729 1096
1546 1096 462 -742 239 241 -344 -426 151 878 -457 -268 1221 -406 -1030 514 145 -1102 498 595 -242
1565 -242 -448 455 403 -673 -501 1043 32 -1013 878 587 -1102 460 668 -807 -407 315 177 -497
1583 -497 9 732 -404 -934 560 588 -1176 155 641 -664 -216 1109 363 -358 -403 269 -429 -681 680
1602 680 401 -909 311 560 -846 -489 506 98 -544 -333 717 225 -706 735 587 -882 144 548
1620 548 -504 64 743 -98 -465 -221 250 -217 -625 132 199 -801 -149 612 -481 -192 742 -76 -197
1639 -197 428 203 163 -458 230 541 -251 -94 851 -344 -360 139 -179 -49 99 57 64 -193 -192 226 -666 -275
1661 -275 664 -193 -274 586 -149 -270 292 -196 153 -110 236 673 -162 -362 247 -76 -297 336 -61 -181
1681 -181 253 97 102 215 -42 333 -19 -311 435 -242 -55 674 232 -151 -77 -60 -80 -331 -17 108 2 -323
1703 -323 160 40 -138 319 37 -345 134 210 -129 240 -78 97 152 -254 118 193 -340 -21 -62 -438 257
1724 257 -107 -19 9 -78 -202 217 -382 74 334 -165 153 143 -504 4 44 -310 116 1 -255 -110 -6 282
1746 282 232 -136 -163 156 -476 76 307 -162 109 125 -239 96 -120 -157 170 -335 62 338 -126 281 92
1767 92 -318 96 185 -167 -69 23 -58 91 -16 32 204 -290 64 87 -272 245 251 -307 -308 75 -282 -137 -28 -189
1791 -189 136 -103 -86 286 -262 -123 48 -33 28 170 -292 283 79 -229 29 29 -19 217 -205 164 142 -58
1813 -58 1 406 -137 -7 95 -135 -34 64 234 76 -36 -311 239 -200 47 386 -315 18 144 35 88
1834 88 339 -227 24 141 -116 47 -108 268 126 -160 -232 84 -100 -47 208 -174 -416 142 51 -70 -40 40
1856 40 271 -239 -99 142 -32 138 217 -231 -204 25 161 129 -45 -231 -32 91 -189 246 -11 -342 184
1877 184 -115 -131 109 12 28 264 -101 215 -141 23 56 -176 -187 403 33 -81 441 194 -40 11 26 75 191
1900 191 -72 120 -142 -124 104 -344 -92 21 -199 16 224 -99 -82 29 31 -4 2 -50 132 26 -321 208 -195
1923 -195 -288 355 -134 -134 333 -101 145 -308 -160 77 -101 -98 26 123 -318 62 159 -25 44 -285 -78 236 -151
1946 -151 -65 5 -188 541 220 -83 172 9 -55 99 3 -227 4 -30 -113 108 -335 227 190 -51 97 95 -10
1969 -10 234 69 -74 78 -53 29 -68 -63 142 285 10 236 140 -246 230 -41 -237 261 192 -118 426 357 82
1992 82 16 21 119 -64 -35 69 1 235 191 -181 -112 25 -27 -265 123 -133 -206 129 -53 210 329 -292 -4 114
2016 114 91 49 226 -395 -82 151 -339 35 -85 -229 101 51 -91 143 -84 -243 204 -306 -138 -39 -61 151
2038 151 93 295 106 -17 14 21 -389 -67 84 -544 -62 -27 -154 -36 56 -304 -18 -172 41 169 -125 -214
2060 -214 361 -328 -270 0 92 137 125 68 213 -80 -257 336 47 -297 109 -73 40 134 -73 -84 -207 82
2082 82 184 -252 -45 223 -363 4 275 -51 -139 143 -117 -36 -150 -213 -164 53 -106 223 7 -229 193 70
2104 70 -154 -108 111 69 220 243 -132 -83 -11 128 -162 -1 275 -2 -263 151 15 -214 142 260 -86 -15
2126 -15 59 14 -127 4 202 160 -354 212 -97 -484 -63 245 -208 115 35 -42 -20 -216 -154 91 -52 155 379
2149 379 -256 172 116 -6 146 235 199 -106 -67 188 184 -247 85 226 -126 291 64 -411 -106 81 -107 6
2171 6 -208 156 -339 96 275 78 -337 92 189 -260 -226 163 -44 -26 -186 -35 204 -29 58 179 -236 -8
2193 -8 18 -157 -180 170 46 -156 -16 0 66 -262 32 69 -245 -4 74 -323 56 170 62 1 151 13 -75
2216 -75 -222 131 256 -92 133 323 134 67 337 300 98 9 -32 209 -52 63 -149 -1 -214 259 -4 154
2238 154 102 -32 19 114 -181 -14 162 92 50 -33 49 -151 -140 -179 75 78 -114 -76 253 65 98 113 -313 192 -163
2263 -163 171 -121 79 251 88 184 -20 138 -197 237 -186 -236 104 -155 26 14 57 -125 9 47 5 -90
2285 -90 -66 101 131 149 149 15 -231 -21 -232 -57 163 117 233 -44 260 -25 12 -20 202 30 -4 276 -104
2308 -104 49 -34 138 188 239 -132 -112 -40 -7 17 94 -16 -44 -155 199 50 143 143 78 253 -114 253 -147 -126 187
2333 187 -249 -12 -126 -87 45 -265 -264 44 -105 4 -130 121 -85 -79 -94 -43 -78 -199 120 -256 191 20 -99
2356 -99 -55 204 72 -157 131 -106 0 -177 -78 23 13 -247 38 -34 126 6 69 201 87 0 76 72 57 -53
2380 -53 -41 -25 -40 141 -179 276 63 -247 52 -50 -70 17 -55 48 -45 46 -75 -103 -1 290 -25 -61 173 102
2404 102 -67 159 -378 -63 -73 260 -192 63 -64 -88 -4 61 15 -303 -33 174 9 42 109 -55 241 -199
2426 -199 -69 36 -97 255 130 -229 89 49 162 17 44 -71 -183 -110 -130 210 -11 110 8 -60 -226 79
2448 79 47 37 26 -49 59 -36 58 -47 37 -43 -209 -149 -111 106 62 -74 -179 -48 -219 129 -48 -13 101 -161
2472 -161 60 46 -41 45 6 -118 81 121 79 19 -162 44 -96 -53 -222 56 -85 -508 98 -127 -242 178 -233
2495 -233 -34 -80 -264 -22 86 -47 186 213 55 110 -140 -2 128 30 129 119 -26 -110 78 -76 12 -223 17
2518 17 23 11 -118 -99 146 390 95 -207 82 251 -93 152 104 -202 40 220 -108 -205 -158 68 -87 -18 -19 -379
2542 -379 83 13 296 -202 49 -67 36 -6 -251 83 254 107 -204 189 80 -46 208 118 -128 17 -289
2563 -289 137 169 337 56 -163 127 227 -247 -60 -29 -87 -68 -5 -117 -25 354 -241 -53 30 -80 78 276
2585 276 -18 110 55 154 132 -54 175 18 105 -113 -30 266 -271 20 -123 324 -277 66 88 -253 14 106
2607 106 218 191 -307 -25 -28 95 -30 49 -21 -82 106 -38 211 -174 49 7 41 -245 -155 0 316 -238 -32
2630 -32 -32 117 -127 -42 163 141 74 -142 56 -113 203 -31 -166 139 -66 -56 55 -41 -303 -40 -103 1 275
2653 275 52 -159 -43 -43 -88 -212 57 -95 -199 9 198 107 -170 118 -207 -298 184 11 21 -167 27 239
2675 239 105 64 -191 -191 -41 -5 80 125 121 -72 -2 -101 -223 -129 117 303 -279 -14 126 -164 -85 27 186 145
2699 145 -110 -44 14 -51 -54 5 -31 21 30 167 56 24 -141 -36 -15 -157 -118 40 -133 103 -293 -71 175 -82
2723 -82 -201 -75 66 135 69 62 3 -40 25 12 -60 -16 88 184 1 -50 -92 -14 -38 -109 192 219 -23 -283 80 29
2749 29 -78 69 63 203 -152 -164 -162 -54 -17 43 51 -49 -83 99 80 -129 186 -37 -80 -45 94 -116 217 -131 75
2774 75 -26 -78 10 70 -110 -66 118 -26 -20 -144 -40 -99 112 -248 -72 -12 227 127 -223 -103 23 65 -18 145
2798 145 55 293 29 165 29 -77 -157 -14 -48 -161 -89 -126 -13 106 63 -90 -7 102 66 177 153 82 -43
2821 -43 -174 -62 17 -241 123 50 2 -138 1 61 -89 74 -42 -168 -74 -197 -97 87 -63 74 -150 -9
2843 -9 -48 85 -57 60 383 207 -23 -15 -214 209 -56 -83 25 -152 -107 132 -150 82 260 22 63 31 110
2866 110 -108 126 164 357 -21 -113 43 -409 -100 -30 -6 69 81 -170 63 92 -114 589 217 -119 -67 10 -206
2889 -206 200 -67 -48 21 157 -42 -23 -264 -235 200 -259 294 137 -3 -116 46 -13 -151 34 -26 -66 24 8
2912 8 -168 -22 -48 27 339 183 70 117 -113 16 128 52 -39 18 377 -15 36 -320 1 -77 -2 19 74 -7 -119
2937 -119 55 72 -177 234 48 -106 254 143 -78 -74 -42 129 35 221 161 95 -26 116 -126 11 220 41
2959 41 171 176 -65 -135 27 -199 54 130 127 -19 76 43 277 -134 11 93 -118 -185 2 223 154 10 44 -29 -90
2984 -90 53 -67 354 -104 -245 365 223 -189 -34 213 50 76 -218 62 400 -197 -26 -97 35 -51 -246
3005 -246 26 -125 246 132 86 -133 -21 -85 -162 -21 -179 -32 78 52 -33 -104 23 52 266 42 -98 -178 -43
3028 -43 -76 -15 4 8 126 -14 -43 66 129 -101 154 86 -120 372 -172 -26 18 41 -21 58 106 -30 -17 -147 11
3053 11 -51 97 167 -88 13 112 102 177 -85 73 -135 -279 194 31 65 135 27 -16 -161 74 -413 -177 -71
3076 -71 12 -65 -21 119 297 -35 51 125 -159 280 153 31 -47 56 -149 54 -54 122 -59 143 -21 101
3098 101 -226 66 -43 -192 19 39 283 124 -95 -123 168 128 83 -143 107 234 -150 -18 -5 45 40 -239 323
3121 323 -89 305 -17 -16 -17 -139 -161 -89 -72 217 214 -65 -230 -77 131 46 136 -169 -23 84 270 4 228 -186
3145 -186 -109 -196 170 58 177 -42 115 -2 111 120 75 145 -17 -26 297 -5 111 141 -6 10 59 167 123 2
3169 2 -12 -57 46 7 97 144 22 82 44 26 -24 274 30 109 -128 138 -102 23 38 43 95 70 -14 9 -182 9
3195 9 -178 53 -206 7 -12 -27 -27 54 163 -52 84 147 38 -171 116 -153 120 -62 32 91 -289 -179 -188 -124
3219 -124 -198 44 120 -189 39 214 19 12 -95 272 -234 -330 -102 -137 -160 -151 -289 -126 232 112 143 13 -82 -85
3243 -85 -47 -57 -237 18 0 -141 122 68 -113 -87 80 -16 184 19 -174 -54 74 146 -190 122 281 135 8
3266 8 67 177 -184 -343 -28 -328 -230 -118 184 110 30 -367 -10 -269 -151 -63 182 93 -19 -131 238 142 -148
3289 -148 -104 -150 75 -144 326 7 -62 210 -1 24 83 -90 -90 -125 287 118 -70 364 126 44 22 110 -140 111
3313 111 -173 98 34 -165 150 89 -7 -4 183 -40 219 16 -34 2 198 -7 -20 443 216 100 -22 -102 -39
3336 -39 37 -93 -17 81 165 244 94 -162 134 152 181 -301 -166 272 -33 0 -19 -62 -95 156 282 -1 168 166 -50
3361 -50 240 -46 -102 174 -30 6 -30 -124 -15 82 -235 2 -60 -112 -152 143 46 -16 -100 -107 4 -329 28 195 318
3386 318 234 -67 136 3 -18 -47 176 -12 28 -42 207 -182 -5 -127 -41 25 -171 -79 55 7 -230 -115 109
3409 109 -77 31 87 -79 102 -252 -244 265 -45 -65 -169 -170 -21 -75 61 162 -9 192 404 49 68 -128 26
3432 26 -24 -255 -181 -23 -120 15 174 -104 -198 -19 -148 114 353 66 -222 202 -83 137 -34 67 -222 53
3454 53 -39 -86 56 80 143 -44 -159 217 42 -92 -110 -27 107 -31 76 -145 109 -257 219 -192 304 -47
3476 -47 20 -113 -352 -78 -61 -61 62 -240 96 -66 -111 33 17 177 118 -67 47 113 -177 -197 -15 -123 -80 90
3500 90 148 5 -101 -156 126 91 -138 -275 -74 188 -48 -108 -36 -240 -54 84 164 26 -149 -236 236 -62 175
3523 175 -129 -252 143 74 4 29 189 -173 41 -41 30 62 -77 56 94 213 27 239 73 66 7 54 286 56
3547 56 -34 17 255 92 182 118 53 11 58 297 160 192 76 -27 -85 -95 -7 -112 22 100 -270 19 -1 16 37
3572 37 -82 49 -73 -6 -129 17 -33 92 216 -17 -71 -132 72 282 -219 -22 -233 -139 -232 42 58 -43 123
3595 123 198 -245 -241 -38 -45 -57 -98 89 13 257 -28 302 -31 92 -2 -49 73 2 40 -91 -240 -131 -163 -11
3619 -11 -34 234 -152 -123 -60 118 -152 -280 -93 42 -146 114 231 -1 83 217 -271 54 197 118 -63 212
3641 212 152 101 -32 -131 -1 46 26 -55 -136 -62 181 110 -76 -15 16 -117 -89 -206 -126 -59 155 225 -310 84 -130
3666 -130 -95 112 -51 60 -53 125 -309 -246 85 -13 -89 -274 -98 4 -145 -20 123 56 57 221 -12 -97 75
3689 75 6 23 -76 -116 47 -100 59 -47 97 -260 206 -181 33 -32 31 268 28 -197 -155 -195 -84 62 29
3712 29 30 -267 34 106 -36 102 62 257 -313 -157 192 -87 -142 61 -146 13 40 -316 128 108 -10 13 146
3735 146 -44 37 199 -181 -81 -9 50 -192 31 31 -214 182 35 129 -178 13 0 17 -126 26 -51 -166 30
3758 30 -2 72 -117 -142 -63 146 -75 -187 96 75 -82 -259 -269 250 25 -240 -25 -91 46 -143 42 -178 127
3781 127 225 146 34 -103 35 82 -85 28 58 142 -38 412 -33 -28 152 -7 -117 -85 206 107 15 -255 223
3804 223 -36 25 -401 33 -39 -220 12 217 -104 67 165 -37 95 -112 6 -98 70 -19 96 48 -47 196
3826 196 46 -42 -25 -43 104 -130 -30 35 115 191 248 154 2 182 -6 -38 -9 -114 143 -275 -43 -5 -191 -43
3850 -43 45 108 -115 -14 -101 35 -125 -89 -29 -42 66 23 147 342 24 -216 39 -87 74 54 83 101 -10 121
3874 121 82 -191 -45 -22 -221 103 -215 46 -49 52 -39 72 140 -126 121 158 -5 -54 301 -128 -50 132 -397
3897 -397 -115 -44 100 16 4 87 267 44 95 61 169 -98 -126 79 -179 -214 -242 80 49 102 -103 101 226 105
3921 105 -133 -139 123 57 295 117 240 -52 -107 195 65 -17 -2 130 -32 130 111 127 37 -87 -59 81 -72
3944 -72 -64 174 -163 103 19 35 -161 -227 98 22 28 125 -218 121 357 -64 -133 206 -31 -186 -84 94 342 215
3968 215 -24 96 -17 -153 10 -228 -123 325 56 7 10 -49 -370 -282 97 -42 -42 110 -71 -72 20 63 -236 -256
3992 -256 90 -172 -230 -48 -48 -42 22 178 -9 24 -67 -95 -98 108 187 -91 -193 61 136 -139 -148 -87 169 -278 125
4017 125 -20 41 181 -120 -40 28 -86 19 -48 82 -59 14 -84 45 210 99 23 -122 -122 -78 -22 79 41 15
4041 15 161 -123 -235 12 49 -96 122 -2 78 89 -186 99 52 82 96 20 -173 25 -6 113 -215 76 -152
4064 -152 12 -74 87 -14 -107 -53 -149 -89 9 167 -4 371 -70 111 223 46 3 174 -13 25 195 -127 -208
4087 -208 10 -2 12 -235 -159 78 95 171 259 -26 69 35 -151 -48 120 41 60 -52 142 -95 40 -84 134
4110 134 -108 -10 -324 83 -9 230 81 37 35 52 31 117 131 -129 132 7 -104 -135 -42 173 -188 97 7 -183
4134 -183 356 -225 65 -240 -12 -71 -234 249 -7 40 71 -135 159 69 -44 243 -39 -42 30 75 18 25 16 -119
4158 -119 -132 -45 88 143 -220 -48 -111 96 -70 118 -93 -120 105 57 119 137 204 170 20 -187 63 210 -135
4181 -135 95 -11 -16 -208 -101 95 -116 80 -115 -191 -131 -38 -66 171 -66 -41 62 -91 -30 71 263 221 -27
4204 -27 -105 65 -116 23 172 100 -302 151 237 -40 36 143 -11 -212 35 -16 -73 -42 -11 95 54 219 -182
4227 -182 90 -89 -17 76 -111 35 -75 421 -12 -89 -138 -181 31 -27 -142 68 359 192 -187 -206 110 -5
4249 -5 -36 -117 179 18 239 -60 -76 -67 76 85 -108 -16 279 -175 243 107 283 -95 8 -27 58 -71 -249 -44
4273 -44 146 97 -109 122 261 -102 -78 41 -148 -73 -158 4 -41 124 57 90 -13 23 -50 68 70 -100 -31 157
4297 157 49 -92 16 1 -27 93 44 -61 161 168 -110 54 145 -39 235 46 190 82 -201 -15 158 -46
4319 -46 51 -15 -264 -198 182 317 173 -2 -5 -15 57 -54 -61 -2 -125 324 -49 -96 -288 66 -166 213 123 -152
4343 -152 36 335 -1 69 -160 -107 107 -16 119 -22 235 -148 -87 -123 11 106 -29 8 -58 59 81 -36 -10
4366 -10 114 -210 44 -237 0 45 -79 -61 -195 -105 262 -76 4 -72 112 111 -45 -208 328 -31 -38 76 76 -161
4390 -161 -79 132 4 48 84 31 0 146 -93 -91 -16 34 -228 -164 -83 -103 1 -8 2 149 -93 -32 240 76 184
4415 184 114 -99 -53 76 -276 -78 -50 113 250 102 43 -80 -241 -323 5 257 107 -31 -236 -158 49 90
4437 90 -10 -220 -15 17 -196 70 -34 103 -262 0 -194 14 -132 90 -12 262 -107 124 132 -359 -63
4458 -63 77 -208 -142 41 28 -198 -34 99 -63 -84 -96 -320 270 -286 -31 35 52 35 -27 -108 85 -81 123
4481 123 110 -158 -52 -93 277 -72 49 61 -113 151 -1 -72 64 61 -125 -273 -55 340 -79 153 98 -101
4503 -101 -7 81 168 -59 10 -109 -144 -153 -112 0 92 -38 -83 11 170 98 -135 -139 301 99 -77 18 93 -285 36
4528 36 248 -25 -348 -114 7 63 219 -99 36 -131 40 -14 95 -57 -151 124 44 -206 -111 -69 68 81 -238
4551 -238 -159 -184 -37 -225 -4 -119 -104 140 71 -82 -36 -102 88 -205 108 -149 -38 -82 128 6 141 -95
4573 -95 -10 -201 29 -134 -89 47 183 178 0 -81 30 166 -53 4 100 84 -127 48 141 121 -55 -267 13 -65
4597 -65 160 84 44 227 -60 177 26 -47 41 -27 -325 -82 -162 -88 159 96 -191 187 22 9 1 -129 -25 -127
4621 -127 181 65 20 121 -148 201 -9 274 -186 -153 199 49 73 -39 75 -106 73 20 -9 103 28 80
4643 80 44 -36 -2 -147 82 -24 119 -134 -84 125 29 94 -133 -116 208 44 238 152 -131 -65 117 190 20 -106
4667 -106 140 157 77 389 1 92 84 55 -137 54 -7 104 64 -26 212 -179 -34 173 -20 124 -6 133 -143
4690 -143 85 -12 104 -204 -78 89 66 -79 191 15 176 -63 143 -73 -119 -51 -138 146 167 21 111 -126
4712 -126 -75 -24 -285 -49 55 -81 -22 135 -100 155 -226 -17 -240 -91 0 73 -262 -167 54 -264 229 165
4734 165 -231 176 22 66 56 5 -120 -244 -13 -28 22 -137 122 86 -39 12 -86 59 -43 -230 32 22 13 -148
4758 -148 -95 204 -134 23 -196 -115 -162 39 -93 -67 -324 -27 -20 335 -295 -1 121 26 58 116 -152 0 172
4781 172 -363 263 51 148 94 -78 18 -28 -70 -2 -47 79 46 -61 -221 -15 -112 150 -2 68 -118 -53 80 56
4805 56 127 68 277 219 -131 177 -39 203 -260 121 -112 -13 99 109 -122 -176 109 -67 30 58 10 -110 155
4828 155 -79 37 -79 204 -137 -270 -9 -168 -130 -233 -38 47 -37 168 151 -112 236 97 187 99 117 -198
4850 -198 13 -90 79 154 -218 196 167 105 -249 84 49 -123 221 197 -162 18 -238 -124 176 0 30 43
4872 43 -76 -136 -90 -139 -63 134 -155 98 -47 346 264 193 117 -123 -54 -44 -24 129 206 -37 103 104 35 -13 18 -182
4898 -182 229 -63 -96 127 16 8 143 -181 35 -21 -134 25 -98 -170 59 9 -139 -98 -110 -259 -115 -39 110
4921 110 -152 132 272 -146 179 -7 6 32 -129 11 70 42 18 9 46 -94 -23 172 163 142 -134 65 60 -247 -78
4946 -78 -175 -12 19 -113 237 30 -158 261 69 -197 -51 207 -15 -123 -62 25 -16 -157 30 -61 308 243 69
4969 69 -136 -110 -140 221 177 -89 114 125 168 -461 -138 -19 139 -123 97 30 -19 -23 109 138 -130 -106 49 201
4993 201 218 184 33 244 -37 109 -95 -118 -81 -200 -217 -180 -166 -55 124 -242 113 315 -48 19 -190 79 9
5016 9 249 -12 13 38 68 203 -109 153 -185 -119 53 -37 125 285 -36 -228 57 -243 -241 -168 -94 240 -14 71
5040 71 -7 76 88 -136 217 -1 82 27 173 -10 -19 208 -171 -92 39 -96 -60 132 -276 -94 -209 73 158 -157
5064 -157 66 77 -45 6 -88 47 -169 165 132 203 2 -398 58 -82 -25 6 217 131 -250 -305 67 199 -54
5087 -54 -336 -35 36 61 216 87 -88 -79 -231 -270 0 130 -90 155 -102 -112 42 -140 -369 123 63 227 208
5110 208 -138 -34 -71 229 52 41 38 90 105 -53 54 75 221 -118 -412 -177 -302 -40 -280 81 65 46 117
5133 117 48 45 50 -156 -103 128 -165 103 124 34 294 -104 147 -26 -296 -87 92 -42 -11 17 -283 -169 313
5156 313 -46 203 9 -26 -129 -86 -20 58 170 117 88 -163 80 45 70 103 186 -218 -182 119 209 -208 -151 -93 129
5181 129 -27 -38 -15 -175 74 65 124 -10 57 118 -48 -74 -20 -63 -119 -140 -72 90 94 146 -183 48 -152 58 -94
5206 -94 -76 -122 148 -444 38 -31 -112 -15 241 -45 22 -108 158 19 -17 -34 -66 -137 -80 165 -160 64 -296 -102
5230 -102 73 79 97 -229 -62 -93 -77 -26 -99 55 109 -26 36 218 -280 114 -52 -32 99 57 -100 -281 110 -136
5254 -136 -80 -30 53 -124 142 149 9 -205 174 -243 63 52 -84 202 55 322 -105 287 222 145 248 -190 123
5277 123 -206 126 19 -194 125 -18 -188 -61 -63 276 160 -249 218 -153 -43 -29 -76 -14 -18 -140 -73 41 -60
5300 -60 -134 -87 123 205 8 19 4 64 -126 -11 -21 1 -32 -196 101 115 62 195 55 -29 -12 64 -55 -33 182
5325 182 33 125 65 -125 21 67 -84 123 -184 105 140 -160 -4 -100 33 -30 -114 -105 -139 -108 6 27 135 -75
5349 -75 119 -94 86 -65 -69 -64 -133 -12 -200 -102 38 83 234 169 -197 -46 -15 77 -71 80 91 118 111 -290 255
5374 255 13 -133 -50 -57 58 -56 -12 -127 -126 180 -255 -7 -26 -372 63 -6 -63 8 91 -94 30 -92 -77 -266
5398 -266 104 -72 204 -16 58 -70 86 -155 77 -115 -96 24 179 70 -319 70 99 1 -67 -67 35 123 -177
5421 -177 -20 37 241 -22 -115 40 100 262 228 152 -7 81 -231 -260 27 199 2 15 -145 59 150 -129 -110
5444 -110 271 6 77 217 18 -93 67 -133 -29 -128 -35 -184 20 74 43 1 23 16 84 -3 42 217 86 72
5468 72 83 -193 45 -209 99 114 6 153 81 119 66 -34 135 67 131 -86 335 -71 -266 229 82 -105 -44
5491 -44 -185 30 138 39 344 7 -168 -247 115 69 -159 -41 51 -102 -10 26 81 -4 73 30 95 372 103 -149
5515 -149 245 -183 -147 4 -59 130 93 6 232 148 109 -25 -33 18 135 165 -20 -41 238 76 167 33 116 122 -106
5540 -106 50 111 -13 88 266 217 88 -233 -258 207 121 -97 92 -28 180 -2 23 -76 81 65 95 88 242
5563 242 52 -37 -99 89 -4 187 -116 -307 156 14 220 -48 -228 -111 84 17 -105 -2 197 -90 -72 183
5585 183 168 -40 97 -71 176 -60 59 83 379 -12 27 138 83 116 32 73 30 331 71 -146 86 -23 -58
5608 -58 -45 168 172 178 106 53 5 -148 -121 -68 136 100 33 25 110 -85 108 -210 94 -278 186 -60 -52 -164 151 -38
5634 -38 129 -282 -144 -223 -251 -115 -159 66 -241 -191 -115 62 -117 296 31 -24 3 280 17 215 32 49 2
5657 2 140 -79 -7 175 97 78 52 44 26 182 169 -89 -9 -24 -57 -89 248 97 -173 112 -40 205 -55 153 4
5682 4 -145 -12 366 -190 98 140 91 -202 247 123 83 179 1 209 195 -218 128 -172 -421 -250 254 112
5704 112 111 -192 -63 -105 -107 177 94 168 91 102 22 -149 33 134 104 63 -20 -56 58 1 -13 47 -82 91 -156 132
5730 132 -90 158 123 233 -106 -133 130 -183 127 201 212 -155 -164 272 166 -134 243 -193 33 197 -90 -89 -151
5753 -151 261 116 17 210 119 136 51 95 7 -113 213 -98 20 -64 -110 -157 171 68 -222 -81 -21 76 -152 262
5777 262 -16 -73 -3 154 63 -153 39 22 -12 79 124 -63 254 74 143 21 -105 18 14 -101 69 68 90 -254
5801 -254 67 -74 106 -52 219 -240 78 146 102 10 -20 80 -16 -30 218 -97 54 102 110 -9 93 169 132 -168
5825 -168 182 135 76 -80 162 139 56 110 -90 178 -61 40 -30 79 11 122 -152 27 223 243 -62 156 -209
5848 -209 6 174 -155 -6 -95 -28 -27 53 -209 -187 54 30 -275 -76 54 216 -183 -111 134 -42 94 -7 27
5871 27 -161 207 -6 266 56 197 43 33 48 4 102 -227 150 -283 -90 -84 -196 32 -20 -95 -118 10 133
5894 133 -106 118 130 216 31 -154 131 -19 27 -41 -67 137 -89 -97 -97 -91 -71 -26 -111 -31 195 136 68 -195 -221 163
5920 163 -5 104 165 72 70 127 56 -16 54 105 -10 2 -97 -14 5 -263 238 -198 216 -117 -8 -110 -70 27 121
5945 121 122 -62 -264 -33 22 -148 -82 -28 -343 99 -72 65 157 -245 -4 63 175 -59 -179 -45 52 164 133
5968 133 102 248 102 -192 16 -74 -197 9 165 298 -46 -44 -186 241 -55 -129 78 -14 48 -5 -45 -104 23
5991 23 -78 129 -81 -15 53 -145 -109 -82 172 -46 76 -9 -4 -49 164 40 82 -8 -93 27 -96 -109 -107 -152 201
6016 201 35 -3 249 184 1 -125 55 -242 46 54 112 -46 -135 54 187 -124 -76 82 133 78 -23 -21 14 -144
6040 -144 227 6 108 238 270 -2 -15 60 94 -149 146 -87 162 181 -184 -98 -39 31 118 114 330 45 -151 83
6064 83 139 -39 -245 -114 42 232 72 -194 78 144 78 -34 160 91 -16 116 126 -131 180 -140 36 310
6086 310 72 64 -101 -60 2 -236 77 0 212 -70 109 230 146 -298 -74 40 21 5 -64 36 -240 -40 -38 -11
6110 -11 270 -191 -5 296 118 -97 93 -14 119 35 -215 -86 -261 -99 254 -223 10 110 111 98 -94 153
6132 153 -55 8 -123 1 62 -131 -10 88 60 -45 -150 165 -175 -65 23 11 112 -11 -117 -142 -56 351 -27
6155 -27 -17 -229 -68 26 154 -77 298 -72 -19 104 61 130 -87 -58 -154 65 110 337 -130 -93 35 121 42 174
6179 174 -147 -35 -22 -66 -61 35 -45 164 -35 174 -98 95 37 8 33 -5 -224 -244 -131 -11 -253 -158 214 122
6203 122 -10 -258 142 -180 -112 208 231 -153 190 -24 78 -230 -230 -11 82 -78 -72 66 84 -64 18 107 -131
6226 -131 136 -66 62 86 -28 82 51 -74 -180 -138 -99 96 97 -54 122 -322 162 277 -123 238 29 -79
6248 -79 111 95 -68 97 -197 96 -31 0 -85 -65 106 -127 -99 -94 -100 -51 208 -24 -33 156 -68 -1 22 216 -177
6273 -177 106 184 9 85 -147 119 123 -33 60 -13 -109 27 -208 245 195 74 148 159 153 -130 -90 -118 -92 173 160
6298 160 169 23 -222 -31 -174 107 -155 -141 -177 -167 12 -84 -108 -173 145 -1 -49 25 -99 24 221 188 109 -46
6322 -46 27 78 15 -75 -179 68 262 -241 -119 -31 -168 211 50 7 242 245 205 33 187 26 -90 -76 -172 -1
6346 -1 11 -87 15 9 -76 79 150 -72 -210 -172 -49 136 117 -200 61 283 3 42 -115 -70 -185 -78 70 -158
6370 -158 190 133 88 -100 -5 330 -134 253 203 36 167 -54 -102 -151 82 -89 110 -125 87 -143 38 -91
6392 -91 -118 9 150 24 189 19 -27 91 -62 135 47 -25 -96 72 19 219 -169 104 -172 15 -144 74
6414 74 -52 145 135 96 -155 42 -37 33 -89 -113 11 -35 1 208 -98 -248 153 32 -144 24 241 73 162
6437 162 -35 -132 25 -9 -153 81 -246 -112 -29 218 70 6 -192 -224 -66 -165 170 -9 100 197 109 -90 -135
6460 -135 60 -15 305 226 -123 -109 -51 141 -125 125 67 299 -148 18 -62 -152 137 147 258 -201 -143 42 -346
6483 -346 -39 -63 -244 39 -131 -179 171 -89 94 1 -171 -316 206 -78 10 103 97 0 112 0 -173 -132 157
6506 157 95 -109 70 -172 72 -2 -122 157 25 -14 -108 175 70 -61 80 19 103 -123 187 88 141 -8 -20
6529 -20 -191 158 -220 -161 12 -286 -44 -102 -66 100 58 172 -148 -165 204 -142 0 -31 -63 20 -8 51 71 134
6553 134 -90 297 154 126 -42 -51 86 -99 -167 153 -4 -128 100 -97 -38 -152 -19 -76 147 204 -153 -56 -60
6576 -60 8 -177 25 187 -88 -94 -89 -129 54 -203 -206 121 163 -125 -22 241 9 107 79 -218 29 20 -179 180 185
6601 185 -23 -63 10 296 163 -261 39 -226 26 -131 96 30 -345 23 -54 164 -217 193 -46 -71 40 -2
6623 -2 11 174 -109 -14 287 42 114 53 55 12 -270 -11 -198 129 315 88 45 -12 -120 -54 15 -71 -127 -186 -61
6648 -61 -164 95 -112 24 -25 22 -67 -71 37 -72 -135 -65 -231 -97 285 -66 14 -22 139 -45 -32 89 102 -139
6672 -139 44 26 221 -173 -23 -13 166 -133 -9 -144 -58 123 -41 -73 -42 170 143 341 347 95 -151 55 -145
6695 -145 140 -81 -133 190 -191 -4 -218 -50 112 39 -132 -196 -83 80 155 262 -98 -38 -131 135 -37 1
6717 1 -16 126 100 165 56 33 -126 154 70 115 -140 -276 61 73 69 -169 48 -131 -154 -29 -17 -262 -12 115
6741 115 -3 49 7 105 97 -310 90 238 91 -77 44 -320 220 -48 -6 -83 35 44 -155 94 -160 -290 -97
6764 -97 42 -118 -138 -39 53 48 -265 -120 129 -13 30 24 227 100 -85 256 119 211 -32 -55 163 38 207 -30
6788 -30 -143 -22 -58 -119 327 -151 83 170 159 -70 -51 179 93 48 -287 82 -216 -37 118 -286 237 -4 -22
6811 -22 59 -26 -86 -38 158 -72 -72 143 13 76 105 37 -19 -19 -34 -183 -36 111 -16 151 -73 41 -80 65 94
6836 94 -112 -61 -161 40 68 -101 -14 15 -51 162 126 -61 -190 49 35 46 26 -118 75 39 28 168 -195 -121
6860 -121 43 124 -100 -80 -66 49 39 61 -121 142 100 -200 -202 80 211 -143 -74 -190 183 93 31 173 18 16
6884 16 102 -184 343 -66 -104 85 105 290 -67 249 -71 65 -21 166 166 107 242 50 184 285 -124 -127 135
6907 135 278 153 250 -99 47 86 -132 120 65 31 82 67 -50 87 37 -36 154 146 27 -94 -32 83 70 39
6931 39 -121 33 -32 15 138 30 9 -130 -87 49 -96 -142 18 -85 35 -289 48 -147 -75 231 -32 -240
6953 -240 -56 98 -8 -50 223 61 -89 169 -11 32 -174 -179 205 75 74 166 -211 -98 -18 262 -187 127 -15
6976 -15 67 -42 -48 -22 47 93 -155 -39 -31 126 -19 18 -88 -302 241 34 -203 -104 -85 -36 6 -274 -54 -8 -20
7001 -20 167 -50 69 177 7 67 5 -195 68 113 -193 273 108 -75 -137 242 102 -208 61 66 -48 146
7023 146 75 85 -12 -46 25 12 -104 99 -112 209 68 -198 29 -362 173 227 43 56 -73 -38 20 76 224 -163
7047 -163 47 -17 -343 -246 3 186 -355 -152 146 -121 -141 -326 36 -102 144 -154 286 70 5 -111 15
7068 15 67 -265 135 77 261 -136 92 59 -38 -7 -13 -47 181 -80 -31 20 47 157 -107 26 98 -173 5 -141
7092 -141 136 -122 102 7 125 142 18 85 -108 -75 142 25 -49 125 -31 -41 130 14 -146 -62 -65 -129 -7
7115 -7 -247 297 -124 -64 63 -171 -8 -64 -4 -262 -94 -148 -21 229 13 -48 102 16 -16 -4 108 55 73 160
7139 160 146 46 -189 -110 -254 65 54 -116 2 30 134 -113 -61 107 -126 218 338 -130 10 -62 -197 -171
7161 -171 289 23 1 338 -143 -38 61 72 -135 47 212 -98 -146 3 91 59 258 -287 -436 -24 -178 -118
7183 -118 -221 -69 294 -184 172 81 292 -80 -406 -228 195 140 98 181 -19 3 25 -104 37 264 -23 -1
7205 -1 25 133 -38 346 -121 167 -150 -25 94 118 -93 -45 -64 -91 21 -58 -147 -48 95 178 -88 169 222 -107
7229 -107 -253 -70 184 -311 -36 49 -164 43 0 108 -4 -11 59 234 154 89 210 -103 34 75 7 -52 -130 192
7253 192 253 -150 112 317 -23 -42 -146 152 91 20 -149 58 74 -68 20 26 154 -31 141 -97 180 -16 -7
7276 -7 141 -117 -286 -124 -23 -73 -129 -207 -249 54 -103 -64 109 -40 52 -120 39 141 23 -161 29 -32 -43
7299 -43 -115 184 289 56 90 295 -77 211 -43 -17 -224 133 99 65 -169 168 18 -66 321 1 -217 33
7321 33 -71 218 9 -231 -166 2 -117 -27 52 130 31 -201 -38 -6 178 -94 -13 -126 -50 40 125 -78 -11 18
7345 18 -212 12 69 -36 137 67 -127 91 20 -106 -192 -21 65 -60 -115 -156 -284 -140 -292 279 -20 28 -194
7368 -194 -181 204 -127 -147 -204 60 -95 53 -209 48 178 -11 160 -46 -50 62 248 109 -106 10 -51 -208
7390 -208 -58 228 -19 -21 -61 -102 -141 -73 126 -258 -126 56 -212 0 102 -58 103 -159 38 -250 -97 -83
7412 -83 103 -130 -171 -279 -158 -208 81 -58 28 113 -243 -166 46 -38 4 -55 -79 40 109 -77 17 -51 -150 109 150
7437 150 -87 172 -96 -212 9 -95 306 172 146 -113 29 -29 93 10 -4 -31 111 -74 23 41 -98 -127 25
7460 25 -24 -27 103 -122 48 -39 -25 37 -152 -76 386 -136 -85 213 32 -121 46 58 6 -35 78 -143 59 -85
7484 -85 42 83 97 274 -95 -13 69 94 -172 -37 -82 181 -131 -220 66 -140 -41 120 -16 33 64 98 -7 -23
7508 -23 -73 -63 108 -128 -68 30 255 -72 11 -154 33 -41 -52 19 -46 -115 23 53 166 196 -96 135 -221 -239 40
7533 40 74 -228 356 54 -50 107 -68 26 -57 95 94 -113 159 242 48 -102 1 -22 -55 -94 -127 140 78 -6
7557 -6 65 -178 224 -78 -148 169 26 57 126 -110 -174 -98 -273 -78 -12 -212 -210 149 213 24 -97 42 302 -20
7581 -20 11 98 -420 -32 -303 23 72 -59 11 -301 256 -162 43 -211 170 128 -202 126 3 -197 -163 -109 197
7604 197 189 -169 2 115 135 213 -188 -90 356 15 -110 -145 -62 -113 -60 -6 169 52 44 104 130 31 -18 62 23 -176
7630 -176 223 -143 110 98 -118 124 -45 -44 -101 140 10 -142 -2 180 -125 -180 -10 -29 39 176 91 -76 20
7653 20 111 34 184 -175 199 -56 83 254 227 -37 -233 84 128 165 97 65 -319 -240 -153 -52 111 143 -35 -356
7677 -356 -43 -189 183 -17 28 -121 -27 306 74 43 -219 120 254 66 213 -259 110 -135 -162 -92 101 -55
7699 -55 36 188 -219 -20 -50 110 140 29 -222 -233 25 58 -52 -186 -387 -214 25 -70 61 -53 192 199 -147
7722 -147 184 -44 121 -181 91 -61 147 -127 -173 -89 -136 128 14 131 -18 -201 53 -35 146 25 -59 -41
7744 -41 28 -26 -21 -236 -157 231 93 229 73 19 25 -343 6 -96 306 64 -15 -36 -135 -46 33 -50 159 67 163 10
7770 10 -33 116 -9 -110 36 -106 97 321 141 16 81 -66 -99 185 -81 177 -9 34 79 -223 227 73
7792 73 -2 -1 145 -3 -63 35 226 -190 304 254 161 -145 -183 80 -78 -70 84 -146 -21 257 16 85 -29 -32 -97
7817 -97 47 54 207 -15 -100 -149 -113 -154 -110 50 12 -9 -48 -315 -101 -103 -393 -63 99 209 -89 -269 -62 86
7841 86 -70 8 345 4 21 2 4 -297 178 -404 31 150 -272 59 111 -115 249 1 -287 -74 -11 -137 152
7864 152 -129 -37 99 -104 -282 -114 -103 -87 73 -238 104 -30 -69 233 121 -228 96 -351 123 164 134 -286
7886 -286 10 -42 -311 145 215 49 40 78 46 19 -30 -126 104 122 -39 83 38 -191 11 -55 -13 189 -97 -133 -176
7911 -176 68 66 -235 5 -1 31 -244 21 -314 -29 8 -225 217 86 -91 224 151 222 235 -14 -3 1 -122 134
7935 134 -56 127 50 -61 311 268 146 -45 379 -87 -266 55 166 -98 -6 -37 192 -4 177 -18 -6 -248
7957 -248 80 177 -1 -80 204 195 -115 193 -214 -131 56 -200 2 -67 24 263 45 0 17 -55 -2 24 41 124 -279
7982 -279 -244 -30 -155 -37 -87 -212 -16 -116 38 85 47 -12 -170 70 289 59 92 -76 -332 69 96 -198
8004 -198 -147 107 -97 -129 241 23 279 254 -26 -221 -78 120 52 122 -144 98 29 -35 -281 185 -15 -63 -95
8027 -95 29 50 261 -213 -47 -84 -19 29 1 159 303 -116 280 21 -170 217 -56 -76 -258 91 -190 103
8049 103 283 54 163 59 137 126 34 177 138 -3 -25 -88 -36 66 -192 97 -83 347 11 -29 -125 123 -20
8072 -20 38 82 -315 84 -121 53 29 281 -274 -179 80 -48 62 -140 -151 -12 -130 -73 -67 -168 -219 -139 -48 116
8096 116 201 127 11 95 -108 -114 181 -38 59 -169 40 234 70 49 -156 -54 -5 -188 -344 151 242 -175 7
8119 7 27 69 -112 -64 -26 101 -222 94 -237 126 236 -197 -181 130 97 -4 -8 54 82 -207 66 -162 89 -89
8143 -89 -281 -194 -115 -9 119 231 138 -205 -133 -9 68 -158 70 132 -165 -153 237 -63 -69 95 298 55 28 -53
8167 -53 -158 -15 307 34 155 -127 -190 -338 93 76 201 75 21 35 27 -2 -42 236 3 298 -42 -258 123
8190 123 165
8191A65
$$ Imaginary data points
##PAGE= N=2
##DATA TABLE= (X++(I..I)), XYDATA
0 0 0 0 0 0 0 0 0 0 0 0 8 -8 8 -8 16 -16 24 -24 32 -40 48 -56 64 -80 88 -104 124 -144 164 -188 216 -247
32 -247 280 -316 358 -404 452 -508 566 -632 703 -781 867 -962 1062 -1174 1295 -1428 1575
49 1575 -1735 1910 -2106 2320 -2560 2829 -3132 3475 -3871 4329 -4870 5520 -6314 7314 -8618
64 -8618 10392 -12967 17051 -24554 42939 -188138 -150423 119431 -133734 -95283 39089 -16927
76 -16927 -116160 19245 113490 62544 64329 185089 74045 -21756 127928 114922 -62980
87 -62980 40732 101543 -88141 -146590 -6625 10527 -104619 -117688 -3037 -37285 -100522
98 -100522 33246 60175 -73941 1866 99613 18841 21820 105923 70351 -5394 4698 44927
110 44927 -23598 -75541 39871 46925 -97948 -58067 17980 -65772 -61498 20209 884 -23645
122 -23645 10493 44786 25568 -6190 43797 54637 -12289 29155 58740 -37323 -32587 34773
134 34773 -5871 -39324 -19592 -8312 -19779 -48517 -25174 3066 -29526 5550 51586 -7296
146 -7296 -7843 41923 12742 6433 35655 21790 5887 -2707 7960 19010 -19205 -18320 5985
159 5985 -37508 -35239 4929 -23503 -18383 16036 -8134 -13934 -379 568 17653 13437 8207 22562
173 22562 652 4333 31700 1787 -2762 16627 -13484 -15281 1019 -15403 -2915 2339 -14623
186 -14623 -2621 -8655 -14465 7030 -6216 -5513 18038 -2739 -282 22186 929 2565 10955
199 10955 -8918 580 5275 -5102 7940 -2224 -8531 9004 -12328 -14955 10549 -7688 -7959
212 -7959 10636 -5630 -1319 9711 -3020 5066 3604 -5043 8947 -2911 -6893 14971 -2196
225 -2196 -7669 11981 -6164 -9427 4225 -8566 -2700 3695 -6130 6695 2053 -7335 10825 -781
239 -781 -9177 12627 -3 -5573 11484 -576 -1367 6310 -7167 408 952 -11261 4411 -214
253 -214 -11111 7952 -805 -9124 8088 -2447 -5634 7212 -3621 1478 8689 -4544 6072
266 6072 6899 -7767 5230 2116 -8207 6079 -1249 -6523 7132 -4222 -4054 6117 -8089 -1966
280 -1966 6056 -7968 2119 5826 -5897 4273 2172 -5104 6674 -1970 -4379 8781 -4905
293 -4905 -3491 8572 -5575 -1548 6337 -6409 1009 3598 -5552 4085 387 -4061 8308 -3047
307 -3047 -4239 9888 -4758 -4918 8048 -4526 -2186 4121 -5626 1248 1102 -6211 4513 -1322
321 -1322 -5418 7396 -3698 -4778 10014 -2886 -3441 8070 -2308 79 4773 -2849 3631 644
335 644 -5368 6226 -1890 -6263 7139 -3679 -6158 6888 -4770 -5694 4765 -3090 -1057 2131
349 2131 -2883 5117 105 -4826 8299 -1100 -5229 9978 -483 -4628 8068 -927 -3279 4683
363 4683 -2382 -480 -860 -4672 4800 -2528 -7407 8079 -1650 -8234 6756 -1823 -7538 5355 537
378 537 -1196 3175 -457 4463 -202 -5280 7487 -417 -7806 9306 1138 -8620 5858 1754 -5104
393 -5104 1278 -662 -804 -1871 -3838 6518 124 -7871 8287 1352 -10133 5465 1689 -7773
407 -7773 3752 3294 -2446 -344 -1191 4165 -941 -7606 6465 1815 -9349 7886 5601 -7497
421 -7497 5439 4712 -4773 264 -89 515 -89 -3431 6423 1107 -10229 4326 2066 -11701 2176
436 2176 3050 -7902 1209 3588 -1531 276 -1065 3923 1685 -6811 5000 5334 -5976 7116 6667
451 6667 -7782 2360 4201 -5952 -1111 794 78 -953 -4822 3944 2644 -9442 1804 3639
465 3639 -9949 1047 4825 -5876 3001 6965 -1043 -1271 -763 2669 1160 -5070 6140 6454 -8398
480 -8398 3295 7090 -9154 -1066 5451 -5329 -3064 1196 -55 -1281 -3742 3850 3111 -9025
494 -9025 3239 6829 -10030 882 10346 -4723 -476 9459 2838 -3214 -3755 1740 235 -8184
508 -8184 4192 8556 -7981 174 6190 -13475 -7337 8074 -431 -2925 4428 4995 -1613 -6544
522 -6544 5458 8869 -7056 1738 11640 -6968 -5362 7883 -3477 -5412 5163 2669 -5856 -8646
536 -8646 2 2286 -8944 1182 13067 -4545 -3221 10726 -2944 -8628 5930 6657 1017 746
550 746 5458 3201 -10545 -4944 6902 -8113 -7344 9949 -2337 -10378 2950 1559 -4382 1087
564 1087 7090 3997 -6026 422 12131 -2409 -3935 13251 1748 -9628 3040 -280 -9952
577 -9952 -3663 2323 794 -6158 -2262 6387 -6101 -8457 9074 1143 -6762 10571 10230 -2630
591 -2630 1768 5561 660 -3679 168 6586 -4212 -9482 5301 -1306 -12510 1429 2593 -8028
605 -8028 -1253 2389 -1837 -936 3043 8919 2147 -1862 9922 4465 -8781 4160 6330 -5966
619 -5966 -853 3311 -2402 -5194 -5407 -1536 -4193 -8315 2707 3049 -6704 4758 8732 -4641 948
634 948 8268 1401 -143 3667 6471 2022 -5026 2853 2138 -10348 -1570 3802 -9288 -5218 2416
649 2416 -5021 -3808 2227 2053 -1 -1770 4860 4714 -4078 4802 10926 -2206 289 7845 -2441
664 -2441 -4707 342 -2033 -2976 -3819 -694 650 -6138 -1632 2175 -7378 -1882 7664 -1555 -1105 7265
680 7265 2302 72 1938 2651 3318 -2154 -535 3567 -4854 -3082 4072 -4251 -4098 2685 -4113 -4606
696 -4606 970 157 822 128 2020 5648 -655 -363 6477 -1593 -2171 5303 -737 -1959 2456 -1612
712 -1612 -2870 -2009 -2939 -527 -3130 -2458 3607 -2271 -2871 5852 426 -1616 4629 1218 -239 3291
728 3291 1230 1781 571 -1022 2413 -2589 -3740 2038 -3716 -5234 2786 -1654 -3605 1975 66
743 66 -370 742 -486 2506 1348 280 5721 799 -1764 4485 -435 -3356 2763 -784 -3453 -16
759 -16 -1521 -1002 -1482 -2830 1725 -1218 -3559 2930 86 -2023 4477 1934 -1640 3629 1097 -538
775 -538 930 -505 1169 11 -2836 2255 -903 -4388 1743 -592 -3850 1624 236 -1934 1931
790 1931 451 437 1511 -634 2597 1271 -2447 2704 1021 -3340 2024 322 -3206 884 -780 -2202
806 -2202 440 -1521 153 827 -1925 1992 1367 -2400 3205 2311 -2018 2399 1554 -1231 1687 -545
822 -545 -681 940 -1718 -341 -120 -3455 751 166 -3813 1167 1034 -2572 1651 1432 -532 2153 174
839 174 1521 2316 -1177 1313 1865 -2076 1616 707 -3499 603 276 -3402 -3 -307 -1736 383 -1142
856 -1142 570 1472 -2526 1372 2963 -2044 1150 1939 -1145 2203 1160 -1592 1015 -534 -1192 288
872 288 -1760 129 1141 -2974 461 1878 -3100 -18 1516 -1116 1249 350 -629 2198 187 -482
888 -482 1481 -1879 102 1673 -2626 -26 1405 -2334 185 1006 -2013 -134 -419 -719 1857 -640
904 -640 -190 2838 -682 619 1934 -1419 540 1407 -1926 193 648 -1619 663 -686 -988 727
920 727 -2405 -1691 2282 -1198 -111 1678 -712 1099 1056 -1386 1458 877 -637 1810 182 -451 2117
937 2117 -1356 -1213 1126 -2006 -1234 869 -1448 316 370 -1238 1278 -19 -1437 1312 -383 -565
953 -565 2542 -111 217 2000 -881 -259 665 -1582 662 -135 -1717 1222 -116 -1956 1735 0
969 0 -1519 923 -803 -494 1408 -416 899 1145 -1374 1102 -62 -2344 1714 156 -2292 1199
985 1199 435 -1118 763 -210 -260 -447 -2232 972 1301 -977 2550 1125 -2762 1003 884 -1831 541
1002 541 914 -181 -210 -1009 792 515 -2308 1314 446 -3801 541 1685 -1496 926 1784 -686 -284
1019 -284 -259 602 52 -1518 2203 1675 -2760 1113 2420 -2504 -259 1735 -1646 -1074 627 806 76
1036 76 -1559 903 1108 -2907 805 2431 -2965 -337 2977 -1141 -670 1685 876 -564 -1780 535
1052 535 1125 -2407 1418 4130 -2128 -892 2325 -1749 -2043 1425 314 -744 -716 1032 731 -2806
1068 -2806 131 2714 -2766 -1757 3021 -1054 -1651 2403 1105 -1084 -589 856 993 -2085 247 2965
1084 2965 -2349 -1460 3347 -951 -2628 2322 141 -2718 -760 1000 833 -774 569 2804 -2063
1099 -2063 -2291 2842 -307 -2092 2707 790 -2113 729 905 -108 -1201 44 1180 -2191 -1576 3351
1115 3351 -176 -2301 2144 800 -2347 302 1181 -94 -767 366 1618 -589 -929 2242 -488 -2970
1131 -2970 1783 595 -2772 904 1589 -1074 -988 358 556 -1047 -1465 1774 312 -1656 2260 1802
1147 1802 -2171 593 1035 -1954 -125 1106 238 -751 -929 1104 -517 -2191 1969 960 -2718 273
1163 273 1055 -1478 701 1958 25 67 -87 9 13 -781 1765 1088 -1619 823 820 -1952 495 878 -1376
1182 -1376 -700 -106 -334 533 -16 661 230 -1583 458 641 -901 1736 1320 -1301 69 604 -919
1199 -919 507 163 -437 -150 -1026 262 499 -824 886 599 -1805 181 928 -1048 709 1281 -307
1216 -307 17 182 -94 263 -821 161 185 -1571 333 781 -1390 -48 633 -1255 -12 526 -175 565
1234 565 -66 587 591 -312 829 888 -1224 228 811 -1227 -334 367 -779 -227 -603 -268 208 -792 -60
1253 -60 749 -1052 337 1253 -857 424 1310 -617 194 696 -266 398 -266 -171 641 -938 -241 290 -1266
1272 -1266 -285 920 -1144 -50 617 -495 319 387 -267 766 55 121 984 -314 -265 928 -769 -79
1290 -79 570 -984 77 147 -764 50 -71 -513 923 -304 -82 820 -505 16 941 -315 133 559 -518
1309 -518 312 253 -802 -95 -174 -571 350 -593 -248 707 -790 -159 831 -410 134 824 -365 553 637 -437
1329 -437 397 195 10 285 -450 -484 381 -838 -137 535 -710 -259 501 -487 362 457 -216 527 134 198
1349 198 769 -226 -178 871 -595 -390 396 -502 -276 348 -935 -210 56 -527 87 -555 -238 499 -255
1368 -255 -190 927 -473 -268 1066 -303 180 517 -313 281 15 -104 442 -529 -329 572 -661 -338 430
1387 430 -504 -58 734 -238 171 465 23 114 151 -343 445 138 -82 653 -464 -298 784 -724 -363 363
1407 363 -223 -235 107 119 168 -258 -5 683 -153 8 936 89 -255 636 -175 -9 252 -345 -40 -152 -511
1428 -511 79 -369 -276 797 -318 -269 525 -281 -519 739 -200 195 479 -166 258 -46 -373 410 -187 -518
1448 -518 282 -453 -454 469 -338 -415 284 -516 -161 71 -392 147 -62 -29 560 -201 -340 726 -324 -246 646
1469 646 -189 -13 299 -191 240 188 -489 262 -287 -352 814 14 -295 947 -221 -413 245 -432 -144 259
1489 259 148 183 -104 -103 331 -400 -519 464 -211 -624 938 -84 -317 615 223 54 -124 69 429 -258
1509 -258 -165 960 -169 -688 879 154 -697 360 291 -601 -64 286 112 -466 -433 480 -511 -739 984
1528 984 180 -1138 812 534 -583 103 390 43 -372 -44 556 -453 -600 902 140 -1118 738 494
1546 494 -1260 -23 456 7 -389 64 795 -309 -426 964 139 -925 488 720 -728 190 864 -474
1564 -474 -527 266 589 -600 -520 956 475 -1091 698 746 -1104 -97 816 -652 -313 391 598 -491
1582 -491 -366 660 -89 -1140 509 727 -1132 -117 958 -329 -459 665 74 -516 -137 704 156
1599 156 -625 734 870 -993 -12 444 -876 -564 679 120 -531 -172 688 200 -456 133 453 -854
1617 -854 -140 1038 -321 -361 837 -314 -542 -307 597 2 -350 31 215 -387 110 775 -495 -582 506
1636 506 2 -718 210 89 106 -552 228 424 -167 -83 610 -423 -338 351 259 5 545 97 -101 -430 -51
1657 -51 436 -99 -371 425 -5 -523 538 -39 -228 -308 -128 -23 59 24 469 217 -85 343 -46 -347 398
1678 398 -48 -105 88 -53 -167 8 144 230 208 -489 434 230 -369 405 61 -50 -56 209 -302 -91 -135 82
1700 82 244 -244 395 94 -228 105 125 -510 104 300 35 321 -49 110 596 -193 8 165 -39 -150 369
1721 369 -405 230 120 -53 101 19 -57 307 -232 -115 201 -143 54 327 -235 -135 -197 -32 69 321 -187
1742 -187 145 -106 -163 125 -504 -197 315 -251 -22 377 -154 102 253 -25 -23 70 -251 95 -109 -45 31 -135
1764 -135 -35 138 -524 -88 268 -25 103 65 -179 31 107 -364 -179 -50 -160 306 -56 -45 316 -88 -197
1785 -197 272 -101 -135 77 -170 -57 243 -165 315 129 -113 485 -261 -13 228 -299 -87 249 -161 170
1805 170 -9 -166 196 -157 -143 81 -133 -172 427 -311 -320 25 81 14 384 -258 50 -117 20 325 -33 -428
1827 -428 131 -104 -476 169 -100 36 16 -130 -4 221 239 149 75 -232 159 99 -74 124 -148 -183 105 12
1849 12 34 114 -152 -26 -279 -32 61 11 -161 222 -88 -246 343 -1 -108 113 -47 94 135 35 291 18
1871 18 -110 300 74 -370 100 -106 -197 81 -284 10 128 119 -182 -137 210 107 129 36 358 106 -13 161
1893 161 23 -43 76 104 -134 -102 115 132 -91 -10 188 -131 -196 510 -83 -122 351 184 -182 133 -62 188
1915 188 307 -63 182 -101 -203 328 -17 -251 166 76 -92 100 161 -51 146 -126 110 -32 -153 309 -14
1936 -14 -258 437 44 -87 -81 -108 -133 -56 -79 52 -5 -163 107 159 85 313 106 -263 219 -7 16 179 229 -26
1960 -26 0 -218 -3 -69 -28 10 -47 -231 231 -62 -266 84 81 -45 -249 208 218 102 5 -150 70 -205 -12
1983 -12 315 -41 -146 -42 -260 -130 14 -152 -155 -21 -190 73 34 -244 209 -102 156 88 -86 106 114 -190
2005 -190 -147 52 -136 140 233 172 126 -84 -164 179 -42 151 463 -76 -29 98 -47 -41 15 -111 219 -112 -24
2028 -24 -1 -79 -137 22 -95 -177 -9 -111 99 25 -187 121 -54 -179 41 -120 -164 223 -142 -226 195 120 237
2051 237 138 -163 87 -349 -298 194 22 -134 425 -114 -111 -69 -247 -208 152 73 187 82 -36 -155 -2 -61 429
2074 429 155 -466 59 19 -186 -150 118 55 41 -19 -35 155 18 240 -75 -373 148 99 -290 -161 257 84
2096 84 279 -96 69 -36 -307 182 -17 -421 9 126 -388 199 263 108 111 -101 -19 -15 -176 51 146 -345 -22
2119 -22 101 -195 -105 -51 -183 -162 113 -240 275 -198 58 41 -398 158 136 0 -17 198 -408 10 342 136
2141 136 -321 -19 40 -104 -134 118 259 -598 -137 292 -71 -15 181 -67 273 47 200 112 -67 317 12
2162 12 -372 -11 346 64 146 251 -65 -50 -4 -22 48 -45 65 488 -181 105 152 7 42 12 -92 -11 -26 150
2186 150 197 -56 272 232 -74 -219 188 -63 -11 43 76 -193 121 68 -201 138 12 37 210 -1 36 37 -62 255
2210 255 -229 -231 -47 -113 21 -176 -109 -137 10 23 25 -131 -269 -73 125 -72 49 -90 92 289 -66 -48 165
2233 165 86 354 -163 -175 98 -216 -302 -136 -186 -51 -30 87 -85 81 155 145 94 91 11 -182 -85 -52 -150 -200 79
2258 79 -147 -50 167 -30 -204 99 -76 -45 -364 -17 222 107 -151 33 149 -266 -33 48 115 104 174 -37
2280 -37 -101 -262 -168 -67 -263 85 -54 -94 16 -62 -6 182 -77 124 -256 320 -82 -193 -240 203 250 -15 39
2303 39 313 -14 -23 20 105 -130 -60 -10 103 52 -19 -123 -91 259 -118 -75 293 -295 -133 47 -83 142 12 69
2327 69 -24 184 -55 -112 18 28 -112 9 222 -119 64 30 41 -104 4 -166 9 49 15 212 60 254 222
2350 222 67 171 -92 -30 -11 -52 -94 11 207 8 92 -30 -14 144 63 234 -86 -51 -153 -136 -117 51 153
2373 153 -1 -21 93 -69 -52 -162 -42 -137 9 111 -60 289 -149 193 -172 158 -137 137 10 -371 182
2394 182 70 192 -164 -124 136 -98 -251 92 113 -196 -177 8 -6 -150 7 -221 287 -74 -70 -226 -167 -160 -163 -254
2418 -254 26 240 -76 346 239 17 35 -93 -284 -92 135 155 186 -169 113 101 -170 -105 14 -135 277 0
2440 0 -231 264 -240 40 -25 -28 -59 110 -24 67 -77 -425 -234 -93 95 63 19 -138 46 -69 45 71 71 53
2464 53 213 37 2 -121 -225 11 -37 -104 173 -110 -93 10 -73 32 12 20 102 232 -116 -157 32 -111 -1 163
2488 163 228 142 108 206 -17 -63 -187 -168 -138 -31 -58 181 -188 71 32 65 40 158 -38 -241 -9 127 -109 -16
2512 -16 -188 -6 -67 59 86 96 172 -66 -181 -151 122 46 -39 272 56 -90 197 -2 -7 60 375 -43 48 195
2536 195 101 -178 103 -14 112 -18 -24 62 -41 -13 50 -13 145 -179 73 1 -66 -66 -99 216 63 188 18 45
2560 45 -39 325 -64 -5 327 232 -42 -143 -7 -122 -212 -60 7 15 151 -11 102 -55 -44 -249 -32 144 -51
2583 -51 -153 -30 78 26 -39 -18 -205 -133 -37 7 -5 96 18 -169 91 57 89 20 134 120 -90 -334 27 -113
2607 -113 -32 201 69 -124 145 -136 -102 32 183 -61 43 19 164 -24 -246 14 -163 109 -21 7 234
2628 234 92 -131 194 -72 -149 -60 -190 -52 -194 59 69 101 195 -70 97 95 30 110 -62 -34 46 -229 156 199
2652 199 -268 -3 133 -272 -488 4 -137 -377 -2 60 49 -150 -96 98 -152 -124 329 -72 -171 -129 266 43
2674 43 105 -42 -34 -73 236 62 -13 -101 -38 56 138 78 -9 -129 16 20 94 -210 -137 -295 164 -146 56 -277 5
2699 5 190 25 21 118 113 7 128 -92 111 -25 -178 0 84 -91 -280 -21 184 108 35 -100 110 -158 14
2722 14 -32 -2 138 -177 46 499 30 186 148 22 185 278 114 -205 271 46 -43 249 -57 -13 -57 145 -85
2745 -85 -165 -94 -37 -31 -104 7 -196 -160 335 15 42 -107 212 -49 158 -281 -168 101 64 238 -88 165 157 34
2769 34 47 -133 -24 -22 131 -85 171 180 19 -98 10 156 54 152 -70 127 -126 -114 -246 -154 213 83 1
2792 1 -173 -146 -42 -105 -198 2 -320 -10 -140 110 -154 89 -3 -335 353 199 235 8 -85 67 64 136 64 -63
2816 -63 -138 -269 85 135 150 -140 61 104 90 106 247 -203 122 174 -28 -139 -100 89 73 8 35 -87 235 -31
2840 -31 53 -124 159 71 29 -233 153 -159 257 7 103 28 -219 142 9 132 -102 216 -54 229 60 92
2862 92 -37 -41 -48 -82 -88 10 -26 -64 -89 -7 -89 255 -119 -239 -126 51 -71 -138 -13 -120 -11 226 29 210 70
2887 70 44 -71 -125 136 174 229 -27 161 150 -104 -103 52 -66 83 -213 -13 21 130 -278 94 45 58 65 145 -88
2912 -88 -110 -55 -44 132 76 -28 279 220 -75 -3 187 34 175 16 -59 -159 -136 -58 42 307 168 62 346
2935 346 45 318 -57 -335 -156 45 54 142 -90 83 70 46 -180 -97 -160 -55 40 -27 38 87 -167 263 -166 46
2959 46 256 58 123 69 155 5 13 -118 92 241 153 85 -235 -29 252 -74 91 13 -21 223 -62 -53 250 118
2983 118 -135 -31 27 -56 -280 171 42 -5 -267 11 -158 -148 -17 -12 107 161 90 4 33 -87 111 76 -106 247
3007 247 85 -70 7 -24 -90 105 137 201 133 483 17 -148 215 -123 -166 -54 112 -252 -219 61 -2 30 82 -6
3031 -6 88 -83 -239 -160 79 -7 45 187 -23 60 91 -84 -222 -90 -120 -74 59 131 -18 161 -5 101 -123 125
3055 125 145 -64 4 -86 260 2 -47 -91 -69 -5 210 -206 -40 -111 2 -149 -12 36 -91 -158 -210 -90 108 285
3079 285 178 104 -139 33 27 47 1 137 -212 144 100 263 -87 -28 181 -79 -146 44 26 -222 49 -193 -140
3102 -140 218 -133 -173 -183 -7 -68 263 -142 155 53 12 -146 62 19 161 -145 -135 70 -125 -237 -77 47
3124 47 370 -107 26 -60 303 45 -19 -18 -52 248 -120 -162 -19 -145 22 52 -102 38 281 -239 -125 -9 -80
3147 -80 -76 -132 150 -145 69 137 -118 194 188 -73 37 53 276 142 90 -76 -144 -61 -83 194 53 17 62 68 204
3172 204 -15 285 -164 -48 -40 -198 16 -178 117 -77 -58 95 231 -253 -38 -235 285 -30 -154 -149 86 -17
3194 -17 -184 2 -46 159 131 0 220 -296 -63 -57 239 77 2 -8 -255 -81 -70 73 -232 29 -47 -58 -83 -254
3218 -254 -74 -72 -303 -22 -247 -25 17 105 239 64 -110 231 188 -23 15 -126 -38 3 27 -26 -47 -63 66 -21
3242 -21 140 -124 366 -4 -17 -152 39 -66 144 54 -18 30 -47 137 78 -134 -108 213 -61 46 -3 129 63
3265 63 -109 -214 -59 -6 -211 -50 42 21 247 44 -160 -130 100 -73 -117 245 77 63 80 -88 -193 121 -166
3288 -166 74 4 -37 -193 88 260 -37 -157 -109 -92 -80 74 -271 2 113 19 -116 27 120 -162 -79 101 188
3311 188 311 -56 -218 197 -154 43 181 -12 74 -150 212 75 185 31 -439 227 -54 -207 31 -271
3331 -271 -168 259 12 28 51 -81 44 38 -392 -129 99 -192 -280 193 -3 69 6 6 -59 -292 11 -129 89
3354 89 -13 57 -12 101 204 -30 -228 3 -106 173 284 251 209 26 39 9 64 228 -306 -20 -87 159 116
3377 116 -22 195 -49 220 -116 -306 -87 -71 -98 61 -59 -166 -1 -104 196 190 -381 -11 28 -129 -9 61
3399 61 -30 27 10 -135 103 100 -6 91 58 -95 -124 106 -204 -57 -102 -222 183 76 181 -263 -31 199 -131
3422 -131 119 -172 95 317 76 140 -48 -9 -69 180 -143 -175 -134 39 135 -110 51 27 48 -183 104 169 105
3445 105 139 19 136 53 139 69 131 -72 95 -43 -8 247 -259 135 147 1 -33 -150 141 163 -375 -185 -8
3468 -8 -53 117 108 394 100 -119 26 -103 22 -85 -6 108 165 -49 59 56 -64 -382 28 -51 273 5 10 -24
3492 -24 62 82 -13 -64 170 12 -278 237 131 -163 7 -75 317 241 0 -91 -372 264 -8 -18 46 12 -124 82
3516 82 138 -13 -62 -201 -163 -14 -205 -111 126 -255 172 181 112 -172 45 -59 -71 -35 62 -79 237 -130 -32 66
3540 66 -35 126 66 -65 -128 67 166 -103 95 92 100 -34 -55 -232 -65 -176 28 194 -133 -62 -123 -168 -33 37
3564 37 31 -21 93 -102 -65 201 68 83 104 -105 71 168 263 -196 -6 -78 197 148 32 -112 -263 338 117 -193
3588 -193 49 -7 37 -34 -218 29 -132 -96 -4 60 17 207 116 -136 -60 -41 183 -15 61 -177 113 6 44 64
3612 64 -129 210 -154 -57 -24 127 46 -68 -135 -312 50 78 134 207 -4 -2 1 -208 -93 55 -30 -145 16 159
3636 159 88 108 -116 -25 6 -74 -294 -54 -135 -93 86 -189 32 -28 178 -85 4 -80 -72 292 -30 -33 13 -145 -134
3661 -134 248 204 -207 53 -192 220 -120 54 -223 -58 3 2 90 6 17 -151 -253 -150 70 52 60 -12 -99 84
3685 84 -70 -49 -70 294 -17 -202 43 130 -50 -318 77 38 -291 31 117 -193 43 39 -217 -112 87 167 -11
3708 -11 9 -135 -109 101 45 -56 -112 -18 -105 35 146 35 200 9 -248 81 -68 183 57 -69 -106 17 -71
3731 -71 -211 203 -20 44 29 -217 -136 20 8 143 -160 -71 2 55 161 -120 -26 -204 15 179 93 -64 -72 -2
3755 -2 -68 -174 95 -16 -150 116 -40 -176 124 297 -95 245 -283 -104 -136 -2 -8 0 -57 31 -57 3 -13 97
3779 97 106 -172 -213 -171 -11 27 240 126 80 51 232 -50 -31 51 26 155 -207 55 4 149 111 -337 -28 -112 -207
3804 -207 -159 79 -177 11 -95 8 72 -129 -47 203 -311 87 150 6 -15 -45 224 -143 -20 -303 80 57
3826 57 -28 -101 129 -149 -68 -64 90 290 90 150 179 135 -65 -182 200 -33 98 185 -160 52 198 60 19 -103
3850 -103 37 -71 8 -244 -66 440 215 -103 -3 -2 -4 4 -144 -136 33 138 192 -118 -145 68 -124 79 -17 36
3874 36 237 -182 69 -17 86 -135 -30 27 -75 -59 -21 -36 222 -162 34 -76 -306 85 57 94 191 -115 -65
3897 -65 35 -249 -64 78 -16 -67 -140 136 -24 75 199 146 121 90 -195 10 114 226 -109 42 -143 90 -198
3920 -198 128 -64 75 -90 -149 -44 134 109 79 -158 -114 -60 -174 26 -309 -118 -1 -43 -189 -1 -63 101
3942 101 138 -121 -42 -119 96 -114 -22 38 -171 94 36 -149 -46 -57 -57 51 4 -129 3 -105 13 67 193 115
3966 115 93 -17 247 -59 9 40 -21 46 104 194 85 235 -211 -196 14 126 -120 -61 270 -233 -168 101 61 -30
3990 -30 -49 -243 -107 -81 -50 32 -284 100 149 8 -196 4 -147 213 69 110 176 46 -43 -237 -9 -144 107
4013 107 -94 -135 46 -61 -49 277 -38 -268 117 -35 -197 -31 -176 224 181 -149 -22 -109 107 -186 -12
4034 -12 -119 -128 -47 -12 34 -133 -162 -200 239 160 -22 -123 308 -155 -267 -97 56 -113 -85 -206 77 60 110 28
4058 28 -125 100 -208 -124 24 -56 35 191 35 44 -39 -4 -42 -68 -132 -235 -40 160 -232 -8 -3 -139 -62 -49 31
4083 31 89 98 42 46 -22 13 22 -263 -126 -96 -129 236 124 41 303 -15 87 82 -65 -33 74 -69 -130 -138 -173 344 168
4110 168 -191 125 179 -35 -96 108 57 65 9 212 130 23 211 69 80 181 44 115 -81 -37 -97 31 182 -62
4134 -62 -118 4 -148 72 -89 -81 -86 103 -54 -156 122 134 104 -81 -119 -157 -73 -189 49 -34 -138 186 -82 110
4158 110 -45 -253 -67 -124 -39 79 137 -59 52 -202 -95 136 -34 40 -257 -3 -44 27 -16 78 -9 17 -133
4181 -133 165 128 -164 -247 130 -1 -38 7 198 -66 -29 15 -205 -126 -126 -86 -1 61 50 -36 -129 -150 -97 -163 55 -136
4207 -136 8 -129 138 10 64 -25 -36 -39 27 124 -38 91 12 218 -14 42 -166 76 -37 -134 -91 37 40 153
4231 153 -1 -236 -50 -396 252 -51 270 4 -2 -146 98 -51 -151 -138 32 99 -184 -52 -110 -53 125 294
4253 294 70 81 78 -19 -20 187 -111 -46 66 134 -7 -168 25 139 -25 340 -164 -163 -57 99 -102 0 246
4276 246 119 -185 -15 100 -118 70 32 -1 -100 -115 34 248 -2 -32 -121 -69 39 39 7 -291 -59 378 7
4299 7 -37 25 -211 -76 123 12 -393 28 123 105 121 120 -13 148 -271 -101 -155 35 62 119 15 69 136 42 187
4324 187 -228 38 -376 -119 -146 25 -180 -67 99 5 73 281 -77 -213 -40 -94 -200 202 -18 -48 -108 -14
4346 -14 88 57 60 2 18 -283 115 28 -170 129 -85 -11 72 125 91 -74 87 232 -9 -133 68 118 87 -175
4370 -175 -234 39 -115 104 -174 -4 -9 -257 -68 -36 -142 272 116 79 -37 -111 44 -203 -119 186 62 -89
4392 -89 25 -155 109 -127 -68 89 208 -127 72 10 145 -141 84 -213 -71 117 -14 -170 -113 -159 125 101
4414 101 -62 -120 53 -55 139 85 -164 169 -461 -109 117 114 -1 -37 70 23 106 -55 87 300 35 -153
4436 -153 121 -90 -127 -24 -119 -152 198 202 -80 169 -31 -21 120 83 -273 134 -70 80 16 26 -103 92 194
4459 194 -307 152 106 144 -36 -104 92 90 43 -79 -99 -18 19 228 23 -8 82 19 307 -126 111 -119 213 247
4483 247 -159 -126 141 -182 225 60 -347 132 -90 275 -97 30 -113 301 14 182 15 -213 260 -118
4503 -118 153 2 -29 336 82 -38 -4 -135 12 -281 -51 -82 198 235 159 -63 72 -93 -88 -62 -253 -4 4
4526 4 -213 -60 -315 -43 -39 73 159 0 -37 -50 -31 135 45 131 -106 107 73 171 187 26 111 191 -256 -154 389
4551 389 -367 51 60 240 -220 35 -150 -13 -120 -85 105 144 240 -224 -66 26 106 -71 -44 276 261 -22 -98
4574 -98 -174 167 45 -259 -7 46 126 -162 -84 28 94 116 -217 -127 113 77 113 72 -59 -54 131 170 209 -6 432
4599 432 65 104 211 127 -10 -102 -136 -146 -101 57 166 80 -306 111 26 39 -59 23 -82 -23 32 100 -208 260 -176
4624 -176 128 142 115 21 -25 258 18 45 -38 -121 198 102 -231 65 -321 117 181 -86 -113 76 -73 -47 -261 123
4648 123 -89 56 -49 -67 -132 24 186 -174 -185 -390 34 -42 2 -62 -24 72 -180 157 191 262 -163 -102 158 157
4672 157 140 109 77 -50 28 68 -182 -159 64 155 97 114 -131 149 27 8 -135 138 -114 178 276 -13 -82 -250
4696 -250 -2 -36 179 -74 -55 -73 28 -137 -18 -11 133 -271 -49 -124 -151 -114 -67 78 -132 -14 45 109 147 258
4720 258 145 7 102 140 -30 -257 -121 113 107 -350 -120 -32 54 53 5 -372 -70 -136 -125 -53 52 -81 -27 -263
4744 -263 -21 -74 -27 -133 71 -77 170 -126 -49 208 -211 70 -125 50 -73 119 -276 -57 15 93 -49 96
4766 96 -305 -85 107 -96 290 65 -122 44 77 -129 -141 -15 201 -358 152 -13 -99 153 160 -278 -154 439
4788 439 -168 -63 -52 -251 -179 158 1 5 42 121 98 207 284 -25 -51 156 -53 181 -55 20 11 112 -146 50
4812 50 127 162 108 73 -127 4 275 33 173 121 -92 -18 -127 70 110 113 132 -50 -7 18 21 -104 149 21 82
4837 82 -460 -207 -37 -6 83 -129 -207 -161 -293 -27 -191 -364 203 -37 194 139 -11 -119 -42 312 -298 -96
4859 -96 -108 -48 206 33 -119 113 -42 79 -75 50 87 -253 7 -7 163 -161 41 86 50 2 113 2 98
4882 98 -7 39 -144 -38 176 97 -235 174 -108 113 -225 301 125 -118 -81 328 83 191 229 -162 58 -280
4904 -280 -86 -19 -108 203 163 -70 257 52 -3 -224 191 22 -102 351 -192 -166 9 11 128 163 -266 339 -210
4927 -210 -216 -114 225 44 217 171 -294 -15 165 11 -154 -106 -37 7 204 87 -110 -70 127 -95 -174 -63 95
4950 95 -31 -32 -89 -1 42 145 -226 -45 27 26 -53 94 16 -64 104 31 265 -106 216 -194 33 -114 201 225 45
4975 45 65 -115 -82 14 -179 -66 -55 247 82 -3 -112 31 -83 87 -156 -105 12 -80 -111 39 11 -91 28
4998 28 -67 -136 154 1 -42 220 -132 -72 -218 -228 -454 -103 45 -236 104 292 156 197 -20 157 81 -109 83
5021 83 -93 227 -198 20 -516 -174 76 281 -55 32 -147 113 32 -123 47 6 -189 59 -65 61 113 -152
5043 -152 74 -87 14 79 -239 -20 -56 4 -120 219 -243 29 332 37 -22 -391 85 136 21 -55 255 14
5065 14 -235 80 -199 -304 12 -145 -249 127 1 -517 201 -138 116 -13 189 78 5 159 79 126 122 -15
5087 -15 -231 160 -212 139 161 70 -100 -4 -15 -89 138 -139 218 -37 9 135 221 -423 -28 -36 -272 97 -113
5110 -113 315 34 38 -270 -80 13 -23 67 151 -35 -153 -163 28 51 129 77 -49 -120 54 -29 95 0 -82 96 226
5135 226 133 -7 -240 -174 134 -53 8 -169 62 -116 243 -50 49 164 -46 78 26 -182 -130 18 -141 174
5157 174 -19 -89 -165 -100 -79 170 178 187 88 -72 19 -41 40 -109 67 303 -24 -23 -153 221 41 -104 161 38 -54
5182 -54 299 -92 -74 168 20 -70 111 -219 116 -373 14 -164 121 -338 44 134 -69 18 134 -130 -139 184
5204 184 46 6 -30 -66 54 4 -265 67 123 364 -93 -216 -82 -191 -12 51 -278 -95 -55 101 -105 80
5226 80 96 41 -18 105 -55 15 -101 -85 28 12 -14 -104 92 -195 46 67 152 -199 -20 19 -173 -316 58 214
5250 214 -24 -101 35 211 369 27 -253 84 -172 146 -30 -98 51 163 95 -135 132 272 59 23 -27 2
5272 2 -52 -131 -142 -61 4 -373 -13 -120 7 -371 90 275 53 62 -254 83 -18 144 -39 -116 87 0 -39 30
5296 30 61 131 -308 22 -18 -354 -81 30 54 159 -206 -152 23 -214 46 170 11 -113 -257 -278 -4 -69 21
5319 21 -55 19 21 31 37 -71 -102 -406 140 25 82 55 -63 -39 -32 -289 180 -21 76 -19 11 -46 -141 -13 -40 -240 -74
5346 -74 -50 67 -218 23 8 164 76 -287 2 -113 -193 -114 -9 -131 425 8 -104 -47 -8 50 -99 -129 -42 167
5370 167 -37 1 -134 6 -216 144 -90 -202 82 45 54 -142 113 139 5 192 20 51 -123 130 -25 -131
5392 -131 119 -73 34 118 2 -179 -213 -98 109 182 -231 140 -132 10 10 -63 -290 188 295 9 21 -45 149
5415 149 125 -2 -81 210 -152 -198 47 40 299 37 -132 507 9 -6 9 -3 265 237 37 -70 -5 -48 -130 123
5439 123 -59 72 68 75 43 77 -90 237 12 -24 13 -30 -99 -247 18 23 -100 -44 -164 27 -125 -115 60 -72 -15
5464 -15 -160 -6 -193 -278 118 131 131 -377 108 116 222 124 -57 -239 -57 -61 226 328 -134 -126 11 126 -144 107
5488 107 -261 175 -123 -71 -270 20 -19 -89 -25 88 -100 -75 -63 46 18 87 297 348 4 -154 206 -250 -99
5511 -99 100 -279 63 34 -78 104 106 22 54 208 162 53 -15 -263 12 -83 -253 -129 -14 -80 -200 -146 198 47
5535 47 14 -7 34 64 -72 265 -136 -14 -341 87 -15 270 -79 133 221 -5 -148 247 18 -179 -114 -15 -292
5558 -292 13 66 -32 -82 45 -16 -151 187 -99 -12 45 169 95 87 -79 52 230 -21 -85 -24 64 141 138 118 245
5583 245 -167 53 -30 138 95 5 48 -234 95 -190 191 -295 26 98 103 -96 -118 -26 92 -77 188 109 -65
5606 -65 -134 -2 -65 149 -106 -348 -167 -3 28 -68 -25 34 86 -134 -13 -231 29 -20 115 99 -28 -64 32 -98
5630 -98 227 -153 -154 25 -227 -128 -14 -36 44 309 -89 187 -122 59 -56 -120 193 187 -97 377 92 152 -162
5653 -162 -52 355 -25 90 50 -138 126 -191 142 85 74 -91 32 87 -122 116 113 -25 83 -15 -37 -106 -36
5676 -36 -78 225 125 86 6 105 212 189 138 -75 108 -100 -57 10 82 -11 128 -54 31 -131 62 -72 -242 37
5700 37 -24 -149 -196 -17 -12 -25 -90 91 -128 -125 -59 -190 137 -2 50 -15 -23 32 84 -32 73 48 -42 -95 127 49 -110
5727 -110 -78 -320 -20 1 -48 42 -204 -4 -2 104 -146 -192 -3 101 228 -20 235 311 209 155 46 149 -104
5750 -104 111 132 -203 -144 -69 106 -95 204 110 116 177 -135 -156 -71 -97 108 -147 -261 -35 -85 98 -97 -33 -81
5774 -81 -35 25 -89 57 -52 -17 -11 -75 -44 194 -122 -12 -98 279 -72 77 62 -86 -112 -222 190 46 -108 -110
5798 -110 -7 -49 147 56 -46 9 238 7 39 -123 198 8 -253 -56 -58 -151 -207 -234 101 146 -116 -6 -67 -264
5822 -264 -6 52 -76 -133 -149 171 -10 -134 -39 -314 -66 -182 210 87 37 41 231 -321 -32 -9 -163 -19 26
5845 26 43 -160 -341 239 -141 20 -97 -347 52 132 255 57 22 72 -22 323 264 128 29 110 117 122 109 -69 2
5870 2 -80 152 -26 61 93 190 102 -57 24 -19 16 -213 -53 70 -170 -31 -48 -147 -5 194 -2 -70 -29 123 -188
5895 -188 -107 -7 173 -128 -21 29 390 202 -23 106 -31 8 -161 -154 -187 125 167 -169 95 112 194 -98 -180
5918 -180 -79 313 119 42 10 23 -41 338 144 -157 296 -5 -171 459 18 -33 26 184 -73 51 -38 -104 -57
5941 -57 108 -63 -131 135 11 262 -28 -118 195 59 151 -103 141 222 -152 43 -225 88 124 -117 62 -4
5963 -4 -155 -107 67 50 95 -66 15 -51 -2 232 -178 124 -254 40 43 250 -145 -107 31 53 -92 281 13 -275
5987 -275 -61 27 5 119 -75 224 31 224 -35 -179 -197 -87 221 113 29 151 26 68 -256 156 130 96
6009 96 -261 -127 -161 98 -215 54 -50 -44 -61 -109 -161 32 2 132 -94 -176 5 135 -193 -213 -89 -91 229 -125
6033 -125 195 -180 98 -204 -57 -124 224 23 62 30 -51 65 7 -120 218 159 12 -127 -28 53 -55 166 132
6056 132 -244 31 109 -65 55 -90 -125 -120 -68 220 162 -112 -86 -319 -167 101 7 -36 141 -16 -80 -234 164
6079 164 37 -122 -80 -78 -35 163 21 109 -196 112 70 118 107 -129 98 12 101 261 170 159 -115 255 -91 90
6103 90 150 56 -82 60 149 37 -127 32 135 -17 -167 169 -21 -9 -54 -4 -114 17 -289 93 -212 -402
6125 -402 -83 -40 -45 56 -228 147 70 151 55 -12 -140 -162 -65 -112 -204 198 -108 -311 -51 -46 25 -30 5 -8 -121 -199
6151 -199 1 189 -338 -149 -50 -182 -11 127 81 -301 120 -93 232 108 -32 -76 -249 -57 95 23 96 -134
6173 -134 -74 441 76 15 -107 -26 -76 93 -86 304 -114 19 110 153 -70 59 97 -31 274 -32 183 -7
6195 -7 66 70 48 286 155 198 128 114 93 275 148 173 23 -14 -176 -198 137 -90 -80 -68 8 47 257 111 -9 -266
6221 -266 -171 -153 -183 -27 -78 79 -349 54 104 -37 310 -133 -28 18 -33 146 146 -13 -91 150 -38 27 -254 -67
6245 -67 90 161 184 -151 31 108 -54 -385 68 -174 -4 -202 39 68 -97 95 -402 292 -4 -192 -300 104
6267 104 -13 75 180 42 -22 125 45 118 117 -54 -3 80 88 -19 17 -186 96 106 12 -194 -144 -20 132 -78 280
6292 280 161 -52 -234 -61 -285 158 -64 -317 -37 -131 -117 -91 -180 -19 -21 164 156 -117 -96 -78 119 9 114
6315 114 -15 173 -171 -143 -176 59 -121 116 151 69 58 -47 12 -106 99 28 117 214 28 119 12 58 55 -372
6339 -372 -2 -194 -68 -27 53 29 -177 -51 -274 105 -28 -125 60 -55 -134 5 277 21 442 -16 -175 -241
6361 -241 -145 6 149 -105 29 21 152 250 113 96 -216 85 -111 50 -87 104 46 -89 -49 -241 22 289
6383 289 -107 -71 -25 24 -188 172 -14 146 104 -39 -236 147 139 -3 -30 301 -309 54 3 -316 4 144 148
6406 148 -189 44 -402 -7 -184 -30 49 -143 -152 -35 197 55 -19 -31 -283 13 -105 -117 105 73 -163 -59
6428 -59 -40 140 151 -43 110 115 -4 135 -76 99 -120 14 177 118 37 -4 -12 135 -155 -178 6 72 45 -28 -40
6453 -40 -40 399 -73 -236 28 195 137 146 37 -101 -38 49 33 -49 154 -72 77 -89 -161 -78 -130 116 -109 -78 77
6478 77 -127 275 -150 -17 79 98 201 -85 112 148 152 -45 -2 -42 -4 -25 265 -9 -3 19 58 -232 -8 69 -257
6503 -257 125 -120 -75 0 29 -175 -73 36 237 -38 54 -165 143 102 -1 -172 90 34 187 23 21 135 -75
6526 -75 -264 -144 -46 -96 52 -63 152 123 -184 48 -36 8 -97 111 -37 39 12 75 155 -156 -10 -27 115 125
6550 125 -35 14 -138 -221 -113 -123 308 158 37 -152 -121 99 216 -25 -26 138 -2 -21 212 29 -190 187
6572 187 43 -2 -15 38 72 13 68 21 125 11 62 72 -78 80 46 -15 -89 53 -33 -225 -322 0 34 46 28 -53
6598 -53 -182 39 -136 -29 16 113 -61 -120 -22 57 -127 -259 -156 -66 83 -87 -29 67 -41 126 103 22 -49 158
6622 158 40 31 -49 -75 -51 160 59 16 18 -67 61 163 -91 -128 -111 37 83 -113 -32 29 71 -49 -302 406 187
6647 187 64 -80 143 42 -168 -50 105 308 146 -164 212 -26 -31 -62 -73 5 -43 321 -92 295 66 -108
6669 -108 -70 -237 322 119 199 59 73 193 102 -143 38 74 66 -87 -42 199 -109 113 -196 -121 -191 -42 24 114
6693 114 -59 -20 29 162 -187 131 16 160 45 -93 168 -342 -15 -227 216 -197 204 -139 -48 170 77
6714 77 -61 37 187 4 -55 -15 -47 30 171 -229 74 -8 -25 -103 -45 44 -72 -134 -133 -2 33 -66 332 111 11
6739 11 -146 62 68 159 147 28 303 239 82 -1 486 -8 158 -49 -23 257 70 -9 102 -159 -241 63 122 -134
6763 -134 -223 57 -157 49 -74 18 30 245 -66 -198 -12 -176 -259 -205 -67 -279 102 -150 3 -173 -1 2
6785 2 -52 -54 199 98 -131 -135 -24 255 -146 136 -108 194 73 -281 -203 152 -149 104 14 -22 65 13 -262 50
6809 50 -192 -94 -104 164 152 35 156 51 119 -153 134 139 -163 -23 -128 97 3 104 68 -104 -87 124 29 -189
6833 -189 -395 131 -64 -312 -170 -17 -83 121 171 -194 -120 -45 321 -45 -51 58 -116 -214 -179 -36 24 81 186
6856 186 59 -183 -30 59 -84 65 210 -199 222 -189 -168 50 1 -69 -10 -122 167 -87 27 12 106 107 -67
6879 -67 -34 -66 99 -92 -179 -414 206 29 50 -74 -37 70 -59 136 166 145 -498 4 -131 -69 178 -33 132
6902 132 158 -31 -210 5 -24 72 101 29 -130 26 160 -289 -147 20 55 -94 -97 -79 -77 -4 -115 -114 160 -2 289
6927 289 11 12 -1 -35 3 96 -229 -189 109 23 -118 75 125 -241 -16 92 -184 92 216 -80 69 -64 134
6950 134 92 -104 22 33 43 55 60 -170 152 -14 83 -109 -71 -55 -66 -25 -122 -205 -175 -9 -103 -123 -7 -2 28 37 -197
6977 -197 63 -103 83 -49 -167 -165 77 -13 -250 -96 -104 -104 -165 -120 -26 -270 15 176 -68 -119 -19 -167 150 -164
7001 -164 84 51 -221 -236 223 40 -9 -224 244 -169 261 18 -230 -41 23 176 -283 279 42 -71 6 -88
7023 -88 115 -202 33 101 -77 18 64 105 -75 -70 -163 98 -126 -113 13 -70 239 -120 20 -68 -29 27 -59 -286 -48
7048 -48 -25 2 130 59 66 195 144 165 253 192 -30 400 -350 -222 385 -132 11 119 64 323 -63 -85 -153 184
7072 184 165 -129 -223 -257 -121 -192 -54 -157 104 -103 95 206 -70 50 -98 -50 -79 140 -189 -18 -177 191
7094 191 -304 -11 47 -69 69 86 41 -168 -100 7 -72 70 102 -138 120 16 -269 -113 -252 190 76 39
7116 39 -175 -84 -83 -27 -99 -182 -80 150 1 -141 6 -89 80 1 140 73 -114 154 50 -266 27 180 69
7139 69 -20 -92 -215 -65 159 33 -180 126 186 203 100 170 -99 -240 9 -250 -72 -94 -191 80 -81 -47 -29
7162 -29 -448 72 141 -309 61 -3 -23 -5 -58 -146 -59 0 146 130 32 -3 -127 -14 -153 -101 -57 61 -145 -147 -128 122
7188 122 -15 165 325 -145 -65 122 -3 -158 -190 112 -107 -133 -57 217 -115 81 -121 58 11 -73 -80 -106 203
7211 203 -72 200 -146 55 -66 -66 -33 -331 -90 186 -269 131 303 44 -189 -92 60 -12 25 207 77 -20
7233 -20 -81 145 -212 -204 -5 -152 136 -49 -139 299 46 -142 259 76 -44 -313 -22 -94 24 76 84 18 -12 -15
7257 -15 -144 -150 -196 305 -33 -77 194 165 283 -317 9 -123 -186 67 146 -96 -177 6 -47 -153 -159 162 -104 -16
7281 -16 7 105 -282 -61 -179 -234 -116 -85 -39 66 -68 -20 -101 34 -25 2 146 -45 -141 181 53 197 -19 58
7305 58 128 -67 -4 8 -78 -89 -168 -219 240 181 -42 -116 143 165 -47 5 -154 85 83 223 87 -148 115 64 -88
7330 -88 -144 -81 -208 14 117 -180 -215 60 -120 36 -125 -103 -62 158 -62 16 92 114 -71 127 132 144 -443 186
7354 186 135 85 -275 141 67 286 113 -80 -164 -40 10 54 -1 -295 -83 -251 292 197 126 47 -81 -115 190 12
7378 12 -23 98 72 142 -130 -62 23 -123 -56 253 -153 44 -66 35 26 -32 0 -170 30 -222 -388 23 163 -149
7402 -149 -31 -9 66 -388 10 -80 31 244 238 -322 21 -10 8 103 -91 165 102 107 25 61 -59 -176 -241 -428 -182
7427 -182 -54 -264 79 53 57 270 -28 75 88 -76 5 266 -354 -12 -38 -146 22 -26 -59 -99 28 78 250
7450 250 -116 -152 86 -160 -8 -96 101 -5 15 82 -49 298 -256 -6 -253 -2 7 102 48 182 362 -126 71
7473 71 238 -286 32 89 53 -202 31 -138 -172 -47 -87 110 130 -187 122 17 346 125 165 -17 -44 263 -143
7496 -143 206 209 177 -100 -186 30 214 -137 257 348 -88 -142 83 16 -15 205 -304 -55 -13 -97 -40 14 -131 154
7520 154 -2 33 93 314 -117 95 -114 189 79 -67 -213 23 117 -17 155 -66 23 -323 187 45 20 -5
7542 -5 17 145 74 37 -130 -70 322 170 72 154 -106 -166 14 -98 -138 40 -111 -147 -18 84 109 -137 -58 -97 -31
7567 -31 177 136 225 -54 55 245 -3 162 -45 144 -27 -20 -2 -303 104 219 -151 40 -129 201 -134 -53
7589 -53 4 -37 -132 142 127 -190 207 25 314 -10 75 32 56 45 -101 30 37 108 -5 9 73 327 -19 2 -4 -5
7615 -5 180 57 -99 -8 -5 -54 -24 -157 49 -262 62 -4 -74 27 -227 -88 -77 -170 78 -33 49 -46 149 7
7639 7 -7 50 -166 117 58 282 -367 97 47 231 -229 -2 55 -159 171 -93 152 132 275 20 72 250 159
7662 159 131 77 40 125 -104 76 41 58 60 -38 286 8 -129 -27 -21 -40 -178 -45 13 76 125 81 35 16 -84 43
7688 43 -129 -14 -113 -45 -139 82 61 18 188 -126 -136 -239 -181 39 66 -68 -58 128 112 -218 178 1 216 -115
7712 -115 146 -107 -188 -102 -253 23 140 93 135 95 -169 105 157 -15 66 -54 -53 -257 -144 -2 47 36 228 131
7736 131 141 -110 -169 91 -108 168 52 -49 -102 -6 58 55 117 28 114 -123 -51 151 61 -83 -77 66 -126 -112 -150
7761 -150 -102 -51 55 -230 42 -63 -187 -44 -168 -204 -203 -141 111 -201 -17 110 176 -26 -104 -114 -55 -45 237 -24
7785 -24 -398 -106 217 17 18 -7 25 14 -126 152 205 19 -111 -242 95 80 -21 332 157 -91 -23 -6 306
7808 306 -116 458 107 -118 12 -127 267 -173 161 -9 59 -3 12 106 -37 11 140 34 -11 -199 -79 -38
7830 -38 -55 228 -103 44 328 28 4 -123 105 102 -113 -300 44 100 -65 97 -194 -243 -217 204 -81 -167 -14
7853 -14 370 -111 -128 68 -11 -199 149 -137 -22 -114 -45 -42 20 20 52 -3 9 -157 -114 -256 111 -117 11 -233 21
7878 21 257 11 138 73 436 -9 -29 1 -49 185 -205 54 -370 -29 -5 67 157 -56 33 106 201 -202 10 57
7902 57 141 76 -62 141 10 -22 3 -1 21 245 -8 -42 -62 2 -140 335 135 73 33 77 4 -71 98 155 47 -12
7928 -12 -31 124 -222 -373 -154 38 -357 52 70 -18 138 64 -221 56 323 -274 -83 88 -247 214 90 94
7950 94 40 -107 -131 -9 -52 77 -45 184 -200 -119 103 -16 6 225 -224 -302 198 11 132 190 -123 238 18
7973 18 80 217 -187 94 -167 -94 -240 -163 118 -39 25 166 -75 -10 -124 187 80 16 117 28 -215 12 55
7996 55 121 -202 -22 -53 105 170 -165 23 -16 149 9 -149 -154 242 -25 96 94 121 98 -266 -96 -309 -15 -7
8020 -7 65 -30 91 129 -81 -11 -90 21 56 79 146 244 21 20 56 -234 71 247 48 -13 186 116 11 -4 230 213
8046 213 58 -56 -169 181 -182 48 -254 -186 181 66 -101 -50 -245 -185 -39 214 -54 48 -64 -43 98
8067 98 -90 -59 -102 -117 -144 -196 122 110 -170 174 -190 22 -95 334 127 -123 -52 -61 -289 96 -68 225 -73
8090 -73 -344 123 17 54 21 107 -201 -140 106 7 163 53 155 -144 4 20 -30 79 -59 167 -221 42 136
8113 136 -6 -183 -87 223 59 -71 -129 -45 153 -3 -57 -87 6 119 293 79 -172 145 92 83 137 96 124 40
8137 40 74 43 -52 -153 -232 -211 65 72 158 -94 32 -55 -87 -39 90 -338 -84 -141 -36 8 -98 -203 134 234 -35
8162 -35 27 -216 -167 20 74 143 -65 155 150 -107 106 75 -80 139 208 73 216 87 -143 -21 44 79 -25 64
8186 64 -125 -145 -14 126 142
8191A42
##END NTUPLES=NMR FID
##END=
