##TITLE=1H_LR-732-C-K1-EK-MPE
 CDCl3,8 sc, 
 1.03.2021
##JCAMPDX= 6.0         $$ Bruker NMR JCAMP-DX V2.0
##DATA TYPE= NMR FID
##DATA CLASS= NTUPLES
##ORIGIN= UXNMR, Bruker Analytische Messtechnik GmbH
##OWNER= root
$$ XWIN-NMR		Version 3.5
$$ Mon Mar  1 11:21:13 2021 Russian Standard Time (UT+4h)  she@DPX200
##.OBSERVE FREQUENCY= 200.1315066352
##.OBSERVE NUCLEUS= ^1H
##.DELAY= (6, 6)
##.ACQUISITION MODE= SIMULTANEOUS
##.ACQUISITION SCHEME= undefined
##.AVERAGES= 8
##.DIGITISER RES= 18
##SPECTROMETER/DATA SYSTEM= spect
##.PULSE SEQUENCE= zg30
##.SOLVENT NAME= CDCl3
##.SHIFT REFERENCE= (INTERNAL, CDCl3, 0, 15.7039)
##AUDIT TRAIL= $$ (NUMBER, WHEN, WHO, WHERE, WHAT)
$$ ##TITLE= Audit trail, XWIN-NMR		Version 3.5
$$ ##JCAMPDX= 5.01
$$ ##ORIGIN= Bruker BioSpin GmbH
$$ ##OWNER= she
$$ F:/spectra/data/she/nmr/H-F/1/audita.txt
$$ ##AUDIT TRAIL=  $$ (NUMBER, WHEN, WHO, WHERE, WHAT)
(   1,<2021-03-01 11:20:02.64 +0400>,<she>,<DPX200>,
      <created by zg, POWCHK disabled, PULCHK disabled
       configuration hash MD5:
       00 E9 B6 7A A2 85 ED C7 34 08 36 98 17 FE 4E 26
       data hash MD5: 16K
       9A E5 EA 47 F6 38 7D 1D 9A 1D 3C EF EB 7C 61 B2>)
$$ ##END=
$$ 
$$ hash MD5
$$ 90 5B 7E 32 BB 1F 29 8D E2 D6 E9 AF 32 F6 05 4D
##$RELAX= 
##$RELAX= 
##$RELAX= 
##$RELAX= 
##$RELAX= 
##$RELAX= 
$$ Bruker specific parameters
$$ --------------------------
##$DU= <F:/spectra>
##$EXPNO= 1
##$NAME= <H-F>
##$PROCNO= 1
##$TYPE= <nmr>
##$USER= <she>
##$AMP= (0..31)
100 100 100 100 100 100 100 100 100 100 100 100 100 100 100 100 100 100 
100 100 100 100 100 100 100 100 100 100 100 100 100 100 
##$AQSEQ= 0
##$AQ_mod= 1
##$AUNM= <au_zg>
##$AUTOPOS= <>
##$BF1= 200.13
##$BF2= 200.13
##$BF3= 200.13
##$BF4= 200.13
##$BF5= 200.13
##$BF6= 200.13
##$BF7= 200.13
##$BF8= 200.13
##$BYTORDA= 1
##$CFDGTYP= 0
##$CFRGTYP= 5
##$CHEMSTR= <none>
##$CNST= (0..31)
1 1 145 1 1 1 1 1 1 1 1 1 1 1 1 1 1 1 1 1 1 1 1 1 1 1 1 1 1 1 1 1 
##$CPDPRG= <>
##$CPDPRG1= <>
##$CPDPRG2= <>
##$CPDPRG3= <>
##$CPDPRG4= <mlev>
##$CPDPRG5= <mlev>
##$CPDPRG6= <mlev>
##$CPDPRG7= <mlev>
##$CPDPRG8= <mlev>
##$CPDPRGB= <>
##$CPDPRGT= <>
##$D= (0..31)
0 1.2 0 0 0 0 0 0 0 0.06 0 0.03 0 0 0 0 0.0002 0 0 0 0 0 0 0 0 0 0 0 0 
0 0 0 
##$DATE= 1614583202
##$DBL= (0..7)
120 120 120 120 120 120 120 120 
##$DBP= (0..7)
150 150 150 150 150 150 150 150 
##$DBP07= 0
##$DBPNAM0= <>
##$DBPNAM1= <>
##$DBPNAM2= <>
##$DBPNAM3= <>
##$DBPNAM4= <>
##$DBPNAM5= <>
##$DBPNAM6= <>
##$DBPNAM7= <>
##$DBPOAL= (0..7)
0.5 0.5 0.5 0.5 0.5 0.5 0.5 0.5 
##$DBPOFFS= (0..7)
0 0 0 0 0 0 0 0 
##$DE= 6
##$DECBNUC= <off>
##$DECIM= 32
##$DECNUC= <off>
##$DECSTAT= 4
##$DIGMOD= 1
##$DIGTYP= 9
##$DL= (0..7)
0 120 120 120 120 120 120 120 
##$DP= (0..7)
150 150 150 150 150 150 150 150 
##$DP07= 0
##$DPNAME0= <>
##$DPNAME1= <>
##$DPNAME2= <>
##$DPNAME3= <>
##$DPNAME4= <>
##$DPNAME5= <>
##$DPNAME6= <>
##$DPNAME7= <>
##$DPOAL= (0..7)
0.5 0.5 0.5 0.5 0.5 0.5 0.5 0.5 
##$DPOFFS= (0..7)
0 0 0 0 0 0 0 0 
##$DQDMODE= 0
##$DR= 18
##$DS= 0
$$ [...]
##$SUBNAM2= <"">
##$SUBNAM3= <"">
##$SUBNAM4= <"">
##$SUBNAM5= <"">
##$SUBNAM6= <"">
##$SUBNAM7= <"">
##$SUBNAM8= <"">
##$SUBNAM9= <"">
##$SW= 16.9725356469052
##$SWIBOX= (0..15)
0 0 2 0 0 0 0 0 0 0 0 0 0 0 0 0 
##$SW_h= 3396.73913043478
##$TD= 16384
##$TD0= 1
##$TE= 0
##$TE2= 300
##$TE3= 300
##$TEG= 300
##$TL= (0..7)
0 120 120 120 120 120 120 120 
##$TP= (0..7)
150 150 150 150 150 150 150 150 
##$TP07= 0
##$TPNAME0= <>
##$TPNAME1= <>
##$TPNAME2= <>
##$TPNAME3= <>
##$TPNAME4= <>
##$TPNAME5= <>
##$TPNAME6= <>
##$TPNAME7= <>
##$TPOAL= (0..7)
0.5 0.5 0.5 0.5 0.5 0.5 0.5 0.5 
##$TPOFFS= (0..7)
0 0 0 0 0 0 0 0 
##$TUNHIN= 0
##$TUNHOUT= 0
##$TUNXOUT= 0
##$USERA1= <user>
##$USERA2= <user>
##$USERA3= <user>
##$USERA4= <user>
##$USERA5= <user>
##$V9= 5
##$VALIST= <valist>
##$VCLIST= <CCCCCCCCCCCCCCC>
##$VD= 0
##$VDLIST= <DDDDDDDDDDDDDDD>
##$VPLIST= <PPPPPPPPPPPPPPP>
##$VTLIST= <TTTTTTTTTTTTTTT>
##$WBST= 1024
##$WBSW= 4
##$XGAIN= (0..3)
0 0 0 0 
##$XL= 0
##$YL= 0
##$YMAX_a= 262667
##$YMIN_a= -287186
##$ZGOPTNS= <>
##$ZL1= 120
##$ZL2= 120
##$ZL3= 120
##$ZL4= 120
##$ABSF1= 10
##$ABSF2= 0
##$ABSG= 5
##$ABSL= 3
##$ALPHA= 0
##$AQORDER= 0
##$ASSFAC= 0
##$ASSFACI= 0
##$ASSFACX= 0
##$ASSWID= 0
##$AUNMP= <proc_1d>
##$AZFE= 0.1
##$AZFW= 0.1
##$BCFW= 1
##$BC_mod= 2
##$BYTORDP= 1
##$COROFFS= 0
##$CY= 11.3945322036743
##$DATMOD= 1
##$DC= 2
##$DFILT= <>
##$DTYPP= 0
##$F1P= 15.9154993809931
##$F2P= -4.1035820241983
##$FCOR= 0.5
##$FTSIZE= 0
##$FT_mod= 4
##$GAMMA= 1
##$GB= 0.15
##$INTBC= 1
##$INTSCL= 1
##$ISEN= 128
##$LB= 0.24
##$LEV0= 0
##$LPBIN= 0
##$MAXI= 10000
##$MC2= 0
##$MEAN= 0
##$ME_mod= 0
##$MI= 1.114404
##$NCOEF= 0
##$NC_proc= 0
##$NLEV= 6
##$NOISF1= 3.799351
##$NOISF2= 2.8
##$NSP= 1
##$NTH_PI= 0
##$NZP= 0
##$OFFSET= 15.70392
##$PC= 1
##$PHC0= -10767.79
##$PHC1= 18.80094
##$PH_mod= 1
##$PKNL= yes
##$PPARMOD= 0
##$PSCAL= 0
##$PSIGN= 0
##$REVERSE= no
##$SF= 200.130013532006
##$SI= 16384
##$SIGF1= 3
##$SIGF2= 2
##$SINO= 400
##$SIOLD= 16384
##$SREGLST= <1H.CDCl3>
##$SSB= 0
##$STSI= 0
##$STSR= 0
##$SW_p= 3612.71676300578
##$SYMM= 0
##$S_DEV= 0
##$TDeff= 0
##$TDoff= 0
##$TI= <>
##$TILT= no
##$TM1= 0
##$TM2= 0
##$TOPLEV= 0
##$USERP1= <user>
##$USERP2= <user>
##$USERP3= <user>
##$USERP4= <user>
##$USERP5= <user>
##$WDW= 1
##$XDIM= 8192
##$YMAX_p= 0
##$YMIN_p= 0
$$ End of Bruker specific parameters
$$ ---------------------------------
##NTUPLES= NMR FID
##VAR_NAME=  TIME,          FID/REAL,        FID/IMAG
##SYMBOL=    X,             R,               I
##VAR_TYPE=  INDEPENDENT,   DEPENDENT,       DEPENDENT
##VAR_FORM=  AFFN,          ASDF,            ASDF
##VAR_DIM=   8192,          8192,            8192
##UNITS=     SECONDS,       ARBITRARY UNITS, ARBITRARY UNITS
##FACTOR=    0.0002944,     1,               1
##FIRST=     0,             0,               0
##LAST=      2.4114304,     0,               0
##MIN=       0,             -287186,         0
##MAX=       2.4114304,     262667,          0
$$ Real data points
##PAGE= N=1
##DATA TABLE= (X++(R..R)), XYDATA
0 0 0 0 0 0 0 0 0 0 0 0 -8 8 -8 8 -16 16 -24 24 -32 38 -40 54 -64 72 -80 96 -112 128 -150 168 -192 222 -248
33 -248 283 -318 358 -398 446 -500 556 -617 685 -759 839 -926 1022 -1127 1241 -1367 1506
50 1506 -1658 1826 -2014 2223 -2460 2729 -3033 3386 -3801 4294 -4894 5637 -6585 7837 -9577
65 -9577 12137 -16272 23965 -42689 172135 125825 -258690 262667 -110721 -156270 258380
76 258380 -146557 -10155 177257 -200083 60999 88824 -150298 96719 46060 -126346
86 -126346 113106 17191 -125942 123368 -20692 -111217 173707 -84955 -68961 171046 -162653
97 -162653 30625 132895 -198192 129072 24080 -162891 193606 -85009 -79497 171684
107 171684 -157290 28357 114879 -160174 84634 27047 -127364 111861 -12631 -77723
117 -77723 102678 -50405 -55251 101604 -68319 -22951 104335 -109567 13951 87477 -141267
128 -141267 82490 44402 -142375 139601 -36848 -100036 161603 -106683 -18097 130284
138 130284 -147523 55719 64687 -134459 106145 914 -95061 114226 -43724 -51909 105060
149 105060 -64489 -21008 91342 -81225 5304 80077 -98376 41495 55245 -110368 86397
160 86397 9634 -96352 121459 -53106 -52038 123793 -103643 13672 88122 -122391 68656
171 68656 29394 -101718 97272 -22504 -59604 92596 -56703 -20262 73059 -67617 9551
182 9551 53367 -73226 28950 34085 -76625 53895 11586 -73351 77325 -25584 -53462
193 -53462 90702 -64652 -11813 78475 -92356 36837 40650 -92465 73755 -7307 -65215
204 -65215 86401 -46222 -26664 74081 -65945 7962 52039 -67492 30921 28395 -63545
215 -63545 46013 8343 -55345 60395 -14575 -42071 70744 -43113 -17741 70296 -68497
226 -68497 19345 50605 -80321 54624 13256 -68803 76648 -25462 -37290 74681 -53737
237 -53737 -2049 54746 -61663 26187 29196 -56513 41164 6160 -46354 48153 -11011 -34049
249 -34049 52864 -28180 -20131 52698 -46361 1732 44704 -59241 28838 22222 -60682 52485
261 52485 -8954 -43662 63042 -38675 -15031 53810 -56824 14495 32317 -56692 36043
272 36043 7588 -45036 43867 -12822 -28912 44247 -25755 -13178 40043 -36263 1186 33510
284 33510 -43815 19187 22040 -47453 37018 2014 -40846 50148 -21189 -21934 51773 -41625 3106
297 3106 38242 -50104 27215 16348 -43884 41555 -6613 -29485 44076 -23336 -11000 38723
309 38723 -32143 4201 28451 -36284 16566 17205 -35627 27908 3745 -31216 36416 -12642
321 -12642 -20660 39906 -28480 -3422 34442 -40273 15243 19435 -41594 31518 249 -32436
333 -32436 38535 -18097 -17002 36622 -29984 551 26840 -35078 14583 13566 -33420 24300
345 24300 373 -26730 30227 -12058 -17234 30949 -23103 -4513 27277 -30290 8899 17788
357 17788 -32992 21461 4450 -27655 30249 -9851 -17193 31704 -21931 -3189 26965 -28858
369 -28858 10826 16756 -29685 21305 3831 -24912 28063 -8208 -15404 29087 -19216 -3146
381 -3146 25032 -25181 9326 16225 -26773 19422 4065 -23359 25747 -7293 -14955 26629 -17160
394 -17160 -4592 23226 -23099 6533 15885 -24905 15625 5485 -22750 21601 -5539 -16004
406 -16004 24602 -15458 -6434 22169 -22767 4632 15870 -25218 14712 5349 -22852 20729
418 20729 -5512 -15526 22555 -14762 -5347 19735 -20606 4469 13290 -21746 12801 5518 -19506
431 -19506 17877 -3669 -14678 20175 -11238 -6924 19472 -17151 1935 14764 -20060 11106
443 11106 7580 -18881 17513 -2068 -14096 20479 -10740 -6210 19690 -16395 2825 14268
455 14268 -18738 10553 7045 -16929 16038 -1008 -12350 18060 -9023 -5767 17536 -14294
467 -14294 1990 13125 -17467 9191 6394 -16630 14870 -1151 -12314 16950 -8969 -5808
479 -5808 14881 -13454 1097 10938 -15384 6985 5258 -14972 11445 -313 -12270 13922 -6551
492 -6551 -8297 14843 -11829 -2130 13179 -15622 5259 7909 -16941 12117 171 -13205 16222
505 16222 -7706 -6612 15132 -13678 1430 10529 -14800 7724 4095 -12425 11076 -1316 -8168
518 -8168 11378 -4610 -4385 10270 -7238 -987 9320 -9191 2936 7525 -11359 7407 3822
531 3822 -11144 12359 -2220 -8355 14888 -9126 -1916 12508 -13702 6401 6373 -13427 11783
544 11783 -1488 -8879 12691 -6989 -2632 9871 -9016 1626 6122 -8689 3825 3337 -7956
557 -7956 4834 1231 -7694 6924 -1271 -7164 9342 -5321 -4434 10449 -10650 1002 7939 -12836
571 -12836 7531 2275 -11436 11695 -4674 -5748 11219 -9655 921 6872 -10126 5509 2148
584 2148 -7760 6657 -1026 -4849 6436 -1985 -3454 6054 -2929 -2564 6620 -4557 -562 6827 -7597
599 -7597 3531 4737 -8736 8090 -390 -6924 10991 -6373 -1827 9759 -9639 4161 5081
612 5081 -9120 7795 -420 -5301 7707 -3773 -1492 5327 -4858 1052 3157 -4260 1869 2346
626 2346 -4212 2105 1978 -5143 3678 769 -5668 6114 -2498 -4085 7116 -6336 85 5560 -8212
641 -8212 4517 949 -7087 7311 -3408 -3736 7125 -6349 475 4352 -6495 3135 1404 -4812
655 -4812 3499 -643 -3160 3322 -1199 -2005 3594 -1628 -1362 3994 -3249 256 4043 -5062 2755 2377
671 2377 -5455 5546 -485 -3664 6543 -3491 -576 5548 -5550 2554 2653 -4982 4567 -276 -2992
686 -2992 4774 -2313 -998 3650 -2664 425 2825 -2999 1287 2099 -3462 2204 1155 -3330 3403
701 3403 -736 -2807 4256 -2702 -793 4077 -4411 1528 2080 -4759 3540 -483 -3724 4117 -2544
716 -2544 -1411 3335 -3646 534 2094 -3744 1919 650 -3146 2571 -961 -2383 2636 -1694 -1478
731 -1478 3005 -2572 78 2726 -3218 1581 1607 -3715 3074 -223 -2638 3877 -2246 -1081 3347 -3458
747 -3458 1411 2496 -3589 2715 912 -2964 3769 -577 -1816 3614 -2243 -602 3234 -2879 970
762 970 2363 -3083 2330 1136 -3070 3373 -717 -2285 3925 -2590 -638 3339 -3834 1183 2054 -3912
778 -3912 2869 57 -2954 3551 -1444 -1872 3764 -2798 -540 2630 -3391 1001 1508 -3809 2273 175
794 175 -3483 3214 -1355 -2076 3615 -2973 -732 3326 -3959 1122 1952 -4304 3072 268 -3461 3870
810 3870 -1793 -1657 3980 -3013 110 3033 -4074 2148 1675 -3718 3049 284 -2942 3943 -1440 -1700
826 -1700 4014 -2999 -326 3444 -3543 1726 2472 -3699 3084 598 -3298 4043 -1372 -2077 4374 -3146
842 -3146 -66 3561 -3828 1620 2136 -4240 3404 175 -3690 4407 -1627 -2097 4186 -3322 -420 3571
858 3571 -4480 1682 2187 -4504 3209 411 -3793 4274 -1751 -2353 4328 -3352 -448 3514 -4505 1372
874 1372 2330 -4596 2869 490 -4102 3921 -1546 -2806 4571 -3171 -772 4017 -4261 1131 2746
889 2746 -4877 3314 1006 -4266 4716 -1560 -2531 4987 -3284 -635 4245 -4190 1700 2568 -4420 3184
905 3184 924 -3697 4302 -1075 -2386 4541 -2537 -831 3988 -3748 995 3153 -4631 2602 1630
920 1630 -4497 4262 -670 -3374 5174 -2915 -1291 4873 -4797 1085 3359 -5124 3203 995 -4392
935 -4392 4289 -1207 -3081 4288 -3083 -1418 4001 -3989 594 2982 -4434 1811 1718 -4381 3460 125
951 125 -3627 4593 -2294 -2453 4716 -4127 20 4001 -5317 2650 1804 -4628 4429 -1090 -3264 4785
967 4785 -2506 -1130 4480 -3615 220 3330 -4566 1805 2521 -4096 3520 813 -3554 4852 -2089
982 -2089 -3097 4774 -3531 -316 5083 -4119 1780 2489 -5429 3698 -181 -3608 5152 -1994 -2889 4311
998 4311 -3397 -367 2821 -3992 1632 2309 -4705 3059 1018 -3994 4147 -1007 -2960 4259 -2777
1013 -2777 -948 3417 -2834 1181 2731 -4637 3351 1201 -3974 4327 -1462 -3321 4720 -3667 -999
1028 -999 4042 -4279 601 2909 -3778 2662 488 -3614 4253 -400 -2255 4109 -2344 -1290 3946
1043 3946 -3657 555 3084 -4161 2598 1636 -3949 4214 -522 -3051 4437 -2282 -1199 4126 -3715
1058 -3715 1082 2725 -4344 2703 1342 -3605 3777 -606 -2553 3871 -1805 -1217 3428 -2816 -92
1073 -92 2967 -3780 1352 1814 -3902 2787 200 -3536 4076 -1617 -2105 4302 -3641 -8 3256 -4489
1089 -4489 1822 1457 -4036 3272 -525 -2982 3651 -1929 -1489 3331 -3019 20 2654 -3402 1107
1104 1107 1774 -3397 2042 703 -3064 3213 -854 -2577 3778 -2536 -799 3720 -3653 1232 2255
1119 2255 -4211 2804 474 -3174 3843 -1152 -1907 3616 -2348 -102 2851 -3124 1137 1821 -3230
1134 -3230 2353 740 -2836 2639 -336 -1861 3266 -1489 -1350 3467 -2984 386 2707 -3750 2040
1149 2040 1370 -3480 3475 -830 -2628 3580 -2537 -760 2885 -3224 1139 1892 -3107 1993 692
1164 692 -2611 2473 -441 -1929 2553 -1286 -1108 2713 -2070 -307 2535 -2874 839 1441 -3529 2649
1180 2649 291 -2621 3258 -1555 -1518 3367 -2731 199 2470 -3301 1803 998 -2661 2379 -110 -2042
1196 -2042 2562 -1363 -821 2513 -2087 10 2089 -2500 740 1392 -2278 1643 717 -2210 2588 -729
1212 -729 -1586 3086 -1779 -365 2578 -2738 932 1623 -3043 1900 427 -2401 2766 -1110 -1359 2671
1228 2671 -2115 -270 1991 -2169 889 1221 -2463 1406 387 -2057 2149 -363 -1629 2275 -1529
1243 -1529 -798 2300 -2067 379 1780 -2837 1433 503 -2341 2105 -527 -1426 2199 -1336 -644 1944
1259 1944 -2014 609 1521 -2163 1383 642 -2192 1752 -140 -1507 1906 -821 -753 1831 -1482 251
1275 251 1525 -1933 936 927 -1973 1741 -92 -1734 1954 -944 -926 1983 -1640 328 1589 -2127
1291 -2127 812 831 -1455 1507 -139 -1471 1923 -480 -892 1763 -1493 -9 1631 -1605 820 892
1307 892 -1640 1339 41 -1574 1530 -719 -913 1704 -1331 -57 1356 -1782 358 633 -1655 1231
1323 1231 189 -1360 1561 -286 -780 1504 -1039 -490 1473 -1581 394 1004 -1555 1047 386 -1342
1339 -1342 1312 -389 -769 1602 -792 -446 1394 -1340 430 947 -1487 1091 421 -1274 1245 -92
1355 -92 -792 1292 -715 -153 1297 -932 435 854 -1142 773 376 -1334 1173 -140 -873 1362 -660
1372 -660 -483 1240 -981 320 1076 -1397 719 378 -1221 871 -48 -920 1133 -773 -612 1163 -996
1389 -996 -146 879 -1164 534 542 -1172 989 21 -838 871 -569 -468 1117 -876 -19 809 -1018
1406 -1018 505 515 -964 695 44 -815 951 -64 -286 1031 -696 -43 897 -891 408 754 -884
1423 -884 629 13 -1060 923 -338 -478 1056 -482 -231 752 -885 133 589 -868 749 213 -850
1440 -850 764 -212 -554 870 -423 -210 667 -718 191 410 -785 379 154 -896 760 7 -680
1457 -680 813 -266 -98 820 -714 108 473 -918 319 292 -813 804 -102 -568 635 -452 -204
1474 -204 773 -557 -43 473 -650 108 335 -522 372 -41 -664 841 -216 -376 910 -463 102 721
1492 721 -514 267 198 -605 440 263 -427 433 -133 -210 579 -397 -17 518 -369 236 178 -399 382 182
1512 182 -428 360 -22 -352 474 -119 -85 396 -592 20 507 -724 392 -16 -336 592 -82 -359 610 -249
1532 -249 -63 573 -442 -40 367 -377 274 49 -493 170 -133 -351 280 -227 -82 361 -413 -91 336 -308
1552 -308 178 306 -460 407 23 -84 440 -114 -232 356 -399 -121 311 -477 354 112 -332 381 148 -271
1572 -271 204 -185 -114 153 -223 214 401 -421 -47 179 -376 174 80 -279 136 152 -106 549 -259 11 337
1593 337 -377 501 410 -247 -102 -45 -16 117 -32 -304 139 -133 -256 428 -105 97 -12 -186 301 86 -147
1614 -147 289 267 -211 381 57 -267 58 110 -110 245 -366 179 -48 -298 154 -41 -38 149 -27 -86 139 3
1636 3 -141 165 -2 -213 -17 -211 -78 239 -96 326 -198 -16 351 -221 -43 187 -4 -106 150 -11 264
1657 264 16 -200 282 -189 6 159 87 26 274 5 50 147 -9 76 139 -179 202 -1 -257 494 13 -101
1679 -101 126 -36 -167 108 -178 71 -64 -73 85 92 -276 109 35 -245 162 -26 -107 55 -23 9 -186 -50 321
1702 321 112 23 152 108 -134 106 -162 -293 183 -3 -105 342 36 26 93 -259 120 7 -100 76 -58
1723 -58 -131 166 226 116 35 -57 149 -151 59 -4 220 -239 234 -107 -122 284 -60 -39 41 -107 -211 -23 60
1746 60 265 -37 -29 -68 117 -63 17 10 20 14 -14 32 175 20 128 -28 -99 107 197 77 255 -217 -14 16 -136
1771 -136 -154 23 100 92 163 -51 -104 131 90 -136 47 118 -122 140 39 33 -26 -116 -172 -29 54 -268 -5 -14 294
1796 294 176 139 -138 -47 -63 -241 -108 -126 -183 40 214 12 -106 -16 47 70 -158 -181 -27 -3 -50 -157 -237 -328
1820 -328 -57 -167 144 106 2 70 140 -95 94 -51 -165 -80 18 -20 285 -60 -231 30 -153 187 7 -79
1842 -79 -41 -3 191 -208 -79 36 75 -182 -187 150 -144 239 215 62 153 -28 -1 31 232 -30 -141 -42 31 -161
1866 -161 -20 -192 118 -96 -280 -122 -57 -81 28 86 -184 108 -1 255 96 -84 -104 210 -26 -309 -103
1887 -103 137 40 76 76 35 -41 69 -76 -210 -97 -86 -91 119 -234 90 -68 -116 -235 -68 -113 -13 173 -32 111
1911 111 -66 -15 -45 134 166 -45 7 23 13 -35 -254 -51 -24 -160 -2 -131 32 216 -66 8 33 -29 31 5
1935 5 -83 -196 -139 126 -112 -99 18 75 -62 42 -48 151 17 102 133 20 -47 63 164 -133 -22 140 -271
1958 -271 -207 -100 -123 2 -67 130 56 296 256 134 -213 45 -65 38 -4 -21 -264 195 164 -72 147 -62 -74
1981 -74 76 -170 181 223 125 64 290 -13 -49 133 -155 245 -251 227 55 21 26 51 134 31 161 -73 -41 450
2005 450 -153 46 21 -251 20 42 -131 79 -94 46 9 -4 18 84 -188 -13 157 -298 157 40 -154 158
2027 158 -225 -18 80 -200 -23 234 -21 -7 104 -148 146 10 78 230 -119 87 204 -92 -32 203 33
2048 33 121 -65 -213 239 16 -92 33 -421 -78 239 -160 9 170 68 84 -68 -349 274 193 -97 288
2069 288 -33 -69 311 -59 -19 177 -164 203 183 -318 -49 155 -410 375 45 -133 96 -249 -49 129 -137
2090 -137 234 -56 -384 83 -223 -347 204 2 -214 193 -170 -285 135 -329 -12 16 -155 13 -43 -307 198
2111 198 -146 -423 169 -171 -187 195 -195 194 217 -240 3 306 -348 370 -25 -290 265 52 -197 257 -262
2132 -262 167 131 -431 -92 111 -165 262 192 -324 229 -231 -273 136 -173 -63 148 -448 -16 76 -199 178
2153 178 8 -190 77 152 -255 440 -213 -14 391 -433 110 -87 -211 142 205 -55 459 -265 -211 617 -310
2174 -310 118 499 -331 234 90 -217 250 68 -342 310 -184 -118 569 -378 -128 301 -107 106 357 -451
2194 -451 155 212 -394 351 -265 -309 417 -279 -99 317 -281 78 498 -426 180 -191 -514 281 117 -74 354
2215 354 -86 5 363 -344 107 238 -310 67 238 -319 197 -45 -493 126 -262 -162 365 -326 -249 281 -521
2236 -521 206 197 -642 271 30 -521 258 -40 9 581 -347 76 376 -284 156 352 -333 77 205 -135 214
2257 214 -168 -285 548 -448 23 606 -281 -6 222 -391 229 205 -458 561 -91 -348 351 -270 -5 597
2277 597 -384 -92 418 -241 130 112 -441 340 -61 -153 303 -151 -270 370 -331 -38 374 -695 151 225 -399
2298 -399 297 45 -305 623 -37 128 383 -557 67 369 -391 363 108 -644 442 102 -365 370 -369 -223
2318 -223 322 -123 77 242 -447 202 342 -435 619 97 -374 535 67 -99 445 -248 88 427 -482 222
2338 222 220 -483 346 8 -281 608 -225 -182 535 -76 -281 464 -317 -52 490 -342 140 312 -107 410 11
2359 11 -272 498 -266 -144 526 -542 253 252 -522 138 28 -425 322 -44 -305 630 -349 -326 410 -506 -102
2380 -102 239 -268 258 165 -572 180 3 -153 286 -81 -183 549 -352 -63 463 -402 193 82 -504 337
2400 337 -67 -500 626 -185 -684 384 -236 -157 189 -529 443 192 33 179 -206 -803 807 -274 -277 288
2420 288 -1165 -844 733 -725 343 344 -969 274 -47 -323 150 -112 -542 586 -41 -2 693 -608
2438 -608 -113 238 -264 446 311 -482 197 -142 -311 883 -446 94 252 -288 4 289 -618 55 128 -315
2458 -315 307 -215 -258 666 -288 -281 367 -609 -34 386 -672 12 267 -391 477 -145 -331 376 -139 -442 614
2479 614 -438 15 466 -479 126 117 -284 528 -40 -675 359 -289 -347 562 -389 -72 116 -247 -98 114
2499 114 -410 359 -65 -415 233 -66 -303 599 -122 -115 225 -454 242 331 -656 226 220 -598 524 -141 -281
2520 -281 277 -333 29 279 -328 279 203 -394 294 119 -530 467 -51 -126 705 -279 50 466 -579 82
2540 82 245 -492 218 -33 -436 441 -29 -92 530 -424 -163 276 -408 23 319 -422 278 115 -522 85 -45
2561 -45 -211 276 -471 -124 311 -387 103 169 -616 268 -49 -529 526 156 -399 418 -57 -106 430 -177 79
2582 79 570 -631 224 291 -329 193 -153 -185 408 -312 -288 540 -136 -63 438 -350 288 357 -351 316 -120 -341
2604 -341 525 -378 -653 331 -430 -170 19 -470 374 428 69 85 -367 -279 646 -38 -96 487 -504 -19 478
2625 478 -297 397 91 -436 592 91 -1109 1 -149 -503 353 -137 -559 5 -394 -79 -252 -282 4
2644 4 64 -72 -64 787 115 435 76 -278 -124 -309 80 525 219 142 45 98 -5 -669 49 -475 473 345 -230
2667 -230 144 -159 728 54 67 55 -562 106 194 135 410 -180 -207 269 -358 -137 360 -413 -12 262 -366 288
2689 288 41 -371 3 74 -473 395 -115 -170 358 -359 -65 423 -304 177 -147 -429 354 -107 -144 336 -152
2710 -152 256 280 -268 123 109 -406 129 157 -221 254 18 -247 350 -266 -3 412 -391 29 331 -442 47
2731 47 -88 -332 115 126 -36 529 76 -72 379 -217 -129 316 -479 263 27 -294 124 -3 -237 8 -246
2752 -246 -295 501 -88 37 115 -402 273 321 -514 219 156 -140 334 -263 -174 241 -165 -21 354 -462 -7 187
2774 187 -348 251 36 -25 170 16 -116 233 -106 -66 442 -242 109 233 -294 231 -21 -79 452 -119 -78
2795 -78 686 -33 -51 368 -249 181 339 -409 109 -6 -252 206 6 -55 327 -174 -180 141 -121 124 230 -363
2817 -363 -92 -104 -154 177 76 -82 233 89 -358 423 -116 -164 259 -376 145 247 35 203 -169 -186 114
2838 114 67 16 226 -21 -18 -94 -285 69 86 -61 42 -81 -179 267 104 -110 287 -247 89 55 -190 -15 359
2861 359 -227 147 -33 -435 245 -50 132 388 -240 -145 128 25 60 -1 -323 184 85 -146 67 37 25 363
2883 363 -103 -62 275 -221 39 68 -276 -12 239 -267 65 135 -185 118 -49 -103 172 -127 129 78 43 70
2905 70 144 -38 52 149 -354 161 -45 80 10 -39 -66 43 -315 -100 49 -121 131 78 -151 -32 -19 -1 270
2928 270 -89 -73 218 -35 -78 14 -38 25 -162 -51 -35 283 35 144 -17 -8 294 62 -11 364 -105 39 -134
2951 -134 -57 -8 71 -120 364 -58 65 433 100 74 310 -127 -229 145 -289 -219 -62 -136 252 -99 -356 329
2973 329 175 136 181 130 -27 234 -49 29 -218 -429 133 -115 -35 58 -221 -245 17 -70 -61 -45 -120 21 80 -99
2997 -99 58 164 -50 -52 92 13 80 -235 50 95 -69 16 256 -76 -73 114 -238 45 22 -186 245 -133 146
3020 146 -73 -159 8 -74 -204 113 -182 -145 194 -16 -113 -79 -179 80 234 146 -24 309 13 159 97 -30
3042 -30 145 -40 -253 150 185 -150 161 85 -40 42 -145 8 14 -208 -248 0 -156 18 -13 -40 237 29 17
3065 17 330 -47 -86 163 -55 166 -28 -357 72 122 -102 24 -115 -186 215 -239 46 291 -55 -85 100 -127
3087 -127 80 28 -163 284 220 -319 9 18 -62 222 -116 -177 247 -136 69 82 -92 70 298 -148 95 66 -27
3110 -27 153 -66 -108 12 -63 -17 325 -274 198 -7 -211 145 83 -268 -73 -69 26 75 -60 -116 63 30 136 -146
3134 -146 -156 170 294 -234 -120 -110 -231 -131 -74 -119 142 -237 292 225 -180 59 155 -328 88 139 -86 50
3156 50 -11 -152 194 -105 -179 108 -66 46 79 -158 75 -234 -290 171 -8 136 -40 -20 37 208 -251 110
3178 110 -68 -46 291 58 -181 228 -332 -93 433 -145 -70 -10 -45 172 61 -269 26 63 -265 297 77 -343
3200 -343 229 -120 -83 -77 -122 101 68 -344 -84 -12 -101 -45 -277 -241 134 -104 -152 288 -62 65 222 -226 239
3223 239 -76 -178 138 -168 77 47 61 -176 307 -82 -133 168 -119 29 222 -266 224 25 -250 232 39
3244 39 -77 -3 -201 157 213 -10 232 216 -6 6 96 76 343 -70 -138 -124 -51 -101 375 -57 347 39 155 18
3268 18 6 -188 284 -13 -206 139 -67 -257 22 -86 129 262 -257 151 209 -18 229 33 -41 254 98
3289 98 38 239 -59 -181 244 -214 257 70 -167 -19 -77 -118 34 -37 -8 406 -5 62 74 55 -77 130 -116
3312 -116 12 55 -210 346 79 113 235 -126 -3 -10 -238 -101 202 -101 66 -53 -270 187 -17 -59 397 120
3334 120 -177 278 -172 -9 134 -30 174 -57 -448 56 -109 -47 137 4 105 377 -247 -207 150 -151 110
3355 110 115 -224 290 -30 83 244 -183 154 40 -216 118 147 -237 165 19 -49 -180 115 -180 -178 -187 227 111
3378 111 -29 -153 -303 22 140 311 -387 374 -539 -246 278 95 66 349 -161 -152 345 -210 82 157 -115
3399 -115 107 -71 182 165 -137 -64 15 -27 31 116 -103 -79 244 -95 132 15 48 342 -60 -65 563 -46 -57 219
3423 219 -40 149 -19 -117 40 -14 -148 35 102 -289 184 -148 -181 107 120 -12 303 -233 151 97 -119 168
3445 168 -34 -7 111 68 68 58 -379 224 129 -205 287 135 -115 -76 244 -60 85 -123 -107 130 -140 -62 54
3468 54 -26 193 -115 -93 114 -37 -185 -29 78 94 19 15 76 178 -372 27 255 -64 125 5 -253 -42 -88
3491 -88 -72 187 -1 27 197 -211 -219 -15 -393 -53 380 7 257 -175 -176 12 132 -179 27 -73 138 251
3513 251 -359 -33 -28 -106 -54 16 -216 245 -49 -15 317 -79 -221 270 -22 159 147 -44 83 95 -167 -4 36
3536 36 33 -118 -247 -8 120 -79 63 288 -148 -5 14 -153 41 149 -186 -58 -26 -72 -32 -113 148 99 -135
3559 -135 49 127 -177 99 21 129 17 -181 -218 35 -371 -47 1 -70 -28 -243 -75 126 43 46 112 -109 105
3582 105 122 -14 -14 87 -267 48 -116 102 22 120 -89 164 14 -132 240 -40 -175 91 -7 63 -10 -255 62
3605 62 -368 248 116 -23 -36 -57 -167 198 83 97 -41 99 13 38 73 -122 -25 -66 55 75 -64 -268 21
3628 21 -88 99 62 -259 15 87 -190 -115 46 -19 182 -139 -134 -92 163 24 142 21 24 159 -6 -9 -44 117
3652 117 40 67 72 197 -154 138 -29 51 53 -1 -215 -54 -7 224 240 -105 -9 198 -50 -171 -37 -102 41 -3
3676 -3 -22 95 57 274 201 -247 255 37 -101 21 122 -327 71 149 -117 -24 -61 194 -48 -22 44 199 -332
3699 -332 125 -55 -11 -88 19 -78 101 -87 6 -16 49 -60 185 -110 -48 56 -325 268 105 -4 79 -115 -34
3722 -34 21 -22 43 77 20 57 128 -345 184 -326 -29 184 -63 2 -51 -144 -191 39 -97 249 -76 16 12 106 -92
3747 -92 125 44 7 115 107 -195 4 -22 -77 44 63 -125 147 -39 -21 -4 -136 -120 134 -41 -140 79 142 -46
3771 -46 92 -107 218 -6 97 -75 -242 67 190 93 141 -32 -123 -131 88 -58 -48 -7 -165 -23 -46 128 78
3794 78 -36 16 111 -216 109 195 195 203 168 213 126 -39 -43 21 63 214 -102 99 -22 -2 -134 -112 -50 174 -168 19
3820 19 -120 51 4 -86 -89 73 -113 -272 -182 222 -57 -147 103 116 119 -34 106 173 -163 -38 -75 -209 -164 179
3844 179 203 130 -14 -103 78 -248 -14 90 -229 137 -92 -232 -14 270 -150 16 -34 62 -23 -45 62 -147
3866 -147 12 -69 276 -262 3 14 -182 27 103 140 197 -180 -168 -15 -135 -119 -50 -100 83 96 47 131 109 182 313
3891 313 274 72 156 -28 43 143 -97 62 40 7 -15 -293 11 52 -148 -156 132 -15 -169 281 130 133 -84 -84
3915 -84 412 -200 62 233 -14 72 53 -35 -84 119 105 230 145 -27 32 70 -197 44 -162 -107 312 -64 40
3938 40 29 -5 25 103 -60 -213 -60 18 136 139 -56 -60 11 -88 306 -22 112 145 -152 -161 -82 150 -166 60 -14 -59
3964 -59 -142 153 94 79 -31 -104 75 100 83 43 38 0 -39 -46 44 -51 106 -133 35 -86 28 159 153 -112 191 -158
3990 -158 -6 37 23 -188 75 -40 36 -18 -16 185 -32 -175 -31 215 -140 205 60 28 230 109 50 279 -201
4013 -201 25 29 13 -93 -21 81 135 57 -40 55 -65 106 -56 -89 128 -79 -60 -153 154 -20 -78 28 -5 41 98
4038 98 91 46 -222 243 -101 135 107 174 170 138 249 181 399 -60 175 47 9 171 107 -190 -429 -464 -347 225
4062 225 -321 -321 -118 -183 97 268 676 14 -23 94 266 382 -37 -131 -246 -231 666 -126 -584 -16 8 15 -92
4085 -92 216 -688 12 575 473 -319 -148 7 30 639 -474 -33 -662 153 -132 -133 -167 -454 570 142 -90
4106 -90 64 566 198 -42 1 90 59 -58 -109 53 32 -131 141 -54 84 26 -120 -101 -212 -18 182 78 59
4129 59 33 -82 -68 -186 100 74 -35 118 51 99 -204 -44 56 38 114 -67 129 -130 102 65 -23 -7 108 16
4153 16 198 258 -9 -115 108 -225 -27 -13 15 14 -105 283 179 151 -153 74 -145 59 19 -39 180 124 45 105
4177 105 -31 -128 -92 73 -37 19 -104 -8 -52 -115 -72 21 -180 -114 -285 -46 147 52 -9 206 34 31 177 43
4201 43 -68 -146 -171 -107 -12 -70 11 143 -138 42 133 68 156 -241 -77 67 -24 66 54 21 107 -81 180 -142 15
4226 15 -163 -6 -21 49 55 12 78 -158 -134 126 90 -41 -239 -3 -204 -38 115 -125 -99 89 -25 -34 34 0 -13
4251 -13 -176 148 43 169 66 -104 -15 -22 54 -41 -25 -205 -243 7 131 -102 26 -124 28 19 69 -10 -3 -131 -266
4276 -266 -16 -50 375 -240 -68 -146 -110 166 -38 5 38 -73 280 36 28 94 -61 -87 84 61 -7 12 -90 -182
4300 -182 60 76 -17 86 -55 80 98 -271 110 -213 -83 162 115 -71 -14 -187 47 -95 -3 -11 85 -34 201
4323 201 140 111 145 -188 -248 106 -27 -122 -104 -179 -187 -29 42 -187 -60 111 12 161 -176 -1 -71 -111 100 -78
4347 -78 -20 52 48 144 15 -103 -83 -78 -11 -56 -44 -145 -111 25 -59 -103 44 98 -234 -58 92 206 -79 8 68 -21
4373 -21 -249 -122 118 36 -15 -7 -21 -90 -104 -72 -138 116 108 -166 218 68 33 115 -273 -105 -113 -176 211 79 -247 146
4399 146 -71 14 -49 -93 -148 41 -114 147 -23 -26 -58 158 134 -5 -155 -191 -109 -116 -25 -89 202 -175 82 -19 21
4424 21 194 -161 -37 156 -12 -41 154 49 97 -107 -51 49 -115 -79 -35 -304 131 -107 -288 -34 147 -65
4446 -65 -148 -122 -69 -136 -61 241 -48 -83 -120 69 -44 -32 -32 -24 -93 22 74 -13 -33 44 -97 -51 -46 33 48 167 171 -149
4474 -149 -56 2 -5 117 115 71 225 -54 -124 193 172 9 34 85 284 -12 -13 38 -8 -25 28 -22 81 45 -178 282
4500 282 60 -152 124 -49 191 -159 50 12 -13 119 -94 -83 88 171 -35 -185 -18 -108 -97 76 -78 -69 -10
4523 -10 0 -31 102 95 169 -6 -46 -20 241 18 160 2 73 95 -179 17 45 -7 -21 62 151 -60 34 63 77 7
4549 7 -382 38 80 3 159 -62 132 91 -22 114 239 191 137 -388 217 124 -159 187 -34 47 18 -11 58 -28
4573 -28 -253 -44 66 -93 117 218 25 -287 -210 -103 -2 -17 134 -34 -162 -265 138 -18 -22 -22 81 49 140
4596 140 245 -157 -80 77 35 -214 -132 232 173 -11 -52 -227 -214 215 -50 154 -83 -52 64 222 -195 -105 128
4619 128 27 48 38 7 165 87 96 167 -163 -16 65 -131 -161 -270 -114 67 37 -23 -10 -58 -87 86 -186 -147 82
4644 82 -323 -86 -30 127 66 -153 -90 19 167 4 266 -87 109 -185 -137 -224 257 -130 121 -145 152 -36
4666 -36 170 226 57 -6 46 2 -49 240 -51 107 133 -100 -184 81 -105 112 -215 -323 -33 45 -32 77 -14 140
4690 140 333 18 23 136 48 11 214 -144 120 -142 -12 59 173 35 60 120 -14 -132 -138 -48 -7 -108 -42 12
4714 12 -242 -103 120 -148 36 -147 -213 -132 98 -80 32 77 9 -172 -101 -32 59 56 7 173 94 -320 101 -13
4738 -13 57 172 17 225 -101 127 210 -177 -71 -41 -78 86 29 -36 1 -41 59 56 22 59 -64 243 136 237
4762 237 -51 65 -43 -5 113 -52 23 69 -213 -73 -94 -110 -94 -27 -69 2 70 39 -17 108 19 72 -208 16 4
4787 4 74 -186 -176 -71 86 6 170 -108 -96 178 27 -65 -110 168 106 -70 -121 74 -191 117 -203 102 191 -198
4811 -198 -76 48 -31 -17 -247 -165 -82 -127 -9 -132 -41 133 17 -22 158 35 -130 160 -103 26 -171 162
4833 162 -60 -167 52 -287 47 92 167 -38 -129 4 67 81 146 -151 -10 69 51 -232 -187 -197 -262 -89 -209 -62
4857 -62 -87 1 -77 17 -36 186 -93 5 -105 -34 12 236 -144 8 -76 139 2 -97 -147 -231 -152 93 -207 100 -256
4882 -256 -21 -31 -212 165 51 127 32 -24 -5 -158 144 -100 -228 322 75 111 116 14 89 18 -115 -118 51 -128
4906 -128 -46 118 -12 67 106 257 78 -157 -225 166 -82 2 59 -50 -100 118 40 -24 -48 -293 -61 -7 108 -146
4930 -146 -52 81 -17 -28 -75 -140 61 156 16 147 98 22 -12 -24 -50 90 -11 -189 -5 239 -179 -150 20 -15
4954 -15 -111 -165 116 -61 91 65 -69 -12 -235 -53 -263 118 50 88 30 -270 -137 149 -129 161 69 45 136 -36
4978 -36 -192 -27 -307 37 -66 -14 -156 12 -288 152 137 -44 1 -56 231 67 -51 -154 234 121 32 -154
5000 -154 -103 -141 102 -121 77 149 -106 101 -86 -53 -140 -186 -21 115 -126 -25 92 -243 12 -202 127 77
5022 77 -107 -37 -65 -83 164 177 -227 84 57 -25 -97 -5 -34 122 58 -194 -59 -107 -127 -38 -193 -40 29 51 116 -192
5048 -192 -20 133 176 20 46 62 57 109 -2 6 -141 -22 -184 -30 -120 -157 43 123 -167 -202 16 183 -89 -30
5072 -30 -79 -111 19 -1 -181 -91 -13 -37 93 -205 302 192 -27 55 4 50 1 121 -9 -315 147 2 132 124
5096 124 -208 -92 -29 18 67 -50 52 -23 58 -134 35 -108 134 265 218 116 69 -19 -28 -8 -218 188 34 29
5120 29 103 -121 -4 -101 -111 -111 -19 162 -168 75 -15 126 29 12 96 -83 5 -35 186 110 -209 11 -165 86 -48
5145 -48 171 -211 -72 246 -86 145 -138 49 122 324 -74 58 -98 11 -130 162 -12 192 23 39 -96
5166 -96 -173 -37 -2 15 35 -63 -46 -124 46 -61 -99 12 -147 51 -44 -15 -243 25 -106 -137 35 362 14 -76
5190 -76 83 169 -228 -58 -149 -122 -170 -79 -33 -100 10 -158 93 249 85 113 37 -120 -61 -17 -56 -78 162 25 -270
5215 -270 79 108 5 84 118 15 -15 129 -77 10 21 67 24 93 84 129 -2 81 -119 -114 257 35 -6 68 -72 150
5241 150 -251 -57 12 22 -26 -37 -140 302 27 -20 -22 102 -69 -176 11 -27 46 -61 -101 -43 20 -138 443 -271
5265 -271 -70 -30 -72 312 -234 48 97 -114 -203 174 106 -10 -157 -84 18 -78 -299 122 -52 92 -116 127
5287 127 191 -150 469 347 178 -121 364 -5 -56 142 265 -88 -5 -331 -225 -111 191 -10 -92 -356 -88
5308 -88 407 -16 255 -12 201 -128 154 210 -29 385 -71 -106 -133 94 163 152 148 -77 -9 56 -178 263 -169
5331 -169 -76 38 192 119 -343 53 -106 111 -174 -387 -62 -165 -127 236 48 -274 26 -26 216 -75 -93 -305
5353 -305 284 -187 -117 -267 180 -216 -229 -180 -88 -97 136 -161 202 434 219 -8 89 -320 -11 297 -370 -161
5375 -161 126 21 64 201 -197 -16 -101 5 175 359 -99 -5 -91 -63 -55 180 -9 -100 -104 129 114 -207 -5 154
5399 154 -10 101 94 121 -12 -144 9 -133 -143 6 -66 -176 -171 41 -198 -84 -30 23 31 -17 88 -94 -106 -239
5423 -239 -28 -167 -141 -128 297 254 -49 -91 -128 -255 146 -18 -32 -181 -198 -209 62 -49 -8 -3 -92 -134 -175 128 22
5448 22 3 -107 188 -13 -83 -158 -36 99 -13 65 -36 -238 34 -75 54 -69 -95 58 170 -118 -120 -258 30
5471 30 44 135 413 181 -125 128 -382 253 -48 -198 -151 -233 677 139 255 3 -877 263 -209 -199 -768 -128
5493 -128 434 -17 255 430 212 -246 -242 219 -14 -110 -443 -244 -77 79 410 99 -461 140 -3 -143 314
5514 314 387 139 -481 -351 130 -66 86 316 -236 352 -177 37 16 245 -393 932 132 -410 461 -210
5534 -210 -151 293 -265 122 -123 -198 -687 679 -238 119 17 269 319 -58 -45 -16 79 79 -38 38 -65 -15 34
5557 34 377 -149 -60 127 90 -32 7 -32 -161 169 188 -78 -208 -97 0 70 -123 -48 -154 117 12 172 -4
5580 -4 -35 16 52 87 63 86 -78 -15 25 339 171 39 -155 18 -5 -89 -75 19 151 -24 105 59 152 142 126 161
5606 161 -18 -87 -44 138 183 -166 -33 58 -21 95 22 26 -106 -22 27 -110 190 28 -129 -80 -177 -49 -65 -23 2
5631 2 24 -81 -115 -150 -252 15 -33 -135 214 101 109 64 -86 243 -70 13 -1 -236 -24 116 50 57 42 -21 -161
5656 -161 -108 95 77 31 13 60 3 161 206 70 61 154 157 19 -124 -41 12 16 -26 -86 100 -38 -12 -35 -217 -136 124
5683 124 265 -44 -143 -171 48 -317 -5 85 62 88 -155 46 172 103 209 3 21 54 -171 -19 62 12 -109
5706 -109 12 -158 -91 49 192 201 103 208 -103 -45 -42 -219 -42 -225 151 -10 -125 73 30 -72 155 89 14
5729 14 270 -70 220 197 -129 -35 -104 4 -38 264 34 89 77 8 150 -17 183 69 -237 -6 -19 -13 102 -22
5753 -22 16 32 -221 -90 195 30 -284 66 76 4 32 -13 185 16 -306 0 15 126 194 -56 -105 -191 37 48
5777 48 40 -22 -181 56 27 -98 47 73 -64 84 -134 157 -249 -8 15 84 200 -112 -60 122 -192 170 -202
5800 -202 -48 63 32 -161 -187 63 32 -37 -308 -24 48 -35 89 87 -1 316 11 63 105 152 -85 23 -7 -130
5824 -130 -42 -96 -47 32 -68 -64 14 -273 -69 -118 -124 48 -72 5 15 -214 111 -179 82 8 2 69 -74 57 36 -23
5850 -23 157 -24 -145 171 -208 64 -53 45 121 102 -88 -156 -78 -199 48 48 137 36 171 24 -103 -32 232
5873 232 53 -184 -91 179 -63 -37 -163 89 -142 -214 58 -189 -14 144 -98 -184 66 -136 70 -108 66
5894 66 -250 -218 -57 -24 189 87 104 -45 -173 165 -308 -115 27 -171 61 178 -24 -65 -17 67 -77 -256
5916 -256 135 -4 -112 1 120 -216 348 -195 -140 226 45 -147 13 -113 43 -53 11 74 97 -56 73 84
5938 84 139 -67 -131 -9 -48 -36 -89 80 -43 138 122 -136 41 -207 172 31 -43 105 185 237 215 152 -72 18
5962 18 -165 -68 52 48 -149 -132 -3 98 47 56 85 -142 -54 -245 -19 -277 -55 -185 -214 109 -16 116 33 91
5986 91 145 -4 -24 -121 45 -175 -7 294 -56 -96 285 -182 -12 147 -71 24 -62 142 -313 87 25 229 -95
6009 -95 -114 35 -56 56 -149 104 -70 80 -314 -69 95 -77 221 -42 62 107 -103 29 -12 -165 60 -83
6031 -83 -63 -161 -137 36 -175 23 -82 68 -105 130 -6 -25 -10 38 -191 -12 -314 659 362 -349 360 -75
6053 -75 202 144 60 186 175 -565 75 -335 -367 0 -189 225 194 399 -304 126 2 130 -117 2 -152 -20
6075 -20 175 336 583 295 -229 211 125 -51 506 -485 -41 -286 -17 -176 260 441 73 -138 -254 -335 -745
6096 -745 117 -285 541 168 -384 -8 -93 378 -546 85 -95 303 -125 129 -486 -783 474 -314 225 -199
6116 -199 80 177 -181 -172 -486 -418 455 -243 138 438 3 404 114 87 61 89 -168 223 283 -376 -480 169 -155
6139 -155 -416 -2 -328 -249 -293 428 605 271 351 -23 -201 -12 -436 125 338 -268 518 88 672 60 -423
6160 -423 441 132 321 268 -198 -139 223 -369 -144 -346 587 489 -211 -71 -299 -161 -651 3 162 -351 -750
6181 -750 -515 -129 -60 721 -416 -306 184 -417 -629 228 -975 -431 -365 -69 -253 -345 -585 -88 563 -99
6201 -99 -500 342 33 -583 287 -293 317 -257 173 -228 -191 143 256 -569 -417 3 212 -658 -298 133 50
6222 50 -81 -524 -170 241 0 308 351 91 -374 -283 451 196 261 469 -46 352 -223 217 -113 692 -666
6243 -666 -74 -213 -210 -57 -235 323 103 313 198 -174 -650 71 69 436 -35 -246 131 273 -375 -141 -752
6264 -752 -123 554 -135 181 269 135 101 -544 380 -396 195 -205 131 -11 -389 -103 263 -252 346 -12 -86
6285 -86 323 -247 124 -426 -62 23 152 -203 94 10 412 125 -314 58 -3 -11 288 -461 -494 152 -236 21
6307 21 -120 -109 -510 -9 69 -244 215 -244 215 378 23 441 467 -200 -320 -290 418 -46 545 179 -254 243
6329 243 99 -58 -187 -148 -31 -74 -50 -255 -99 2 -31 -15 83 -129 26 -8 111 -20 111 -138 24 124
6351 124 126 303 -95 -93 146 155 -22 223 -36 170 80 -37 153 -21 441 -46 -151 -217 129 -49 -54 -1 -34 -179
6375 -179 -140 194 -3 -176 -527 290 -237 -32 226 7 602 150 245 -696 111 -67 -18 155 491 -6 101
6396 101 -244 -240 -584 -157 187 -252 -169 103 -180 212 -403 -247 -15 -42 247 -46 316 -698 -52 465 272
6417 272 -190 -471 266 -181 -171 -324 405 -193 498 691 -182 -374 -60 66 -260 -130 190 107 392 -278 342
6438 342 -315 422 210 -69 448 -96 -173 66 -215 240 -36 73 -129 319 29 226 -478 44 11 -252 50
6459 50 -55 -83 269 402 -83 -47 -388 215 -361 442 -100 -123 403 133 -338 78 -208 243 405 -19 -276
6480 -276 -653 237 -133 -82 -449 165 83 -164 40 -607 16 42 131 -166 -557 37 -76 -554 -151 -246 -288 -482
6502 -482 -465 78 92 -169 -608 344 -327 -629 -127 -585 -7 -515 -148 322 -310 -294 -168 -308 -85 -233 122
6523 122 -88 -120 -71 135 -75 -350 321 224 -147 95 53 -68 -228 169 194 -84 86 157 170 -34 47 -40 83
6546 83 -108 -127 -90 88 -165 -276 -45 50 91 78 168 -98 165 158 236 278 -132 -117 346 -153 -617 -605 -140 -237 338
6571 338 599 -682 -179 -295 471 -220 -459 55 530 41 130 25 22 6 -2 -94 106 101 -164 -150 -70 97 8 199
6595 199 101 -71 38 -37 95 -39 -26 -71 -87 -158 -171 0 111 201 -211 2 -114 136 -254 -9 9 156 -25
6618 -25 130 95 -61 -251 -114 -82 94 -2 37 -185 110 -88 -49 -72 -119 171 -93 -27 134 -43 -24 99 -81
6641 -81 -6 96 -54 152 128 105 148 -49 -47 8 179 -38 -124 -82 -30 63 -123 -170 59 79 -193 35 97 186 -28
6666 -28 100 -39 30 20 -47 -158 -49 -69 -55 -150 -73 -161 -16 100 -17 -8 -138 74 103 -65 -33 -109 -273 52 -73
6691 -73 -65 6 39 0 75 217 -36 -261 140 160 -70 21 25 252 7 -293 -14 199 43 -112 -70 175 43 24
6715 24 23 66 221 105 52 210 91 -125 26 245 160 0 -43 50 34 112 32 168 -236 -64 -91 21 -62 22 -17
6740 -17 9 -65 104 66 21 -56 -119 -257 94 -152 -136 -25 -188 55 38 0 -103 45 97 266 146 -215 111 327
6764 327 -81 -109 144 -16 208 20 -156 -156 135 169 72 130 -68 -48 223 -74 -22 64 -60 63 -75 17 -126
6787 -126 57 54 48 -6 -51 59 0 -39 -3 114 -36 71 -87 -64 -7 -153 -182 -82 -124 120 126 14 -79 54 64 51
6813 51 146 -80 -147 -124 194 -345 13 -3 -132 10 -264 155 63 -248 292 -241 48 110 -285 -210 191 -71 -45
6836 -45 -63 -3 76 -116 -220 27 -44 -221 158 -108 -7 -8 1 178 170 72 -294 -53 126 44 -119 65 141 145 13
6861 13 -144 -57 2 -9 81 202 112 110 71 -10 -110 -46 32 119 -194 110 6 -147 30 -175 158 -1 -202 -214 -129
6886 -129 290 225 -92 191 76 -73 35 234 74 -6 -89 -16 -103 -104 8 182 114 41 52 -56 -141 -144 394 9
6910 9 -146 156 -179 -135 72 36 216 -213 -254 86 92 168 199 -18 84 -79 200 -72 -124 123 -69 -215 -58
6933 -58 169 -179 -77 178 266 130 51 221 115 330 -87 -63 11 -226 -87 -272 164 -408 14 10 -221 -149 -164
6956 -164 169 150 -40 -32 -271 -51 150 -538 -90 386 -272 499 -111 494 122 -157 -251 194 101 186 83 -123
6978 -123 -375 228 -514 -413 -135 47 -83 246 -198 -259 160 -229 -321 25 -51 493 -216 -148 -535 277 -89
6999 -89 297 496 -674 -24 -642 466 418 -662 -130 501 -545 -164 422 -593 -374 -2 249 23 131
7018 131 204 -101 59 52 -77 -14 -82 -47 -39 -74 -35 35 42 -174 -85 -172 -153 37 -76 39 -29 -128 -103 -2 -47 -201 371
7045 371 217 -134 -56 -135 -524 -46 126 -592 -172 -148 -267 70 70 -77 44 198 122 339 -492 -151 -320 -214
7067 -214 78 -66 51 12 89 -265 -9 -103 -415 -14 -60 34 -61 78 -166 333 -37 -33 -102 -191 -88 95 30 -24
7091 -24 -149 -323 14 -19 -187 10 -64 59 20 -18 -185 94 238 -113 -78 272 80 -17 -96 -147 278 -158 -44
7114 -44 38 -19 -248 49 51 -20 11 -4 70 -15 -44 398 -50 10 -288 -74 72 -202 -141 26 7 163 179 -28 207
7139 207 19 -57 -58 44 57 132 -12 29 -165 99 -83 160 -59 -77 -141 -3 -33 -63 -105 91 66 -6 -104 -58 23
7164 23 174 -248 54 -63 -14 -143 -29 -176 -225 -154 -138 45 98 163 48 103 -49 -66 -258 -45 -188 163 -18
7187 -18 21 347 -187 -146 57 -73 152 80 38 30 -73 115 329 195 27 -75 -22 -246 275 18 132 -214 96
7210 96 250 91 -74 -118 -13 -180 82 68 208 -3 25 -244 -81 -8 125 -9 -53 -103 -181 91 -97 -22 -51
7233 -51 -80 85 -108 162 -18 -52 161 116 5 23 -146 -118 -41 10 -102 41 33 35 -72 -399 -22 -11 158 159 97
7258 97 101 75 40 164 -80 152 31 -370 -452 -298 -256 -24 689 -224 62 -26 -188 609 0 36 -431 -806 202
7281 202 -240 349 -654 -349 -112 117 -169 -738 475 -25 129 -52 -10 87 -102 67 25 175 -20 56 -20
7302 -20 -32 -121 209 88 101 -282 -11 60 54 27 163 -29 -88 -110 -34 -84 305 -39 -72 -101 -32 83 -56 236 -159
7327 -159 -30 153 117 -110 6 -73 -101 42 -11 191 -22 147 -168 60 167 32 119 -5 -275 -131 -243 198
7349 198 -195 45 73 -238 131 -50 5 -65 123 51 -68 124 -24 156 52 4 -52 24 -60 97 166 251 54
7372 54 -233 91 -29 11 -140 123 -83 -59 -68 -44 -92 2 112 -4 -108 -55 14 77 -27 222 17 60 121 254
7396 254 104 -121 -94 -102 151 195 91 -53 -157 -24 66 -10 162 -112 -24 -52 15 60 3 249 -1 -143 -58 124
7420 124 275 94 -371 68 84 -421 -162 227 204 29 -324 -161 -212 45 80 -21 -346 2 29 240 345 147
7442 147 -215 -295 -127 73 114 -57 -86 50 223 -106 103 315 556 315 -457 -569 363 -259 369 319 -49
7463 -49 -104 89 259 -102 57 -174 662 269 -24 89 -336 314 646 -187 589 -162 -288 -192 -451 125 200
7484 200 188 220 -89 -38 -85 113 85 -148 -99 -150 -108 -19 153 -44 -21 -45 8 -80 -65 45 -67 42 75 -37 -28 120
7510 120 -141 -70 78 3 -126 -53 -42 47 230 -42 -54 148 -14 -100 83 86 132 71 111 -84 -247 -81 -9 19 144
7535 144 61 -218 113 -187 -187 54 53 -61 -2 -249 -166 72 -93 59 -61 49 6 83 -180 63 -32 2 150 -214
7559 -214 -20 -149 -36 -22 -109 -78 194 -136 78 -42 32 -77 161 -19 112 -3 91 72 -137 314 -47 -217
7581 -217 -218 -27 -39 -202 29 -24 -112 -96 -70 43 -91 254 72 187 -35 291 46 -11 -6 4 -61 8 -143 87
7605 87 26 265 141 43 246 -27 313 19 -57 -94 117 107 -256 -35 -112 -7 -34 129 -26 -189 30 -63 -39
7628 -39 -165 -7 32 -10 -86 -7 -40 274 2 239 41 -1 -128 -64 184 100 -224 -81 -138 -234 22 311 196 12
7652 12 90 47 -6 93 -35 203 -99 -194 106 -93 24 -176 75 6 -181 -132 -20 -5 -167 -70 -112 175 -141 32
7676 32 98 -30 -128 -73 93 -136 -54 -27 41 -156 52 94 53 -37 163 -61 -37 11 -260 -118 -120 69 54 89 -183
7701 -183 -184 -204 -7 -52 -47 -52 35 13 -113 67 -41 30 -79 232 -38 -273 46 -44 -195 -200 -115 328 -51 -184 -293
7726 -293 -138 5 -28 -153 162 16 -276 40 56 -121 145 76 19 151 13 26 243 64 -125 27 85 37
7748 37 -248 -76 -257 75 84 -262 -81 -127 93 -138 87 98 -36 253 47 121 103 -150 1 131 -63 -89 119
7771 119 -42 281 20 49 -33 217 53 -41 -37 -75 45 -114 -68 185 160 -133 7 191 148 -13 67 -56 62
7794 62 96 80 2 -72 149 49 165 -109 -35 107 146 258 -75 62 -84 -23 124 -34 -49 239 15 135 121
7817 121 -49 98 13 -224 158 -267 -46 76 59 -162 -24 -121 92 -16 -26 117 44 123 -93 -83 -69 22 -92
7840 -92 -14 123 -42 16 38 -121 -233 -47 150 43 -222 205 205 -120 -48 48 120 80 -26 90 76 -20 -2 24 18
7865 18 -68 103 122 13 4 67 -30 -243 51 162 -134 -3 110 53 -380 93 -107 47 -78 67 247 97 59
7888 59 113 50 -144 -96 322 218 84 13 -234 207 -59 -21 22 -134 189 90 -20 71 86 -297 -393 -89 -166 -63
7912 -63 -73 -36 -118 35 -57 -1 13 73 -28 129 -68 207 93 223 313 -40 29 92 42 -66 125 23 -49 179
7936 179 114 -49 126 171 190 -97 -114 -6 86 -66 97 339 182 -95 -107 73 3 -48 -95 27 137 -27 17
7959 17 -83 177 -97 -155 -51 196 -32 -201 -69 -109 167 212 -68 -37 -71 -36 -22 -91 223 -183 -108 48 7 -124
7983 -124 -177 139 -84 149 -145 -92 -80 -53 -49 -18 -255 24 -66 -113 38 42 -109 92 115 154 -52 122 75 118 10
8008 10 -101 106 -93 50 -68 85 243 191 -61 -195 28 57 -95 -64 92 -9 -88 -104 203 -218 -25 -126
8030 -126 210 -77 -127 -30 -224 -74 -16 -151 89 -137 -67 49 17 -15 -156 -117 98 140 -112 26 -98 65 -7
8053 -7 109 -88 50 -78 -38 99 102 -16 105 -140 -202 -32 -275 -11 223 -141 -260 118 185 -105 -31 14 -60
8076 -60 111 -105 -108 21 -133 76 166 -9 -13 -55 -91 -83 128 -110 -229 -143 140 -225 146 -57 40 102 29 222 94
8101 94 101 4 -13 49 130 16 -136 8 -7 79 3 25 89 -116 -82 -12 60 24 -186 99 -76 -149 -169 26 -146 -111
8127 -111 124 204 -168 261 256 124 -18 81 77 -48 161 -174 178 49 17 84 -6 -207 -151 22 21 67 -22 94 29
8152 29 22 85 -38 73 199 136 192 43 -148 -63 13 48 79 137 119 189 82 111 1 -136 49 -146 -75 -137 6
8177 6 162 82 119 320 -165 27 -95 -188 -11 -72 6 -218 -83 18
8191A8
$$ Imaginary data points
##PAGE= N=2
##DATA TABLE= (X++(I..I)), XYDATA
0 0 0 0 0 0 0 0 0 0 0 0 -8 8 -8 8 -8 16 -16 24 -27 32 -40 48 -57 72 -80 96 -112 130 -152 175 -200 228 -259
33 -259 294 -332 378 -426 477 -535 596 -665 741 -823 912 -1010 1115 -1234 1361 -1500 1652
50 1652 -1820 2004 -2209 2433 -2683 2963 -3280 3640 -4054 4533 -5098 5773 -6600 7637 -8976
65 -8976 10791 -13395 17481 -25147 73826 -247415 76527 109385 -287186 252931 -15675
76 -15675 -155088 209154 -123541 -66720 180409 -141819 18292 112748 -129302 40437 86949
87 86949 -145825 59171 64207 -146538 114307 25088 -158834 163969 -60117 -98677 191877
98 191877 -149864 -3454 149650 -196081 111524 46024 -182355 169876 -56343 -90651
108 -90651 177236 -128308 -13516 114216 -138910 59575 67190 -114799 75422 13063 -96650
119 -96650 90604 -7134 -77202 107402 -47585 -60666 125501 -95605 -8127 124281 -141749
130 -141749 61804 73302 -155882 129704 -5170 -116881 157697 -84835 -43148 138319
140 138319 -125198 31391 83541 -126942 77996 30325 -100339 94352 -11130 -76511
150 -76511 95029 -36169 -51848 100477 -62367 -27103 96616 -95726 17074 79698 -117295
161 -117295 70931 29230 -115717 113389 -35010 -72366 125550 -90213 -11372 95503
171 95503 -114029 45602 46314 -100526 76641 -2519 -70323 80259 -33992 -39079 73714
182 73714 -51661 -14850 65648 -65886 9414 55267 -80127 40229 33525 -83838 73986
193 73986 -6424 -68331 92982 -51892 -26604 88330 -84171 22677 54260 -90721 63126
204 63126 11736 -69908 79558 -26730 -39408 74358 -48484 -9835 60808 -57245 12625
215 12625 44478 -62485 31874 27168 -63391 54574 2399 -57227 72353 -31882 -34170 77845
227 77845 -63094 2938 61236 -80672 40807 26268 -74032 66014 -11842 -48027 69572
238 69572 -41389 -17456 55885 -53718 9181 38064 -54845 25613 20035 -52491 38250 3903
250 3903 -46238 49616 -16260 -35000 56669 -39163 -11639 53115 -57646 18711 33326 -64016
262 -64016 46057 2440 -50628 61045 -27525 -24551 56663 -47415 3943 40391 -51239 25437
274 25437 19310 -45208 35874 1137 -34720 41842 -12872 -23351 43979 -27665 -9624 42467
286 42467 -40575 9966 33569 -49145 31261 13368 -47048 47984 -11689 -30507 52644 -34453
298 -34453 -6382 42562 -46220 17821 24010 -44454 33381 2572 -34900 39000 -14402 -21074
310 -21074 37949 -25637 -7557 32479 -33630 5790 24480 -37436 20219 11611 -37550 32383
322 32383 -5789 -29238 39996 -23692 -13086 37617 -37751 6855 26219 -41616 25158 8780
334 8780 -35881 34924 -9989 -23047 35908 -23261 -7119 30955 -30756 6923 20732 -32382
346 -32382 19440 9745 -29026 27931 -3258 -22596 31956 -15749 -11041 31544 -26220 2876
358 2876 24279 -31397 16984 11925 -29226 27900 -2585 -21821 31590 -16264 -9772 29649 -25278
371 -25278 3823 21729 -29318 15481 10329 -27485 24282 -2099 -20389 28118 -14412 -10220
383 -10220 26226 -23175 2015 19577 -27544 13108 9496 -26472 21531 -1532 -20084 25276
395 25276 -12516 -11251 23760 -20418 -266 18895 -24493 9806 10154 -25103 18398 241 -19889
408 -19889 23980 -10521 -11602 24206 -19610 -1058 19318 -23878 10140 10642 -23447 18091 3
421 3 -17912 22604 -9152 -9230 21576 -16751 -1 17270 -19864 8764 10526 -20128 15674 2452
435 2452 -16672 20101 -5611 -10334 21214 -13664 -2394 17860 -18785 6850 11470 -20011 14592
448 14592 2343 -16942 19360 -6311 -10160 19983 -13502 -2109 16046 -17765 5959 9924
460 9924 -18426 12121 2002 -15602 16194 -5877 -10067 17353 -12646 -2426 14848 -17551
472 -17551 4551 9031 -17665 11284 1769 -14721 14646 -5757 -9131 15258 -10893 -2577 12817
485 12817 -14230 3410 8686 -15115 8859 3695 -14194 13183 -2121 -10817 15817 -8452 -4941
498 -4941 15482 -13682 2545 11325 -16381 10675 4024 -14391 15631 -4336 -8604 16044 -10573
511 -10573 -917 12451 -12689 5426 6928 -11730 8622 1928 -9137 9713 -1563 -6951 10168
524 10168 -4880 -4314 10789 -8426 -391 9978 -12081 4953 6095 -13509 10577 -550 -10964
537 -10964 14295 -8142 -4423 12814 -13373 3492 7491 -13762 9095 516 -10236 10919 -4836
550 -4836 -5277 9344 -7076 -1489 6771 -7458 946 5274 -8027 3022 4157 -8976 6195 1506
564 1506 -9017 10199 -3598 -6429 12065 -9394 -350 10304 -12368 6481 4419 -11409 10957
577 10957 -2498 -6457 11066 -7402 -382 8044 -8464 3736 4308 -7065 5146 1833 -5401
590 -5401 5380 636 -4946 6078 -689 -4417 7658 -3837 -2268 8315 -7954 2225 6033
603 6033 -9991 7501 572 -8681 10325 -5307 -3569 9596 -9325 1890 5218 -8936 5787
616 5787 290 -5951 5971 -2978 -2601 4426 -3643 -1006 3401 -3677 -523 3348 -4490 350 3426
631 3426 -6178 2976 2304 -6908 5860 -1305 -5117 7708 -5495 -466 6418 -7897 4159 2515
645 2515 -7205 7141 -1857 -4000 6914 -4688 -371 4989 -5020 2274 2660 -3821 2776 1123
659 1123 -2929 3034 587 -2717 3955 -667 -2274 4924 -3014 -750 5122 -5210 1888 3549 -5787
674 -5787 4910 195 -4657 6178 -3064 -1396 5240 -5180 1477 2659 -5015 3515 172 -3756
688 -3756 3796 -1421 -2312 3228 -2413 -1207 2800 -2947 -281 2433 -3690 1141 1708 -3990 2759 -165
704 -165 -3514 4020 -2552 -1844 4234 -4469 746 2853 -4882 3023 387 -3654 4107 -1469 -1690 3964
720 3964 -2721 60 2693 -3204 1159 1759 -3012 2348 666 -2530 3064 -547 -1879 3560 -1799
735 -1799 -597 3690 -3188 1171 2426 -3691 2894 481 -3028 4141 -1470 -1460 3899 -2949 518 2901
751 2901 -3675 2014 1504 -3334 2668 -53 -2429 3515 -1603 -1578 3186 -2768 -84 2704 -3550 1454
767 1454 1363 -4059 2797 -251 -3336 3613 -2096 -1483 3466 -3404 202 2205 -4108 1994 682 -3258
783 -3258 2998 -989 -2431 3368 -2324 -1148 3250 -3001 388 2324 -3556 1580 1013 -3549 3215
798 3215 -387 -2936 3914 -1930 -1239 3864 -3573 914 3099 -4180 2935 1399 -3530 3906 -843
813 -843 -2351 4326 -2434 -605 3861 -3343 1171 2384 -3790 2335 1105 -3509 3739 -829 -2368
828 -2368 4091 -2602 -1251 3818 -3663 723 3078 -4188 2611 1395 -4237 3745 -743 -2979 4102
843 4102 -2774 -1544 3723 -4040 592 2700 -4500 2330 1104 -4057 3550 -809 -3010 4221 -2808
858 -2808 -1561 4071 -4070 585 2743 -4656 2564 1229 -4044 3881 -809 -2832 4672 -2516 -1228
873 -1228 4319 -3688 533 3467 -4197 2228 1835 -3869 3834 -226 -3247 4697 -1955 -1681 4652 -3494
889 -3494 392 3804 -4589 2513 2165 -4387 4243 -123 -3372 4763 -2321 -1595 4710 -3777 602 3220
905 3220 -4339 2520 1702 -4096 3442 42 -3310 4175 -1614 -2143 4341 -3479 -476 3924 -4734 1720
921 1720 2510 -5111 3611 53 -4297 4494 -2143 -2292 4968 -4159 -320 3760 -4964 2021 1866 -4755
937 -4755 3435 -220 -3782 4336 -1848 -2164 4181 -2984 -842 3966 -4079 916 2838 -4126 3103
952 3103 1304 -4392 4633 -1110 -2956 5203 -3316 -724 4966 -4956 1714 2973 -4766 3585 520
967 520 -3858 4980 -1047 -2192 4365 -2833 -725 4062 -4206 911 2910 -4361 2746 1355 -4114
982 -4114 3954 152 -3211 4370 -2443 -1411 4528 -4320 552 3336 -5042 2182 1157 -4448 4294
997 4294 -842 -3075 4214 -2667 -863 3916 -3422 606 2741 -4306 2642 1430 -4118 3630 -531
1012 -531 -3501 3978 -1898 -2432 4998 -3837 267 3488 -4419 1695 2493 -4614 3779 -15 -3329 4581
1028 4581 -2090 -1627 4352 -3523 76 3580 -4448 1759 1678 -3750 3506 520 -3429 4058 -1621 -2366
1044 -2366 4504 -3191 -410 4093 -4103 1301 2508 -4338 3570 127 -3956 4323 -1882 -1921 4271
1059 4271 -3546 -328 3474 -3886 1667 1855 -3944 2806 427 -3362 3326 -800 -2232 3714 -2333
1074 -2333 -1017 3535 -3413 674 2717 -4349 2440 1221 -4111 3850 -882 -2798 4429 -2921 -758
1089 -758 3786 -4186 1245 2190 -4267 2910 513 -3091 3547 -749 -1936 3461 -1853 -844 3147
1104 3147 -2652 607 2683 -3415 1666 1717 -3592 2920 206 -2652 4135 -1603 -1567 3969 -3390 670
1120 670 2890 -3947 2406 1263 -3468 3097 -802 -2461 3353 -2096 -1030 2977 -2462 112 2510
1135 2510 -3100 1600 1349 -3067 2165 173 -2830 3159 -957 -1917 3660 -2678 -508 2995 -3641
1150 -3641 1478 1749 -3867 2960 -164 -3078 3534 -1629 -1228 3130 -2566 85 2132 -2839 1216
1165 1216 1432 -2365 1856 472 -2454 2468 -514 -1971 2745 -1439 -1098 2975 -2745 551 2375
1180 2375 -3260 2087 951 -2976 3087 -791 -1850 3744 -2290 -363 2902 -3051 1060 1456 -2743
1195 -2743 1984 586 -2082 2536 -899 -1436 2524 -1484 -739 2404 -1976 -9 2131 -2726 1168
1210 1168 1129 -2659 2309 41 -2282 2841 -1450 -997 2733 -2673 11 1880 -2823 1303 747 -2687
1226 -2687 2354 -384 -1762 2412 -1542 -819 2100 -1840 237 1621 -2304 988 796 -1976 1470
1241 1470 128 -1995 2291 -526 -1242 2690 -1680 -291 2211 -2376 1095 1265 -2450 1753 -36
1256 -36 -2093 2395 -882 -1118 2379 -1551 -69 1722 -2114 797 1065 -2210 1509 254 -1581 1981
1272 1981 -567 -1006 1978 -1302 -428 1749 -1927 443 1237 -2056 1389 301 -1882 1689 -655 -1138
1288 -1138 1852 -1152 -495 1851 -1854 708 964 -2115 794 389 -2203 1683 -221 -1178 1923 -859
1304 -859 -642 1923 -1789 121 1355 -1847 1229 564 -1674 1353 -295 -1300 1640 -894 -206 1412
1320 1412 -1419 208 1102 -1653 1021 503 -1316 1142 -189 -1163 1472 -731 -627 1679 -1144 247
1336 247 1370 -1550 830 651 -1594 1222 -57 -1143 1478 -619 -652 1381 -1042 -62 1322 -1302
1352 -1302 605 828 -1219 1208 11 -1052 1547 -421 -736 1424 -979 -163 940 -1247 625 464
1368 464 -1221 845 232 -1364 1162 -206 -796 1194 -1173 -288 1184 -1057 266 739 -1297 762
1384 762 244 -1012 1069 -359 -746 1069 -621 -286 1151 -961 354 626 -1055 679 325 -1070
1400 -1070 1126 -175 -550 1010 -547 -116 1065 -1023 295 749 -891 691 368 -849 981 -172
1416 -172 -847 812 -652 -284 896 -920 -95 527 -967 248 252 -1019 828 -55 -823 877 -569
1433 -569 -288 794 -797 4 827 -846 526 140 -1007 806 -86 -645 604 -150 -383 527 -719
1450 -719 57 663 -891 365 522 -707 556 239 -1068 649 -259 -403 750 -588 -2 578 -792
1467 -792 200 305 -731 468 163 -795 656 3 -207 747 -336 5 646 -591 253 454 -579 573
1485 573 216 -696 486 156 -565 947 -287 -359 621 -451 235 206 -750 342 217 -541 568 -30 -259
1504 -259 649 -253 -76 437 -282 -11 324 -577 198 210 -235 548 74 -425 547 -276 -373 592 -339 31 534
1525 534 -358 322 423 -538 450 -6 -265 209 -351 0 406 -160 -72 205 -345 17 275 -175 357 333 -239
1546 -239 257 -182 -411 478 -361 -117 486 -427 -127 120 -261 238 325 -289 244 3 -288 98 -248 -59
1566 -59 328 -224 105 183 -255 45 134 -267 159 -158 -340 566 1 -108 234 -128 86 91 -219 126 172 -431
1588 -431 137 -6 -320 200 103 -254 294 -216 -220 100 -414 135 49 -337 97 108 -190 -37 96 -243 81 -68
1610 -68 -100 305 -145 -10 93 -359 69 22 -266 38 29 -241 77 -157 -59 102 -330 65 114 51 -43 45 -270
1633 -270 156 100 116 244 204 -294 315 -304 -174 40 -300 -76 243 -36 171 118 -314 311 -54 -146 199 20
1655 20 75 228 -43 230 170 -159 176 80 -185 -128 19 -160 -1 -154 -12 141 -67 -176 201 -126 -2 -54
1677 -54 -278 200 72 -185 220 33 140 194 -173 63 -207 -142 -180 127 -188 111 83 -116 -20 -251 62 303
1699 303 -86 298 8 81 5 -113 -6 169 149 -170 8 216 -222 201 316 123 206 -115 77 -27 -279
1720 -279 127 311 31 234 86 -143 5 66 -53 66 -9 -49 -96 -2 96 79 18 1 51 -101 38 -82 -30 68
1744 68 133 -38 64 -112 8 142 71 48 -126 72 101 227 -70 -37 -89 -186 67 23 62 184 26 -174 165
1767 165 -9 0 75 -52 180 165 -10 -154 8 -53 -74 -240 142 127 -321 -51 90 -22 40 415 -159 -47 -37
1790 -37 46 17 -98 -95 80 -162 -51 -53 33 -26 -160 265 -49 174 115 278 -99 59 12 -165 -15 134 -91 -115
1814 -115 164 -54 -77 268 187 177 16 -69 -121 -59 -182 -68 108 85 25 -4 169 121 -31 171 -113 -141 110 99
1838 99 -88 -108 94 -9 -63 43 177 38 3 -17 233 -91 22 110 202 325 -198 -229 118 -175 -145 -88 9 244
1862 244 -13 -174 7 -116 160 -33 -124 69 6 -95 62 -5 -46 -2 -71 12 118 175 -178 -124 75 257 245
1885 245 -207 -240 -154 -81 -260 158 -44 -140 -54 27 -54 -52 -148 -90 15 129 179 -15 3 76 158 52 -13 -2 165 117
1911 117 46 -25 34 -170 -32 -13 -82 -145 -120 -106 56 71 -145 101 28 -120 222 1 -142 -34 138 -144 62
1934 62 -53 30 -105 65 6 189 -339 74 165 47 48 11 14 79 -202 138 -163 -277 -21 23 -96 205 55 -14
1958 -14 6 -221 -182 -89 77 28 164 13 278 -50 -85 65 70 -94 156 91 38 175 -64 119 14 -268 15
1981 15 -160 -187 176 -208 -150 150 -98 75 146 -111 -15 331 -16 560 -123 -209 290 -323 -145 152 115 -70
2003 -70 73 -60 71 293 -245 273 158 -101 -11 90 -194 210 45 95 10 137 251 -130 -154 121 -153 -39
2025 -39 44 -80 -250 101 81 -110 334 116 13 111 -188 -137 224 -148 -113 123 -182 152 -43 -118 218 -281
2047 -281 41 177 -110 -2 144 -237 100 -51 -353 223 -259 -100 150 -128 -46 69 -291 -76 234 -309
2067 -309 116 109 -219 367 -122 -58 381 -11 -168 235 -200 40 -33 -194 61 196 -367 15 62 -120 -51 -183
2089 -183 -3 355 -237 -102 199 -200 -49 161 -387 219 -66 -126 200 -150 -198 181 -68 -221 42 -179 434
2110 434 182 -448 278 -16 -323 379 -117 -196 369 -57 142 240 -42 165 -6 -235 87 14 -157 305 -181
2131 -181 -366 324 -141 -66 100 -490 350 217 -323 25 -41 -294 367 -99 -216 319 46 -46 253 138 185
2152 185 292 -47 157 144 -200 363 79 -174 246 -83 -211 504 -354 25 303 -286 233 423 -381 483
2172 483 106 -289 269 -235 24 196 -120 -207 38 -381 52 126 -179 139 169 -305 286 8 -45 339 -41
2193 -41 -210 269 -262 22 403 -397 398 159 -303 498 -184 -127 408 -143 -172 484 -502 241 391 -417 274
2214 274 -225 -258 96 -99 122 616 -239 -20 574 -367 -175 226 -423 119 172 -537 510 -135 -488 159
2234 159 56 -258 273 -408 -258 640 -462 116 211 -481 322 -204 -250 519 -233 -18 445 -171 177 222 -431
2255 -431 111 155 -401 209 129 -346 281 -81 -100 529 -201 50 70 -402 55 318 -508 504 40 -452 510
2276 510 -377 28 263 -348 49 465 -453 289 250 -458 220 -20 -591 320 21 -17 428 -264 -53 375 -546
2297 -546 -35 223 -287 286 21 -521 508 -278 -164 410 -366 -252 561 -250 -21 252 -432 300 104 -305
2317 -305 321 -161 -37 298 -538 -194 422 -437 396 513 -393 234 252 -112 290 162 -386 463 -287 -67
2337 -67 214 -505 -36 513 -479 172 216 -483 561 -87 -361 604 -257 -116 329 -591 60 213 -518 82
2357 82 234 -556 207 -156 -447 342 -162 -23 487 -193 -220 437 -283 211 282 -465 276 -129 -438 513 -121
2378 -121 -454 528 -283 30 501 -547 93 403 -618 291 38 -294 400 -213 -444 381 -515 -119 166
2397 166 -454 29 160 -445 178 15 -364 233 354 -405 657 -5 181 707 -263 128 271 -34 313 510
2417 510 -253 -184 -211 -171 542 -448 -465 647 202 -364 319 -763 -11 -153 -704 317 -118 -596 515 -94
2437 -94 -318 163 -256 -200 106 -508 87 341 -114 433 97 -556 527 -201 -210 624 -276 -136 401 -325 212
2458 212 277 -454 319 63 -539 579 -305 -430 479 -188 -201 548 -342 33 114 -714 305 10 -360 455
2478 455 -140 -470 426 -326 91 515 -594 340 87 -164 394 200 -379 462 -41 -372 499 3 -118 521
2498 521 -194 -26 315 -532 294 192 -424 272 80 -316 564 -162 -132 496 -408 -1 442 -394 209 306 -275
2519 -275 455 -175 -276 716 -160 -238 287 -479 -209 308 -415 168 290 -566 433 -84 -640 200 -305 -321 671
2540 671 -382 53 467 -489 258 161 -385 320 279 -316 506 -191 -343 646 -440 -84 409 -403 178 296
2560 296 -282 503 101 -390 362 -36 -349 551 -251 -4 447 -354 197 368 -265 3 -192 -388 327 61
2580 61 -215 461 -182 -68 335 -372 -36 335 -458 308 136 -488 508 111 -367 184 -346 -322 533 -757
2600 -757 -28 456 -527 -90 132 -164 -106 0 -142 496 -251 -33 390 -342 112 358 2 134 202 -458 703
2621 703 -228 -372 481 -569 419 1015 -436 -349 235 -860 -101 313 -446 171 245 39 1052 -28 -565
2640 -565 234 215 -364 220 -7 -333 -133 -180 417 296 -230 483 -293 -304 348 564 77 288 -197 373 266
2661 266 -133 -229 -923 -735 -261 -392 -413 -148 -141 -300 340 -162 -14 363 -344 253 216 -147 306 -97 -216 361
2683 361 -122 69 343 -280 124 286 -383 169 234 -270 108 109 -155 301 -102 -203 450 -216 -89 275 -485
2704 -485 138 196 -256 461 76 -352 384 45 -201 356 -166 -174 353 -142 27 206 -199 159 141 -260 445
2725 445 -91 -313 332 -220 -107 292 -263 -107 98 -191 2 104 -439 185 -235 49 311 -31 -114 396
2745 396 -415 167 22 -230 -124 -44 -388 207 165 -342 353 -57 -144 407 -179 30 442 -524 167 -73 54
2766 54 60 208 -104 80 -38 3 456 -344 -44 130 -328 49 441 251 284 106 -91 375 -83 -93 196 -266
2788 -266 -64 160 -280 -133 385 -151 55 19 -258 315 -63 -142 235 -216 -102 239 -264 -32 -26 -130 219
2809 219 58 -235 154 -48 -216 347 -78 -54 138 -109 50 219 -325 245 175 -185 73 43 -87 223 -128
2830 -128 36 120 -110 -203 302 -252 54 81 -261 201 247 -45 190 -125 -213 236 -171 -32 164 -197 175 259
2852 259 -243 309 184 -324 176 178 -20 178 -330 26 234 -333 96 -134 -339 258 -38 46 84 -34 -43 101
2874 101 10 -229 217 -271 -13 204 -418 44 37 -82 165 -306 -119 -29 -96 195 243 -189 -10 247 -317 197
2896 197 -11 22 147 -10 -281 276 -144 -126 139 -241 -126 89 -331 -58 -159 -427 -9 283 -116 347 50
2917 50 -70 79 86 91 245 -140 -11 137 -355 103 -86 55 147 85 -145 344 236 -74 280 -40 -24 137 -253
2940 -253 -31 231 -72 126 99 -29 293 136 -90 62 -65 -36 -43 -174 9 65 -186 35 -201 -115 -39 -119 89
2963 89 308 -2 -42 -22 -45 -78 47 -217 168 -248 -444 177 -16 -171 142 -71 65 214 -165 174 168 68
2985 68 86 34 -131 274 101 -59 -24 -11 -90 259 -90 51 140 -202 104 72 -362 10 -40 -168 300 18 -78
3008 -78 52 42 -169 21 -138 -79 157 33 301 -59 32 182 23 19 -103 25 -62 216 -56 0 46 -188 -26
3031 -26 167 -78 -92 254 -52 -6 88 -170 182 -99 -51 126 -126 62 178 -159 286 7 -28 205 194 -285
3053 -285 -195 77 39 124 -327 3 -5 112 110 468 -111 -46 -25 68 211 -287 -56 244 58 -133 119 -99 144
3076 144 52 -250 138 173 -176 56 241 -195 18 -132 140 358 -139 1 256 -169 317 -103 110 199 186
3097 186 -26 277 -7 61 217 162 10 110 -281 20 -54 -118 75 -150 -128 71 -135 66 254 -77 173 73
3119 73 -182 32 84 1 -188 169 -232 63 -11 18 63 -82 -5 219 105 82 136 -181 219 149 -260 102 110 -298
3143 -298 -26 -80 105 174 -199 -25 187 9 -115 155 -93 229 -54 -332 -131 132 210 195 -38 -60 155 -150
3165 -150 -141 89 13 118 96 -77 186 104 -91 90 91 50 374 -2 17 219 -133 -19 25 -87 77 -219 -178 -189
3189 -189 98 70 105 -252 0 168 -102 230 320 -218 41 -27 -5 96 -61 -168 -17 -258 163 -57 -99 11
3211 11 346 -119 132 -34 184 253 105 -235 372 -180 -80 136 -173 0 94 -179 145 21 66 315 23
3232 23 -184 50 214 -106 -3 136 34 -26 -241 121 108 -81 170 143 -139 478 -6 -85 145 4 -181 350
3254 350 -354 3 -57 -269 199 -144 -205 222 -92 -76 63 -93 -24 26 -237 63 66 -182 148 -112 -256 -19
3276 -19 -125 -188 275 -148 -119 271 -269 -188 292 -105 186 55 -65 184 -22 56 239 -304 -52 535 -176 91
3298 91 9 -166 4 164 -202 -70 27 -120 274 12 -170 248 -19 22 358 -250 159 203 -315 139 121 -47
3320 -47 306 -166 -267 114 47 194 -47 -162 -101 198 27 160 105 -4 518 36 -85 213 46 156 170 -95
3342 -95 158 300 -239 -121 -307 -234 100 -75 -128 61 105 -157 223 -179 243 308 -206 -98 37 -86 212 -224
3364 -224 -25 -83 -131 -14 190 -149 -79 280 10 -133 173 120 15 88 -155 220 67 -440 -219 -194 -196 284 -277
3387 -277 -468 -138 106 -46 -231 -35 -31 -285 56 43 -161 119 10 -29 10 65 -79 249 123 -154 17 27
3409 27 -64 159 -363 -98 472 -357 200 -102 -123 225 -191 -57 288 -104 -84 120 -51 -15 231 -245 80 -10
3431 -10 -37 196 133 169 19 -39 -54 139 -268 -9 172 -111 -26 -30 -90 -23 102 -207 217 136 21 125 -161 -181
3455 -181 226 -127 9 209 -32 232 128 -154 15 -132 -202 142 -244 192 232 -140 314 191 -264 -101 -118
3476 -118 -337 -28 -63 -73 221 100 -219 135 -137 -42 225 -184 -110 -83 50 358 76 -212 443 -102 -5 157
3498 157 -345 -179 143 -52 -161 129 -114 59 -91 -101 163 57 239 135 -121 -214 99 78 -113 152 -33
3519 -33 217 -158 20 -17 -73 -67 113 138 -286 188 -90 48 95 -222 -155 210 90 266 -205 82 233 -66 -51
3542 -51 346 -119 146 118 -278 113 88 -194 62 89 -103 111 -263 -107 61 -85 -168 48 -252 31 -55 185
3564 185 218 70 92 58 -261 35 331 -323 16 27 17 -105 144 -30 89 85 -174 -35 -163 -11 104 -176
3586 -176 -53 15 -62 -75 56 67 163 -106 58 184 -34 -64 -39 -131 56 229 -1 -39 16 -3 50 218 71 -8
3610 -8 70 71 10 -113 15 73 29 -17 57 49 -43 60 -276 51 109 146 14 -109 100 -230 33 -138 122 -73 -21
3635 -21 -108 -51 139 -57 -159 -34 78 3 -45 -86 0 53 -228 166 26 -78 183 76 -149 1 -122 136 164
3658 164 -79 96 -38 139 11 2 83 169 42 49 -66 320 -188 -36 88 176 190 8 144 -11 136 49 -179
3681 -179 -307 -272 -138 -157 243 32 -52 45 24 89 -325 -88 135 58 -236 142 -197 -57 15 98 -43 -38 11 3 164
3706 164 -109 145 -47 -90 95 97 -13 46 -238 77 65 49 370 -132 -261 -35 35 17 -161 -179 -77 -60 -22 56
3730 56 1 -82 -28 113 -189 177 -103 -120 62 215 162 265 130 114 65 -13 88 -185 -106 18 -95 -125 28 -91
3754 -91 16 128 3 105 137 -165 133 114 -280 218 240 -73 175 -319 51 124 -271 -14 -35 -115 -55 194 165
3777 165 -21 -6 35 -112 123 92 12 -103 51 -3 -197 13 41 46 -9 94 -222 37 -117 17 65 -347 -34
3800 -34 5 -124 321 9 116 -9 -76 -59 -30 65 -47 45 44 -82 79 223 84 68 21 88 -196 229 -20 44
3824 44 -113 -2 -32 -256 95 83 137 127 -103 -92 -251 -168 353 -8 209 100 -29 -84 13 -57 -77 152 147 25
3848 25 -38 17 25 -48 -114 -22 115 -60 94 7 233 -52 21 360 -119 -78 15 15 85 10 32 78 -66 -101 -24 68 57
3875 57 125 69 -127 -62 -156 -17 65 18 -2 154 -48 -306 42 -82 109 24 -180 30 385 -108 -107 306 171 -18
3899 -18 172 74 181 101 -38 29 -26 93 -14 -43 173 -138 -46 -14 -49 251 -62 -104 -39 -222 71 140 -138 3
3923 3 160 -38 33 79 -33 81 220 -90 197 -32 57 97 -85 178 -34 -202 -109 133 52 33 163 37 169
3946 169 11 -100 131 6 -156 302 -149 28 -24 -115 -118 -101 -45 24 73 62 -43 -256 37 74 -209 210 140 -39
3970 -39 118 87 -28 108 -44 -6 8 -98 88 -36 -69 -88 -73 -236 48 -103 -63 -61 -26 48 -100 175 -312 -91
3994 -91 -174 74 92 -78 -361 -59 -106 -38 76 -148 262 -60 109 -67 -161 -152 -44 -212 -41 33 -33 -23 -28 129
4018 129 -100 -74 -242 326 -304 -52 -236 41 95 13 -16 -75 36 -58 -10 161 -24 -9 72 -308 137 69 86 288
4042 288 38 -45 194 437 62 12 62 -116 164 86 31 -173 86 206 -235 76 67 456 -26 114 134 -44 -261
4065 -261 -61 99 -375 -343 159 486 139 -562 -487 -462 -241 -182 -848 211 -130 185 -172 -87 767 -271 -17
4086 -17 -79 156 491 -178 97 153 179 -163 29 -20 -291 -57 -132 -207 197 -289 -206 -561 -136 104 258 -43 -203
4109 -203 279 204 -268 76 -157 -364 -358 115 71 -276 404 -78 -311 -125 -214 -33 26 102 171 -2 -196 -114 18
4132 18 76 -73 -36 -101 -18 -120 -79 -96 -90 -195 136 47 82 29 -93 46 68 130 239 -50 -53 -260 -102 57 -139
4157 -139 71 86 40 -108 44 24 -115 -19 265 152 -43 -24 -78 -20 -77 61 235 -122 62 155 -79 -50 59
4180 59 147 92 -110 -102 26 -11 -66 112 168 168 190 -93 63 -183 -125 -99 91 64 -28 6 210 226 -205 109 146 -146
4206 -146 -89 16 -98 -5 -26 -117 -12 -106 -140 -174 -4 -8 202 -167 18 68 -190 -77 -131 18 -1 36 -203 22
4230 22 -133 -178 221 124 40 57 -88 113 69 -176 -48 -23 -23 103 42 -213 16 -106 -102 -176 48 -207 13 89 132
4255 132 159 1 32 -364 17 78 19 -209 -29 37 -239 -221 -32 23 -17 68 37 -97 236 136 130 57 -116 -15
4279 -15 -122 62 96 89 48 -186 344 61 -100 -341 120 -5 23 -127 -32 -67 -8 231 -159 -89 115 -69 136
4302 136 22 2 -111 -111 118 -52 -107 -189 133 -111 -190 156 -70 34 136 45 58 -25 -53 -220 -7 -15 39 -9 -87
4327 -87 151 -205 -103 56 -93 54 -28 -330 30 59 41 148 47 61 -23 60 -12 -107 12 -79 343 105 78 263
4351 263 88 222 -26 27 206 -73 -40 -166 -99 -23 187 -54 87 136 101 -72 31 4 -124 62 57 218 97
4374 97 72 22 59 -131 -81 -155 -50 137 -192 -292 66 -1 159 -143 -24 -192 62 -7 21 -46 22 154 -127 -36
4398 -36 165 187 -118 -132 3 -109 -250 30 7 -55 111 -44 -169 -13 185 17 -41 -7 -116 31 -279 212
4420 212 118 37 181 -16 -278 164 3 -55 -124 -177 18 -240 -35 -303 202 -5 323 108 -107 -102 -131 18 -71
4443 -71 -83 4 36 -215 -144 73 115 28 187 -29 164 155 -91 -44 152 -39 -18 98 -106 -45 152 -106 -107 -62 -155
4468 -155 118 -23 92 -46 41 -33 72 -129 155 -227 125 -23 -10 -98 32 -269 -107 -61 -139 40 9 109
4490 109 45 -63 101 231 16 41 -247 25 -100 -153 -114 144 -58 -14 -17 36 118 -156 216 -211 43 -54 -92 36
4514 36 110 82 -6 57 194 107 62 62 -111 34 40 -243 -1 79 62 181 66 -43 259 -308 -78 -40 -104 25 -120
4539 -120 147 40 162 158 245 7 -153 126 64 48 94 -40 28 69 108 -55 -132 -122 169 87 -123 7 185 2
4563 2 -71 107 -212 404 -19 -28 37 112 -53 -107 -142 78 -13 -240 237 -164 51 27 -69 88 129 -89 138 160 -97
4588 -97 286 -16 -198 86 -99 80 277 82 10 154 114 -139 137 79 -109 79 -193 11 28 163 -154 -124
4610 -124 89 198 -10 -110 146 -169 121 -280 -150 134 -24 31 200 177 -8 19 -266 141 31 147 -189
4631 -189 64 11 -107 131 43 66 -186 90 8 25 -275 213 -61 -10 109 -107 -88 -50 153 189 227 -124 206
4654 206 150 -71 -133 -145 101 44 -205 121 81 -74 -46 105 -24 -50 14 116 -131 -60 -215 -104 -68 124 -38
4677 -38 -140 162 -61 -182 -45 -132 83 -45 64 -78 -52 -192 -134 26 -83 18 -27 -1 90 114 -4 -15 108
4700 108 -144 52 -30 -152 -30 61 110 71 -63 8 -18 -73 -6 -187 -69 5 -181 42 -29 -227 12 17 -240 -21
4724 -21 55 -193 -74 -265 -113 119 -27 -165 128 92 58 -23 -78 159 -74 -111 142 -122 64 23 51 79 -60
4747 -60 -311 -36 14 -16 2 6 -101 93 0 181 81 97 -114 41 -7 -33 1 30 -228 -189 -75 -167 -218 37 83
4772 83 109 -40 135 -254 -77 -34 -124 -12 -28 -35 136 -30 -171 5 -105 41 183 17 -166 55 -166 -120 77
4795 77 161 388 83 -57 -44 -302 -162 88 -123 191 -196 51 -227 122 -132 -85 107 55 12 -197 -168 -116 -128
4818 -128 -38 -73 -171 110 60 46 279 -149 -73 229 133 355 -86 -187 -23 116 -143 56 67 137 -64 18 -44 176
4842 176 -43 33 31 51 -98 15 -39 233 -62 -193 220 66 -308 -97 -23 -199 317 -28 96 104 13 197 177
4865 177 5 30 83 11 23 -103 121 -158 -34 -3 222 30 -24 212 -48 -163 94 -63 -114 -95 -123 -46 -77 -186
4889 -186 93 -88 11 84 -279 -6 120 -273 -114 204 -88 17 73 -58 327 -86 -27 -61 -50 26 58 -178 -26
4912 -26 215 -2 -80 101 -122 24 -45 -38 114 -50 44 -153 110 -96 130 -185 176 159 -39 -21 1 116 -46
4935 -46 -299 -104 -77 54 102 -138 136 -88 64 70 -114 -72 71 227 148 -45 118 -210 78 108 -3 -132 -63
4958 -63 -139 163 164 -25 -127 -217 0 -61 46 289 -29 -92 -66 218 123 76 11 9 0 -68 37 87 213 190 -37 30
4984 30 -48 31 85 137 -59 -128 256 131 115 110 -180 -183 -85 -161 -27 105 -177 -12 -58 73 -63 -145 135 -74 -270
5009 -270 -20 16 -33 -85 -83 -16 -63 -3 23 119 76 -151 11 146 53 -66 -145 -11 134 40 153 -228 17 235 74
5034 74 25 50 44 -59 -208 -334 57 -21 -67 34 -43 -30 53 -40 -71 59 -44 296 19 -106 223 176 -43 62
5058 62 -16 27 337 177 178 100 -13 7 23 9 -72 -169 -137 18 -159 -6 56 -87 -64 -39 -133 -175 117 -101 232 219
5084 219 93 -330 77 -11 302 -96 -92 -146 -206 -22 97 20 -80 220 32 30 2 -34 -67 -132 -91 13 -346 105
5108 105 71 5 275 -220 104 -35 143 113 174 -139 167 -136 52 112 83 113 -82 -31 -189 15 -62 -200 -108
5131 -108 -14 286 -87 84 52 237 32 40 -26 -269 17 89 106 149 -148 -87 221 -42 62 112 21 248 -7 -99
5155 -99 -25 77 -94 -57 24 132 219 19 -12 71 148 -63 25 -178 1 161 -70 -294 -254 -35 26 -70 -265 54
5179 54 183 -121 -32 -124 -92 145 148 -8 272 25 135 179 130 -153 45 269 74 -49 10 -66 -70 24 -25 -71 -19
5204 -19 -30 -83 14 6 -153 -55 82 -63 -2 -176 -19 179 39 145 125 -32 99 -133 -174 -103 91 -14 189 -43
5228 -43 -66 -27 -81 176 -4 115 132 80 -84 68 23 113 -17 84 32 -2 117 256 -202 54 118 -96 -240 11
5252 11 -33 62 -56 -17 -144 44 -85 61 -141 38 -108 292 -186 -149 -140 146 -366 -394 259 149 -5 151 183
5275 183 -113 5 -83 -173 -137 -339 -37 117 166 54 -266 83 -454 119 -64 -142 -50 -100 -140 -533 16 -220 -124
5298 -124 224 91 -269 199 -95 -329 -139 253 -100 -34 -55 -35 -175 -25 145 157 154 160 -10 -360 262 116 272
5321 272 178 -39 -79 -109 52 -180 37 15 218 -59 65 155 44 -227 67 -202 -30 145 -92 201 -189 97
5343 97 244 -209 -51 -280 -194 -308 247 -10 -232 697 203 221 -268 172 5 -79 -23 -279 69 -396 165 -303
5365 -303 227 0 -233 21 -54 -303 161 -185 15 109 -121 -197 150 -42 -110 41 19 -113 252 -33 77 223
5387 223 -237 11 -45 -72 74 -15 -79 -51 -100 116 135 80 -32 46 -26 -134 78 -74 -21 126 31 -162 -106 -35 291
5412 291 -27 -132 -68 79 117 -117 48 122 179 -13 172 -63 -29 -62 11 18 -123 86 -60 -191 48 200 109
5435 109 198 31 140 31 135 -58 43 5 47 -20 -42 81 -28 116 -155 -62 -232 123 -43 32 3 -72 -3
5458 -3 243 58 277 178 44 65 50 84 44 -113 -105 89 76 15 280 46 233 -277 188 48 83 -172 119 253
5482 253 -21 234 -136 -332 -194 -330 -112 100 -86 38 84 -437 -137 97 -109 -218 -387 238 -3 192
5502 192 -8 242 -336 -359 -10 192 -353 -85 316 286 -66 -11 -24 -178 -199 -426 -243 56 -53 156 -106 510
5524 510 44 -115 532 -167 -727 517 479 161 -81 -694 -355 -138 -296 485 157 -378 -212 -26 156 -58
5544 -58 286 280 273 165 -347 -163 30 -9 -40 -26 18 11 30 99 244 -41 -74 94 331 97 -164 27 32 -115 195
5569 195 -176 -58 -144 -42 90 -28 -242 -102 81 -153 20 127 -43 -247 -170 166 66 -76 -157 92 -75
5590 -75 6 -60 -48 99 -130 -31 34 76 -173 45 -61 101 -105 -14 3 112 58 39 -121 -88 16 5 22 89 176
5615 176 25 113 -78 266 -7 20 -142 2 -210 241 133 54 -235 -226 73 147 -352 -3 22 -84 188 -133
5637 -133 22 -91 118 -92 58 7 101 -140 -188 -134 98 -111 -127 -61 -138 156 75 -74 93 29 -131 -29 262
5660 262 -118 21 115 323 107 60 298 -68 49 287 3 -145 75 118 15 112 234 17 -267 21 126
5681 126 67 -178 -20 164 54 132 89 131 80 -195 67 137 -176 -50 -119 -127 -146 -12 -133 -115 236 -62 -46 169
5705 169 -179 8 -14 97 152 -93 168 257 -250 128 29 -77 -40 5 34 -208 -19 331 51 -48 -104 178 105
5728 105 16 -240 182 -89 -71 -20 90 -5 -187 101 -55 32 -75 51 -13 -156 -210 174 -85 -120 -25 116 -252
5751 -252 6 -79 242 64 -59 -77 -254 10 97 -1 62 -159 -11 131 -109 -104 -34 -107 164 59 -79 108 121
5774 121 -7 56 -126 -92 -30 -207 88 -101 -97 -5 20 26 -61 289 60 -76 215 362 85 -340 -95 13 66 -267
5798 -267 85 -39 128 -40 242 -133 53 -65 41 -92 -351 11 144 -2 47 81 130 -323 -163 27 129
5819 129 33 -76 -21 -218 16 -49 -142 149 50 13 105 -178 -248 160 -33 -180 -189 -102 218 192 26 194 -262 -8
5843 -8 -126 57 36 87 -111 61 197 -281 20 55 -72 18 23 185 97 45 250 41 -9 -203 -45 14 -23 -110 26
5868 26 36 -239 -61 74 310 99 156 5 78 13 188 27 96 -249 -134 73 -24 297 -88 23 -161 -74 -106
5891 -106 84 153 -34 -55 -241 22 -88 -91 82 -88 13 41 -210 -131 141 -90 -145 192 119 1 119 35 50
5914 50 14 -5 110 -346 -89 6 -177 53 -118 54 290 130 12 30 160 177 -37 221 -14 -48 -220 -41
5936 -41 -15 -96 -26 -58 -163 72 -60 -47 -102 -74 -39 -320 -19 -109 77 -1 -188 349 -122 -87 45 -32 -42 62 -61
5961 -61 -105 0 0 117 -94 48 -77 -125 -1 231 38 130 82 -155 148 138 -24 107 86 212 90 -130 34
5984 34 -152 -226 -83 -13 -7 -80 -69 -3 -119 -242 134 -98 -85 -42 72 -274 -126 45 -107 4 -17 -26 146 -97
6008 -97 -73 141 215 71 111 -14 88 -234 -142 14 -11 -125 -45 192 175 26 -99 72 -200 -113 -29 41 -177 -38
6032 -38 141 66 74 -10 -43 184 32 93 -140 -67 -19 59 -145 -221 -102 -18 56 -209 -24 -436 -124 -230 121 -46
6056 -46 -315 -201 134 -52 111 93 119 38 -46 -264 242 -242 148 78 279 -107 271 -175 53 115 -310 82
6078 82 -306 -138 131 163 315 -396 -523 -270 345 -204 -63 -11 -396 -454 194 -191 114 -18 -343 -188 -92 -282
6100 -282 -8 69 -55 331 204 -319 -207 40 27 214 49 261 -544 245 403 21 38 316 -11 709 -8
6121 -8 37 205 79 -32 -130 13 137 27 -229 -78 364 82 586 148 -15 183 505 -137 -599 401 -163
6142 -163 134 -193 454 -179 -144 117 422 -362 321 159 -44 -282 859 309 524 -128 108 -384 -1224 -264
6162 -264 802 -237 -47 -202 -311 76 753 -395 140 -288 87 810 170 -258 577 735 196 -611 -16
6181 -16 -245 -851 787 294 -80 85 -250 1031 446 -137 941 435 837 742 -101 -893 803 515 73
6200 73 14 -492 -182 65 106 8 190 -403 -67 13 -46 -98 -93 126 -258 -108 -78 3 341 -90 157 19 281 226
6224 226 119 394 300 138 213 -211 437 233 -64 -192 50 -754 331 -107 343 -111 135 197 31 365 -60
6245 -60 15 90 2 86 -337 -410 -543 273 605 -270 331 658 152 -34 564 -181 479 -22 -135 291 238 -125
6267 -125 -232 54 -175 574 -56 335 -91 315 -108 5 -140 67 -325 -68 357 151 -307 -309 419 425 805
6288 805 -403 54 -205 136 -152 249 116 479 -261 164 870 -172 -102 412 -86 62 383 -409 -418 26
6308 26 -156 -86 293 -16 155 71 -99 225 -189 -106 148 -180 -116 50 -112 218 -33 -231 161 23 228 6
6330 6 -54 99 107 134 -74 -158 -259 63 74 188 -316 -77 -202 -98 -102 6 143 26 74 -19 -94 79 92 90 92 292
6356 292 322 32 -85 -4 -64 139 -11 190 140 278 -314 -40 -1 -197 -230 41 -109 -452 260 23 -10 327
6378 327 137 -11 -170 -208 -280 654 45 -298 745 449 335 -308 19 -79 -307 -5 253 320 -292 -173 411
6399 411 -10 33 -126 31 -160 57 288 -300 42 -103 244 -80 20 405 -47 70 359 286 -458 164 -516
6420 -516 89 -353 -149 960 -75 72 -390 -320 249 -122 469 -161 -418 31 -164 20 152 -142 -236 158
6440 158 123 665 174 -200 39 131 233 133 -242 262 -279 -174 264 89 184 616 -153 -65 -96 -382 68 6
6462 6 315 10 -186 -233 341 278 -118 426 -260 -78 -12 386 -8 18 -27 79 -106 -229 678 -47 -190 68
6484 68 -278 -252 -344 -161 115 335 312 661 -121 -394 -13 -233 -193 -7 -15 -26 -8 -217 95 -114 -383 144 350
6507 350 -154 -358 282 -458 -170 -208 285 184 -7 -108 -132 72 -231 305 97 -185 376 602 -66 -334 -368
6528 -368 28 -207 50 28 -8 31 46 46 33 -13 31 -310 6 -15 130 114 -50 -182 35 -68 -32 96 73 77 163
6553 163 156 110 68 209 30 -108 177 -109 23 109 145 -83 -156 -127 261 -170 4 -454 435 180 -26 3 157
6576 157 100 6 -248 148 17 -91 27 80 86 -41 -52 204 -169 -94 -65 -255 25 63 -37 16 178 23 -1 104
6600 104 -149 22 27 -115 251 45 135 183 112 -107 169 -53 186 64 127 32 -93 -193 152 108 10 208 -5
6623 -5 62 -80 -247 -28 -259 -1 10 -176 25 51 236 8 63 -70 164 4 -84 16 -42 -130 139 122 -24
6646 -24 -150 261 93 -5 -180 -85 101 -83 -185 28 40 -104 -92 -61 -7 -57 -31 -15 242 99 -280 -68 28 -84
6670 -84 245 227 -161 -117 50 -95 143 304 74 55 -17 159 -180 -202 162 -6 93 65 22 -164 269 179 -9
6693 -9 -159 -30 -114 -67 -25 -71 66 5 -144 -4 -83 52 164 9 -55 -82 -76 -24 -8 82 121 44 -64 -100 -26 -8 -21
6720 -21 183 -36 -16 270 106 218 -96 152 -31 -69 -163 -108 -108 65 9 13 184 -146 -293 186 -51 272 -99
6743 -99 65 -321 -34 33 -78 173 88 -230 74 100 -212 -110 -163 -17 71 94 -44 136 -132 149 76 30 -110
6766 -110 222 -29 -89 -28 219 144 -48 -99 202 -5 -122 99 7 -75 79 -75 -158 139 145 37 -41 98 64 86
6790 86 -64 -115 -6 -158 115 139 139 -42 -132 -84 154 161 -105 39 48 47 125 -163 32 72 23 -115 80 143 100 102 -256
6817 -256 -60 -202 129 105 118 -171 -200 161 171 200 -195 159 118 17 59 47 180 38 173 -14 29 -39 134
6840 134 -191 40 -215 165 -183 63 69 27 -137 152 -89 113 -5 45 25 -166 -22 -50 69 65 262 -31 -2
6863 -2 -162 -20 61 -22 -252 6 -67 -28 102 45 62 -36 -13 67 33 -13 -11 96 87 -63 41 -118 150 2 -36 28
6889 28 -86 150 -25 -128 92 -113 -83 -100 18 121 149 -75 -9 -29 -183 29 -248 -47 43 6 62 115 35 -45
6913 -45 -34 -5 -58 83 17 232 -137 -113 58 82 17 49 95 -90 107 -103 -17 -174 20 25 140 -32 15 -87 46
6938 46 168 122 17 138 86 -288 62 101 32 -31 90 -109 127 81 -30 157 -468 23 -244 -29 171 -104
6960 -104 118 -65 -131 -290 -289 34 107 18 -68 421 179 67 653 -211 -262 98 75 -31 328 336 -67 382 272
6983 272 -191 -108 -113 -278 -123 205 11 -277 -221 -89 394 490 -207 401 498 691 -631 -190 -915 -523 49 -213
7005 -213 644 81 -331 318 -254 -51 -300 -659 265 33 19 -132 120 -155 48 -45 -122 25 -145 129 16
7026 16 -156 95 173 -154 -50 -254 67 -83 35 -101 89 47 -84 91 87 -84 153 110 16 179 17 47 48
7049 48 266 -94 -1 -238 137 -116 640 186 -84 -35 6 555 126 -370 -35 247 212 -21 50 59 -428 2 47
7072 47 119 11 201 85 -84 -69 46 16 -84 -16 -121 61 255 153 -164 -46 64 41 208 -8 -112 -34
7094 -34 -51 -233 254 -77 -155 -133 243 7 216 -145 101 -113 205 103 -60 -65 -218 61 -49 4 44 113 72
7117 72 49 -159 195 -22 22 -5 126 -230 151 132 162 -41 -264 232 132 95 33 -157 -46 116 241 18 -325
7140 -325 18 -15 -56 144 153 -70 153 -240 -39 -184 -40 84 59 -93 -30 -28 205 66 -135 57 7 92 -196
7163 -196 181 -106 103 41 19 187 106 -231 58 129 -131 308 115 86 16 -30 47 149 -27 -91 -63 79 177 75
7187 75 -95 -51 -86 -130 -145 157 88 109 -94 24 83 -218 32 -197 8 -46 -113 -170 186 100 41 138 55 14 61 -154
7213 -154 37 72 -200 -78 -23 25 -68 140 -48 104 -207 188 240 12 103 86 141 181 -96 58 -52 159 90
7236 90 -45 179 -263 -72 -181 74 143 -12 -73 1 161 -155 193 205 90 129 30 83 -7 63 96 -130 -111 151
7260 151 199 -219 73 268 -161 -303 -287 -121 162 173 -43 -285 192 398 176 18 100 28 95 -351 -694 -422
7282 -422 116 574 -182 -412 -100 -220 278 287 -68 138 97 352 177 128 200 67 -142 -123 172 14 -280 112
7304 112 15 -80 29 -37 -41 139 -10 -42 103 -99 90 -29 70 2 68 115 -21 99 16 -81 -85 -137 88 219 -89
7329 -89 -178 -253 -33 55 -17 40 -107 -21 -84 16 -90 55 -136 58 101 -95 -73 -115 -42 112 72 -62 -384 -92
7353 -92 -109 15 -4 -13 114 -143 -27 -1 59 -206 22 7 105 -65 114 163 48 -50 4 145 8 -179 154 122
7377 122 146 51 122 -113 15 3 -140 -15 76 -105 23 166 -132 -4 -25 -8 19 150 -138 36 -206 90 -47
7400 -47 -204 91 -30 -74 56 -74 0 -25 -37 -26 -7 98 -104 114 0 -205 98 -212 40 177 13 -58 -87
7423 -87 -70 -35 -100 5 -184 -408 103 -136 166 -202 -34 -123 -137 104 -96 136 -166 -199 418 27 7 151 69
7446 69 -199 144 68 355 15 6 208 173 37 625 280 -59 72 -196 186 -126 -331 -103 88 -97 104 -259
7468 -259 295 -215 85 20 -601 54 -121 121 -479 267 -15 -44 49 271 -43 112 -255 28 93 9 88 57
7490 57 95 -41 21 76 105 108 -41 -126 -134 -43 3 -134 125 148 6 -17 31 -88 -73 -27 35 73 189 -93 25 -46 -70
7517 -70 -188 92 120 -126 -73 154 -6 -36 -85 46 -115 24 -71 -125 137 -87 -172 10 156 -55 168 -3 244
7540 244 -117 -156 80 -26 84 -42 -34 -135 -89 -107 -24 -128 8 -127 -18 -133 -11 -134 -153 85 46 -91 97
7563 97 -66 83 187 -216 -121 -58 -393 -167 -171 83 -128 -66 182 -217 73 -10 15 -255 102 145 59 76 25 12
7587 12 20 -69 67 136 13 -60 -185 142 215 31 158 -67 2 62 -102 -5 137 -68 48 -151 -172 -130 -121 121 -84
7612 -84 113 -165 -192 -144 -102 -41 -31 -230 89 151 27 -28 123 158 -29 15 -100 2 157 30 -224 -124 125
7635 125 75 -32 -138 -7 73 60 267 55 -50 129 -40 -242 88 -29 -30 219 99 -8 17 -55 -51 134 -65
7658 -65 -131 -256 76 304 9 128 263 220 9 -28 -18 194 -166 17 186 74 125 -4 -8 -214 109 30 93
7681 93 -54 -242 165 -80 -10 -190 69 208 -47 42 187 -50 169 -91 -53 65 -208 -59 129 67 -172 128
7703 128 -25 168 -32 96 91 123 -60 203 -84 167 108 -36 21 -234 -109 -4 149 -83 6 -9 212 16
7725 16 57 -286 88 -19 36 -100 1 305 -189 179 49 -55 -114 -12 -3 -150 -2 89 51 -80 -6 -7 -49 62
7749 62 65 -238 33 74 -183 42 -158 -99 -1 97 80 18 38 -31 26 -110 11 -21 -34 40 -110 -205 -5 -163 95
7774 95 -1 -34 -81 164 -12 -146 121 -62 -117 -62 -20 18 319 19 38 264 34 -11 -169 -193 -200 -86 -12 -200 -77
7799 -77 -6 132 -146 9 -27 -39 -96 25 396 -28 -43 -6 -6 165 -20 -79 -196 -393 6 75 -100 -21 238 85
7823 85 -91 -31 126 -171 26 47 31 -210 -141 114 101 -35 -209 73 -14 30 2 20 -78 -125 -75 -262 -83 -133 62
7848 62 62 -20 98 103 -48 98 -79 -58 -12 7 123 -72 10 -59 -110 -84 17 65 31 -20 -56 -83 114 -86 -19 105
7874 105 -146 -70 -74 17 31 -95 -15 63 76 158 -35 -140 -131 -61 -85 54 -127 241 23 103 -45 -284 -74 73 207
7899 207 88 25 -146 -122 51 274 42 15 -51 44 5 -31 79 -62 2 96 -151 -42 -84 -167 57 73 37 38 120
7924 120 92 138 20 -38 25 -30 -90 23 -50 -43 77 63 -217 201 73 -115 115 -312 -171 -242 -37 -274 103 -151
7948 -151 16 -152 193 126 -56 -95 -62 -94 1 -34 -293 23 -30 132 -181 -54 6 225 -62 197 -144 3 -2
7971 -2 -55 -12 -41 149 96 100 -81 134 165 -19 -143 49 131 -18 -21 53 -31 -159 -207 192 20 78 -61 91 -5 -203
7997 -203 -152 48 -159 20 -217 -206 -2 61 104 -43 -100 -237 -45 -75 134 -61 103 176 -103 -126 -85 -9 -177
8020 -177 -274 130 136 120 -234 17 -80 194 98 46 112 9 -197 -59 -215 -180 -107 9 -52 -135 46 -9 66 -97 35
8045 35 -114 115 -10 142 5 -12 -79 -50 -100 -79 -236 36 164 -50 -37 253 -60 -69 -57 -77 96 235 -42 111
8069 111 -27 -5 75 -75 88 56 115 -208 -163 -193 -15 -169 -213 -49 -72 -57 -79 57 -263 -238 37 -16 -108 -32 -100
8094 -100 7 -109 60 -103 -41 79 -89 71 169 5 -79 -94 32 -241 -70 19 5 -103 122 198 -10 -33 24
8117 24 196 179 194 12 223 49 -120 345 37 -105 -192 -58 -300 -71 -108 203 41 -83 -85 135 -21 -311
8139 -311 -33 -164 26 -43 -47 -285 -1 72 -139 -23 138 63 -255 -47 39 -171 -148 -39 -208 188 6 -38 217
8162 217 -10 -9 -47 -190 237 63 -31 54 139 152 -99 77 -57 -126 -169 125 -11 209 66 -4 133 -134 -68 -39
8186 -39 6 194 -125 110 132
8191A32
##END NTUPLES=NMR FID
##END=
