##TITLE=1H_LR-732-C-K1-EK-PE
 CDCl3,8 sc, 
 1.03.2021
##JCAMPDX= 6.0         $$ Bruker NMR JCAMP-DX V2.0
##DATA TYPE= NMR FID
##DATA CLASS= NTUPLES
##ORIGIN= UXNMR, Bruker Analytische Messtechnik GmbH
##OWNER= root
$$ XWIN-NMR		Version 3.5
$$ Mon Mar  1 11:16:32 2021 Russian Standard Time (UT+4h)  she@DPX200
##.OBSERVE FREQUENCY= 200.1315066352
##.OBSERVE NUCLEUS= ^1H
##.DELAY= (6, 6)
##.ACQUISITION MODE= SIMULTANEOUS
##.ACQUISITION SCHEME= undefined
##.AVERAGES= 8
##.DIGITISER RES= 18
##SPECTROMETER/DATA SYSTEM= spect
##.PULSE SEQUENCE= zg30
##.SOLVENT NAME= CDCl3
##.SHIFT REFERENCE= (INTERNAL, CDCl3, 0, 15.7039)
##AUDIT TRAIL= $$ (NUMBER, WHEN, WHO, WHERE, WHAT)
$$ ##TITLE= Audit trail, XWIN-NMR		Version 3.5
$$ ##JCAMPDX= 5.01
$$ ##ORIGIN= Bruker BioSpin GmbH
$$ ##OWNER= she
$$ F:/spectra/data/she/nmr/H-F/1/audita.txt
$$ ##AUDIT TRAIL=  $$ (NUMBER, WHEN, WHO, WHERE, WHAT)
(   1,<2021-03-01 11:14:24.54 +0400>,<she>,<DPX200>,
      <created by zg, POWCHK disabled, PULCHK disabled
       configuration hash MD5:
       00 E9 B6 7A A2 85 ED C7 34 08 36 98 17 FE 4E 26
       data hash MD5: 16K
       F0 17 D5 94 7D 63 87 9D 41 D8 9C 71 D7 75 D8 DA>)
$$ ##END=
$$ 
$$ hash MD5
$$ 16 B1 1A 40 7B A5 A8 B0 16 E7 EA 30 A0 7B 04 3F
##$RELAX= 
##$RELAX= 
##$RELAX= 
##$RELAX= 
##$RELAX= 
##$RELAX= 
$$ Bruker specific parameters
$$ --------------------------
##$DU= <F:/spectra>
##$EXPNO= 1
##$NAME= <H-F>
##$PROCNO= 1
##$TYPE= <nmr>
##$USER= <she>
##$AMP= (0..31)
100 100 100 100 100 100 100 100 100 100 100 100 100 100 100 100 100 100 
100 100 100 100 100 100 100 100 100 100 100 100 100 100 
##$AQSEQ= 0
##$AQ_mod= 1
##$AUNM= <au_zg>
##$AUTOPOS= <>
##$BF1= 200.13
##$BF2= 200.13
##$BF3= 200.13
##$BF4= 200.13
##$BF5= 200.13
##$BF6= 200.13
##$BF7= 200.13
##$BF8= 200.13
##$BYTORDA= 1
##$CFDGTYP= 0
##$CFRGTYP= 5
##$CHEMSTR= <none>
##$CNST= (0..31)
1 1 145 1 1 1 1 1 1 1 1 1 1 1 1 1 1 1 1 1 1 1 1 1 1 1 1 1 1 1 1 1 
##$CPDPRG= <>
##$CPDPRG1= <>
##$CPDPRG2= <>
##$CPDPRG3= <>
##$CPDPRG4= <mlev>
##$CPDPRG5= <mlev>
##$CPDPRG6= <mlev>
##$CPDPRG7= <mlev>
##$CPDPRG8= <mlev>
##$CPDPRGB= <>
##$CPDPRGT= <>
##$D= (0..31)
0 1.2 0 0 0 0 0 0 0 0.06 0 0.03 0 0 0 0 0.0002 0 0 0 0 0 0 0 0 0 0 0 0 
0 0 0 
##$DATE= 1614582864
##$DBL= (0..7)
120 120 120 120 120 120 120 120 
##$DBP= (0..7)
150 150 150 150 150 150 150 150 
##$DBP07= 0
##$DBPNAM0= <>
##$DBPNAM1= <>
##$DBPNAM2= <>
##$DBPNAM3= <>
##$DBPNAM4= <>
##$DBPNAM5= <>
##$DBPNAM6= <>
##$DBPNAM7= <>
##$DBPOAL= (0..7)
0.5 0.5 0.5 0.5 0.5 0.5 0.5 0.5 
##$DBPOFFS= (0..7)
0 0 0 0 0 0 0 0 
##$DE= 6
##$DECBNUC= <off>
##$DECIM= 32
##$DECNUC= <off>
##$DECSTAT= 4
##$DIGMOD= 1
##$DIGTYP= 9
##$DL= (0..7)
0 120 120 120 120 120 120 120 
##$DP= (0..7)
150 150 150 150 150 150 150 150 
##$DP07= 0
##$DPNAME0= <>
##$DPNAME1= <>
##$DPNAME2= <>
##$DPNAME3= <>
##$DPNAME4= <>
##$DPNAME5= <>
##$DPNAME6= <>
##$DPNAME7= <>
##$DPOAL= (0..7)
0.5 0.5 0.5 0.5 0.5 0.5 0.5 0.5 
##$DPOFFS= (0..7)
0 0 0 0 0 0 0 0 
##$DQDMODE= 0
##$DR= 18
##$DS= 0
$$ [...]
##$SUBNAM2= <"">
##$SUBNAM3= <"">
##$SUBNAM4= <"">
##$SUBNAM5= <"">
##$SUBNAM6= <"">
##$SUBNAM7= <"">
##$SUBNAM8= <"">
##$SUBNAM9= <"">
##$SW= 16.9725356469052
##$SWIBOX= (0..15)
0 0 2 0 0 0 0 0 0 0 0 0 0 0 0 0 
##$SW_h= 3396.73913043478
##$TD= 16384
##$TD0= 1
##$TE= 0
##$TE2= 300
##$TE3= 300
##$TEG= 300
##$TL= (0..7)
0 120 120 120 120 120 120 120 
##$TP= (0..7)
150 150 150 150 150 150 150 150 
##$TP07= 0
##$TPNAME0= <>
##$TPNAME1= <>
##$TPNAME2= <>
##$TPNAME3= <>
##$TPNAME4= <>
##$TPNAME5= <>
##$TPNAME6= <>
##$TPNAME7= <>
##$TPOAL= (0..7)
0.5 0.5 0.5 0.5 0.5 0.5 0.5 0.5 
##$TPOFFS= (0..7)
0 0 0 0 0 0 0 0 
##$TUNHIN= 0
##$TUNHOUT= 0
##$TUNXOUT= 0
##$USERA1= <user>
##$USERA2= <user>
##$USERA3= <user>
##$USERA4= <user>
##$USERA5= <user>
##$V9= 5
##$VALIST= <valist>
##$VCLIST= <CCCCCCCCCCCCCCC>
##$VD= 0
##$VDLIST= <DDDDDDDDDDDDDDD>
##$VPLIST= <PPPPPPPPPPPPPPP>
##$VTLIST= <TTTTTTTTTTTTTTT>
##$WBST= 1024
##$WBSW= 4
##$XGAIN= (0..3)
0 0 0 0 
##$XL= 0
##$YL= 0
##$YMAX_a= 264134
##$YMIN_a= -283119
##$ZGOPTNS= <>
##$ZL1= 120
##$ZL2= 120
##$ZL3= 120
##$ZL4= 120
##$ABSF1= 10
##$ABSF2= 0
##$ABSG= 5
##$ABSL= 3
##$ALPHA= 0
##$AQORDER= 0
##$ASSFAC= 0
##$ASSFACI= 0
##$ASSFACX= 0
##$ASSWID= 0
##$AUNMP= <proc_1d>
##$AZFE= 0.1
##$AZFW= 0.1
##$BCFW= 1
##$BC_mod= 2
##$BYTORDP= 1
##$COROFFS= 0
##$CY= 11.3945322036743
##$DATMOD= 1
##$DC= 2
##$DFILT= <>
##$DTYPP= 0
##$F1P= 15.9154993809931
##$F2P= -4.1035820241983
##$FCOR= 0.5
##$FTSIZE= 0
##$FT_mod= 4
##$GAMMA= 1
##$GB= 0.15
##$INTBC= 1
##$INTSCL= 1
##$ISEN= 128
##$LB= 0.24
##$LEV0= 0
##$LPBIN= 0
##$MAXI= 10000
##$MC2= 0
##$MEAN= 0
##$ME_mod= 0
##$MI= 1.114404
##$NCOEF= 0
##$NC_proc= 0
##$NLEV= 6
##$NOISF1= 3.799351
##$NOISF2= 2.8
##$NSP= 1
##$NTH_PI= 0
##$NZP= 0
##$OFFSET= 15.70392
##$PC= 1
##$PHC0= -10767.96
##$PHC1= 19.00094
##$PH_mod= 1
##$PKNL= yes
##$PPARMOD= 0
##$PSCAL= 0
##$PSIGN= 0
##$REVERSE= no
##$SF= 200.130013532006
##$SI= 16384
##$SIGF1= 3
##$SIGF2= 2
##$SINO= 400
##$SIOLD= 16384
##$SREGLST= <1H.CDCl3>
##$SSB= 0
##$STSI= 0
##$STSR= 0
##$SW_p= 3612.71676300578
##$SYMM= 0
##$S_DEV= 0
##$TDeff= 0
##$TDoff= 0
##$TI= <>
##$TILT= no
##$TM1= 0
##$TM2= 0
##$TOPLEV= 0
##$USERP1= <user>
##$USERP2= <user>
##$USERP3= <user>
##$USERP4= <user>
##$USERP5= <user>
##$WDW= 1
##$XDIM= 8192
##$YMAX_p= 0
##$YMIN_p= 0
$$ End of Bruker specific parameters
$$ ---------------------------------
##NTUPLES= NMR FID
##VAR_NAME=  TIME,          FID/REAL,        FID/IMAG
##SYMBOL=    X,             R,               I
##VAR_TYPE=  INDEPENDENT,   DEPENDENT,       DEPENDENT
##VAR_FORM=  AFFN,          ASDF,            ASDF
##VAR_DIM=   8192,          8192,            8192
##UNITS=     SECONDS,       ARBITRARY UNITS, ARBITRARY UNITS
##FACTOR=    0.0002944,     1,               1
##FIRST=     0,             0,               0
##LAST=      2.4114304,     0,               0
##MIN=       0,             -283119,         0
##MAX=       2.4114304,     264134,          0
$$ Real data points
##PAGE= N=1
##DATA TABLE= (X++(R..R)), XYDATA
$$ plain form
0 0 0 0 0 0 0 0 0 0 0 0 -8 8 -8 8 -16 16 -23 24 -31 39 -47 55 -63 71 -86 95 -111 132 -151 173 -196 222
32 222 -251 285 -322 361 -404 452 -504 562 -623 690 -767 847 -934 1032 -1137 1253 -1379
49 -1379 1519 -1672 1843 -2032 2243 -2482 2751 -3060 3417 -3833 4332 -4936 5685 -6641 7907
64 7907 -9662 12251 -16433 24211 -43166 173751 129887 -262956 259681 -112791 -150717 264134
76 264134 -155382 -9152 180881 -203686 64618 85108 -152249 107199 41423 -132171
86 -132171 117264 11430 -122038 126866 -28315 -105090 175905 -94676 -63956 170459
96 170459 -163975 39475 124471 -201211 135491 18727 -158517 194443 -92816 -73655
106 -73655 172356 -160590 30984 109443 -157845 85404 24364 -122963 110320 -11601
$$ packed form
0@%%%%%%%%%%qJ6j6J6k4L2l9M7n5P0q6J02j18J34j57J81k06K43k83L24l69M18
32B22m73N36o07O83p65Q56r56J066j185J313j457J614j781J966k169K390k632
49a379K898l191L515l875M275m725N233n811O477p250Q165r268J0621j2326J4548
64G907j7569K1913k8684M0644o7377K16917m3864l92843N22637l72472l7926M14851
76B64134m19516J46230J90033l84567K68304K0490k37357K59448o5776j73594
86a32171K49435j05834j33468K48904j55181p6775K80995k70581L0720K34415
96A70459l34434K03450Q4996l25682L36702j16764j77244L52960k87259J9161
106g3655K46011l32946J91574P8459k67288K43249o1040j47327K33283j21921
$$ plain form
116 -11601 -79714 100811 -46474 -57902 104954 -70155 -27971 112377 -111602 10883 91954
127 91954 -148874 87761 47714 -152874 148781 -40721 -103015 170995 -116332 -16597 139561
138 139561 -158419 61286 67075 -141587 115844 -2147 -100731 125277 -47537 -55559 110770
149 110770 -71221 -19964 99258 -88929 6478 85855 -108007 46508 58862 -119541 96604
160 96604 8098 -105404 132894 -59156 -54283 134215 -115213 17045 94704 -133680 74554
171 74554 30875 -110646 106415 -24556 -66054 101715 -60349 -24336 81734 -72705 7206
182 7206 62154 -80940 29097 42156 -87777 59326 16813 -86918 88915 -26685 -64448
193 -64448 104898 -72604 -15286 91226 -105701 40204 48877 -107978 84411 -6747 -77083
$$ packed form
116a1601o8113J80525j47285j1428J62856j75109M2184J40348k23979J22485Q1071
127I1954k40828K36635m0047k00588L01655j89502o2294K74010k87327R9735J56158
138A39561k97980K19705N789k08662K57431j17991r8584K26008j72814q022J66329
149A10770j81991N1257J19222j88187R5407P9377j93862J54515J2354j78403K16145
160I6604q8506j13502K38298j92050M873J88498k49428J32258P7659k28384K08234
171G4554m3679j41521K17061j30971m1498J67769j62064L6013J06070j54439P9911
182G206N4948j43094J10037J3059j29933J47103m2513j03731J75833j15600l7763
193f4448J69346j77502N7318J06512j96927J45905Q673j56855J92389r1158p0336
$$ plain form
204 -77083 100075 -51624 -33257 86634 -75533 6846 62088 -78505 33042 36523 -74979
215 -74979 51846 13549 -67654 70762 -13836 -53555 85291 -49166 -24080 86395 -81614
226 -81614 20337 63423 -97058 63458 18246 -83954 91316 -28078 -47345 90082 -62621
237 -62621 -5709 67317 -73568 28590 38105 -68737 47176 11214 -58176 57678 -9980
248 -9980 -45011 65501 -32295 -28083 66138 -56231 -358 57067 -72848 33547 29902 -75523
260 -75523 63413 -9398 -54935 76071 -45248 -19937 66248 -67686 15588 41216 -68201
271 -68201 41163 12301 -55537 51088 -12231 -37804 53641 -28139 -19949 50959 -43397 -2216
283 -2216 44239 -55178 21469 30786 -60997 45685 5589 -53816 62846 -24543 -30394 66120
$$ packed form
204g7083J77158j51699J8367J19891j62167Q2379N5242j40593J11547L481j11502
215g4979J26825l8297q1203J38416q4598l9719J38846j34457K5086J10475j68009
226h1614J01951M3086j60481J60516m5212j02200J75270j19394j9267J37427j52703
237f2621N6912P3026j40885J02158R515j06842J15913l5962o9390J15854o7658
248i980l5031J10512r7796M212R4221j22369N5873N7425j29915J06395l645j05425
260g5523J38936p2811m5537J31006j21319K5311Q6185j33934Q3274K5628j09417
271f8201J09364k8862o7838J06625o3319k5573R1445q1780Q190P0908r4356M1181
283b216M6455r9417P6647R317r1783J06682m0096n9405J16662q7389n851R6514
$$ plain form
295 66120 -50591 658 49818 -61878 30857 23672 -55957 49852 -3985 -39464 54380 -25502
307 -25502 -18148 49647 -37860 952 38642 -45118 17343 25845 -46339 33321 9031 -42575
319 -42575 45313 -12621 -30012 51725 -33638 -8588 45900 -49948 15439 28212 -53295 37259
331 37259 4994 -43678 47708 -19074 -25600 47014 -35029 -3969 37061 -43045 14244 21433
343 21433 -43617 28020 4664 -36568 37740 -11649 -25536 40198 -26953 -9695 37354 -36658
355 -36658 8133 25473 -41962 24230 9759 -37198 36743 -8278 -25609 40141 -24418 -8740
367 -8740 36754 -34571 9801 25213 -38494 24150 9276 -34147 34566 -6250 -23303 38123
379 38123 -21686 -8612 33563 -31187 8245 24075 -33895 21195 9505 -31425 30390 -4755
$$ packed form
295F6120j16711N1249M9160j11696R2735p185p9629J05809n3837l5479R3844p9882
307b5502P354O7795q7507L8812L7690q3760O2461Q502p2184P9660k4290n1606
319d2575Q7888n7934j7391Q1737q5363K5050N4488r5848O5387J2773q1507R0554
331C7259l2265m8672R1386o6782o526P2614q2043L1060M1030q0106N7289P189
343B1433o5050P1637k3356m1232P4308m9389j3887O5734o7151J7258M7049p4012
355c6658M4791J7340o7435O6192j4471m6957P3941m5021j7331O5750o4559J5678
367h740M5494p1325M4372J5412o3707O2644j4874m3423O8713m0816j7053O1426
379C8123n9809J3074M2175o4750L9432J5830n7970N5090j1690m0930O1815l5145
$$ plain form
391 -4755 -22179 33608 -18129 -10291 31103 -27323 3574 24258 -31943 16910 11583 -31929 25566
404 25566 -4232 -23587 32135 -17273 -11240 30367 -28544 3488 22444 -32487 17382 8962
416 8962 -30104 25325 -4859 -21311 27824 -16084 -9608 24870 -23345 2294 18343 -26629
428 -26629 12883 9762 -25897 20763 -475 -21043 25463 -10707 -12276 27153 -20173 -1136
440 -1136 22305 -26147 11391 12251 -25600 21065 521 -19897 25492 -10792 -10004 25342 -18083
453 -18083 -419 20837 -22112 9385 12839 -22483 17358 3565 -19878 21873 -6842 -12170
465 -12170 24079 -16659 -1514 20453 -22980 9035 12200 -22961 17915 805 -18377 21409
477 21409 -8798 -9994 19010 -15878 -189 15330 -19039 6060 8532 -18234 11335 2486 -16567
$$ packed form
391d755j7424N5787n1737P838M1394n8426L0897K0684n6201M8853n327m3512N7495
404B5566k9798j9355N5722m9408O033M1607n8911L2032J8956n4931M9869q420
416H962l9066N5429l0184j6452M9135m3908O476L4478m8215K5639J6049m4972
428b6629L9512l121l5659M6660k1238k0568M6506l6170j569L9429m7326J9037
440a136K3441m8452L7538Q60l7851M6665k0544k0418M5389l6284P88L5346m3425
453a8083J7664K1256m2949L1497L454l5322L9841j3793k3443M1751k8715n328
465a2170L6249m0738J5145K1967m3433L2015L165l5161M0876j7110j9182L9786
477B1409l0207j196K9004l4888J5689J5519l4369K5099K472k6766K9569q849j9053
$$ plain form
490 -16567 16210 -3970 -14124 18820 -11756 -6759 19439 -19856 3084 14172 -22870 12984
502 12984 3685 -19157 21432 -7802 -11873 20442 -16325 256 14576 -18806 8541 7262 -15127
515 -15127 11407 420 -9984 12479 -2939 -7591 12373 -4853 -5143 12488 -9227 49 13684
528 13684 -15087 6356 9575 -16576 15234 -622 -13949 20854 -10153 -4924 17675 -17175
540 -17175 7100 9161 -16823 14164 -315 -10701 13546 -7183 -2774 10495 -8465 -444 6308
553 6308 -6276 144 5075 -7544 1243 6444 -10712 4363 3864 -12431 11660 -3657 -10695 15888
567 15888 -12392 -2389 13421 -17963 8431 4842 -16793 14602 -4748 -8418 13993 -11522
579 -11522 532 8722 -11204 4955 2347 -8033 6290 443 -5856 5268 1005 -5715 6184
$$ packed form
490a6567L2777k0180j0154L2944l0576M997K6198l9295K2940J1088l7042L5854
502A2984r299k2842M0589k9234m071L2315l6767J6581J4320l3382K7347j279k2389
515a5127K6534j0987j0404K2463j5418m652J9964j7226k90J7631k1715R276J3635
528A3684k8771K1443L219k6151L1810j5856j3327L4803l1007N229K2599l4850
540a7175K4275K061k5984L0987j4479j0386K4247k0729M409J3269j8960Q021O752
553F308j2584O420M931j2619Q787N201j7156J5075m99j6295K4091j5317p038K6583
567A5888k8280J0003J5810l1384K6394l589k1635L1395j9350l670K2411k5515
579a1522J2054Q190j9926J6159k608j0380J4323n847o299J1124m263o720J1899
$$ plain form
592 6184 9 -6599 9838 -3967 -4499 11595 -9551 2477 8414 -12800 10922 989 -10377
605 -10377 14278 -7775 -1985 12461 -12008 5333 5155 -9054 8625 -1659 -3906 7048 -3341
618 -3341 63 2920 -2035 546 1338 -576 -1508 3406 -2040 -2406 5303 -5992 1530 4400 -9202
633 -9202 6732 -337 -7911 9550 -6803 -1857 7764 -10241 4283 1655 -8677 8144 -4502
646 -4502 -3754 6984 -6682 857 3002 -5939 2513 626 -3490 1863 296 -2194 1090 766 -2873
661 -2873 2891 108 -3409 4699 -2799 -1287 5827 -5994 2741 3555 -6715 6513 -947 -3856 7627
676 7627 -4746 637 5011 -5532 4417 670 -3463 5409 -2149 -796 3431 -3014 1458 2050 -1567
691 -1567 1282 1205 -1300 477 1245 -1682 999 1320 -2895 2396 -521 -2250 3745 -3196 -98 3116
$$ packed form
592F184o175o608J6437j3805n32J6094k1146J2028N937k1214K3722r933j1366
605a0377K4655k2053N790J4446k4469J7341j78j4209J7679j0284k247J0954j0389
618c341L404K857m955K581P92j914r32M914n446l66P709j1295P522K870j3602
633i202J5934p069p574J7461j6353M946R621j8005J4524k628j0332J6821j2646
646d502P48J0738j3666P539K145q941Q452j887m116N353j567k490L284l24l639
661b873N764k783l517Q108p498J512P114j1821Q735Q14j0270J3228p460k909J1483
676G627j2373N383M374j0543R949l747m133Q872p558J353M227o445M472N92l617
691a567K849p7k505J777P68k927K681L21m215N291k917j729N995o941L098L214
$$ plain form
707 3116 -4785 2434 457 -4371 4134 -2471 -2068 3513 -4352 654 1523 -4060 2352 -425 -2617 2438
723 2438 -2221 -1820 1768 -2288 -783 1922 -2424 -194 1717 -3203 1405 1592 -3544 3151 17 -3117
739 -3117 4636 -2715 -876 4325 -4332 2334 2295 -4896 4573 -88 -3118 5025 -2249 -662 4616 -3295
755 -3295 1290 3150 -3696 2659 2017 -3740 4000 278 -3428 5090 -1269 -2034 5466 -3858 -146 5038
771 5038 -5651 2809 2323 -6029 4770 -562 -4523 6204 -3950 -1951 5462 -5551 883 3595
785 3595 -6254 3013 839 -5531 4287 -1207 -4354 5039 -3043 -3044 5729 -5337 -508 4830 -7027
800 -7027 2353 2792 -7262 5554 -420 -6235 7485 -4275 -3009 7535 -6790 913 5618 -7833
814 -7833 4431 2582 -7153 6963 -607 -4963 7983 -3886 -2252 7583 -6065 818 6186 -6895
$$ packed form
707C116p901P219j977m828Q505o605M03N581p865N006Q69n583O412k777k192N055
723B438m659M01L588m056J505K705m346K230J911m920M608J87n136O695l134l134
739c117P753p351J839N201q657O666l9p191R469m661l030Q143p274J587N278p911
755c295M585J860o846O355o42n757P740l722l706Q518o359p65P500r324L712N184
771E038j0689Q460m86q352J0799n332l961J0727j0154J999P413j1013O434K712
785C595r849R267k174o370R818n494l147R393q082jQ773j1066M829N338j1857
800g027R380M39j0054J2816n974n815J3720j1760J266J0544j4325P703M705j3451
814g833J2264j849r735J4116p570m356J2946j1869J634R835j3648O883N368j3081
$$ plain form
828 -6895 4046 3468 -7293 6399 564 -6206 8459 -2942 -3668 9137 -6045 -440 7355 -8567
842 -8567 3111 4221 -8958 6609 1026 -7473 8273 -3732 -4562 9942 -7200 -234 6706 -9410
856 -9410 3284 3927 -9802 7148 98 -7802 8672 -4436 -5060 9085 -7567 -1117 7542 -9569
870 -9569 3200 4666 -10152 6564 672 -8775 9070 -3476 -5893 9733 -7099 -2088 9041
883 9041 -9532 2708 6234 -10730 7094 2429 -9547 10267 -2890 -6423 11236 -7403 -1711
896 -1711 10081 -9923 3580 6494 -10588 7624 2095 -8877 9905 -2389 -5869 10762 -6040
909 -6040 -1969 9805 -8413 1756 7940 -10365 6013 4347 -10542 9596 -432 -8362 12461
922 12461 -6130 -4495 12055 -10920 1214 8942 -12726 7304 3852 -11706 10427 -2240 -8690
$$ packed form
828f895J0941n78j0761J3692n835o770J4665j1401p26J2805j5182N605P795j5922
842h567J1678J110j3179J5567n583q499J5746j2005q30J4504j7142O966O940j6116
856i410J2694O43j3729J6950p050p900J6474j3108o24J4145j6652O450Q659j7111
870i569J2769J466j4818J6716n892r447J7845j2546k417J5626j6832N011J1129
883I041j8573J2240L526j6964J7824m665j1976J9814j3157l533J7659j8639N692
896a711J1792k0004J3503K914j7082J8212n529j0972J8782j2294l480J6631j6802
909f040M071J1774j8218J0169O184j8305J6378j666j4889K0138j0028p930K0823
922A2461j8591J635J6550k2975J2134P728k1668K0030l452j5558K2133j2667o450
$$ plain form
935 -8690 11894 -7119 -4001 10200 -10557 1102 7685 -11133 5851 3733 -11643 8953 234
948 234 -9847 11446 -5223 -5329 12032 -10414 16 10164 -12595 5383 5617 -12905 10714
961 10714 -431 -10152 12428 -5811 -4753 12107 -9803 734 9607 -11313 5421 5698 -11186
974 -11186 9145 1401 -9794 11527 -3325 -6662 12813 -7664 -2047 11943 -11819 3500 8575
987 8575 -13207 9164 2650 -12031 13039 -3435 -7721 13758 -9305 -2064 11841 -12590 3693
1000 3693 7518 -12969 8201 2573 -11568 10947 -2512 -9372 12406 -7686 -3896 11514 -11819
1013 -11819 1845 9200 -13876 7285 3647 -13373 11981 -2653 -9794 13727 -8451 -3790 12247
1026 12247 -12604 2209 8617 -13282 7378 3139 -11914 10976 -1744 -8701 12489 -6331
$$ packed form
935h690K0584j9013L118J4201k0757J1659O583j8818J6984k118j5376K0596q719
948B34j0081K1293j6669j06J7361k2446J0430J0148k2759J7978K34j8522K3619
961A0714j1145r721K2580j8239J058J6860k1910J0537Q873k0920J6734K77j6884
974a1186K0331p744j1195K1321j4852l337J9475k0477N617J3990k3762J5319N075
987H575k1782K2371o514j4681K5070j6474m286K1479k3063P241J3905k4431J6283
1000C693L825k0487K1170n628j4141K2515j3459o860K1778k0092L790J5410k3333
1013a1819J3664P355k3076K1161l638j7020K5354j4634p141K3521k2178M661J6037
1026A2247k4851J4813O408k1899K0660m239j5053K2890j2720o957K1190j8820
$$ plain form
1038 -6331 -4732 11787 -10062 331 10478 -12792 5579 6689 -13348 11203 280 -10900
1050 -10900 14565 -6131 -5821 14433 -10989 1233 10807 -13679 7233 5607 -12713 10984 -685
1063 -685 -9403 12543 -5130 -5158 12064 -8755 -1132 10055 -11372 3337 7386 -12635 8172
1076 8172 2824 -12173 12179 -3534 -8931 14303 -9558 -3018 12670 -14334 4283 7932 -14913
1089 -14913 10053 1090 -12035 12796 -5390 -6806 12732 -9457 -1757 10015 -11343 3016
1101 3016 6864 -12054 6823 3403 -11655 10108 -1274 -9537 12995 -6647 -5287 13300 -11661
1114 -11661 1383 10278 -14549 8559 4625 -13245 13176 -2442 -8820 14496 -8534 -2809 12234
1127 12234 -11361 3038 8191 -11716 7096 3662 -10665 9586 -634 -8260 11890 -5134
$$ packed form
1038f331J599J6519k1849J0393J0147k3270J8371J110k0037K4551j0923j1180
1050a0900K5465k0696L10K0254k5422J2222R574k4486K0912j626j8320K3697j1669
1063f85q718K1946j7673k8J7222k0819P623J1187k1427J4709M049k0021K0807
1076H172n348j4997K4352j5713n397K3234k3861O540J5688k7004J8617L649k2845
1089a4913K4966q963j3125K4831j8186j416J9538k2189P700J1772k1358J4359
1101C016L848j8918J8877l420j5058K1763j1382q263K2532j9642J360J8587k4961
1114a1661J3044Q895k4827K3108l934j7870K6421j5618o378K3316k3030N725J5043
1127A2234k3595J4399N153j9907J8812l434j4327K0251j0220p626K0150j7024
$$ plain form
1139 -5134 -5299 12567 -9383 -745 11455 -12724 5277 6737 -14118 10986 250 -10966 14071
1152 14071 -6766 -5682 13272 -11829 968 9342 -13152 6585 3700 -11720 9357 -764
1164 -764 -8998 10457 -4815 -5905 10168 -7865 -2236 9848 -10636 2483 7454 -12680 7418
1177 7418 2953 -12441 12125 -3231 -8582 13852 -9615 -2199 12313 -13135 4847 7341 -13347
1190 -13347 10162 754 -10138 12304 -4425 -5384 11789 -8279 -780 9834 -10133 3204 6947
1203 6947 -10834 6469 3413 -10327 10062 -1072 -8272 12260 -5826 -4147 11927 -10485 1825
1216 1825 9256 -12952 7592 3638 -12152 11335 -2713 -7980 12519 -7671 -3123 10632 -10604
1229 -10604 2227 7053 -11056 6273 3014 -10426 8895 -1297 -7986 10622 -5559 -4851 10731
$$ packed form
1139e134j65J7866k1950Q638J2200k4179J8001J460k0855K5104j0736j1216K5037
1152A4071k0837J084J8954k5101J2797Q374k2494J9737k885j5420K1077j0121
1164g64q234J9455j5272j090J6073j8033N629J2084k0484J3119M971k0134K0098
1177G418m465j5394K4566j5356n351K2434k3467P416J4512k5448J7982K494k0688
1190a3347K3509r408j0892K2442j6729r59J7173k0068P499J0614j9967J3337L743
1203F947j7781J7303l056j3740K0389j1134p200K0532j8086J679J6074k2412J2310
1216A825P431k2208K0544l954j5790K3487j4048n267K0499k0190M548J3755k1236
1229a0604J2831M826j8109J7329l259j3440J9321j0192o689J8608j6181P08J5582
$$ plain form
1242 10731 -9333 -107 8689 -11544 4767 4787 -11563 9136 -519 -9392 11555 -5698 -4503
1255 -4503 11234 -9549 474 8512 -11485 5139 4742 -10648 8605 -23 -8260 10678 -4230
1268 -4230 -4974 10617 -7630 -601 9278 -9943 3885 5943 -10474 8331 1262 -9071 10624
1281 10624 -3777 -5567 11276 -7725 -914 9310 -9901 3541 5911 -10095 7498 1503 -8814
1294 -8814 9568 -3030 -5969 10300 -6804 -1669 9231 -9794 2303 6208 -10703 6234 2398
1307 2398 -9394 9411 -2517 -6635 10074 -6877 -2301 9107 -9381 2137 6168 -10519 5787
1320 5787 2204 -9125 8588 -1956 -6619 9567 -5636 -2970 8777 -8199 1170 6982 -9522
1333 -9522 4617 3319 -9306 8170 -394 -6881 9812 -4755 -3663 9619 -8025 920 7535
$$ packed form
1242A0731k0064R226Q796k0233J6311K0j6350K0699r655q873K0947j7253J195
1255d503J5737k0783J0023Q038j9997J6624l97j5390J9253q628q237J8938j4908
1268d230p44J5591j8247P029R879j9221J3828K058j6417J8805p069j0333J9695
1281A0624j4401j790J6843j9001O811J0224j9211J3442K370j6006J7593n995j0317
1294h814J8382j2598k939J6269j7104N135J0900j9025J2097L905j6911J6937l836
1307B398j1792J8805j1928m118J6709j6951M576J1408j8488J1518M031j6687J6306
1320E787l583j1329J7713j0544m663J6186j5203K666J1747j6976R369N812j6504
1333i522J4139j298j2625J7476q564o487J6693j4567J092J3282j7644Q945O615
$$ plain form
1346 7535 -9295 5058 3868 -8913 8013 -419 -6730 9547 -4391 -3109 9079 -7441 743
1359 743 7531 -8669 4348 3830 -8675 7032 147 -6957 8862 -3625 -4092 8960 -7153 -406
1373 -406 6958 -8317 3642 4225 -9112 6628 194 -7419 8587 -3525 -4513 8596 -6606 -736
1387 -736 6828 -8620 3202 4139 -8750 6041 526 -7354 7783 -3045 -4338 8266 -6247
1400 -6247 -981 6887 -8080 2608 4447 -7949 5541 1132 -7125 7500 -2317 -4528 8130
1413 8130 -5191 -1253 7223 -7068 2119 4935 -7846 5212 2162 -7332 7401 -1503 -5026 8256
1427 8256 -4400 -1692 7616 -6615 1726 5032 -7616 5180 2218 -7068 6970 -1080 -4920 7485
1441 7485 -4254 -2150 7147 -6409 1161 5389 -7437 3770 2699 -7272 6295 -722 -5439 7148
$$ packed form
1346G535j6830J4353j190j2781J6926q432o311J6277j3938J282J2188j6520Q184
1359G43O788j6200J3017n18j2505J5707o885p104J5819j2487m67J3052j6113O747
1373d06P364j5275J1959N83j3337J5740o434p613J6006j2112r88J3109j5202N870
1387g36P564j5448J1822R37j2889J4791n515p880J5137j0828j293J2604j4513
1400f247N266P868j4967J0688J839j2396J3490m409q257J4625r817k211J2658
1413H130j3321L938Q476j4291R187K816j2781J3058l050r494J4733q904l523J3282
1427H256j2656K708R308j4231Q341L306j2648J2796k962r286J4038q050l840J2405
1441G485j1739K104R297j3556P570M228j2826J1207j071r971J3567p017m717J2587
$$ plain form
1455 7148 -4104 -2855 6942 -6149 667 5155 -7637 3680 2175 -6759 5920 -942 -5127 6192
1469 6192 -3646 -2628 5944 -5166 146 4625 -6003 2573 2929 -6250 4543 578 -5342 5958
1483 5958 -2007 -3740 6571 -4509 -670 5809 -6007 2388 3753 -6546 5063 625 -5496 6438
1497 6438 -2078 -3177 6426 -4333 -558 5467 -5443 2419 3652 -5629 4017 946 -4796 5466
1511 5466 -1084 -3218 5881 -3674 -1437 5719 -5351 1344 4149 -5908 3817 1505 -5879 5798
1525 5798 -1397 -3980 5982 -4007 -1304 5134 -5790 1312 3386 -5774 3337 954 -5359 4706
1539 4706 -1210 -3619 5086 -3126 -1448 4421 -4660 399 3408 -5315 2240 2037 -5211 4151 -289
1554 -289 -3815 5099 -2378 -2173 4896 -4273 462 4051 -4792 2410 2185 -4559 4026 -42 -3832 4936
$$ packed form
1455G148j1252J249R797j3091O816M488j2792J1317j505q934J2679o862m185J1319
1469F192r838J018Q572j1110N312M479j0628Q576L56r179J0793l965n920J1300
1483E958p965j733J0311j1080L839O479j1816Q395J365j0299J1609m438o121J1934
1497F438q516j099R603j0759L775O025j0910P862J233r281R646l071n742J0262
1511E466o550k134R099r555K237P156j1070O695K805j0057R725k312p384J1677
1525E798p195k583R962r989K703O438j0924P102K074r160R111k383o313J0065
1539D706n916k409Q705q212J678N869r081N059L009q723P555k03p248R362m440
1554b89l526Q914p477K05P069r169M735L589q843P202k25o744Q585m068l790Q768
$$ plain form
1570 4936 -1772 -2061 4905 -3676 -290 4299 -4253 2249 2801 -4705 3776 362 -4120 4865 -1913
1585 -1913 -2132 4852 -3434 -153 3918 -4518 1993 2473 -4344 3263 303 -3831 4026 -1271 -2342
1600 -2342 4283 -2835 -849 3661 -3881 633 2849 -4534 2497 936 -4294 3736 -1224 -2975 4275
1615 4275 -3045 -1205 3708 -4037 874 2309 -4296 2691 537 -3311 3260 -1248 -2176 3455 -2206
1630 -2206 -936 3167 -2792 108 2643 -3528 1360 1857 -3277 2905 516 -2961 3599 -1510 -1636
1645 -1636 4242 -2704 269 3464 -3838 1999 1665 -3404 3607 -157 -2060 3538 -1952 -519 2986
1660 2986 -2525 656 2092 -2472 1189 1193 -2767 2214 492 -2376 2412 -552 -2080 2628 -1496 -788
1676 -788 3248 -2761 323 1842 -3251 2461 816 -3055 2993 -1269 -2169 3033 -2795 -91 2355
$$ packed form
1570D936o708k89O966q581L386M589q552O502N52p506Q481l414m482Q985o778
1585a913k19O984q286L281M071q436O511M80o817P607k960m134P857n297j071
1600b342O625p118J986M510p542M514K216p383P031j561n230Q030m960j751P250
1615D275p320J840M913p745M911J435o605O987k154l848O571m508r28N631n661
1630b206J270M103n959K900K535o171M888M97n134O182k389l477O560n109j26
1645a636N878o946K973L195p302N837l34n069P011l764j903N598n490J433L505
1660B986n511L181J436m564L661Ml960M981j722k868M788k964j528M708m124P08
1676g88M036o009L084J519n093N712j645l871O048m262r00N202n828K704K446
$$ plain form
1691 2355 -2775 1392 1383 -2541 1792 126 -1862 1993 -573 -1232 2135 -1235 -903 2060 -1729 71
1707 71 2136 -2428 1039 1157 -3123 2306 104 -2066 2801 -1396 -984 2542 -2155 556 1864 -2410
1723 -2410 1612 660 -1976 2276 -410 -1279 2276 -1024 -411 1839 -1436 84 1710 -1495 518 1435
1739 1435 -1855 1234 615 -1787 1897 -394 -1428 2166 -1416 -498 1873 -2001 577 1149 -2298 1325
1755 1325 130 -1803 1715 -861 -1055 1721 -1286 -247 999 -1624 201 1046 -1609 555 254 -1755
1771 -1755 1016 -52 -1590 1322 -439 -1046 1360 -1451 -205 1383 -1510 673 677 -1332 1205 125
1787 125 -1181 1588 -596 -641 1906 -1203 65 1367 -1059 754 911 -1160 905 428 -967 1172
1803 1172 -99 -464 1301 -702 -206 1244 -988 187 929 -1108 723 563 -1142 851 88 -910
$$ packed form
1691B355n130M167rl924M333j666j988L855k566o59L367l370L32K963l789J800
1707G1K065m564L467J18m280N429k202k170M867m197M12L526m697K711J308m274
1723b410M022r52k636M252k686q69L555l300O13K250l275J520J626l205K013R17
1739A435l290L089o19k402L684k291j034L594l582R18K371l874K578N72l447L623
1755A325j195j933L518k576j94K776l007J039J246k623J825Q45k655K164l01k009
1771a755K771j068j538K912j761o07K406k811J246J588k893K183Mk009K537j080
1787A25j306K769k184m5K547l109J268J302k426J813J57k071K065m77j395K139
1803A172j271l65J765k003M96J450k232J175P42k037J831j60j705J993p63r98
$$ plain form
1819 -910 1036 -376 -900 1000 -818 -5 664 -1284 240 532 -1476 557 106 -1039 808 -265
1835 -265 -646 951 -615 -367 1123 -905 126 652 -1090 271 200 -1051 647 -15 -810 990 -276
1852 -276 -651 824 -828 -129 785 -821 375 783 -1030 789 389 -834 996 140 -380 977 -461
1869 -461 -404 1024 -756 92 791 -889 331 839 -656 627 360 -722 831 -174 -483 997 -469
1886 -469 -269 901 -909 407 549 -948 502 90 -1016 931 75 -885 909 -471 -487 858 -781
1903 -781 191 755 -1075 244 588 -1114 805 125 -1025 784 -332 -784 1171 -659 -57 980 -1157
1920 -1157 -52 667 -953 497 101 -1081 830 -350 -807 946 -543 -533 1015 -845 -94 920
1936 920 -1264 737 690 -1324 1039 123 -1101 1287 -486 -724 1310 -872 137 967 -1116 719
$$ packed form
1819i10J946j412n24J900j818Q13O69j948J524K92k008K033m51j145J847j073
1835b65l81J597j566K48J490k028J031N26j742J361p1j251J698o62p95J800j266
1852b76l75J475j652O99R14j606J196M08j813J819m00j223J830q56n20J357j438
1869d61N7J428j780Q48O99j680J220N08j495J283k67j082J553j005l09J480j466
1886d69K00J170j810J316J42j497J450m12j106J947q56r60J794j380j6J345j639
1903g81R72N64j830J319L44j702J919o80j150J809j116m52J955j830O02J037k137
1920a157J105P19j620J450l96j182J911j180m57J753j489J0J548j860P51J014
1936I20k184K001m7k014K363r16j224K388j773k38K034k182J009Q30k083J835
$$ plain form
1952 719 710 -1258 1164 280 -881 1291 -89 -729 1274 -818 -303 1189 -964 32 1096 -1075 705
1969 705 645 -1168 723 -161 -1216 1175 -655 -775 1382 -1561 41 1016 -1662 698 667 -1652 1079
1986 1079 -241 -1107 1291 -778 -684 1346 -1181 -15 1150 -1293 564 719 -1320 873 317 -1280
2002 -1280 1295 -364 -1131 1458 -1012 -299 1402 -1461 355 1182 -1821 947 554 -1732 1712 -496
2018 -496 -981 1949 -1037 -4 1571 -1428 443 1039 -1617 1114 718 -1443 1654 -151 -1197 1774
2034 1774 -710 -585 1645 -1198 -44 1604 -1611 641 768 -1870 1481 277 -1670 1915 -971
2049 -971 -660 1902 -1591 0 1268 -1994 797 609 -1830 1258 35 -1546 1833 -884 -1176 1538
2065 1538 -1470 -314 1485 -1725 607 814 -1984 1110 -41 -1748 1891 -470 -1173 2033 -1276
$$ packed form
1952G19rj968K422q84j161K172j380o40K003k092N15J492k153R96J064k171J780
1969G05o0j813J891q84j055K391j830j20K157k943J602R75k678K360l1k319K731
1986A079j320q66K398k069R4K030k527J166J165k443J857J55k039K193n56j597
2002a280K575j659p67K589k470P13J701k863J816Q27l003K768l93k286L444k208
2018d96m85K930k986J033J575k999J871N96k656K731l96k161L097j805j046K971
2034A774k484J25K230k843J154J648l215K252J27k638L351j204j947L585k886
2049i71L11K562l493J591J268l262K791j88k439L088j223j581L379k717k92K714
2065A538l008J156J799l210K332K07k798L094j151j707L639k361p03L206l309
$$ plain form
2080 -1276 -218 1830 -1735 686 1283 -2052 1445 306 -1485 1845 -524 -1154 2150 -1114 -682 1741
2096 1741 -1586 470 1414 -1977 1214 700 -1580 1733 -116 -1108 2037 -980 -451 2030 -1549 419
2112 419 1385 -2031 805 711 -1847 1767 -93 -1654 2106 -1067 -1000 1637 -1804 110 1732 -2181
2128 -2181 762 889 -2389 1612 -109 -1813 2086 -886 -1039 2021 -1709 -5 1292 -2053 928
2143 928 941 -2432 1457 16 -1588 2109 -620 -1194 2116 -1501 -384 1756 -2167 679 1170 -2201
2159 -2201 1401 542 -1926 2182 -714 -1295 2272 -1433 -254 2202 -1827 587 1295 -2117 1703 410
2175 410 -1527 1960 -670 -957 2226 -1325 -549 1705 -1912 363 1251 -2182 1056 665 -1762 1778
2191 1778 -257 -1466 2096 -1442 -826 1706 -1801 150 1546 -2387 1355 871 -2225 2206 -208
$$ packed form
2080a276J058K048l565K421N97l335L497j139j791L330k369o30L304l264M32K423
2096A741l327K056R44l391L191n14k280L313j849r92L145l017N29K481l579J968
2112D19R66l416K836r4k558L614j860j561L760l173O7K637l441J914J622l913
2128b181K943J27l278M001j721j704L899k972j53L060l730J704J297l345K981
2143I28J3l373L889j441j604L697k729n74L310l617J117K140l923K846M91l371
2159b201L602q59k468M108k896n81L567l705J179K456m029K414P08l412L820j293
2175D10j937L487k630k87L183l551P76K254l617K275Q88l433L238l91k427L540
2191A778k035j209L562l538O16K532l507J951J396l933L742m84l096M431k414
$$ plain form
2206 -208 -1854 2340 -1311 -860 1899 -2027 181 1695 -2270 1254 538 -2014 1730 -255 -1799 1986
2222 1986 -764 -1097 2082 -1664 -123 1839 -2470 714 1305 -2252 1875 264 -1972 2315 -957
2237 -957 -1121 2428 -1833 250 1740 -2365 1177 1047 -2231 1851 252 -1539 2303 -785 -941 2231
2253 2231 -1660 -124 1920 -2040 544 1426 -2333 1373 507 -2157 2125 -687 -1631 2302 -1520 -493
2269 -493 2033 -2210 518 1295 -2418 1560 517 -2050 2062 -828 -1461 2126 -1463 -510 1714 -2019
2285 -2019 732 1307 -2091 1228 380 -2239 1714 -605 -1681 2063 -1244 -800 2047 -2088 429 1596
2301 1596 -2557 1194 857 -2117 2044 -161 -1462 2221 -1363 -648 2213 -1918 480 1269 -2160 1296
2317 1296 816 -1907 1860 -96 -1841 2190 -879 -721 2162 -1699 157 1660 -2067 1104 1084 -2167
$$ packed form
2206b08j646M194l651M51K759l926K208J514l965L524p16k552L744j985j544L785
2222A986k750l33L179l746J541J962m309L184N91l557M127j611k236M287l272
2237i57j64L549m261K083J490m105L542j30l278M082j599j791L842l088j56L172
2253B231l891J536K044l960K584Q82l759L706q66k664M282k812r44L933l822J027
2269d93K526m243K728P77l713L978j043k567M112k890o33L587l589R53K224l733
2285b019K751N75l398L319q48k619L953k319j076L744l307M44K847m135K517J167
2301A596m153L751l37k974M161k205j301L683l584P15K861m131K398P89l429L456
2317A296m80k723L767j956j745M031l069J58K883l861J856J503l727L171k0l251
$$ plain form
2333 -2167 1821 40 -1810 2097 -955 -869 2301 -1800 -114 1820 -2420 961 965 -2373 1687 -13
2349 -13 -1799 1842 -1030 -1096 2092 -1306 -149 1657 -2229 661 1079 -2349 1343 69 -2008 2171
2365 2171 -793 -1380 2004 -1414 -333 2099 -2080 607 1107 -2392 1450 350 -1893 2105 -535
2380 -535 -1425 2251 -1015 -355 2000 -2003 514 1338 -2224 1434 551 -1765 1908 -394 -1365 2288
2396 2288 -1391 -439 2074 -1826 442 1490 -2148 1242 603 -1955 1858 -330 -1516 2255 -1183
2411 -1183 -583 2110 -1917 102 1092 -2390 1252 618 -2092 1607 -149 -1561 2178 -949 -881 1913
2427 1913 -1702 137 1436 -2064 814 1061 -1836 1637 2 -1583 1886 -910 -892 1928 -1638 -42
2443 -42 1679 -2125 1123 912 -1976 1560 227 -1541 2079 -683 -988 1895 -1383 -348 1654 -1915
$$ packed form
2333b167L988j781j850L907l052Q6L170m101J686J934m240L381Ml338M060j700
2349a3j786L641k872o6L188l398J157J806l886K890M18l428L692j274k077M179
2365B171k964n87L384l418J081K432m179K687N00l499L842j100k243L998k640
2380e35q90L676l266O60K355m003K517Q24l562L658q83k316L673k302r71L653
2396B288l679R52K513l900K268J048l638L390o39k558L813k188j186L771l438
2411a183O00K693m027K019R90l482L642o34k710L699j756j412L739l127O8K794
2427A913l615J839J299l500K878K47k897L473j635j585L469k796J8K820l566J596
2443d2J721l804L248k11k888L536j333j768L620k762l05K883l278J035K002l569
$$ plain form
2459 -1915 613 1158 -1942 1683 562 -1560 2061 -434 -1369 2256 -1370 -169 2054 -1765 652
2474 652 1215 -2040 1445 286 -1703 1779 -405 -1154 2315 -1394 -595 1854 -1825 357 1148 -2006
2490 -2006 1223 393 -1482 1802 -279 -1429 1608 -1301 -655 1736 -1538 214 1239 -2034 1117
2505 1117 363 -2143 1423 -7 -1078 2102 -1114 -487 2046 -1613 436 1065 -1993 977 702 -1562
2521 -1562 1492 -683 -1642 1611 -1018 -697 1651 -1458 385 1195 -1712 653 836 -1610 1399 124
2537 124 -1370 1867 -807 -964 1834 -1308 14 1639 -1916 834 826 -1776 1654 108 -1313 1691
2553 1691 -735 -805 1853 -1472 -302 1562 -1757 689 903 -1656 1093 204 -1487 1282 -696 -725
2569 -725 1567 -1309 -550 1645 -1884 580 918 -1931 1147 59 -1518 1621 -616 -1248 1863 -1226
$$ packed form
2459a915K528N45l100L625j121k122L621k495r35L625l626J201K223l819K417
2474F52N63l255L485j159j989L482k184p49L469l709P99K449l679K182P91l154
2490b006L229q30j875L284k081j150L037k909O46K391l274J752J025l273L151
2505A117p54k506L566j430j071L180l216O27K533l659K049O29l058K970k75k264
2521a562L054k175r59L253k629L21K348l109J843Q10k907K365J83k446L009j275
2537A24j494L237k674j57K798l142J322J625l555K750qk602L430j546j421L004
2553A691k426p0K658l325J170J864l319K446K14k559K749q89j691K769j978k9
2569g25K292k876P59K195l529K464L38k849L078j088j577L139k237o32L111l089
$$ plain form
2585 -1226 -583 1516 -1863 276 1009 -1577 1307 297 -1881 1422 -283 -602 1537 -1021 -394 1489
2601 1489 -1271 273 913 -1573 968 637 -1388 1122 -79 -1224 1656 -1091 -521 1725 -1288 82
2617 82 1206 -1333 1021 613 -1476 1364 -228 -980 1480 -1029 -510 1352 -1325 834 2035 -1361
2633 -1361 654 800 -1766 1405 -668 -1552 1821 -682 -726 1489 -1423 -220 1175 -1767 633 651
2649 651 -1634 1208 3 -1431 1505 -503 -865 1630 -1128 -326 1323 -1475 403 885 -1601 948
2665 948 204 -1466 1606 -658 -901 1410 -1159 -177 1431 -1256 392 882 -1459 1284 322 -963
2681 -963 1369 -158 -722 1456 -776 -149 1422 -1191 158 988 -1405 882 411 -1462 1355 -167
2697 -167 -1111 1540 -595 -250 1152 -1355 90 830 -1327 878 495 -1440 1179 -27 -937 1254
$$ packed form
2585a226O43K099l379K139P33k586K884j010k178L303j705l19K139k558O27J883
2601A489k760J544O40k486K541l31k025K510j201j145K880k747N70K246l013J370
2617H2J124k539K354m08k089K840j592p52K460k509N19J862k677K159J201l396
2633a361K015J46k566L171k073q84L373k503m4K215k912J203J395k942K400J8
2649F51k285K842j205j434K936k008l62K495k758Q02J649k798J878M82k486K549
2665I48p44j670L072k264k43K311k569R82J608k687J648M90k341K743r62j285
2681i63K332j527n64K178k232O27J571k613J349Q30k393K287m71j873K817j522
2697a67r44K651k135L45J402k507J445P40k157K205l83j935K619j206r10K191
$$ plain form
2713 1254 -846 -411 1146 -964 -98 956 -1213 605 524 -1441 1233 105 -1104 1289 -626 -780
2729 -780 1495 -980 -154 764 -1744 410 576 -1199 955 -97 -1168 1202 -622 -615 1374 -961 -2
2746 -2 1073 -1071 569 443 -1053 941 90 -1029 1117 -245 -832 1226 -934 -204 1263 -843 405
2763 405 895 -1197 835 336 -1134 1315 -185 -759 1416 -927 -215 1068 -1168 304 660 -1186
2779 -1186 591 109 -1106 1025 -161 -873 919 -542 -367 1037 -917 155 870 -1170 590 469
2795 469 -1209 946 97 -1023 1006 -703 -601 1149 -989 28 780 -1095 418 286 -1354 927
2811 927 121 -809 636 -386 -317 796 -882 -133 353 -892 -12 280 -738 332 398 -1079 1094 162
2829 162 -709 825 -578 -428 826 -891 414 1265 -960 889 244 -1040 1452 -285 -680 1369
$$ packed form
2713A254k100M35J557k110Q66J054k169J818q1j965K674j128j209K393j915j54
2729g80K275k475Q26R18k508K154J66j775K154j052j071K370j824PJ989k335R59
2746bJ075k144J640j26j496J994q51j119K146j362n87K058k160P30J467k106J248
2763D05M90k092K032m99j470K449j500n74K175k343P12J283k236J472L56j846
2779a186J777m82j215K131j186p12J792j461J75J404j954J072P15k040J760j21
2795D69j678K155q49j120K029j709J02J750k138J017P52j875J513j32j640K281
2811I27q06r30J445j022O9J113j678P49M86j245Q80K92j018J070O6j477K173r32
2829A62q71J534j403J50J254j717J305Q51k225J849o45j284K492j737l95K049
$$ plain form
2845 1369 -383 -468 1196 -858 -80 795 -1094 596 480 -574 966 -143 -788 875 -616 -400 1152
2862 1152 -724 -54 657 -934 322 382 -894 553 -165 -937 1090 -402 -550 758 -494 137 417
2879 417 -831 165 188 -1084 730 -404 -1027 948 -175 -880 979 -614 -288 395 -696 332 626
2896 626 -680 1081 304 -595 1464 -543 -113 290 -327 -800 291 -1208 689 809 -611 537 640
2913 640 -312 329 219 -961 713 -251 -207 999 -252 -216 733 -980 574 345 -1039 809 -165 -660
2931 -660 557 -178 -48 790 -947 4 502 -819 256 439 -751 637 254 -171 440 -694 -747 730
2949 730 -472 -395 496 -637 111 624 -811 108 138 -802 465 -202 -453 376 -138 -375 691 -650 49
2968 49 498 -676 557 183 -665 405 66 -482 550 -145 -373 843 -423 6 876 -485 380 349
$$ packed form
2845A369j752q5J664k054P78Q75j889J690j16j054J540j109o45J663j491K16J552
2862A152j876O70P11j591J256O0j276J447p18p72K027j492j48J308j252O31K80
2879D17j248R96K3j272J814j134o23J975j123p05J859j593L26O83j091J028K94
2896F26j306J761p77q99K059k007M30M03o17m73J091j499J897J20j420J148J03
2913F40r52O41j10j180J674r64M4J206j251L6R49j713J554k29j384J848r74m95
2931f60J217p35J30Q38j737R51M98j321J075J83j190J388l83m25O11j134n3J477
2949G30j202P7Q91j133P48N13j435R19L0r40J267o67k51Q29n14k37J066j341O99
2968D9M49j174J233l74q48J070l39n48J032o95k28J216j266M29Q70j361Q65l1
$$ plain form
2986 349 -478 415 103 -605 693 -257 -316 740 -587 -141 535 -422 43 403 -376 544 285 -440 491
3005 491 -274 -688 791 -389 -144 330 -555 218 201 -772 316 363 -785 439 -417 -649 359 -459 -297
3024 -297 419 -388 179 223 -518 20 136 -631 635 -35 -601 734 -338 -296 951 -646 -174 715 -921
3043 -921 544 526 -693 569 -108 -537 566 -11 -106 765 -490 -41 493 -826 295 635 -544 697
3061 697 315 -756 249 157 -402 636 -44 -217 622 -717 35 404 -642 525 84 -545 521 -325
3079 -325 -526 755 -393 -492 463 -616 55 364 -672 192 126 -436 196 125 14 671 -198 -771 651
3098 651 -337 -254 515 -768 -270 720 -579 168 -16 -640 728 -107 -321 1046 -385 -283 783 -875
3116 -875 -369 304 -511 391 458 -828 910 -72 -289 793 -238 -610 954 -383 -68 483 -789 149
$$ packed form
2986C49q27Q93l12p08J298r50n9J056j327M46O76r57M65L60p79R20k59p25R31
3005D91p65m14J479j180K45M74q85P73j7r73J088M7j148J224q56k32J008q18J62
3024b97P16q07N67M4p41N38J16p67J266o70n66J335j072M2J247j597M72Q89j636
3043i21J465j8j219J262o77m29J103n77r5Q71j255M49N34j319J121L40j179J241
3061F97l82j071J005r2n59J038o80j73Q39j339P52L69j046J167m41o29J066q46
3079c25k01J281j148r9R55j079O71L09j036Q64o6n62O32p1j11O57q69n73J422
3098F51r88Q3P69j283M98R90j299P47j84o24J368q35k14J367j431J02J066j658
3116h75N06O73q15R02O7j286J738r82k17J082j031l72J564j337L15N51j272R38
$$ plain form
3134 149 192 -526 749 -57 -584 791 136 -660 769 -497 -246 146 -541 521 443 -829 718 252
3152 252 -713 1047 -382 -597 619 -638 -148 1024 -1373 -123 295 -716 221 -203 -908 476 -432
3169 -432 -310 727 -357 -287 523 -578 164 276 -1137 16 -224 -1414 636 267 -392 661 -234 -203
3187 -203 653 -436 -73 315 -806 358 653 -442 505 12 -446 1166 86 8 904 -1032 -256 712
3205 712 -143 309 159 -1013 472 511 -791 664 156 -734 1255 -576 46 410 -656 187 614 -644
3223 -644 487 365 -749 563 -238 -611 449 -422 -270 537 -684 49 899 -941 257 392 -886
3240 -886 639 71 -439 424 -157 -124 873 -699 -53 368 -1123 270 353 -929 225 21 -808 753
3258 753 -291 -252 728 -582 -297 535 -746 103 270 -1069 720 255 -815 886 -171 -353 1141
$$ packed form
3134A49M3p18J275q06n27J375o55p96J429j266K51L92o87J062p8j272J547m66
3152B52r65J760j429k15J216j257M90J172k397J250M18j011R37m24p05J384r08
3169d32J22J037j084P0Q10j101P42J12j413J153k40j190K050l69o59J053q95L1
3187b03Q56j089L63L88j121J164K95j095R47m93m58J612j080p8Q96j936P76R68
3205G12q55M52j50j172J485L9j302J455n08q90J989j831O22L64j066Q43M27j258
3223f44J131j22j114J312q01l73J060q71J52Q07j221P33Q50j840J198J35j278
3240h86J525n68n10Q63n81L3R97j572O46M21j491J393Q3j282J154k04q29J561
3258G53j044L9R80j310K85Q32j281Q49J67j339J789m65j070J701j057j82J494
$$ plain form
3275 1141 -777 -448 919 -756 688 739 -734 338 280 -470 744 -85 -760 752 -149 -96 730 -666
3293 -666 80 712 -730 475 375 -595 746 -571 -717 596 -678 -417 649 -778 -51 766 -1093
3310 -1093 46 476 -768 825 224 -1169 773 -490 -439 972 -1062 -237 973 -649 -27 227 -1040
3327 -1040 788 117 -518 977 -466 -416 720 -713 24 778 -1191 218 763 -1150 751 458 -855
3344 -855 555 -344 -807 790 -381 -226 991 -776 266 816 -594 628 495 -718 799 -269
3360 -269 -794 653 -237 -130 1000 -963 19 1025 -1159 809 221 -995 680 -310 -404 1180 -146
3377 -146 -246 660 -1553 324 736 -651 327 222 -1073 733 153 -1176 842 -572 -670 1025 -1530
3394 -1530 -342 1273 -1069 390 268 -980 267 -94 -614 961 -334 -859 521 -624 -166 867
$$ packed form
3275A141j918L29J367j675J444N1j473J072n8p50J214q29o75J512r01N3Q26j396
3293f66P46O32j442J205j00r70J341j317j46J313j274K61J066j427P27Q17j859
3310a093J139M30j244J593o01j393J942j263N1J411k034Q25J210j622O22K54j267
3327a040J828o71o35J495j443N0J136j433P37P54j969J409N45j913J901k93j313
3344h55J410q99m63J597j171J55J217j767J042N50j410J222j33j213J517j068
3360b69n25J447q90J07J130j963R82J006k184J968n88j216J675r90r4J584j326
3377a46j00R06k213J877M12j387R78j05j295J806n80j329K018j414r8J695k555
3394a530J188J615k342J459j22j248J247l61n20J575j295n25J380j145M58J033
$$ plain form
3410 867 -1769 476 384 -1379 1051 61 -455 1152 -743 -460 995 -1328 -473 648 -1841 -536 537
3427 537 -231 -151 27 93 162 906 -756 1470 -696 -18 1048 -1009 1174 682 -1101 1121 -222 -884
3445 -884 650 415 -375 1028 112 -539 953 -951 428 864 -678 353 590 -1440 715 -139 -667
3462 -667 542 -692 -595 814 -1304 -392 602 -1203 395 -32 -1223 761 153 -496 1039 -417 -713
3479 -713 1255 -585 93 893 -993 -335 779 -932 531 -318 -1312 862 -437 -489 825 -262 -302
3496 -302 2021 -794 537 95 -1846 638 -526 -1088 491 192 -839 852 -457 370 1127 -1064
3512 -1064 -362 243 -850 478 810 -1369 174 -171 -869 324 -983 -448 1229 -1377 -479 447 -1219
3529 -1219 665 89 -1235 227 -7 -161 802 -761 -292 1222 -1005 -198 410 -1009 474 -97 -889
$$ packed form
3410H67k636K245r2j763K430r90n16J607j895K83J455k323Q55J121k489J305J073
3427E37p68Q0J78O6O9P44j662K226k166O78J066k057K183m92j783K222j343o62
3445h84J534k35p90J403r16o51J492j904J379M36j542J031K37k030K155q54n28
3462f67J209j234R7J409k118R12R94j805J598m27j191J984o08o49J535j456k96
3479g13J968j840O78Q00j886O58J114j711J463q49r94K174j299n2J314j087m0
3496c02K323k815J331m42j941K484j164n62J579k99j031J691j309Q27P57k191
3512a064P02O05j093J328L32k179J543l45o98J193j307N35J677k606Q98R26j666
3529a219J884n76j324J462k34j54R63j563M69J514k227Q07O08j419J483n71p92
$$ plain form
3546 -889 480 1 -663 804 -533 -501 854 -847 173 1052 -1624 208 528 -1231 511 95 -287
3563 -287 1164 -307 60 1023 -410 -104 400 -1213 676 662 -1023 623 297 -1182 793 -2 -741
3580 -741 999 -295 -315 525 -979 -78 1045 -1264 931 34 -1087 1272 -578 -555 1147 -821 71
3597 71 307 -1260 49 774 -1510 441 273 -934 1066 -8 -1487 1605 -350 -518 1861 -1055
3613 -1055 624 271 -1620 1025 -283 -969 1434 -659 -557 1209 -616 -449 1126 -1148 407 471
3629 471 -1660 258 679 -1228 1017 40 -1184 1547 -1098 -1244 88 -1275 -234 851 -748 932
3645 932 758 -550 789 269 -469 1705 -918 -385 551 -742 -88 931 -1541 115 898 -1124 652
3662 652 680 -956 243 -589 -496 1510 -752 -379 1023 -715 -22 1231 -1394 856 154 -1282 1140
$$ packed form
3546h89J369m79o64J467j337L2J355j701J020Q79k676J832L20j759J742m16l82
3563b87J451j471L67R63j433L06N04j613J889j4j685J646l26j479J975p95p39
3580g41J740j294k0Q40j504R01J123k309K195q97j121K359j850K3J702j968Q92
3597G1K36j567J309P25k284J951j68j207K000j074j479L092j955j68K379k916
3613a055J679l53j891K645j308o86K403k093J02J766j825J67J575k274J555O4
3629D71k131J918M21j907K245r77j224K731k645j46J332j363J041J085j599J680
3645I32j74j308J339n20p38K174k623N33R36j293O54J019k472J656P83k022J776
3662F52K8j636J199q32R3K006k262L73J402j738O93J253k625K250p02j436K422
$$ plain form
3679 1140 29 -749 1167 -341 111 834 -927 -28 669 -570 620 471 -829 838 -61 -1380 988
3696 988 -558 -614 891 -868 -49 686 -977 658 519 -1401 854 -18 -1039 597 -456 -630 602
3713 602 -678 -543 1199 -946 389 358 -821 687 114 -439 986 -411 -740 679 -925 38 1230
3730 1230 -930 548 274 -445 446 -99 -490 617 -381 -274 1402 -224 -543 1045 -728 288 642
3747 642 -1061 599 -56 -1222 496 -142 -328 888 -593 -248 468 -1078 594 364 -477 453 272
3764 272 -821 1166 -377 -725 759 -574 -416 878 -1369 139 609 -1412 374 366 -1294 780 -176
3781 -176 -190 618 -787 -286 844 -704 139 756 -751 385 160 -561 562 264 -550 822 -210 -416
3799 -416 880 -532 -25 671 -780 247 414 -685 472 -7 -708 983 -160 -538 1053 -477 -2
$$ packed form
3679A140j111p78J916j508M52P23j761Q99O97j239J190j49j300J667q99j319K368
3696I88j546n6J505j759Q19P35j663J635j39j920K255q72j021J636j053j74J232
3713F02j280J35J742k145J335l1j179J508n73n53J425j397l29J419j604R63J192
3730A230k160J478k74p19Q91n45l91J107r98J07J676j626l19J588j773J016L54
3747F42j703J660o55j166J718o38j86J216j481L45P16j546J672k30q41R30j81
3764B72j093J987j543l48J484j333J58J294k247J508M70k021J786qj660K074r56
3781a76j4Q08j405N01J130j548Q43O17j507J136k25p21J123k98q14J372j032k06
3799d16J296j412N07O96j451J027J67j099J157m79p01J691j143l78J591j530M75
$$ plain form
3816 -2 778 -765 424 671 -828 280 248 -845 928 -381 -128 740 -523 71 696 -733 168 447
3834 447 -955 379 302 -1078 669 -69 -705 743 -413 -519 645 -534 95 650 -1010 467 143
3851 143 -828 764 -103 -878 785 -566 -272 848 -458 86 711 -671 368 464 -1021 912 -26
3868 -26 -668 712 -186 -240 811 -446 276 610 -630 441 368 -741 414 394 -733 640 -138 -411
3886 -411 621 -525 -4 568 -821 336 434 -964 525 81 -531 610 -84 -499 753 -686 -99
3903 -99 629 -616 250 447 -651 192 424 -836 355 -42 -494 793 -379 -381 925 -629 -39 475
3921 475 -767 434 247 -666 592 -118 -657 704 -394 -455 780 -714 -204 491 -573 430 197
3938 197 -638 725 128 -492 697 -74 -468 482 -532 6 655 -574 313 275 -532 594 213 -721 434
$$ packed form
3816bP80j543J189K47j499J108l2j093J773j309K53Q68j263N94O25j429R01K79
3834D47j402J334p7j380J747p38o36J448j156j06J164j179O29N55j660J477l24
3851A43r71J592q67p75J663j351K94J120j306N44O25j382J039R6j485J933r38
3868b6o42J380q98n4J051j257P22L34j240J071p3j109J155k0j127J373p78k73
3886d11J032j146N21N72j389J157R8j398J489m44o12J141o94m15J252j439N87
3903i9P28j245Q66J97j098Q43K32j260J191l97m52J287j172kJ306j554N90N14
3921D75j242J201j87r13J258p10n39J361j098o1J235j494N10O95j064J003k33
3938A97q35J363n97o20J189p71l94R50j014N38O49j229Q87l8q07J126l81r34J155
$$ plain form
3957 434 -276 -88 659 -273 -223 582 -499 228 426 -666 659 116 -631 660 -223 -296 539 -398 -261
3976 -261 449 -466 28 592 -824 249 126 -776 592 -99 -502 505 -540 -194 512 -879 160 509
3994 509 -850 73 134 -578 451 -40 -558 502 -331 42 518 -740 -33 641 -501 304 151 -648 527
4013 527 -199 -326 788 -120 -419 750 -454 201 351 -598 405 187 -639 437 182 -377 534 165
4031 165 -88 519 -318 -5 739 -347 91 286 -447 113 142 -587 518 108 -502 614 -361 -212 302
4050 302 -572 -99 249 -492 383 204 -547 658 -112 -620 700 -326 -285 370 -526 128 627 -231 338
4069 338 53 -413 621 291 -365 314 189 -133 472 -614 -234 401 -609 350 -91 -224 -216 -537 -214 386
4089 386 -217 -197 817 -188 -40 135 -336 252 143 -401 320 53 -277 468 5 -265 348 -349 -133 515
$$ packed form
3957D34p10J88P47r32N0Q05j081P27J98j092J325n43p47J291q83p3Q35r37J37
3976b61P10r15M94N64j416J073j23r02J368o91m03J007j045L46P06j391J039L49
3994E09j359R23O1p12J029m91n18J060q33L73M76j258P07O74j142Q05j53p99J175
4013E27p26j27J114r08k99J169j204O55J50r49J003k18q26J076k55n59R11l69
4031A65k53O07q37L13P44j086M38J95p33N60K9p29J105m10o10J116r75J49N14
4050C02q74M73L48p41Q75j79p51J205p70n08J320j026M1O55q96O54M99q58N69
4069C38k85m66J034l30o56O79j25l22O05j086L80O35j010R59m41j33Ql21L23O00
4089C86o03K0J014j005J48J75m71N88j09n44P21k67l30P45m63k70O13o97K16O48
$$ plain form
4109 515 -164 100 274 -620 75 37 -489 393 27 -451 360 -385 -188 347 -521 29 696 -512 144 89
4129 89 -599 301 74 -412 705 -105 -272 55 -388 -119 239 -547 303 275 -452 155 178 -431 276 -101 -423
4150 -423 413 -250 -195 517 -667 60 382 -668 270 -239 -547 575 -145 -255 578 -212 -53 452 -265
4169 -265 223 522 -414 100 172 -382 459 -36 -323 460 -100 -113 646 -417 46 512 -718 20 256 -556
4189 -556 318 -450 -297 528 -147 -331 518 -438 -65 299 -623 54 348 -301 234 -84 -302 496 -205 -156
4209 -156 483 -210 -308 220 -527 26 349 -294 259 26 -312 469 -70 -361 475 -167 -102 651 -337 116 299
4230 299 -317 472 410 -505 333 -63 -169 250 -395 -322 337 -212 -131 206 -212 410 23 -66 583 185 -229
4251 -229 502 -25 -209 594 -387 -170 299 -360 132 522 -208 278 218 -158 439 -144 -176 434 -473 -143 410
$$ packed form
4109E15o79K64J74q94O95l8n26Q82l66m78Q11p45J97N35q68N50O67j208O56n5
4129H9o88R00k27m86J117q10j67L27m43K69L58p86Q50k8p27O07K3o09P07l77l22
4150d23Q36o63N5P12j184P27L22j050R38n09l08J122p20j10Q33p90J59N05p17
4169b65M88K99r36N14P2n54Q41m95k87P83n60j3P59j063M63M66j230P38K36q12
4189e56Q74p68J53Q25o75j84Q49r56L73L64r22O77K94o49N35l18k18P98p01M9
4209a56O39o93r8N28p47N53L23o43N53k33l38P81n39k91Q36o42O5P53r88M53J83
4230B99o16P89o2r15Q38l96j06M19o45P3O59n49Q1L37m18O22l87q9O49l98m14
4251b29P31n27j84Q03r81K17M69o59M92L90p30M86o0l76N97n83l2O10r07L30N53
$$ plain form
4272 410 -220 -144 206 -410 135 -126 -151 380 -107 -519 490 -264 -151 152 -324 281 -3 -488 330 171
4292 171 -532 227 6 -224 277 -391 -160 346 22 -26 599 -164 212 248 -752 600 20 -377 626 -328
4312 -328 -417 -36 -252 -457 331 -76 72 422 -323 84 351 -417 272 38 -59 355 -153 -382 315 -308 180
4333 180 397 -206 74 -36 -361 249 -468 -428 613 -309 -217 342 -606 -54 305 -267 255 190 -228 245 -6
4354 -6 -276 365 -203 -374 238 -415 156 456 -473 162 171 -323 467 -106 -178 299 -255 -289 528 -441 -205 257
4376 257 -493 177 243 -314 244 173 -177 175 -34 -100 450 -120 1 385 -431 170 395 -523 328 126 -493
4397 -493 493 84 -338 281 -502 -158 222 -377 74 462 -325 285 190 -345 517 -185 -418 487 -318 -269 472
4418 472 -236 10 101 -564 371 120 -409 352 -104 -261 511 -416 -374 525 41 -200 591 -564 84 284
$$ packed form
4272D10o30P6L50o16N45k61k5N31m87m12J009p54J13L03m76O05k84m85Q18j59
4292A71p03P59k21k30N01o68K31N06l24m8O25p63L76L6j000J352n80l97J003r54
4312c28q9L81k16k05P88m07J48L50p45M07K67p68O89k34r7M14n08k29O97o23M88
4333A80K17o03K80j10l25O10p17M0J041r22R2N59r48N52L59n72N22o5m18M73k51
4354fk70O41n68j71O12o53N71L00r29O35Rm94P90n73p2M77n54l4Q17r69K36M62
4376B57p50O70O6n57N58p1l50L52k09o6N50n70J21L84q16O01K25r18Q51k02o19
4397d93R86m09m22O19p83L44L80n99M51L88p87O10r5n35Q62p02k33R05q05M9P41
4418D72p08K46R1o65R35k51n29P61m56j57P72r27M2Q99m84k41P91j155O48K00
$$ plain form
4438 284 -444 118 -30 -353 426 -300 -216 564 -305 -260 200 -370 -70 174 -451 121 264 -417 508 -31 -145
4459 -145 433 -254 30 300 -430 184 404 -390 438 164 -338 378 137 -456 350 -118 -250 534 -371 112
4479 112 354 -514 46 352 -655 333 178 -612 376 -287 -216 547 -356 -142 504 -428 414 254 -499 404
4499 404 -40 -528 -41 -483 -325 307 -8 197 -18 -311 69 -58 -716 270 -120 -1429 260 -98 -464
4518 -464 188 -263 8 112 -316 -44 191 -464 102 116 -478 308 106 -401 237 -298 -335 462 -405 197 319
4539 319 -442 432 190 -525 323 -21 -330 440 -279 -238 577 -394 81 393 -386 249 -81 -362 232 40
4559 40 -502 507 68 -83 345 -345 39 387 -470 109 309 -344 435 -140 -292 371 -46 -343 273 -162
4579 -162 7 321 -628 396 -2 -337 692 106 -401 315 -81 -380 433 -397 -179 381 -244 171 319
$$ packed form
4438B84p28N62j48l23P79p26Q4P80q69M5M60n70L00K44o25N72J43o81R25n39j14
4459a45N78o87K84K70p30O14K20p94Q28k74n02P16k41n93Q06m68j32P84r05M83
4479A12K42q68N60L06j007R88j55p90R88o63P1P63r03K14O46r32Q42j60p53R03
4499D04m44m88M87m42J58O32l15K05k15k93L80j27o58R86l90j309J689l58l66
4518d64O52m51K71J04m28K72K35o55N66J4n94P86k02n07O38n35l7P97q67O02J22
4539C19p61Q74k42p15Q48l44l09P70p19M1Q15r71M75L12p79O35l30k81N94j92
4559D0n42J009m39j51M28o90L84L48q57N79K00o53P79n75j52O63m17k97O16m35
4579a62J69L14r49J024l98l35J029n86n07P16l96k99Q13q30K18N60o25M15J48
$$ plain form
4598 319 -318 251 16 -317 338 -123 -289 463 -402 -7 388 -397 33 408 -470 435 239 -400 464 -91
4618 -91 -202 656 -79 -149 426 -557 226 173 -468 389 158 -419 118 143 -357 633 -64 -217 241 -154 -49
4639 -49 408 -438 132 275 -571 441 -66 -384 462 -145 -544 404 -394 -4 324 -595 114 206 -347 296
4659 296 -125 -399 248 -47 -421 443 -73 -223 446 -553 307 340 -395 110 98 -361 603 46 -301 522 -167
4680 -167 -94 583 -315 -118 347 -396 157 300 -525 466 -101 -325 553 -447 55 385 -201 235 548 -351
4700 -351 45 365 -412 387 241 -155 369 -253 -272 548 -274 99 192 -659 298 154 -542 354 72 -197 509
4721 509 -189 -55 566 -409 -110 611 -666 199 446 -620 361 -618 -617 317 -108 -76 547 -753 16 457
4741 457 -236 366 961 49 208 3 -238 442 -486 -193 366 -243 35 416 -234 207 366 -399 324 122
$$ packed form
4598C19o37N69k35l33O55m61j66P52q65L95L95p85M30L75q78R05j96o39Q64n55
4618i1j11Q58p35p0N75r83P83n3o41Q57k31n77N37K5n00R90o97j53M58l95J05
4639d9M57q46N70J43q46J012n07l18Q46o07l99R48p98L90L28r19P09R2n53O43
4659B96m21k74O47k95l74Q64n16j50O69r99Q60L3p35N05j2m59R64n57l47Q23o89
4680a67P3O77q98J97M65p43N53J43q25R91n67k24Q78j000N02L30n86M36L13q99
4700c51L96L20p77P99j46l96N24o22j9Q20q22L73R3q51R57j44o96Q96k82k69P06
4721E09o98J34O21r75K99P21j277Q65K47j066R81r79JR34m25L2O23j300P69M41
4741D57o93O02N95r12J59k05k41O80r28K93N59o09K78L81o50M41J59p65P23k02
$$ plain form
4761 122 -483 350 -112 -406 485 -262 -161 317 -240 131 496 -480 119 163 -413 567 -61 -439 323 -248
4781 -248 -154 513 -360 25 372 -450 115 269 -417 185 144 -322 420 -476 -444 414 -72 -45 432 -482 357
4802 357 160 -315 366 12 -624 478 -149 -239 289 -391 -52 322 -319 70 335 -482 79 102 -266 178
4822 178 7 -201 373 -223 -86 405 -336 -60 508 -347 228 -113 -514 270 160 -158 379 -333 -66 433
4842 433 -328 98 240 -376 208 114 -339 621 4 -451 619 -370 -260 573 -499 51 177 -489 265 329
4862 329 -206 341 156 -290 421 -188 -88 241 -296 191 298 -506 7 290 -348 282 16 -309 164 -269
4882 -269 60 359 -360 -76 254 -486 -106 220 -399 365 159 -282 251 -76 -231 609 -236 -207 258 -471
4902 -471 -16 305 -170 314 296 -410 541 -194 -166 676 -324 -102 356 -337 114 93 -447 275 3 -499 202
$$ packed form
4761A22o05Q33m62k94Q91p47J01M78n57L71L65r76N99M4n76R80o28l78P62n71
4781b48R4O67q73L85L47q22N65J54o86O02m1m66P42q96L2Q58m86K7M77r14Q39
4802C57j97m75O81l54o36J102o27r0N28o80L39L74o41L89K65q17N61K3l68M44
4822A78j71k08N74n96J37M91p41K76N68q55N75l41m01P84j10l18N37p12K67M99
4842D33p61M26J42o16N84r4m53R60o17m55J070r89J10Q33j072N50J26o66P54O4
4862C29n35N47j85m46P11o09J00L29n37M87J07q04N13K83o38O30k66l25M73m33
4882b69L29K99p19K84L30p40L80L26o19P64k06m41N33l27j55Q40q45K9M65p29
4902d71M55L21m75M84j8p06R51p35K8Q42j000K22M58o93M51k1n40P22k72n02P01
$$ plain form
4923 202 -25 -279 385 -285 -80 518 -410 -133 489 -373 238 233 -502 206 -153 -497 503 -242 -234 362 -248
4944 -248 -2 300 -630 247 269 -424 272 -177 -438 352 -374 -263 220 -319 5 267 -513 96 65 -440 416
4965 416 54 -506 209 -77 -286 310 -363 -311 354 -344 330 178 -388 142 -3 -512 350 -81 -259 274
4985 274 -213 -161 615 -265 -186 219 -461 134 129 -411 199 54 -203 258 -356 -134 539 -382 22 200 -306
5006 -306 114 102 -357 354 225 -488 234 -450 133 292 -384 57 176 -549 252 306 -485 112 -85 -270 331
5027 331 -198 -400 414 -425 -119 231 -473 59 -32 -450 248 -27 -327 327 -69 -184 529 -274 -359 286 -281
5048 -281 156 326 -455 422 278 -374 414 117 -418 311 125 -331 229 -212 177 368 -350 342 76 -282
5068 -282 188 -180 -360 357 -176 -34 488 -384 -136 291 -139 225 90 -260 398 86 -122 201 -130 29
$$ packed form
4923B02k27k54O64o70K05N98r28K77O22q62O11np35P08l59l44J000p45QN96o10
4944b48K46L02r30Q77K2o93O96m49k61P90p26J11M83n39L24K62p80O09l1n05Q56
4965D16l62n60P15k86k09N96o73N2O65o98O74j52n66N30j45n09Q62m31j78N33
4985B74m87N2P76q80P9M05o80N95nn40O10j45k57M61o14K22O73r21M04J78n06
5006c06M20j2m59P11j29p13P22o84N83J59o76M41J19p25Q01N4p91N97j97j85O01
5027C31n29k02Q14q39L06L50p04N32r1m18O98k75l00O54l96j15P13q03q5O45n67
5048b81M37J70p81Q77j44o52P88k97n35P29j86m56N60m41L89J91p18O92k66l58
5068b82M70l68j80P17n33J42N22q72K48M27m30L64j35l50O58l12k08L23l31J59
$$ plain form
5088 29 519 -581 162 113 -128 -95 -211 -115 434 368 -580 281 -57 140 436 -888 87 476 -260 240 -298
5109 -298 -377 301 221 -240 374 -44 -352 434 -189 137 205 -228 -92 173 -206 282 98 -447 476 -50 -10
5130 -10 330 -171 -221 464 -439 194 353 -281 173 129 -92 256 57 -316 355 -313 -311 483 -187 147 267 -283
5152 -283 150 82 -288 161 98 -143 325 23 -3 296 -450 43 443 -399 51 307 -227 136 118 -229 356
5173 356 -228 -363 321 -114 -62 386 -20 158 328 -335 300 55 -365 374 16 -104 53 -157 -150 171 149
5194 149 -82 114 -157 329 -225 -197 252 -215 -262 240 45 -222 322 -406 1 335 -271 29 185 -299 55
5215 55 173 -169 292 10 -157 147 -194 94 234 -460 420 311 -220 190 128 -277 187 -71 -201 258 -488
5236 -488 -65 202 -342 196 121 -529 -13 -48 -264 23 -127 -159 -11 -188 -118 397 -480 98 85 -263 360 -223
$$ packed form
5088B9M90j100P43m9k41L3j16R6N49o6r48Q61l38J97K96j324R75L89p36N00n38
5109b98p9O78q0m61O14m18l08P86o23L26O8m33J36K65l79M88j84n45R23n26M0
5130a0L40n01n0O85r03O33J59o34M54m4k21L48j99l73O71o68KP94o70L34J20n50
5152b83M33o8l70M49o3k41M68l02k6K99p46M93M00q42M50K56n34L63j8l47N85
5173C56n84j35O84m35N2M48m06J78J70o63O35k45m20P39l58j20J57k10PL21k2
5194A49k31J96k71M86n54K8M49m67m7N02j95k67N44p28M07L34o06L00J56m84L54
5215E5J18l42M61k82j67L04l41K88J40o94Q80j09n31M10o2m05M64k58j30M59p46
5236d88M23K67n44N38p5o50N16l5k16K87j50l2J48j77P0N15q77N78j3l48O23n83
$$ plain form
5258 -223 -355 486 -4 -12 514 -46 -317 -59 -175 -320 447 -422 189 149 19 183 341 -158 385 -298 -675
5279 -675 96 66 -121 531 63 -146 508 -257 608 -176 35 279 -258 -126 586 -435 -241 -28 -427 662
5299 662 241 -858 387 589 -82 116 -544 -112 -35 278 -170 117 -294 -314 -330 -414 279 291 -239 167 -196
5320 -196 123 -19 -275 -199 202 217 -586 -4 -659 471 482 -423 695 39 -488 -372 334 293 106 -206 878
5341 878 322 -760 677 193 -396 124 237 -708 835 -446 281 350 -145 -402 871 -571 -397 -497
5359 -497 -468 714 -617 109 183 -705 333 377 -718 -72 596 -1 -627 999 -555 367 56 -36 745
5378 745 -492 -340 348 -625 277 421 37 675 294 297 -70 175 -276 493 63 -50 166 -37 -103 512 163
5399 163 194 149 -331 -15 221 -106 95 148 -80 188 -222 -165 57 -314 -48 35 -192 -18 137 -134 39 161
$$ packed form
5258b23j32Q41m90qN26n60k71K58j16j45P67q69O11m0j30J64J58m99N43o83l77
5279f75P71l0j87O52m68k09O54p65Q65p84K11K44n37J32P12j021J94K13l99J089
5299F62m21j099J245K02o71J98o60M32P7L13m48K87m11k0j6q4O93J2n30M06l63
5320a96L19j42k56P6M01J5q03N82o55J130J1r05J118o56n27J16P06m1j87l12J084
5341H78n56j082J437m84n89N20J13r45J543j281P27O9m95k57J273j442J74j00
5359d97K9J182j331P26P4q88J038M4j095O46O68n97o26J626j554R22l11r2P81
5378G45j237J52O88r73R02J44l84O38l81Ll67K45m51P69m30j13K16k03o6O15l49
5399A63L1m5m80L16K36l27K01N3k28K68m10N7K22l71K66Q3k27J74J55k71J73J22
$$ plain form
5421 161 -178 237 -141 -157 250 -299 42 321 -274 208 297 -98 129 116 -275 312 21 -211 458 -121 -60
5442 -60 243 -228 301 196 -194 135 52 -173 124 -13 -314 159 -70 -67 221 -184 -126 214 -278 200 56 -251
5464 -251 379 165 -194 71 -180 77 363 -230 -92 265 -136 140 83 -239 120 -72 -123 243 -112 -227 93
5485 93 -81 60 36 -289 -178 244 -272 296 90 -244 118 -14 90 272 -207 -16 329 -95 95 383 -215
5506 -215 -26 -144 -161 188 90 -61 246 -86 -116 94 -259 -197 257 -60 -45 185 -349 171 -66 -148 447 -381
5528 -381 -18 152 -210 -80 -182 -186 -80 26 -136 202 -198 -133 305 0 -235 167 -199 16 272 -289 379
5549 379 180 -173 140 72 -67 113 -105 -121 179 -44 -96 443 -217 38 273 -160 232 -60 -180 105 -113
5570 -113 58 179 -257 10 298 -250 -61 94 -282 177 169 -92 187 149 -148 282 -22 -150 386 -201 9
$$ packed form
5421A61l39M15l78j6M07n49L41K79n95M82Q9l95K27j3l91N87k91k32O69n79O1
5442f0L03m71N29j05l90L29q3k25K97j37l01M73k29LK88m05N8L40m92M78j44l07
5464b51O30k14l59K65k51K57K86n93J38L57m01K76n7l22L59j92n1L66l55j15L20
5485I3j74J41k4l25J11M22n16N68k06l34L62j32J04J82m79J91L45m24J90K88n98
5506b15J89j18j7L49r8j51L07l32l0K10l53O2M54l17J5K30n34N20k37q2N95q28
5528c81L63J70l62J30j02mJ06J06j62L38m00O5M38l05k35M02l66K15K56n61O68
5549C79j99l53L13o8j39J80k18j6L00k23n2N39o60K55K35m33L92k92j20K85k18
5570a13J71J21m36K67K88n48J89J55l76M59qk61K79l8k97M30l04j28N36n87K10
$$ plain form
5591 9 116 -360 208 319 -152 322 -63 -121 281 -78 -122 13 -99 -62 85 -296 68 76 -139 237 -178 -139 -48
5614 -48 -16 -228 199 79 30 145 4 -128 193 -268 117 -74 -114 93 30 8 251 10 24 136 -8 -83 314
5637 314 -290 402 -165 -133 -532 -463 16 274 -99 -80 392 -200 -35 161 -270 273 140 -65 205 56 -36
5658 -36 178 -174 -84 371 -278 -116 237 -100 294 101 -240 130 100 -165 42 -84 -200 358 -75 -151 152
5679 152 -174 86 102 -368 84 -25 -232 238 -69 -364 272 -30 115 170 -225 81 261 -279 151 164 -212
5700 -212 270 18 -76 474 -256 -75 125 -308 344 151 -197 201 209 -401 344 169 11 277 15 11 112 -34
5722 -34 87 184 -171 -156 258 80 463 122 -366 196 -91 57 169 -102 68 249 -256 2 45 -338 31
5743 31 23 -317 46 -100 -256 80 141 -74 240 -213 0 51 7 136 94 -133 194 -18 -224 343 -184 -74
$$ packed form
5591IJ07m76N68J11m71M74l85n8M02l59m4J35j12L7J47l81L64Qk15L76m15L9R1
5614d8L2k12M27j20m9J15j41j32L21m61L85j91m0K07o3k2K43k41J4J12j44p5L97
5637C14o04O92n67L2l99O9M79K58l73J9M72n92J65J96m31N43j33k05K70j49r2
5658c6K14l52R0M55o49J62L53l37L94j93l41L70l0k65K07j26j16N58m33p6L03
5679A52l26K60J6m70M52j09k07M70l07k95O36l02J45N5l95L06J80n40M30J3l76
5700b12M82k52r4N50p30J81K00m33O52j93l48L98Qo10P45j75j58K66k62mJ01j46
5722c4J21R7l55J5M14j78L83l41m88N62k87J48J12k71J70J81n05K58M3l83L69
5743C1ql40L63j46j56L36O1k15L14m53K13N1m4J29m2k27L27k12k06N67n27J10
$$ plain form
5765 -74 246 -360 106 200 -198 383 -103 -300 129 -72 -179 260 -375 -172 312 -286 58 277 -204 239 -36
5786 -36 -217 157 45 -124 297 -247 -171 297 -112 11 335 -59 -119 176 -309 266 214 -74 326 51 -146
5807 -146 254 5 110 169 15 64 -85 -327 161 -49 -136 75 -8 -130 107 -30 31 200 -144 75 -38 -393
5829 -393 262 -87 6 112 24 -183 18 -225 15 325 -283 -96 277 -343 332 149 -310 168 -79 -243 56
5850 56 -107 -179 323 -269 -271 -12 -465 46 73 -203 383 -63 -360 26 -211 -52 -63 -148 -19 201 -199 240
5872 240 -37 -414 375 51 -131 288 100 -179 204 -200 -14 148 -36 147 122 68 387 -107 -70 8 -66 -63
5894 -63 -44 -95 48 104 -79 -201 110 -229 -20 -6 -264 228 -106 84 224 -158 -128 89 -224 -11 -104 58
5916 58 160 -111 -104 448 -157 -173 209 -55 -31 86 -313 -62 156 -305 -36 94 -174 120 -114 -218 48 -85
$$ packed form
5765g4L20o06M66R4l98N81m86j97M29k01j07M39o35K03M84n98L44K19m81M43k75
5786c6j81L74j12j69M21n44P6M68m09J23L24l94o0K95m85N75n2k88M00k75j97
5807a46M00k49J05N9j54M9j49k42M88k10q7K11q3j22K37j37O1J69l44K19j13l55
5829c93O55l49R3J06q8k07K01k43K40L10o08J87L73o20O75j83m59M78k47j64K99
5850E6j63p2N02n92kK59m53N11K7k76N86m46k97L86k37J59j1q5J29K20m00M39
5872B40k77l77P89l24j82M19j88k79L83m04J86J62j84J83k5n4L19m94L7P8p4L
5894f3J9n1J43N6j83j22L11l39K09J4k58M92l34J90J40l82L0K17l13K13r3J62
5916E8J02k71PN52o05j6L82k64K4J17l99K51K18m61K69J30k68K94k34j04K66j33
$$ plain form
5938 -85 -97 83 -105 -13 84 -140 98 212 -293 -124 191 128 57 16 -194 69 -158 -117 281 -388 185 182 -81
5961 -81 115 -3 -100 -38 61 -17 50 -266 95 224 -51 -2 127 -73 84 22 -4 159 -237 -112 303 -38 -25
5984 -25 149 -54 -139 43 -190 151 480 -108 150 -53 -79 169 -48 123 198 45 22 243 -228 416 179 -161
6006 -161 215 55 -379 155 -82 166 60 -257 228 123 -198 201 -34 -266 387 -116 -63 69 -67 153
6026 153 91 -224 161 401 -475 -18 128 -268 397 -3 -6 204 -172 -118 151 -198 129 131 -205 347 -160 -357
6048 -357 427 171 2 39 27 -103 -167 -167 -127 151 -314 -35 16 -384 299 -22 -302 350 36 -240 342 -55
6070 -55 -282 -58 -202 -89 350 -169 -29 -70 -324 45 -128 -283 75 -98 160 166 -142 125 148 -106 -64 -104
6092 -104 -125 98 -9 9 172 -72 53 134 -7 18 49 -197 -47 -33 -182 191 94 136 271 -255 70 85 -25
$$ packed form
5938h5j2J80j88R2R7k24K38J14n05J69L15o3p1m1k10K63k27M1L98o69N73lk63
5961h1J96j18r7O2R9p8O7l16L61J29k75M9J29k00J57o2k6J63l96J25M15l41J3
5984b5J74k03q5J82k33L41L29n88K58k03k6K48k17J71P5j53k3K21m71O44k37l40
6006a61L76j60m34N34k37K48j06l17M85j05l21L99k35k32O53n03N3J32j36K20
6026A53o2l15L85K40q76M57J46l96O65m00lK10l76N4K69l49L27Kl36N52n07j97
6048c57P84k56j69L7j2j30o4%M0K78m65K79N1m00O83l21k80O52l14k76N82l97
6070e5k27K24j44J13M39n19J40m1k54L69j73j55L58j73K58Ol08K67K3k54M2m0
6092a04k1K23j07J8J63k44J25Q1j41K5L1k46J50J4j49L73r7M2J35n26L25J5j10
$$ plain form
6115 -25 111 151 -173 -27 -71 -188 69 -15 -1 136 74 -2 50 -17 -22 -133 59 133 189 -209 -40 -52 -219 254 -24
6140 -24 -144 218 12 67 286 -85 251 42 -238 142 125 -247 143 120 137 -80 -247 -111 185 -263 -3 213
6162 213 29 179 28 -158 63 -104 -89 16 -34 -86 271 -81 8 227 -326 125 380 -180 188 77 -94
6183 -94 387 -16 107 47 -53 138 -8 -256 48 332 -304 177 -215 -398 258 -141 -43 -24 -86 41 119 -229
6205 -229 33 213 -117 49 75 -371 -137 -294 -53 108 -144 44 4 -192 21 -28 -157 16 93 57 -44 20
6227 20 20 -36 -78 -101 403 -89 -76 260 -235 104 198 -215 313 -19 -264 179 -106 175 155 -229 176 -6 -159
6250 -159 -41 200 -148 70 -25 -52 -12 -198 -218 90 -124 -59 271 40 18 -93 -144 -7 -96 49 244 -248 123
6273 123 129 38 -107 -78 -7 133 148 -109 127 -118 128 256 1 -59 287 51 76 -6 -62 216 85 -51 -12 -92
$$ packed form
6115b5J36M0l24J46m4j17K57q4J4J37o2p6N2o7nj11J92P4N6l98J69j2j67M73k78
6140b4j20L62k06N5K19l71L36k09k80L80j7l72L90k3J7k17j67J36K96m48K60K16
6162B13j84J50j51j86K21j67J5J05n0n2L57l52Q9K19n53M51K55n60L68j11j71
6183i4M81m03J23o0j00J91j46k48L04K84o36M81l92j83O56l99R8J9o2J27P8l48
6205b29K62J80l30J66K6m46K34j57K41J61k52J88m0j96K13m9j29J73P7l6j01O4
6227B0%n6m2k3N04m92J3L36m95L39R4m13N28l32k45M43k85K81k0l84M05j82j53
6250a59J18K41l48K18r5k7M0j86k0L08k14O5L30k31k2j11n1J37q9J45J95m92L71
6273A23Or1j45K9P1J40J5k57K36k45K46J28k55o0L46k36K5q2n6K78j31j36L9q0
$$ plain form
6297 -92 -359 -37 5 -131 144 54 -256 45 -84 60 103 -108 139 117 -171 35 23 -313 99 -84 6 19 -146
6320 -146 182 34 -254 148 161 -184 149 -10 -195 11 127 185 176 -167 104 224 -289 119 41 -34 231 54
6342 54 51 281 -10 -39 155 -60 -114 85 -123 137 94 -133 107 132 -354 186 -21 -30 41 -296 -40 137 -41
6365 -41 -19 61 -60 158 171 -408 227 -117 -141 139 -246 0 -33 80 151 219 -50 66 167 -91 176 -30 14
6388 14 -34 -76 107 252 -163 9 89 -130 184 -18 -106 -13 -175 -22 122 -62 40 196 -126 -6 154 -120
6410 -120 151 174 -23 20 -303 -60 -48 -161 -133 19 82 228 36 -107 212 -110 -56 -120 -1 -39 -79 -268 -109
6433 -109 -86 -82 115 106 -52 -49 -17 -382 90 28 -250 -24 -106 -50 276 -9 -124 167 77 -39 153 -181 -98 124
6457 124 -299 338 -17 -194 337 -46 -39 -42 7 250 155 -166 131 175 -192 82 83 -69 131 79 99 295 91 60
$$ packed form
6297i2k67L22M2j36K75r0l10L01j29J44M3k11K47k2k88K06j2l36M12j83R0J3j65
6320a46L28j48k88M02J3l45L33j59j85K06J16N8rl43K71J20n13M08p8p5K65j77
6342E4lK30k91k9J94k15n4J99k08K60m3k27K40K5m86N40k07rP1l37K56J77j78
6365d1K2Q0j21K18J3n79O35l44k4K80l85K46l3J13P1O8k69J16J01k58K67k06M4
6388A4m8m2J83J45m15J72Q0k19L14k02q8R3j62J53J44j84J02J56l22J20J60k74
6410a20K71K3j97M3l23K43J2j13K8J52O3J46j92j43L19l22N4o4J19l8m0j89J59
6433a09K3MJ97rj58LL2l65M72o2k78K26q2N6L26k85j15K91r0j16J92l34Q3K22
6457A24m23O37l55j77N31l83PlM9K43r5l21K97M4l67K74Jj52K00n2K0J96k04l1
$$ plain form
6481 60 203 -177 223 400 -257 322 100 -165 133 -87 -656 343 -479 -319 289 79 233 108 -313 100
6501 100 -43 -73 249 127 -115 60 99 -4 -99 -157 73 150 -39 -277 150 -10 129 -46 -62 208 273 -101
6523 -101 158 -252 -105 31 89 9 330 -109 62 -226 -112 222 -69 217 -1 -152 136 100 77 12 126 -132
6545 -132 194 -161 15 108 -227 80 -162 213 -113 34 -21 136 -45 45 -5 61 -162 225 26 -155 -27 -49
6567 -49 -31 28 -218 194 7 -134 86 -113 -27 251 -53 -208 212 32 87 229 19 -117 73 -79 70 60
6589 60 -198 78 -68 -93 104 -167 -3 153 117 -216 59 -221 59 -193 -361 119 -57 182 22 36 -137
6610 -137 163 -45 10 113 -147 327 140 90 189 -116 -37 192 -192 53 165 -193 -68 136 -286 12 -157
6631 -157 -200 103 105 57 150 -71 -79 72 -186 -198 -28 -177 -17 53 -44 121 304 264 272 -144 46 225 -200 86
$$ packed form
6481F0J43l80M00J77o57N79k22k65K98k20n69R99q22J60O08k10J54j25m21M13
6501A00j43l0L22j22k42J75L9j03r5n8K30P7j89k38M27j60J39j75j6K70O5l74
6523a01K59m10J47J36N8q0L21m39J71k88J14L34k91K86k18j51K88l6k3o5J14k58
6545a32L26l55J76R3l35L07k42L75l26J47n5J57j81R0n0O6k23L87j99j81J28k2
6567d9J8N9k46M12j87j41K20j99Q6K78l04j55M20j80N5J42k10j36J90j52J49j0
6589F0k58K76j46k5J97k71J64J56l6l33K75k80K80k52j68M80j76K39j60J4j73
6610a37L00k08N5J03k60M74j87n0R9l05P9K29l84K45J12l58J25K04m22K98j69
6631a57m3L03Km8R3k21qJ51k58j2J70j49J60P0r7J65J83m0Qm16J90J79m25K86
$$ plain form
6655 86 82 -143 26 208 55 -5 -201 -247 113 33 -174 93 -342 86 315 -116 -202 17 -1 -166 209 -149 -31
6678 -31 -90 -242 -21 14 -118 144 -20 160 69 -159 -11 193 -75 220 -164 -55 194 131 -66 112 123 -70
6700 -70 149 -187 380 -83 51 -44 -32 -183 257 -200 -124 364 -329 -213 76 -104 246 37 -151 43 -16 96
6722 96 -81 27 38 373 128 175 326 -45 -44 -72 -110 -16 243 -149 111 173 -89 1 -102 181 90 115 124 183 43
6747 43 -45 -92 -191 191 -84 -68 420 -228 -75 91 -150 -152 0 -395 62 127 -141 -1 -71 -127 19 -139 52
6770 52 152 -51 -134 86 -58 108 40 -360 86 34 -115 97 -49 99 289 -56 -272 19 -203 -155 58 -79
6792 -79 -20 -174 -20 78 121 -56 102 -273 -202 82 -13 86 -45 -22 -83 52 -287 228 17 -168 218 4 -322
6815 -322 254 -50 -105 68 -270 118 -32 -22 88 62 -202 132 131 -116 241 -112 108 36 -153 285 -102 -200
$$ packed form
6655H6mk25J69J82j53o0j96m6L60q0k07K67m35M28K29m31q6K19j8j65L75l58J18
6678c1n9j52K21L5j32K62j64J80r1k28J48K04k68K95l84J09K49o3j97J78J1j93
6700g0K19l36N67m63J34r5J2j51M40m57P6M88o93J16K89j80L50k09j88J94n9J12
6722I6j77J08J1L35k45M7J51l71Jk8l8R4K59l92K60O2k62R0j03K83r1K5RN9j40
6747D3q8m7r9L82k75J6M88o48J53J66k41kJ52l95M57O5k68J40p0n6J46j58J91
6770E2J00k03q3K20j44J66o8m00M46n2j49K12j46J48J90l45k16K91k22M8K13j37
6792g9N9j54J54R8M3j77J58l75P1K84r5R9j31K3o1J35l39N15k11j85L86k14l26
6815c22N76l04n5J73l38L88j50J0J10k6k64L34jk47L57l53K20p2j89M38l87r8
$$ plain form
6837 -200 86 46 113 303 -56 -40 298 -191 -165 323 -49 206 -88 -112 172 214 -146 119 -165 99 169 -125
6859 -125 27 38 131 -77 18 -151 19 280 -20 127 151 -272 -277 17 -128 -71 -101 -87 152 -194 135 132 -38 158
6883 158 -8 -105 158 -148 -79 43 -254 107 -32 -215 -52 -56 -46 44 127 -13 90 -123 2 192 -68 129
6905 129 13 -24 -144 43 48 -136 1 -66 -57 -3 -68 17 -75 59 -317 -197 -78 59 -288 212 -125 17 -70 -25
6929 -25 -129 7 -269 -51 180 -131 134 129 40 211 84 95 223 186 -258 5 -242 -5 290 7 -64 96
6951 96 -165 348 -53 -34 20 -44 -118 102 7 -91 79 -180 -202 -47 264 115 73 52 51 -154 -6 251 -28 65
6975 65 168 -409 -185 107 -57 156 374 -178 156 62 37 246 -196 -146 -1 -76 79 142 -246 81 222 -131
6997 -131 146 136 -340 172 -80 69 170 -107 -66 82 -187 367 -95 -234 -113 -147 -423 35 -93 -196 5
$$ packed form
6837b00K86m0O7J90l59J6L38m89K6M88l72K55k94k4K84M2l60K65k84K64P0k94
6859a25J52J1R3k08R5j69J70K61l00J47K4m23nK94j45N7l0J4K39l46L29lj70J96
6883A58j66r7K63l06O9J22k97L61j39j83J63mJ0R0Q3j40J03k13J25J90k60J97
6905A29j16l7j20J87Nj84J37o7RN4o5Q5r2J34l76J20J19J37l47N00l37J42q7M5
6929b5j04J36k76K18K31l11K65nq9J71j27J1J28l7m44K63k47K37K95k83p1J60
6951I6k61N13m01J9N4o4p4K20r5r8J70k59k2J55L11j49m2k1jk05J48K57k79R3
6975F5J03n77K24K92j64K13K18n52L34r4k5K09m42N0J45p5J55O3l88L27J41l53
6997a31K77j0m76N12k52J49J01k77M1J48k69N54m62j39J21l4k76M58j28j03K01
$$ plain form
7018 5 -58 -51 227 -46 -148 -171 -99 123 118 -206 107 -6 -79 212 -58 -170 169 -116 84 207 -35 342 386 -147
7042 -147 -2 157 -127 492 -125 -305 228 -110 -37 243 242 -20 44 -3 56 -282 -318 -25 -108 226 -220 221 -153
7065 -153 374 -20 5 192 -111 0 -26 101 33 -205 173 -147 -57 39 233 -14 -56 -238 -34 125 -266 103
7087 103 -35 -415 -50 30 124 98 110 -87 61 225 -186 124 27 11 341 67 -52 150 -21 -237 98 88
7109 88 116 16 90 404 97 -234 -58 -58 -86 162 182 -23 -114 239 -253 154 44 -4 357 -233 103 91 -341
7132 -341 -40 -72 -43 401 63 -61 -66 -114 56 31 -118 185 350 -103 103 -16 -298 -88 23 -39 -3 -177 -331
7155 -331 187 54 -90 181 6 89 -117 -84 222 56 -135 4 -13 82 246 -263 -89 18 14 63 -154 -150 59
7178 59 -305 -125 27 15 24 69 -2 33 196 -257 -43 -13 -214 293 154 -126 175 30 -156 -29 13 84 19 -89
$$ packed form
7018Eo3PK78k73j02k3P2K22nl24L13j13p3K91k70j12L39k85K00J23k42L77M4n33
7042a47J45J59k84O19o17j80N33l38P3K80jk62O4m7N9l38l6K93q3L34m46M41l74
7065a53N27l94K5J87l03J11k6J27o8k38L78l20R0R6J94k47m2j82K04J59l91L69
7087A03j38l80L65Q0R4k6J2j97J48J64m11L10r7j6L30k74j19K02j71k16L35j0
7109H8K8j00P4L14l07l31J76%k8K48K0k05r1L53m92M07j10m8L61n90L36j2m32
7132c41L01l2K9M44l38j24nm8J70k5j49L03J65m53K06j19k82K10J11o2L6j74j54
7155c31N18j33j44K71j75Q3k06L3L06j66j91J39j7R5J64n09J74J07mM9k17MK09
7178E9l64J80J52j2RM5p1L5J63m53K14L0k01N07j39k80L01j45j86J27M2P1o5j08
$$ plain form
7202 -89 -27 -244 -230 87 -31 -22 226 130 -91 70 -137 208 155 66 -140 192 -248 165 72 -74 334 -26 -2
7225 -2 227 -275 37 102 -112 133 -163 -126 101 -57 -318 191 16 71 40 -50 -33 249 -447 -178 -28 -210 -91
7248 -91 199 51 -58 -79 78 95 -86 48 359 -38 273 -280 -223 156 26 -16 178 111 -194 -83 78 -48
7270 -48 -3 -169 -109 -12 -92 227 110 -108 218 -84 57 -62 -166 62 243 -64 -11 -54 58 9 123 17 -24
7293 -24 11 -189 197 -147 -85 179 -5 112 -158 -81 -46 106 166 55 -97 -117 -162 -170 271 98 39 83 140 -224
7317 -224 -12 67 -217 104 136 -54 243 106 -35 16 -282 82 185 -181 -59 163 -114 -157 88 -182 318
7338 318 -21 156 83 30 -18 -78 -94 1 -60 -315 -206 -17 -32 -173 -31 -284 339 114 109 -66 23 -10 -197 -185
7362 -185 238 216 -169 44 -27 -128 -64 99 -237 58 -58 86 126 -108 90 160 -219 65 77 81 32 61 -50
$$ packed form
7202h9O2k17J4L17j18RK48r6k21J61k07L45n3q9k06L32m40M13r3j46M08l60K4
7225bK29n02L12O5k14K45k96L7K27j58k61N09j75N5l1r0J7K82o96K69J50j82J19
7248i1K90j48j09k1J57J7j81J34L11l97L11n53N7L79j30m2J94o7l05J11J61j26
7270d8M5j66O0R7q0L19j17k18L26l02J41j19j04K28J81l07N3m3J12m9J14j06m1
7293b4L5k00L86l44O2K64j84J17k70P7L5J52O0j11j52k0m5qM41j73n9M4N7l64
7317b24K12P9k84L21L2j90K97j37j41N1k98L64J03l66J22K22k77m3K45k70N00
7338C18l39J77p3n3m8o0j6R5o1k55J09J89j5j41J42k53O23k25nj75Q9l3j87J2
7362a85M23k2l85K13p1j01O4J63l36K95j16J44M0k34J98P0l79K84J2Mm9K9j11
$$ plain form
7385 -50 155 -205 34 -51 -201 80 -19 -167 226 -157 -172 79 140 40 -21 -291 -79 367 -155 260 1 -164
7407 -164 -245 157 -98 180 34 -231 182 80 -57 246 -210 75 -16 -296 97 230 16 -138 -201 -257 326
7428 326 -65 -145 -33 22 -8 68 -304 138 -14 -108 -58 -77 -17 74 -44 -66 -25 -121 -18 280 -46 -7 50 -241 30
7453 30 -31 -143 22 85 -165 -82 -198 -108 313 -199 -139 -135 -186 179 -126 127 116 18 -88 10 -25 -97 -62 38 28
7478 28 59 -123 -145 -55 -152 15 -183 -77 162 -153 -290 182 -36 -129 -125 -5 156 -169 -341 160 35 -128 107
7501 107 25 -122 12 45 6 -48 -258 7 -40 -212 291 -120 -36 12 -59 84 141 -252 38 71 -29 177 231 -309
7525 -309 168 12 -110 253 -215 301 67 -112 100 87 94 196 31 -63 63 -24 -35 132 -57 -383 136 -311
7547 -311 -84 89 -75 -95 154 -193 21 -45 89 307 -40 -114 68 42 35 112 -133 -123 -44 -329 86 220 -135
$$ packed form
7385e0K05l60K39q5j50K81r9j48L93l83j5K51O1j00o1k70K12M46n22M15k59j65
7407a64q1M02k55K78j46k65M13j02j37L03m56K85r1k80L93J33k14j54o3n6N83
7428C26l91q0J12N5l0P6l72M42j52r4N0j9O0R1j18k2M1r6J03K98l26L9N7k91K71
7453C0o1j12J65O3k50Q3j16R0M21n12O0Mn1L65l05K53j1r8j06R8l5p2L5J00j0
7478B8L1j82k2R0r7J67j98J06K39l15j37M72k18r3MJ20J61l25j72N01j25j63K35
7501A07q2j47J34L3l9n4k10K65m7j72N03m11Q4M8p1J43N7l93K90L3j00K06N4n40
7525c09M77j56j22L63m68N16k34j79K12j3PJ02j65r4J26q7j1J67j89l26N19m47
7547c11K27J73j64k0K49l47K14o6J34K18l47p4J82k6pP7k45J0P9k85M15J34l55
$$ plain form
7570 -135 188 -156 -91 44 -88 -517 -58 126 -21 198 -2 43 2 -196 179 -187 159 140 189 -28 -254 -300
7592 -300 325 23 5 7 262 -61 -83 -258 -582 2 192 448 104 521 -373 -18 84 78 -22 -218 68 200
7614 200 -50 -496 295 127 192 398 -241 813 -145 -518 202 -511 305 -371 199 505 145 -268 518 213
7634 213 -133 335 50 15 111 50 250 -99 30 -86 -210 -50 -139 -4 74 211 11 99 189 -197 -157 -22 -42
7657 -42 156 -24 -9 -13 -31 -131 94 227 289 -42 90 -171 -93 -165 -263 131 -182 245 -59 -195 -18 -180 81
7680 81 -17 -198 -62 -88 -169 25 -71 9 337 -118 -120 107 65 148 242 252 46 102 8 -213 506 -760 189 -29
7704 -29 82 759 -185 119 -107 94 -312 6 -197 52 81 488 94 235 -168 -155 -118 -154 107 -133 -63 4
7726 4 266 -56 3 32 261 63 -404 369 145 139 323 -241 187 -181 128 113 -31 -182 131 45 -180 249 -35
$$ packed form
7570a35L23l44O5J35j32m29M59J84j47K19k00M5m1j98L75l66L46j9M9k17k26m6
7592c00O25l02j8KK55l23k2j75l24N84J90K56l44M17q94L55J02oj00j96K86J32
7614B00k50m46P91j68O5K06o39J054r58l73P20p13Q16o76N70L06l60m13P86l05
7634B13l46M68k85l5R6o1K00l49J29j16j24J60q9J35P8J37k00Q8R0l86M0J35k0
7657d2J98j80J5mj8j00K25J33O2l31J32k61P8p2r8L94l13M27l04j36J77j62K61
7680H1r8j81J36k6q1J94r6Q0L28m55kK27m2Q3R4J0k06N6r4k21P19j266R49k18
7704b9J11O77r44L04k26K01m06L18k03K49K9M07l94J41m03J3L7l6K61k40P0O7
7726DK62l22N9K9K29j98m67P73k24oJ84n64M28l68L09j5j44j51L13q6k25M29k84
$$ plain form
7749 -35 108 84 -135 -134 71 -110 -134 143 -102 -36 17 -183 159 -92 -61 394 -50 -1 60 -53 140 88 -257 64
7773 64 119 -34 103 -64 -186 39 18 94 -8 98 -166 73 -94 33 313 -220 -188 -37 -291 169 -85 -8
7795 -8 204 -80 -73 64 51 -28 13 -149 202 159 -67 -12 -168 -76 3 -218 181 70 46 98 -112 116 126 -102 -42
7820 -42 155 -220 -31 168 105 40 95 -126 24 -64 -185 -28 -37 -266 55 132 161 230 -169 -34 161 -339 -5
7843 -5 86 -300 102 76 -125 86 273 -109 268 48 19 -13 43 -89 178 -232 128 173 -32 77 -53 -122 106
7866 106 26 113 -6 -219 -29 307 -35 102 -22 -179 85 58 -97 158 -97 -296 143 -83 -7 -15 -74 -151 277
7889 277 -143 -16 -219 -384 91 93 -60 67 129 41 284 -122 41 116 -106 -211 157 153 83 63 -177 132 180
7912 180 -146 317 -228 -75 176 -124 77 -107 -124 117 -51 -195 -19 -27 45 70 -26 -65 80 -37 -7 9 -220
$$ packed form
7749c5J43k4k19JK05j81k4K77k45O6N3k00L42k51L1M55m44M9O1j13J93n2l45L21
7773F4N5j53J37j67j22K25k1P6j02J06k64K39j67J27K80n33L2J51k54M60k54P7
7795hK12k84PJ37j3p9M1j62L51m3k26N5j56R2P9k21L99j11k4N2k10K28J0k28O0
7820d2J97l75J89J99o3o5N5k21J50q8j21J57rk29L21P7K9O9l99J35J95n00L34
7843eR1l86M02k6k01K11J87l82L77k20k9l2N6j32K67m10L60M5k05J09j30o9K28
7866A06q0Q7j19k13J90L36l42J37j24j57K64k7j55K55k55j99M39k26P6qn9p7M28
7889B77m20J27k03j65M75Kj53J27O2q8K43m06J63P5k22j05L68mp0k0k40L09M8
7912A80l26M63n45J53K51l00K01j84j7K41j68j44J76qP2K5r6l9J45j17L0J6k29
$$ plain form
7935 -220 97 132 -345 382 38 -75 145 -124 90 50 18 51 200 1 192 213 -119 145 68 15 -22 -27 101
7958 101 97 -29 -118 85 -140 -62 75 -179 53 127 -129 86 64 20 -88 213 21 196 -326 199 225 -333 69
7981 69 50 -160 -71 65 -139 57 13 94 23 51 -2 17 -285 -120 -40 198 80 141 -51 -35 -137 18 -3 22 95
8006 95 79 99 95 -84 -60 218 -116 -42 -11 -146 -99 50 -194 -22 -38 157 82 109 65 47 -20 -54 126 -100 -44 96
8032 96 -188 -155 262 -250 254 -38 -54 0 138 -337 10 250 -105 218 135 -13 144 92 -101 235 -91 0
8054 0 -7 -31 62 224 61 264 100 86 234 43 135 -121 -167 132 -146 -174 -124 -30 -155 42 42 3 -5 -17 -181 68
8080 68 -101 14 -210 -257 66 -83 -73 -24 2 -148 174 -180 -164 81 -166 -92 104 -64 -60 -175 15 134 -8
8103 -8 -25 58 -68 -102 8 77 47 43 -115 165 71 -103 -13 45 -103 -68 -95 3 12 -54 165 142 -86 69 144 -29 210
$$ packed form
7935b20L17L5m77P27l44j13K20k69K14m0l2L3J49j99J91K1l32K64p7n3l7nJ28
7958A01mj26q9K03k25P8J37k54K32P4k56K15k2m4j08L01j92J75n22N25K6n58M02
7981F9j9k10Q9J36k04J96m4Q1p1K8n3J9l02J65Q0K38j18O1j92J6j02J55k1K5P3
8006I5j6K0mj79K4K78l34P4L1j35M7J49k44J72j6J95p5K7m4j8o7l4J80k26N6J40
8032I6k84L3M17n12N04k92j6N4J38m75L47K40l55L23q3j48J57n2j93L36l26R1
8054@pk4R3J62j63K03j64j4J48j91R2k56m6K99k78k8N0R4j25J97%l9qj2j64K49
8080F8j69J15k24m7L23j49J0M9K6j50L22l54J6K45k47P4J96j68Mj15J90J19j42
8103hj7Q3j26l4J10O9l0mj58K80r4j74R0N8j48L5k7R8Ro6K19k3k28J55P5j73K39
$$ plain form
8130 210 110 -26 252 -289 -79 137 -254 72 143 -81 -94 -22 -286 113 33 -179 91 -134 -56 183 -118 -82
8152 -82 193 -162 -48 226 -2 150 90 133 -216 32 6 75 -108 192 -138 -114 207 -179 -61 12 106 -209 120
8175 120 -2 -71 -128 66 168 241 -114 54 137 -406 228 -6 25 68 36 -97
$$ packed form
8130B10j00j36K78n41K10K16l91L26P1k24j3P2k64L99q0k12K70k25P8K39l01L6
8152h2K75l55J14K74k28J52o0M3l49K48k6O9j83L00l30K4L21l86J18P3R4l15L29
8175A20j22o9n7J94J02P3l55J68Q3n43O34k34L1M3l2j33
8191i7
$$ Imaginary data points
##PAGE= N=2
##DATA TABLE= (X++(I..I)), XYDATA
$$ plain form
0 0 0 0 0 0 0 0 0 0 0 0 -7 8 -8 8 -8 16 -16 24 -29 32 -39 48 -61 71 -83 96 -113 131 -153 176 -202 231 -263
33 -263 298 -337 382 -429 482 -540 602 -672 748 -832 922 -1022 1129 -1247 1376 -1517 1670
50 1670 -1840 2027 -2232 2461 -2713 2997 -3319 3684 -4101 4586 -5157 5840 -6677 7725 -9086
65 -9086 10922 -13558 17703 -25493 75210 -251670 72946 110898 -283119 258801 -22632
76 -22632 -158764 216375 -127060 -65694 180688 -146524 25508 110322 -138943 45378 86446
87 86446 -146458 65464 57322 -145681 120386 16135 -156677 169148 -64304 -93043 187084
98 187084 -156908 6211 148524 -198430 116203 39837 -179589 174694 -63010 -88196
108 -88196 175925 -128431 -10341 110354 -136015 58532 65456 -113882 71977 15681 -95592
$$ packed form
0@%%%%%%%%%%pJ5j6J6j6K4l2M0n3O1p1Q7j09J32j54J79k09K44k84L29l78M33m94
33b63N61o35P19q11R11j022J142j274J420j580J754j944K151k376K623k893L187
50A670l510L867m259M693n174N710o316P003p785Q687r743J0997j2517J4402j6811
65i086K0008k4480L1261m3196J00703l26880L24616L7952l94017N41920k81433
76b2632j36132L75139l43435O1366K46382l27212J72032Q4814k49265J84321M1068
87H6446k32904K11922q142k03003K66067j04251j72812L25825k33452k8739K80127
98A87084l43992J63119J42313l46954L14633p6366k19426L54283k37704k5186
108h8196K64121l04356J18090J20695k46369J94547O924j79338J85859n6296j11273
$$ plain form
119 -95592 90263 -4164 -83014 113229 -44598 -66867 131008 -100464 -8095 133132 -152705
130 -152705 65628 78539 -163414 138753 -9436 -122252 169649 -93049 -44400 146958
140 146958 -133786 37018 86825 -136935 85746 31670 -108852 100651 -12918 -79951
150 -79951 103686 -41715 -56157 109522 -68647 -27836 104498 -104552 21481 85454 -129538
161 -129538 79697 30855 -124350 124388 -41856 -77685 137140 -99405 -11182 104084
171 104084 -124900 50889 49690 -110010 83497 -1204 -77775 87252 -35458 -45354 82283
182 82283 -54996 -20244 76388 -72934 7055 65954 -92072 44245 42069 -98615 84164
193 84164 -4584 -78983 107003 -58001 -32640 102978 -96350 24459 65078 -105255 71924
$$ packed form
119i5592J85855r4427p8850J96243j57827k2269J97875k31472R2369J41227k85837
130a52705K18333J2911k41953L02167j48189j12816K91901k62698M8649J91358
140A46958k80744J70804M9807k23760K22681n4076j40522K09503j13569o7033
150g9951J83637j45401j4442J65679j78169M0811J32334k09050J26033O3973k14992
161a29538K09235m8842j55205K48738j66244l5829K14825k36545Q8223J15266
171A04084k28984J75789j199j59700J93507q4701p6571J65027j22710r896J27637
182H2283j37279L4752R6632j49322P9989N8899j58026J36317k176j40684J82779
193H4164q8748p4399J85986j65004K5361J35618j99328J20809M0619j70333J77179
$$ plain form
204 71924 15843 -82114 91457 -28932 -47720 86433 -54554 -14629 72486 -65276 10998
215 10998 55336 -73677 34903 35942 -77292 63188 6643 -70862 86303 -35725 -44093
226 -44093 94920 -74391 744 75690 -96688 47175 34250 -89861 78006 -11567 -59925
237 -59925 83096 -47197 -23758 68576 -63186 7281 48431 -65955 28287 27766 -65380 44944
249 44944 8211 -58840 61266 -17421 -44673 70345 -47299 -16398 65963 -69999 20067
260 20067 42076 -78410 54773 4847 -61956 73270 -31285 -31421 69549 -56007 2083
271 2083 50024 -60566 27695 26064 -54376 41515 5409 -45515 50801 -12817 -32004 55093
283 55093 -32283 -15449 55516 -50676 10058 45284 -62451 37504 19542 -61071 59247
$$ packed form
204G1924n6081r7957J73571j20389j8788J34153j40987L9925Q7115j37762P6274
215A0998M4338j29013J08580J039j13234J40480n6545p7505J57165j22028q368
226d4093J39013j69311P5135P4946j72378J43863j2925j24111J67867q9573m8358
237e9925J43021j30293K3439R2334j31762P0467M1150j14386R4242n21r3146J10324
249D4944l6733o7051J20106p8687k7252J15018j17644L0901Q2361j35962R0066
260B0067K2009j20486J33183m9926o6803J35226j04555j36J00970j25556N8090
271B083M7941j10590Q8261j631q0440R5891l6106n0924R6316o3618j9187Q7097
283E5093q7376J6834P0965j06192O0734L5226j07735R9955j7962q0613J20318
$$ plain form
294 59247 -11948 -40579 66163 -40478 -11392 54633 -56018 18423 33195 -55735 38486
305 38486 7148 -45770 47068 -13762 -29963 48511 -29018 -13850 42956 -40953 3095 34613
317 34613 -48018 22546 19275 -49448 39506 -3317 -40027 50841 -26998 -20377 49814 -45829
329 -45829 4521 36262 -52678 28017 15464 -46959 41927 -7974 -33130 45715 -25798 -13652
341 -13652 40863 -36823 4188 29693 -41312 21326 16889 -39037 33817 -379 -31697 40678
353 40678 -17288 -17876 41627 -30665 -566 32931 -38732 17451 19108 -38551 32911 1685 -30359
366 -30359 39653 -16555 -16641 38842 -29796 445 31388 -37077 16208 17256 -36634 29030 1349
379 1349 -29202 35319 -14844 -16922 34686 -27189 -1124 27430 -34070 13145 15505 -33927 24414
$$ packed form
294E9247p1195k8631J06742j06641K9086O6025j10651P4441J4772q8930R4221
305C8486l1338n2918R2838o0830j6201P8474p7529J5168N6806q3909M4048L1518
317C4613q2631P0564l271o8723Q8954m2823l6710R0868p7839O621P0191r5643
329d5829N0350L1741q8940Q0695j2553o2423Q8886m9901k5156P8845p1513J2146
341a3652N4515p7686M1011K5505p1005O2638m437n5926P2854l4196l1318P2375
353D0678n7966n88N9503p2292L0099L3497p1663N6183J657n7659P1462l1226l2044
366c0359P0012n6208q6N5483o8638L0241L0943o8465N3285J048n3890O5664k7681
379A349l0551O4521n0163k078N1608o1875K6065K8554o1500M7215K360m9432N8341
$$ plain form
392 24414 2071 -28195 31483 -11419 -18721 31832 -23308 -5380 27851 -30963 9321 17401
404 17401 -32903 21009 3253 -27881 30858 -11151 -18436 32421 -24112 -3590 26808 -29685
416 -29685 10859 16064 -29186 21072 2914 -23414 26513 -8542 -13774 26941 -18144 -3566
428 -3566 23498 -23815 7156 17492 -25909 16793 7426 -24171 25063 -4142 -16690 28245
440 28245 -15020 -6702 24627 -23548 6097 16746 -25478 16869 6213 -22523 22775 -4648
452 -4648 -15556 25166 -13583 -6743 21325 -20411 3281 16073 -23157 11438 7387 -22664 18797
465 18797 -2969 -17248 23843 -13714 -7904 21566 -21496 2949 14111 -24800 13094 5071
477 5071 -20727 17380 -5260 -12639 18957 -12098 -5097 16576 -15652 1633 12861 -17872 8082
$$ packed form
392B4414k2343l0266N9678m2902p302N0553n5140J7928L3231n8814M0284Q080
404A7401n0304N3912j7756l1134N8739m2009p285N0857n6533K0522L0398n6493
416b9685M0544N205m5250N0258j8158k6328M9927l5055n232M0715m5085J4578
428c566K7064m7313L0971J0336m3401M2702r367l1597M9234k9205j2548M4935
440B8245m3265Q318L1329m8175K9645J0649m2224M2347j0656k8736M5298k7423
452d648j0908M0722l8749O840K8068m1736K3692J2792l9230L4595m051l0051M1461
465A8797k1766j4279M1091l7557N810K9470m3062K4445J1162l8911L7894q023
477E071k5798L8107k2640p379L1596l1055P001K1673l2228J7285J1228l0733K5954
$$ plain form
490 8082 8368 -18754 13806 1354 -16461 19411 -7968 -10814 22259 -16006 -35 17598 -21306
503 -21306 11682 8028 -20672 19317 -2693 -12250 20423 -12288 -2623 16859 -14873 4525 9836
516 9836 -12935 8034 4323 -11400 9841 2150 -10236 11101 -2340 -8545 14639 -8925 -4707
529 -4707 16111 -15108 3183 11073 -19542 13454 2293 -17211 18426 -8999 -7518 16787 -16734
542 -16734 3171 9756 -16434 9458 528 -10897 10840 -4936 -6451 8296 -4317 -3901 5931
555 5931 -4868 -3231 8250 -7189 -2279 9523 -11005 3952 6624 -15040 12554 -611 -12300
568 -12300 17121 -10577 -3190 15729 -16648 7176 7726 -15010 13259 -2583 -7843 13825 -7711
581 -7711 -982 8883 -7893 3524 4475 -6189 3659 4332 -5405 3181 4221 -7336 6253 2910
$$ packed form
490H082K86k7122L2560j2452j7815L5872k7379k846L3073l8265J5971J7633l8904
503b1306L2988l654k8700L9989k2010r557L2673l2711R665J9482l1732J9398N311
516I836k2771K0969l711j5723K1241p691j2386K1337j3441o205K3184k3564M218
529d707K0818l1219J8291P890l0615L2996j1161j9504L5637k7425J481K4305l3521
542a6734J9905O585k6190K5892q930j1425K1737j5776j515J4747j2613M16R832
555E931j0799J637J1481j5439M910J1802k0528J4957K672k1664K7594j3165j1689
568a2300K9421k7698P387J8919l2377K3824N50k2736K8269j5842n260K1668k1536
581g711O729R865j6776J1417R51j0664R848O73r737Q586J040j1557J3589l343
$$ plain form
595 2910 -9043 10489 -2547 -6225 12658 -10054 1146 9756 -13878 9014 1570 -11222 13369
608 13369 -7079 -4220 11167 -10472 2662 4090 -8770 5909 -1241 -4090 3734 -2541 -966
621 -966 915 -1116 -2296 1415 15 -4471 4152 -2425 -3593 6817 -7564 528 6129 -9905 6179
636 6179 358 -8168 10243 -5856 -2260 8310 -9197 4419 2361 -7963 8100 -2342 -3345
649 -3345 6935 -4406 448 3834 -3470 1596 2131 -1481 1089 1956 -1852 1367 2734 -3609 2971
664 2971 1376 -3988 6076 -2525 -2174 6948 -6033 2335 4461 -6835 6315 -584 -4537 6858
678 6858 -4316 241 4086 -5609 3307 455 -3820 3665 -1843 -1346 2709 -2625 -456 1245 -1655
693 -1655 -820 1069 -1807 -819 1618 -2994 35 1284 -3750 2305 -778 -3360 3606 -3469 -985 3378
$$ packed form
595B910j1953J9532j3036l678J8883k2712J1200Q610k3634K2892p444j2792K4591
608A3369k0448K859J5387k1639J3134J428j2860J4679p150k849P824o275J575
621i66J881k031j180L711j400m486Q623o577j168J0410j4381Q092N601j6034J6084
636F179n821q526J8411j6099L596J0570j7507J3616k058j0324J6063j0442j003
649c345J0280j1341M854L386p304N066N35l612K570Q67l808L219J367o343O580
664B971j595n364J0064q601L51R122j2981Q368K126j1296J3150o899l953J1395
678F858j1174M557L845r695Q916k852m275P485n508M97M055n334K169J701k900
693a655Q35J889k876R88K437m612L029J249n034O055l083k582O966p075K484M363
$$ plain form
709 3378 -5325 2116 678 -4368 3977 -1541 -1976 3993 -3492 793 2438 -3419 2252 871 -2190
724 -2190 2653 -241 -1446 2759 -533 -526 3012 -1112 -583 3503 -2636 1399 2837 -3306 3717 494
740 494 -3299 5198 -2146 -917 5516 -4225 1565 3703 -4867 3934 966 -3825 4468 -2021 -1986 4170
756 4170 -3405 -485 3432 -4151 1017 2385 -4821 2394 1079 -4817 4003 -1486 -4210 5109 -3950
771 -3950 -1919 4845 -6111 1159 3108 -6703 4218 53 -5434 5711 -2934 -3140 5405 -5182
785 -5182 -481 4628 -5783 2047 2766 -5868 4109 1045 -5095 5401 -1327 -3779 6324 -3865
799 -3865 -1521 6474 -6187 1744 4784 -7131 5293 2058 -6669 7900 -1923 -3935 8568 -5361
813 -5361 -218 7340 -7307 3308 4464 -7045 6016 886 -6095 7326 -2030 -4116 7634 -4630
$$ packed form
709C378q703P441j438n046Q345n518m35N969p485M285J645n857N671j381l061
724b190M843k894j205M205l292PL538m124N29M086o139M035J438o143P023l223
740D94l793Q497p344J229O433r741N790K138q570Q801k968m791Q293o489L5O156
756D170p575K920L917p583N168J368p206P215j315n896Q820n489k724R319r059
771c950K031O764j0956P270J949r811J0921m165n487J1145q645k06Q545j0587
785e182M701N109j0411P830P19q634R977l064o140J0496o728k452J0103j0189
799c865K344P995j2661P931L040j1915J2424l235q727J4569r823k012J2503j3929
813e361N143P558j4647J0615J156j1509J3061n130o981J3421r356k086J1750j2264
$$ plain form
827 -4630 -1155 6812 -7154 1377 5644 -8055 4779 2349 -7761 7154 -1703 -5832 8796 -5661
841 -5661 -3126 8113 -8203 925 5337 -9580 5478 1895 -8968 8057 -2306 -5791 9049
854 9049 -5928 -2864 8333 -8874 1078 6429 -9900 5211 3052 -9063 8516 -1540 -6683
867 -6683 9793 -5811 -2636 9123 -8356 1452 7226 -9529 5575 3827 -9481 8625 -266
880 -266 -7172 10244 -4351 -3665 10506 -8070 677 8754 -10408 5647 4664 -10706 9684 30
894 30 -8099 11238 -5244 -3871 11076 -9172 804 7963 -10287 5015 4283 -10199 8021 126
908 126 -8277 9865 -4239 -5470 10041 -7734 -1333 9335 -10756 3071 6071 -12162 7412
921 7412 1674 -11019 10821 -3957 -7502 12026 -9350 -1733 10660 -12113 4916 5911 -12462
$$ packed form
827d630L475P967j3966Q531M267j3699J2834k430j0110J4915q857m129J4628j4457
841e661K535J1239j6316R128M412j4917J5058l583j0863J7025j0363l485J4840
854I049j4977L064J1197j7207R952N351j6329J5111k159j2115J7579j0056n143
867f683J6476j5604L175J1759j7479R808N774j6755J5104j748j3308J8106q891
880b66o906J7416j4595O86J4171j8576Q747Q077j9162J6055r83j5370K0390r654
894C0q129J9337j6482J373J4947k0248R976P159j8250J5302p32j4482J8220p895
908A26q403J8142j4104j231J5511j7775O401J0668k0091J3827L000j8233J9574
921G412n738j2693K1840j4778l545J9528k1376P617J2393k2773J7029R95j8373
$$ plain form
934 -12462 8691 581 -10331 10962 -4426 -5754 11075 -8107 -1792 8767 -9554 3105 6993
947 6993 -11659 7188 2886 -11045 11536 -2689 -7604 13587 -7647 -2552 12175 -11571 3459
960 3459 8400 -12804 8711 2819 -10882 11693 -3007 -7116 12457 -7583 -2482 10931 -10011
973 -10011 2344 7783 -11886 6537 4317 -11581 9947 -358 -9164 12496 -6222 -5500 12653
986 12653 -10752 166 10021 -13786 6224 5148 -13778 10613 -1211 -10242 13298 -7102 -5577
999 -5577 12464 -10964 -64 9529 -12619 5387 5254 -12712 9347 734 -10315 12225 -5207
1012 -5207 -6563 13200 -9765 -1163 11347 -13336 4951 6741 -13874 10473 861 -11170 13757
1025 13757 -5483 -5783 13661 -9891 -251 10883 -12011 5141 6508 -12274 9104 1710 -10471
$$ packed form
934a2462K1153q110j0912K1293j5388j328J6829j9182O315J0559j8321J2659L888
947F993j8652J8847m302j3931K2581j4225m915K1191k1234N095J4727k3746J5030
960C459M941k1204K1515n892j3701K2575j4700m109J9573k0040N101J3413k0942
973a0011J2355N439j9669J8423k220j5898K1528j0305q806K1660j8718P22J8153
986A2653k3405J0918R855k3807K0010j076j8926K4391j1824r031K3540k0400J525
999e577J8041k3428J0900R593k2148J8006j33j7966K2059q613j1049K2540j7432
1012e207j356J9763k2965Q602J2510k4683J8287J790k0615K4347r612j2031K4927
1025A3757j9240l00J9444k3552R640J1134k2894J7152J367j8782K1378p394j2181
$$ plain form
1038 -10471 11943 -2879 -7326 12998 -8149 -2774 12761 -11877 3003 9119 -13875 8737
1050 8737 3400 -12920 12998 -3563 -8316 14343 -9609 -2628 12120 -12934 3577 7225 -13010
1063 -13010 8280 2192 -11585 10540 -2582 -8266 11260 -6753 -4502 11638 -10412 181
1075 181 9678 -13309 5744 5608 -13967 10980 -716 -11445 14656 -7297 -5412 13865 -12614
1088 -12614 1528 10033 -14292 7986 3910 -12327 11434 -1862 -8581 12402 -6295 -4185 11660
1101 11660 -9373 70 10078 -11111 4412 7087 -12136 9135 2297 -11491 12904 -3682
1113 -3682 -7502 14281 -9868 -1161 12655 -13726 5666 7129 -13983 11410 116 -10714 13573
1126 13573 -5796 -5469 12425 -9591 -17 9605 -11703 3889 5960 -11703 7388 2186 -11098
$$ packed form
1038a0471K2414j4822m447K0324k1147N375J5535k4638J4880O116k2994K2612
1050H737n337j6320K5918j6561m753K2659k3952O981J4748k5054J6511L648k0235
1063a3010K1290o088j3777K2125j3122n684J9526j8013K251J6140k2050J0593
1075A81R497k2987J9053j36j9575K4947j1696j0729K6101k1953J885J9277k6479
1088a2614J4142Q505k4325K2278m076j6237K3761j3296o719K0983j8697K110J5845
1101A1660k1033R443J0008k1189J5523K675j9223K1271o838j3788K4395j6586
1113c682l820K1783k4149Q707J3816k6381J9392J463k1112K5393j1294j0830K4287
1126A3573j9369L27J7894k2016R574R622k1308J5592K071j7663J9091n202j3284
$$ plain form
1139 -11098 10299 -2741 -8834 12988 -8070 -4207 12362 -12591 2255 8892 -14826 8880
1151 8880 2726 -12726 12968 -4539 -8056 13418 -9375 -1648 10657 -12026 3822 6497 -11469
1164 -11469 7052 2415 -9703 9321 -1443 -7745 10880 -5038 -4787 11688 -9179 78 10338
1177 10338 -12478 5900 6300 -13137 11412 -223 -10359 14555 -7215 -4676 13379 -11648
1189 -11648 2408 9194 -12986 7789 3396 -11122 10831 -1577 -7604 11373 -5690 -3945 10621
1202 10621 -8598 -88 8936 -10622 3967 6074 -11566 7985 1360 -10683 11610 -4246 -7179
1215 -7179 12590 -9709 -1100 10515 -12647 5111 5891 -12898 9361 46 -9929 11489 -4987
1228 -4987 -5502 11120 -8834 -921 8723 -10504 3529 5621 -10943 7188 1646 -9647 9984
$$ packed form
1139a1098K1397j3040o093K1822k1058L863J6569k4953J4846O637k3718K3706
1151H880o154j5452K5694j7507l517K1474k2793P727J2305k2683J5848K675j7966
1164a1469J8521m637j2118J9024j0764o302J8625j5918K51J6475k0867R257J0260
1177A0338k2816J8378M00j9437K4549j1635j0136K4914k1770K539J8055k5027
1189a1648J4056O786k2180K0775m393j4518K1953j2408o027J8977j7063J745J4566
1202A0621j9219Q510R024j9558J4589K107j7640J9551o625j2043K2293j5856k933
1215g179J9769k2299Q609J1615k3162J7758P80j8789K2259r315r975K1418j6476
1228d987n15J6622j9954P913R644j9227J4033K092j6564J8131n542j1293J9631
$$ plain form
1241 9984 -2677 -6715 11421 -7096 -2570 10421 -10412 2909 7423 -11617 7657 2594 -10162
1254 -10162 11060 -2667 -6441 11769 -6987 -1837 10155 -9803 2939 7143 -10565 7155
1266 7155 2817 -9689 9569 -1611 -7234 10872 -5770 -3341 10289 -9255 1464 7757 -11220
1279 -11220 6356 3457 -10627 9380 -1518 -7805 10776 -5939 -3651 9853 -9192 929
1291 929 7209 -10342 5029 3552 -10070 8294 -786 -8076 9820 -5073 -4304 9736 -8445
1304 -8445 -242 8109 -10490 4292 4388 -10446 7884 -103 -8287 9929 -4600 -4482 9982 -8036
1318 -8036 -46 8024 -9762 4099 4577 -9264 7480 622 -7907 9217 -3046 -4992 9669
1331 9669 -6554 -940 8409 -8636 3325 5527 -9565 6932 1897 -8434 9290 -2583 -5401
$$ packed form
1241I984j2661m038J8136j8517M526J2991k0833J3321M514j9040J9274n063j2756
1254a0162K1222j3727l774J8210j8756N150J1992j9958J2742M204j7708J7720
1266G155m338j2506J9258j1180n623J8106j6642K429J3630j9544J0719O293j8977
1279a1220J7576k899j4084K0007j0898o287J8581j6715K288J3504j9045J0121
1291I29O280j7551J5371j477j3622J8364r080p290J7896j4893P69J4040j8181
1304h445Q203Q351j8599J4782R6j4834J8330p987q184J8216j4529J18J4464j8018
1318h036P990Q070j7786J3861M78j3841J6744o858q529J7124j2263j946J4661
1331I669j6223N614R349j7045J1961K202j5092J6497n035j0331J7724j1873k818
$$ plain form
1344 -5401 10237 -6353 -1408 8656 -8850 2971 5079 -9596 6509 1491 -7985 8592 -2575
1357 -2575 -5179 8900 -6278 -2114 7839 -8196 1955 5459 -9069 5164 1818 -8514 7753
1370 7753 -1884 -5971 8648 -5492 -2536 8124 -8074 1357 5542 -9255 5011 2236 -8198
1383 -8198 7606 -1611 -5983 8632 -5083 -2859 7699 -7459 1437 5935 -8310 4615 2788
1396 2788 -7579 7374 -807 -5622 8579 -4164 -2546 8035 -6662 772 5885 -7697 4033
1409 4033 3316 -7219 6514 -152 -5837 7921 -3255 -3103 7931 -6220 337 6383 -7521 3721
1423 3721 3805 -7710 6088 320 -6544 7671 -3032 -3885 7484 -5930 -498 5973 -7637 2975
1437 2975 3390 -7420 5559 249 -6541 6825 -2849 -3967 6970 -5223 -1088 6077 -7190 2211
$$ packed form
1344e401J5638j6590M945J0064j7506J1821K108j4675J6105n018r476J6577j1167
1357b575k604J4079j5178M164R953j6035J0151L504j4528J4233l346j0332J6267
1370G753r637m087J4619j4140K956J0660j6198R431M185j4797J4266k775j0434
1383h198J5804r217m372J4615j3715K224J0558j5158Q896M498j4245J2925j827
1396B788j0367J4953q181m815J4201j2743J618J0581j4697P434N113j3582J1730
1409D033p17j0535J3733o666n685J3758j1176J52J1034j4151O557O046j3904J1242
1423C721Q4j1515J3798n768o864J4215j0703q53J1369j3414N432O471j3610J0612
1437B975M15j0810J2979n310o790J3366r674j118J0937j2193M135P165j3267R401
$$ plain form
1451 2211 3825 -7609 5039 734 -6470 6938 -2497 -4192 7376 -5229 -741 6121 -6883
1464 -6883 2484 3920 -6814 5024 991 -5451 6103 -2003 -3768 6516 -3811 -1197 6038 -5379
1478 -5379 1372 4462 -6187 3865 2501 -6041 5717 -537 -4760 6847 -3295 -2064 6593 -5694
1492 -5694 951 4490 -6486 3790 2098 -5833 5727 -861 -4114 6309 -3535 -1917 5672 -4906
1506 -4906 546 4341 -5964 2466 2408 -5645 4432 88 -4844 5366 -2480 -3190 6046 -4759 -364
1521 -364 4943 -6149 2447 2657 -6406 4721 -149 -4827 5742 -3034 -2762 5682 -4520 116 4225
1536 4225 -5283 2464 2087 -5394 4064 523 -4181 4880 -1692 -2515 5084 -3556 -666 4665 -4417
1551 -4417 1509 2935 -5315 3533 1040 -4525 4864 -1148 -2901 5173 -3265 -860 4570 -4300 1443
$$ packed form
1451B211J614j1434J2648m305p204J3408r435j695J1568j2605M488O862j3004
1464f883R367J436j0734J1838m033o442J1554q106j765J0284j0327K614P235j1417
1478e379O751L090j0649J0052j364q542J1758o254m223J1607j0142J231Q657j2287
1492e694O645L539j0976J0276j692p931J1560o588l253J0423r844J618P589j0578
1506d906N452L795j0305Q430n8q053J0077m344m932J0210p846p10R236j0805M395
1521c64N307j1092Q596K10r063J1127m870m678J0569q776K72Q444j0202M636M109
1536D225r508P747l77p481R458l541m704R061o572q23P599q640K890N331r082
1551d417N926J426q250Q848k493n565R389o012j753Q074q438K405N430q870N743
$$ plain form
1566 1443 3110 -4893 3104 1202 -4533 4459 -631 -3057 5031 -3017 -1334 4569 -4447 910 3348
1581 3348 -5008 2795 1225 -4785 4357 -721 -3372 4825 -2929 -1501 4068 -4208 500 2935 -4518
1596 -4518 2357 1042 -4154 3248 -495 -3320 4171 -2236 -2032 3961 -3402 -184 3420 -4131 1493
1611 1493 2251 -4233 3365 -79 -3360 4367 -2130 -1685 4446 -3652 267 3126 -3956 2017 1610 -3538
1627 -3538 3217 -162 -2665 3544 -877 -1300 3553 -1880 -596 3075 -3181 868 2312 -3305 2450
1642 2450 988 -3394 3547 -795 -2511 4236 -2615 -436 3566 -3449 1227 2175 -3539 2703 28
1657 28 -2950 2687 -1460 -1410 2775 -2087 -484 2158 -2526 502 1370 -2679 1059 1110 -2721 2179 37
1674 37 -2723 3148 -1471 -1799 3280 -2600 -509 2317 -3457 1560 1340 -3269 2951 -298 -2311 3127
$$ packed form
1566A443J667q003P997j902n735Q992n090k426Q088q048J683N903r016N357K438
1581C348q356P803j570o010R142n078k651Q197p754J428N569q276M708K435p453
1596d518O875j315n196P402l743k825P491o407K04N993p363L218L604p551N624
1611A493P58o484P598l444l281P727o497M45O131q098L919K859p082N973m07n148
1627c538O755l379k503O209m421m23M853n433J284L671o256M049J444n617N755
1642B450j462m382O941m342j716O747o851K179M002p015M676R48n714O242k675
1657B8k978N637m147N0M185m862J603K642m684L028Q68m049L738N1l831M900k142
1674C7k760N871m619l28N079n880K091K826n774N017k20m609O220l249k013N438
$$ plain form
1690 3127 -1760 -759 2456 -2318 613 1688 -2132 1292 1067 -1908 1742 422 -1603 2190 -195
1705 -195 -1590 2567 -1204 -517 2592 -2123 481 1898 -2711 1840 611 -2369 3033 -1185 -1130 2682
1721 2682 -2128 11 1999 -2181 972 945 -2174 1629 156 -1634 1993 -416 -1164 1616 -1253 -1064
$$ packed form
1690C127m887J001L215m774K931J075l820L424k25k975L650j320k025L793k385
1705a95j395M157l771O87L109m715K604J417m609M551j229k980N402m218N5L812
1721B682m810K139J988m180L153k7l119L803j473j790L627k409p48K780k869J89
$$ [...]
8191a09
##END NTUPLES=NMR FID
##END=
