##TITLE=1H_LR-731-CR8
 CDCl3, 8 sc, 
 23.12.2020
##JCAMPDX= 6.0         $$ Bruker NMR JCAMP-DX V2.0
##DATA TYPE= NMR FID
##DATA CLASS= NTUPLES
##ORIGIN= UXNMR, Bruker Analytische Messtechnik GmbH
##OWNER= root
$$ XWIN-NMR		Version 3.5
$$ Wed Dec 23 10:11:30 2020 Russian Standard Time (UT+4h)  she@DPX200
##.OBSERVE FREQUENCY= 200.1315066352
##.OBSERVE NUCLEUS= ^1H
##.DELAY= (6, 6)
##.ACQUISITION MODE= SIMULTANEOUS
##.ACQUISITION SCHEME= undefined
##.AVERAGES= 8
##.DIGITISER RES= 18
##SPECTROMETER/DATA SYSTEM= spect
##.PULSE SEQUENCE= zg30
##.SOLVENT NAME= CDCl3
##.SHIFT REFERENCE= (INTERNAL, CDCl3, 0, 15.7039)
##AUDIT TRAIL= $$ (NUMBER, WHEN, WHO, WHERE, WHAT)
$$ ##TITLE= Audit trail, XWIN-NMR		Version 3.5
$$ ##JCAMPDX= 5.01
$$ ##ORIGIN= Bruker BioSpin GmbH
$$ ##OWNER= she
$$ F:/spectra/data/she/nmr/H-F/1/audita.txt
$$ ##AUDIT TRAIL=  $$ (NUMBER, WHEN, WHO, WHERE, WHAT)
(   1,<2020-12-23 10:10:21.68 +0400>,<she>,<DPX200>,
      <created by zg, POWCHK disabled, PULCHK disabled
       configuration hash MD5:
       00 E9 B6 7A A2 85 ED C7 34 08 36 98 17 FE 4E 26
       data hash MD5: 16K
       D4 45 D7 3D 7C 57 18 27 A8 F6 B0 2F 5E E4 65 DD>)
$$ ##END=
$$ 
$$ hash MD5
$$ 38 55 1C 4A 8C 3B 25 DF 4F 41 4A 95 27 F0 C9 23
##$RELAX= 
##$RELAX= 
##$RELAX= 
##$RELAX= 
##$RELAX= 
##$RELAX= 
$$ Bruker specific parameters
$$ --------------------------
##$DU= <F:/spectra>
##$EXPNO= 1
##$NAME= <H-F>
##$PROCNO= 1
##$TYPE= <nmr>
##$USER= <she>
##$AMP= (0..31)
100 100 100 100 100 100 100 100 100 100 100 100 100 100 100 100 100 100 
100 100 100 100 100 100 100 100 100 100 100 100 100 100 
##$AQSEQ= 0
##$AQ_mod= 1
##$AUNM= <au_zg>
##$AUTOPOS= <>
##$BF1= 200.13
##$BF2= 200.13
##$BF3= 200.13
##$BF4= 200.13
##$BF5= 200.13
##$BF6= 200.13
##$BF7= 200.13
##$BF8= 200.13
##$BYTORDA= 1
##$CFDGTYP= 0
##$CFRGTYP= 5
##$CHEMSTR= <none>
##$CNST= (0..31)
1 1 145 1 1 1 1 1 1 1 1 1 1 1 1 1 1 1 1 1 1 1 1 1 1 1 1 1 1 1 1 1 
##$CPDPRG= <>
##$CPDPRG1= <>
##$CPDPRG2= <>
##$CPDPRG3= <>
##$CPDPRG4= <mlev>
##$CPDPRG5= <mlev>
##$CPDPRG6= <mlev>
##$CPDPRG7= <mlev>
##$CPDPRG8= <mlev>
##$CPDPRGB= <>
##$CPDPRGT= <>
##$D= (0..31)
0 1.2 0 0 0 0 0 0 0 0.06 0 0.03 0 0 0 0 0.0002 0 0 0 0 0 0 0 0 0 0 0 0 
0 0 0 
##$DATE= 1608703821
##$DBL= (0..7)
120 120 120 120 120 120 120 120 
##$DBP= (0..7)
150 150 150 150 150 150 150 150 
##$DBP07= 0
##$DBPNAM0= <>
##$DBPNAM1= <>
##$DBPNAM2= <>
##$DBPNAM3= <>
##$DBPNAM4= <>
##$DBPNAM5= <>
##$DBPNAM6= <>
##$DBPNAM7= <>
##$DBPOAL= (0..7)
0.5 0.5 0.5 0.5 0.5 0.5 0.5 0.5 
##$DBPOFFS= (0..7)
0 0 0 0 0 0 0 0 
##$DE= 6
##$DECBNUC= <off>
##$DECIM= 32
##$DECNUC= <off>
##$DECSTAT= 4
##$DIGMOD= 1
##$DIGTYP= 9
##$DL= (0..7)
0 120 120 120 120 120 120 120 
##$DP= (0..7)
150 150 150 150 150 150 150 150 
##$DP07= 0
##$DPNAME0= <>
##$DPNAME1= <>
##$DPNAME2= <>
##$DPNAME3= <>
##$DPNAME4= <>
##$DPNAME5= <>
##$DPNAME6= <>
##$DPNAME7= <>
##$DPOAL= (0..7)
0.5 0.5 0.5 0.5 0.5 0.5 0.5 0.5 
##$DPOFFS= (0..7)
0 0 0 0 0 0 0 0 
##$DQDMODE= 0
##$DR= 18
##$DS= 0
##$DSLIST= <SSSSSSSSSSSSSSS>
$$ [...]
##$SUBNAM2= <"">
##$SUBNAM3= <"">
##$SUBNAM4= <"">
##$SUBNAM5= <"">
##$SUBNAM6= <"">
##$SUBNAM7= <"">
##$SUBNAM8= <"">
##$SUBNAM9= <"">
##$SW= 16.9725356469052
##$SWIBOX= (0..15)
0 0 2 0 0 0 0 0 0 0 0 0 0 0 0 0 
##$SW_h= 3396.73913043478
##$TD= 16384
##$TD0= 1
##$TE= 0
##$TE2= 300
##$TE3= 300
##$TEG= 300
##$TL= (0..7)
0 120 120 120 120 120 120 120 
##$TP= (0..7)
150 150 150 150 150 150 150 150 
##$TP07= 0
##$TPNAME0= <>
##$TPNAME1= <>
##$TPNAME2= <>
##$TPNAME3= <>
##$TPNAME4= <>
##$TPNAME5= <>
##$TPNAME6= <>
##$TPNAME7= <>
##$TPOAL= (0..7)
0.5 0.5 0.5 0.5 0.5 0.5 0.5 0.5 
##$TPOFFS= (0..7)
0 0 0 0 0 0 0 0 
##$TUNHIN= 0
##$TUNHOUT= 0
##$TUNXOUT= 0
##$USERA1= <user>
##$USERA2= <user>
##$USERA3= <user>
##$USERA4= <user>
##$USERA5= <user>
##$V9= 5
##$VALIST= <valist>
##$VCLIST= <CCCCCCCCCCCCCCC>
##$VD= 0
##$VDLIST= <DDDDDDDDDDDDDDD>
##$VPLIST= <PPPPPPPPPPPPPPP>
##$VTLIST= <TTTTTTTTTTTTTTT>
##$WBST= 1024
##$WBSW= 4
##$XGAIN= (0..3)
0 0 0 0 
##$XL= 0
##$YL= 0
##$YMAX_a= 280679
##$YMIN_a= -261132
##$ZGOPTNS= <>
##$ZL1= 120
##$ZL2= 120
##$ZL3= 120
##$ZL4= 120
##$ABSF1= 10
##$ABSF2= 0
##$ABSG= 5
##$ABSL= 3
##$ALPHA= 0
##$AQORDER= 0
##$ASSFAC= 0
##$ASSFACI= 0
##$ASSFACX= 0
##$ASSWID= 0
##$AUNMP= <proc_1d>
##$AZFE= 0.1
##$AZFW= 0.1
##$BCFW= 1
##$BC_mod= 2
##$BYTORDP= 1
##$COROFFS= 0
##$CY= 11.3945322036743
##$DATMOD= 1
##$DC= 2
##$DFILT= <>
##$DTYPP= 0
##$F1P= 15.9154993809931
##$F2P= -4.1035820241983
##$FCOR= 0.5
##$FTSIZE= 0
##$FT_mod= 4
##$GAMMA= 1
##$GB= 0.15
##$INTBC= 1
##$INTSCL= 1
##$ISEN= 128
##$LB= 0.24
##$LEV0= 0
##$LPBIN= 0
##$MAXI= 10000
##$MC2= 0
##$MEAN= 0
##$ME_mod= 0
##$MI= 1.114404
##$NCOEF= 0
##$NC_proc= 0
##$NLEV= 6
##$NOISF1= 3.799351
##$NOISF2= 2.8
##$NSP= 1
##$NTH_PI= 0
##$NZP= 0
##$OFFSET= 15.70392
##$PC= 1
##$PHC0= -10761.3
##$PHC1= 9.00095
##$PH_mod= 1
##$PKNL= yes
##$PPARMOD= 0
##$PSCAL= 0
##$PSIGN= 0
##$REVERSE= no
##$SF= 200.130013532006
##$SI= 16384
##$SIGF1= 3
##$SIGF2= 2
##$SINO= 400
##$SIOLD= 16384
##$SREGLST= <1H.CDCl3>
##$SSB= 0
##$STSI= 0
##$STSR= 0
##$SW_p= 3612.71676300578
##$SYMM= 0
##$S_DEV= 0
##$TDeff= 0
##$TDoff= 0
##$TI= <>
##$TILT= no
##$TM1= 0
##$TM2= 0
##$TOPLEV= 0
##$USERP1= <user>
##$USERP2= <user>
##$USERP3= <user>
##$USERP4= <user>
##$USERP5= <user>
##$WDW= 1
##$XDIM= 8192
##$YMAX_p= 0
##$YMIN_p= 0
$$ End of Bruker specific parameters
$$ ---------------------------------
##NTUPLES= NMR FID
##VAR_NAME=  TIME,          FID/REAL,        FID/IMAG
##SYMBOL=    X,             R,               I
##VAR_TYPE=  INDEPENDENT,   DEPENDENT,       DEPENDENT
##VAR_FORM=  AFFN,          ASDF,            ASDF
##VAR_DIM=   8192,          8192,            8192
##UNITS=     SECONDS,       ARBITRARY UNITS, ARBITRARY UNITS
##FACTOR=    0.0002944,     1,               1
##FIRST=     0,             0,               0
##LAST=      2.4114304,     0,               0
##MIN=       0,             -261132,         0
##MAX=       2.4114304,     280679,          0
$$ Real data points
##PAGE= N=1
##DATA TABLE= (X++(R..R)), XYDATA
$$ [...]
1979b10k36L4p3j25r5K72l77J41J00k09j2Q1J23J77m42J59L8k3J91j60P7j9L7
2002e51J00r8M95l36o6M79j78J03O5M04m59P3K12Q0j34P4J82P7k6L6J0j41K35
2025F36O9p0J11j58n0J08Q5k35O3L1N3j57j59J80j37p8Pj37q5L8J30k22j20k46
2049c43Q8k2j83P0r0J19j84K3j14J54k01J11r9l7O5K1J5M5j96L54j68l6J82j30
2073e56o4KJ13M6Q3K11K8p8J69j1k02M19p3r9M10k36M2J95j20K84j16N9K71K3
2097H00j63K74j05O6k22j85M09k3n7l04K43k69L79j98k83K25j85L84n86R6j53
2118A43J26j48j52K5j43J48m51L70m18l8L07k83K66m55J77PJ08l89j24M35r3r7
2140f79K82j99j3mO2j86j97N40j21K7R4N1p1K36p2J03l7j2Q0J01L2M77o10K93
$$ y = [-210, -446, -412, -485, -610, -705, -433, -810, -669, -569, -778, -790, -709, -586, -409, -851, -692, -654, -677, -486, -646, -569, -588, -551, -451, -549, -54, -390, -456, 23, -155, -52, 13, 417, -42, 31, 243, 323, 189, 263, 445, 522, 496, 532, 542, 401, 636, 705, 635, 746, 588, 538, 646, 731, 496, 559, 590, 643, 486, 327, 507, 370, 292, 299, 162, 77, 115, 245, 23, -97, -343, -255, -277, -460, -390, -480, -361, -545, -522, -636, -482, -683, -572, -671, -708, -643, -622, -607, -562, -758, -404, -572, -608, -426, -556, -620, -618, -505, -459, -376, -165, -137, -215, -46, -57, -259, 160, 87, -12, 398, 162, 204, 399, 279, 563, 447, 506, 777, 800, 637, 911, 806, 872, 650, 465, 874, 851, 794, 490, 733, 464, 843, 645, 362, 587, 402, 786, 200, 296, 143, 269, 121, -31, -6, -149, -1, -452, -82, -500, -538, -231, -514, -248, -703, -526, -519, -411, -800, -924, -489, -582, -679, -397, -596, -609, -613, -551, -737, -934, -394, -515, -488, -394, -343, -414, -178, -250, -147, -184, -196, -116, -15, 17, 494, -116, 177]
2164A77R8j19K33J13L3m3K19l4j6j8j60O2J84N8j06j52J65j23j00j8N4L23l70
2187D60l0J71k79k35K62O0j4j16j14n8j21j20j45P9j23O0j41N9j36r0J26j92K01
2210d36k82J53n0k3P8N2k5q0J36k94K17J22j64k0J94j56J4L31j64J93J10J24l13
2233b83J93J79O8j08J49j19J35pL93k29K44j49L32j9k19J37j96J66j72L10j67
2254F38J23j65rj26k36N52l33J33k14J51l8k19j31J03j73L4j95OL75l84K5j51
2276b34j82K51j50j19p1L1K19j19P5k16k6j41L1R9k20J80M02n53M1L96k06j04
2298f16L28j47N5l7R1J1qJ53k8J38n1J72J4r6J03j09L40J04k22J13j41L41j01
2321D07K06J6l00L06N8mk75M0J00j16N2P3j37R0n9j47J08q8r5J37j76j71K40k93
$$ y = [177, 275, 156, 389, 502, 535, 492, 711, 677, 661, 643, 483, 545, 729, 787, 681, 529, 694, 571, 471, 453, 507, 830, 460, 430, 601, 322, 87, 349, 409, 395, 279, 165, 107, -14, -134, -279, -200, -323, -263, -404, -345, -481, -571, -445, -637, -436, -718, -565, -615, -638, -560, -508, -533, -613, -477, -771, -554, -432, -596, -616, -422, -578, -564, -233, -397, -204, -94, 30, -283, -90, 89, 157, 49, 198, 79, 214, 207, 600, 371, 615, 466, 798, 779, 560, 697, 501, 667, 495, 805, 638, 761, 596, 587, 461, 225, 777, 444, 577, 363, 514, 476, 257, 126, 229, 56, 90, -105, -99, 276, -108, -83, -234, -416, -165, -315, -434, -505, -474, -255, -374, -299, -515, -541, -682, -651, -552, -772, -592, -190, -743, -702, -306, -512, -616, -288, -435, -380, -417, -326, -315, -323, -170, -198, -60, -111, 61, 75, -21, 82, -27, 313, 417, 195, 308, 167, 508, 407, 613, 629, 329, 635, 693, 689, 414, 454, 554, 438, 490, 563, 426, 516, 457, 310, 418, 330, 235, 372, 196, 25, 265, -28]
2345b8N0j69J15k27J80j54p3R8m4P6j77j17O1j77K84N3j52O8K8k70O0j09J46l1
2369e09Q0l21K84K14j76P3k15K97k98L69k4l1L29k58J08K11l5M1j62J83J77l03
2391C4L27J9nJ29q8K45j16J38l97K43p7O8M6J43q1j31J7j3q5J05R8l06J86k74
2415B25o5J13j94J03J02k97j62J1K28m4j32r6j23M6j20o9m8O0K80k4j80m7j13
2438e46R0p2J38j04r6p6J83m4L99l64j5j72J65J12K04m9k3P5L51k74J31j31L40
2461B22k08K30K15l09K74k94K9L54k45M01Rk41q3n8K08j13J64k68K14j46J97j26
2483D26j29K24n2N1k20J52o4k9R2l19J84l41N9J95j4k24j55qok49J27p0J58M2
2507a70l28j3J77k78n2K25M2j12J33L7l2k07L07l44J63r8K34o6L23k21L8k73M17
$$ y = [-28, 22, -147, -32, -259, -79, -233, -306, -208, -252, -176, -353, -470, -409, -586, -302, -249, -401, -333, -305, -575, -515, -624, -478, -509, -429, -750, -466, -252, -428, -355, -570, -273, -571, -202, -226, -257, 72, -186, -78, 133, 98, 139, -23, 160, 337, 34, 361, 380, 375, 504, 416, 661, 545, 683, 286, 529, 452, 520, 566, 709, 628, 497, 514, 501, 416, 521, 619, 313, 499, 225, 160, 273, 79, 182, 284, -13, -175, -164, 64, 20, -112, -208, -331, -285, -405, -474, -522, -462, -182, -206, -386, -433, -546, -456, -528, -390, -494, -590, -666, -483, -527, -128, -492, -507, -679, -514, -402, -198, -247, -270, -195, 156, -118, 13, -118, 222, 14, 244, 459, 150, 424, 130, 159, 513, 268, 669, 678, 437, 354, 296, 504, 391, 555, 287, 501, 355, 552, 426, 297, 521, 469, 520, 300, 452, 388, 359, 451, 132, 316, -25, 34, 229, 215, -9, -164, -172, -178, -427, -300, -370, -212, -170, -498, -511, -334, -612, -664, -439, -397, -509, -376, -339, -371, -578, -271, -615, -452, -550, -316, -382, -59, -280, -242, -515, -98]
2530i8j80K16J22l23L20j63J62J17R6J44J9k09m7J35j5J4J41k40Q8k7M0R2K71
2553F75Lj88j17j02R7L22k36J18j81l03J54P7j86m4q6K23J16l11J00j92k26L55
2575F8m71K41J10j31j71J35k64J15j44L57kl60M9P9j71R3qnJ36l46L27R1k75L56
2599a91l4J7k27K12P6j2O0P5j2Q8L2O2L3o1L7J17k98J62K29r0k5K4J89j36K6m8
2625C05M87l20K45l72K13l7j69lq4P7k50L34Op8j8k76m3J44j36N3o2k55J40p5
2649a74j36K81j75j30R4j58l6m3n5K66k28q8o0K12K20j63l58M20j88j26M75l45
2671d95M0j05L47l74L57j07J87j01K12k37J90P6J56j47J57j36J95l44M83r0p5
2692A89p8L16j64q0K28k12K61n0J57k06rn7j2J60l3Q1j45P8j66O2O2k25K00l9
$$ y = [-98, -278, -62, 60, -263, 57, -106, 56, 173, 269, 413, 432, 223, 176, 311, 296, 310, 451, 211, 299, 272, 312, 404, 675, 678, 490, 373, 271, 368, 690, 454, 572, 391, 88, 242, 319, 133, 89, 3, 226, 342, 31, 131, -61, -287, 68, -403, -162, -52, -183, -354, -219, -483, -368, -512, -155, -157, -517, -468, -389, -560, -467, -475, -480, -344, -690, -363, -272, -547, -191, -225, -208, -435, -223, -147, -159, -99, -24, -36, 52, 84, 146, 179, 118, 155, 272, -26, 136, 365, 275, 250, 274, 463, 327, 353, 305, 792, 472, 717, 345, 558, 521, 352, 349, 265, 342, 92, 426, 432, 354, 336, 60, 17, 161, 25, 78, 16, -239, -99, -174, -310, -29, -204, -334, -240, -398, -434, -477, -532, -266, -494, -582, -642, -430, -210, -373, -731, -311, -499, -625, -150, -495, -455, -560, -213, -587, -230, -337, -150, -251, -39, -276, -86, -10, 146, -1, 156, 20, 215, -129, 354, 264, 189, 111, 427, 263, 183, 411, 199, 460, 410, 567, 361, 352, 295, 283, 443, 410, 491, 346, 424, 258, 320, 382, 157, 357, 318]
2716C18J01l1l95K54l55K24j87P0OO5m90K25O8j19o1k9O8J70k80k1M1j20P2o1
2740d67q9K22j24K14j45j17J59j25J27LQ1o8kJ83J13j64K59k09K26j34L92j17
2762B18k07K79j05j45P5L59k19r3K00j60K63R0k00P4J0n2K6O9j06j71K18k88K80
2785D15ql24K16p8l9mO1k39J47k90K85l22p2K17k93m2J03J44j85J19j46K2O5o5
2809c13k72M84j39l73K37l8m6k9o8J92N4p6j78K26l4K32o0J6K9j23RL01j08l4
2833a11O5P2J84k2M4o3j0J03M4K4j81J52O5J25m6k1j24L22j66n7O1Q6j83m1L4
2858C56k03K82l27J04J44o3k25J67Q7k6k76NJ72j7n03K41Ln9O2r7J98n8k31j6
2882b80o8o9J38K7P3j63j34k0K01j66R5J35k51J41J9R6O6l51L16J11j30N3k3L56
$$ y = [318, 419, 388, -7, 247, -108, 116, -71, -1, 5, 70, -420, -195, -127, -246, -307, -336, -268, -98, -378, -399, -358, -478, -406, -467, -556, -334, -458, -244, -389, -506, -347, -472, -345, -342, -261, -329, -331, -148, -35, -199, 60, -149, 77, -57, 335, 218, 11, 290, 185, 40, 115, 474, 255, 162, 362, 202, 465, 555, 355, 429, 439, 387, 413, 482, 376, 205, 423, 135, 415, 407, 83, 299, 221, 182, 178, 239, 0, 147, -143, 142, -180, -252, -35, -328, -370, -267, -123, -308, -189, -335, -313, -248, -313, -585, -101, -240, -613, -376, -414, -460, -489, -557, -365, -311, -387, -565, -339, -373, -141, -201, -185, -156, -279, -270, 31, -77, -111, -46, 26, 210, 188, 232, 169, 159, 262, 306, 330, 149, 301, 366, 491, 445, 424, 300, 622, 456, 399, 460, 546, 363, 322, 356, 153, 435, 108, 212, 356, 293, 68, 235, 322, 296, 20, 25, 197, 180, -323, -82, -79, -138, -76, -173, 25, -33, -264, -280, -348, -417, -279, -252, -179, -342, -476, -496, -295, -461, -366, -231, -482, -341, -322, -226, -160, -511, -195, -84, -214, -161, -184, 172]
2906A72j14j43J17J07L5m0j32L11%l8l06K87Kj39J34J8j62L28j23J17l9k32J97
2929C57o6P2p0jj49K4J66m2j22L02l71J99j78q5p3K91l05K23j47l40L04k11J58
2952f4n8j50O5l8l26L80l6k99K5K30j08P5M5j33n5o5J87J40l20p6L95q4j9P4K3
2977a92j82L34m1p2J88j93P6R2J15O0K4O5l48n2L85j7mrO9O3r6K36k03M9N9l9
3003C67K17j92j79J53k3k5j52K45k26J85l73J87l29J83r6J71m0j47K1j82K45k32
3025b22M42k60j42N8j19k36L28j22M9j95r2J79K7j06R0j80J19J73o9M6j62k2M5
3048c71j71L59j03K27k8j09j18M44L7k60M8J24%j23J50j57K16l19L08N5J59q7
3070B81Q4J83k70K2oJ73q3p2K1p5N8K01k89L26k87j03M0J00m5k70OJ0K47j77j20
$$ y = [172, 58, -85, 32, 139, 174, 134, 2, 313, 313, 275, -31, 256, 258, 119, 253, 271, 109, 437, 314, 431, 392, 160, 357, 291, 363, 293, 292, 143, 167, 333, 291, 169, 471, 100, 299, 121, 36, -37, 254, -51, 172, 25, -315, -11, -222, -64, -122, -272, -207, -245, -571, -191, -227, -526, -501, -271, -379, -304, -259, -392, -447, -512, -325, -185, -505, -581, -186, -270, -289, -215, -192, -374, -40, -81, -153, 35, -158, -82, 10, 125, 185, 209, 274, -74, -126, 259, 242, 238, 229, 298, 361, 265, 501, 298, 347, 406, 367, 584, 392, 213, 366, 343, 318, 166, 411, 185, 370, -3, 184, -145, 38, -58, 113, 73, -74, -53, -235, 10, -222, 220, -40, -182, -124, -243, -479, -151, -273, -224, -419, -511, -332, -305, -411, -321, -501, -382, -209, -278, -232, -394, -416, -371, -542, -183, -286, -59, -87, -196, -314, 130, 167, -93, -45, 79, 79, -44, 106, -51, 165, -154, 154, 209, 368, 281, 365, 548, 278, 300, 294, 467, 384, 312, 333, 258, 316, 517, 228, 554, 267, 164, 204, 304, 259, -11, -5, 5, 252, 75, -45]
3095d5k3K98j92j60l9k8j01qO3J54j37J45m8k89r1M49k99k3k9J27K41k08L81M6
3119A84k83j29j57j33J80O60m07R5j79K68j53O28r33R10q16j64j21O96ll32N68
3140C79ro67M79p96J723m42j237Q59k09k0M67o32N2K22R3K96j383J314n81M40
3160C48m89j53M74o58N08l45j4O62o13M95k64o6n08P17k53M49n09nq5J09j66K68
3182i8k81l7j26N0J20kP0Q9m7k0R4k45K27m1K43j59k77J75J92K3j84PQ0j66J30
3207a83j27M39j36K85n5j35K2L1J05k7J17m2j46J60j14J33j93J54R5m4p9J72K03
3230F35m29j0O7j42K86J4m75M16q1l47L41k94J74Q9l98m6J74K23j42k8R4k22J55
3253E4k59rj51J18l36L69M3K1K7l95J20J39k70J80J41O4j64l9nm7J94j8J53j05
$$ y = [-45, -68, 230, 38, -122, -161, -189, -290, -298, -235, -81, -218, -73, -121, -410, -501, -52, -351, -374, -403, -276, -35, -243, 138, 184, -99, -228, -385, -518, -338, 322, -85, 10, -169, 99, -54, 574, -359, 551, -265, -429, -550, 146, 143, -189, 379, 370, -297, 182, -614, 1109, 667, -570, 289, 80, 60, 527, -105, -53, 169, 262, 558, -825, 489, -92, 348, -141, -294, 180, -478, 30, -315, -329, 333, -280, 215, -49, -115, -623, 94, -159, 290, -219, -224, -309, -200, -366, -98, -379, -416, -542, -492, -372, -374, -304, -215, -262, -282, -188, -433, -206, -247, -4, -163, -440, -265, -73, -50, -234, -227, -147, -313, -183, -310, 129, -7, 278, 223, 88, 110, 141, 246, 219, 336, 294, 148, 308, 194, 327, 134, 288, 383, 339, 260, 432, 635, 206, 196, 263, 121, 407, 421, -54, 362, 281, -66, 275, -19, 155, 244, -154, -200, -26, 197, 55, 27, 121, -101, 54, -205, -214, -365, -247, -583, -214, -171, -150, -123, -518, -398, -259, -529, -349, -208, -144, -308, -347, -352, -399, -205, -223, -70, -175]
3277a75o9J41j80Q6K6K30j6L8k1m6J16J62k48Q9Rm3L3qJ99P5j71J06K28j98m7
3302C16p4J40K1k17j04J39j31J35Nm2j62J35M6J58m03K10j95j4L9j65Q7K5M8J
3326bj58m9J81k97OK47k44j8j34J91P9j58J76j65j28j7M90k08J69k86K04n7l4
3349b12r1L28j77J69k3j26P8j4J86j86J92l8M2j71K21l6Qo6o9K23m5j4J27j16
3373A90K31k06J40K8j23p7O9J4M6q1O1R8j0k48k10J18L22k70L8n1mK28k26o6o0
3398d9P8k4j58j33J35k12K73l28K04m3J12k92M42k92R5kn6k5J67M1k23L1Q0L6
3422a43k54J23J50Pm1K08j37L6R7k17J18k3J33j18j01L43l06M19j65p0J62J05
3444C26Noj28M6L3l6o6L35j17j2o1j75J27J72k10J44k00j41o8J19L7k6J56k99
$$ y = [-175, -244, -103, -283, -197, -171, 59, 43, 81, 60, 14, 130, 292, 44, 133, 142, 99, 132, 124, 323, 398, 227, 333, 561, 363, 316, 242, 382, 403, 186, 82, 221, 90, 225, 230, 188, 26, 161, 207, 365, -38, 172, -23, -37, 2, -163, -76, -51, -3, -2, -160, -209, -28, -325, -319, -72, -316, -334, -468, -277, -198, -356, -180, -345, -473, -490, 0, -208, -39, -325, -121, -178, -212, -303, 25, -152, 17, -6, -132, -54, -68, 118, -68, 124, 86, 128, -43, 178, 142, 150, 84, 15, 238, 193, 179, 306, 190, 421, 215, 355, 383, 260, 183, 252, 266, 312, 231, 292, 390, 380, 132, -78, 40, 362, 92, 130, 79, 75, 303, 77, 11, -49, 29, 5, -153, -286, -151, -363, -90, -418, -214, -257, -145, -437, 5, -287, -192, -194, -250, -275, -108, -67, -290, -259, -179, -143, -397, -274, -124, -117, -158, 50, -87, -51, 46, -171, -53, -76, 57, -61, -162, 181, -125, 294, 129, 59, 221, 326, 331, 325, 197, 243, 276, 240, 174, 509, 392, 380, 319, 144, 271, 443, 233, 377, 177, 36, -32, 87, 124, 98, 254, -45]
3468d5J27j41J55k13J3K43k21k08J72j23J46r4j07J80l20L51o9k00P1k08O2L16
3490a13l17K72j00J3M0j01r8J47J13j67K35k27PJ82J39l9q9K50j54J17J72k75
3512GJ27oj53J64j22R2j30K87J34k52N4%K3P4J34k65J49J7r4p3oK65j31k08Q4
3537A71Or6k08K40Q7l68J72k7l5J14j60lJ72l83L32q8m10J02J26R7mJ21k46j74
3561d62L17l4k4mj89J58r7M0K6j4J63m4%M2j57%M4K14j19K77j76J20j00n8L30
3586B53j77j61K52J91m10K90L7J42J3Q2q8J62k53Q6j16L9J71m85j6M70n84K53
3608A51K05l89J54L0N58j15r71O35o92O47o97K81K69l36Q86k39o00l9M33l46J48
3629b7l79K03J66k21l57P74k96k78L30j55r2M36j67k16rJ22J83k44q3R3M4j08
$$ y = [-45, 82, -59, 96, -117, -104, 139, -82, -290, -118, -241, -95, -189, -296, -116, -436, -85, -154, -354, -283, -491, -429, -113, -430, -158, -258, -245, -205, -306, -404, -257, -144, -311, -76, -303, -296, -114, 25, -14, -103, 147, -7, 110, 282, 7, 134, 128, -25, 139, 17, 109, -21, 266, 400, 148, 202, 202, 225, 299, 433, 168, 317, 334, 240, 167, 161, 426, 295, 87, 171, 177, 81, -127, 113, 200, -168, 4, -23, -58, 56, -104, -107, 65, -318, 14, -74, -484, -382, -256, -159, -163, -42, -288, -462, -145, -179, -203, -207, -396, -238, -335, -295, -269, -283, -120, -164, -164, -122, -279, -279, -235, -21, -140, 137, -39, 81, -19, -77, 253, 76, -85, 167, 358, -52, 238, 275, 417, 430, 512, 424, 586, 333, 419, 303, 342, 513, 28, 12, 482, -102, 151, 356, -33, 121, 151, 709, 594, -377, 258, -434, 213, -484, -203, 66, -270, 616, 377, -223, -262, 171, -175, -27, -406, -203, -37, -258, -615, 159, -137, -415, -85, -240, -332, 104, -63, -279, -288, -166, 17, -227, -310, -217, -173, -281]
3651b81J50r5K04k09Q2K20k52oJ0K37k3M21k54K1l33K96Q4k17O2k0j41J69p4K40
3675B91J42j94N2J78j69k39p5J92L5j76K53n0l0Lk31K19J18m54J33N2J08l51J65
3698b8j78J08p3J22n3N2r1j72L28k21j07L2Q2m5q5J97m7N0k54L31k57pR9k3M6
3723a94J15j42Q6k17J44M5J36k35K00K17k72J01j78K78L2J84m24K69j95J68M59
3744E77m37J00l54J111n28j52m46O18Q17o37m12l68l26Q22m8k75K19k38L23k98
3764F8K29m5j55n1Q3N4m16J45k05L27k27J41j36J33j47j12j1L64k07k15J25P7
3786a81P6j28K0QR9j33O0j34K4m3%kJ81p8l2M7J21n3P9Q6R6m0j78R1j4J12R5j46
3814C3K71j08j86k1J38l5J13K61l27L32k88J40j42j11L13P7j81K11j64j98J79
$$ y = [-281, -131, -226, -22, -231, -149, 71, -181, -187, -177, 60, 37, 458, 204, 225, -108, 188, 272, 55, 117, 97, -44, 125, 51, 291, 433, 239, 291, 469, 300, 61, -14, 178, 213, 37, 290, 240, 210, 213, -18, 201, 319, -135, -2, 50, 158, -193, -28, -206, -98, -171, -49, -102, -50, -141, -313, 15, -206, -313, -281, -199, -244, -329, -132, -179, -129, -383, -52, -309, -316, -217, -240, -194, -79, -221, -135, -352, -208, -163, -27, -262, -62, 155, -117, -16, -194, 84, 116, 300, -124, 145, -50, 118, 577, 140, 240, -114, 997, 469, 317, -129, 489, 1306, 669, 257, -111, -437, 385, 337, 62, 281, 43, 366, 68, 297, 252, 97, 46, 129, 183, -233, -88, -293, 34, -193, -52, -188, -55, -202, -314, -325, 39, -168, -383, -258, -181, -105, -233, -213, -205, -106, -239, -179, -313, -289, -332, -332, -334, -153, -231, -263, -216, -95, -148, -69, 17, 113, 73, -105, -14, -28, 84, 179, 33, 304, 196, 10, -11, 127, 92, 205, 466, 139, 471, 183, 323, 181, 70, 383, 460, 279, 490, 326, 128, 307]
3835C07p0Mm6j93K27Q2k34K9J4o6r9K2N1l07J98pP7j67O3o9O9j38O7j20J61J00
3861d5r3j71K5N5J54j86j29N4K3L3J51k54Q5L18q5o4j4j02J43J35j48j7J47J8
3885C3M5O1P5p0k05J28k38K08J86j93K03R8q5j75M2k5L85k04m7k77K47j66J48
3908A74j79J46R2nlj07%J67n9l50J84N0k51K3L16j39q7n6N3j05M1K7O4m32K70
3933a66J23j8k10J96j62J54n8k44Q2o4L5K78o46N52o4R2j66J29R0J12j13k09K
3956b75L88K3K88n05M51j25n83N60J94k28l59k09J019l84K10l78Q5n8K25k04L38
3977D73O2n16L89j15J53R2k68l69Q19n31k84K39k78K21l63L90j99l88R05k85K18
3998C65l16j77K8O39q30K68K13k91J60l15K15j03j51M39o18N10J74j69p6l83J68
$$ y = [307, 237, 241, 195, 2, 229, 311, 77, 106, 120, 54, -45, -23, 28, -279, -81, -88, -11, -178, -115, -184, -115, -253, -186, -306, -145, -45, -138, -309, -284, -229, -75, -261, -390, -336, -313, -280, -129, -383, -298, 20, -65, -129, -143, -245, -102, 33, -115, -132, 15, 33, 78, 139, 214, 144, -61, 67, -171, 37, 223, 30, 233, 331, 246, 71, 113, 88, 473, 269, 222, -55, 192, 26, 174, -5, 141, 233, 228, 225, 118, 118, 285, 226, -124, 60, 110, -141, -118, 198, 59, -28, -84, -31, -136, -95, -68, -4, -436, -166, -43, -61, -271, -75, -237, -83, -141, -385, -303, -367, -332, -54, -700, -148, -212, -120, -286, -157, -67, 45, -68, -277, -275, 113, 136, 424, -81, 370, 245, -338, 222, 416, 188, -171, -380, 639, 255, 465, 87, 172, 114, 339, 135, 473, 535, 19, 408, 293, 446, 538, 270, -99, 720, 189, -95, 144, -134, 87, -276, 114, -85, -473, 432, 147, 365, 49, -128, -100, 539, -291, -23, 190, -101, 59, -256, -41, -144, -295, 144, -474, 36, 210, 41, -35, -418, -250]
4019b50K96l41J02K4K52l34K35l71N89p75L67J69Pp1K37L82n05J00N1J23j88l
4041I6O4Q7k29K74q4K38k51n6J18k10K34j21Mn9J68Mj94J81K19l15j61J52j03
4064E6P5J51km09J9j34L83k61J01k18K69k62P9J3J60k8k79N10o72L78l9l11R34
4087E13p76j46kN69q78M04P7n31O87L2k38L26M49j152j2k41M64Q01m62O62k47
4108B99l24K1K62j74l06L1M11m29M64j99J24L9n47O44K61j49j06k24Ql5L4RK22
4131C36J68l96J27j22nj07r9Q6N7o3J14n5J5l74M14k76L02j8j95P8R6j30r9K34
4155H8m54J04k3L0k1N2q4K8J71j81O0J62j94K72k06J29j23j07K04k99K80J72l11
4178b51L27j27j9Q7k62J64O58k45k57k89j39O60R8k82O2k53J20J05K16j86O2j55
$$ y = [-250, 46, -295, -193, -169, 83, -251, -16, -387, 202, -573, -206, -37, -30, -101, 136, 518, 13, 113, 164, 287, 99, 96, 160, 247, 18, 292, 208, 446, 195, 139, 257, 47, 281, 160, 164, 105, 273, 277, 83, 264, 483, 168, 7, 159, 56, 131, 282, 280, -129, -110, -244, 139, -122, -21, -239, 30, -232, -153, -140, 20, -8, -287, 223, -449, -71, -110, -421, 513, -263, -409, -411, 158, -720, -316, -239, -770, -83, -51, -289, 37, 486, -666, -678, -919, -455, 346, -116, 546, 299, -25, -4, 258, 84, -222, -191, 220, -209, 255, 56, 180, 219, -328, 316, 577, 428, 322, 98, 106, 71, 105, 114, 336, 504, 108, 235, 113, 108, 1, -98, -12, 45, -18, 96, 41, 56, -318, 96, -180, 122, 104, -91, -13, 83, -47, -146, 88, -366, -262, -285, -255, -276, -224, -308, -280, -109, -290, -230, -68, -262, 10, -196, -67, -190, -297, -93, -392, -112, 60, -251, 76, -51, -70, 17, -245, -81, 577, 332, 75, -214, -353, 307, 405, 123, 185, -68, 52, 157, 373, 187, 249, 94]
4200I4J14qQ2k49m6K41L0j11K1j22K57Jk24P5k39L54K1j56L8l48J81r1K03Q3l0
4225A71n6j02l19K05m1m0m9J90j60k3J59j57P3j01J81l23J19K4J1j60K32o8M1
4248a93o4J90l65K18o0K36J08j25L6p6J91j18j8L67j73k00J19J25k54K82Q5k03
4270A08j52Q4K32o8J75n1j88Oj75K22n3L2N6J81m13K52j60q2J79k72J91j38l5
4293f9L42q4n9j66k56L05%j32M4r0j13K89k10J69m9j62l5n9K3R0J20Q0Pj21J9
4318a17j15Q0R4O8k88M35m39J07K49o1kk4k8j75K2Q4J32r4N1K17k26J34j61L61
4342C04k69M10m36J15j17K03J1j75J59l6K59j71k82K11K13l22lQ9l5P4M5p1k08
4365c2l8K62j19k8J73j35j05L9j78K85k75J5L7M1j57J83j63P7j00J46OJ34l35
$$ y = [94, 208, 200, 282, 33, -13, 228, 258, 147, 168, 46, 303, 304, 80, 155, -84, 270, 291, 135, 173, -175, 6, -85, 118, 201, 171, 115, 13, -306, -101, -142, -182, -231, -41, -201, -224, -65, -222, -149, -250, -69, -392, -273, -249, -238, -398, -166, -234, -193, -257, -67, -432, -214, -274, -38, 70, -55, -19, -95, 96, -22, -40, 327, 154, -46, 73, 198, -56, 226, 311, 108, -44, 40, 272, 204, 379, 328, 140, 146, -29, 193, 140, 172, 228, 409, -4, 248, 88, 6, 185, -87, 104, -34, -69, 273, 189, 130, -36, -292, 13, 13, -119, -75, -165, -278, 11, -199, -30, -79, -241, -276, -335, -312, -222, -102, -22, -15, -136, -117, -232, -152, -58, 10, -278, 157, -282, -175, 74, 13, 11, -13, -41, -216, -194, -110, 22, -72, -21, 196, -30, 104, -57, 304, 35, 445, 9, 124, 7, 210, 221, 46, 205, 169, 428, 257, -25, 186, 399, 77, 74, 163, 128, 202, 247, 176, -32, -70, 192, 73, 45, 218, 83, -22, 17, -161, 124, -151, -136, -99, -58, -215, -32, -195, -118, -218, -72, -66, 68, -267]
4388b67k7rJ36M9r4O1om1l8R3J57k08J8K15q0j76L91j39o3K71n50K01J29K74m58
4413a61L08Pk75N33n25N40j12k45M9J73l7j78QL7J86l5m2Qj41K10j62nq5qk7m
4439A7k2Kj04K37k23M9K18j7j26K3l38R5K22l50J61M5J85l10J01J42l59J74j65
4462c43J13Q4J90o0p6j45J90K59m66L73k0m26J97J20rJ34k60K95k26K6R3j05p5
4485a37J54L3Q6ro5J8J36l30J54K60k48J84k40K2L6J00R1J43j82j53J41J98k63
4508A29k36K65m0j12O7j2R6J23j05k64O0%J8k90K59J88j09j66N5k17J12J30j42
4531a91P4k11K79k28l8L90k4l51j44J53O0j59R5J48k14j39L02JN03o27j07R0j66
4554e04j68R53l06k7m4p7K25n48K62k4M56M09o17j06N7o79P69p4K70J06m36qQ
$$ y = [-267, -294, -303, -167, -118, -212, -151, -157, -198, -236, -143, 14, -194, -176, 39, -41, -217, 174, 35, -28, 243, -307, -106, 23, 297, -161, 147, 154, -121, 412, -113, 427, 315, 70, 119, 292, 255, 77, 85, 122, 308, 273, 231, 239, 98, 308, 146, 141, 56, 48, 21, 17, -5, -3, -107, 130, -93, -44, 174, 157, 31, 54, -284, -189, 33, -317, -156, -111, 74, -236, -135, 7, -352, -178, -343, -230, -146, 44, -16, -92, -237, -47, 212, -254, 119, 99, -327, -130, -10, -19, 115, -145, 150, -76, -50, 43, -62, -137, 17, 50, 136, 127, 62, 80, 216, -114, 40, 300, 52, 236, -4, 18, 54, 154, 245, 388, 206, 53, 194, 392, 129, -107, 158, 118, 6, 73, 61, 157, 280, 175, -89, -29, -29, -11, -301, -42, 146, 37, -129, -74, -291, -179, -49, -191, -117, -328, -49, -277, -315, 75, 51, -300, -444, -291, -231, -390, -295, -147, -361, -500, -198, -197, 306, -321, -428, -338, -504, -672, 281, -25, -52, -96, -173, 52, -496, -234, -258, 198, 607, -10, -116, -59, -738, 31, -43, 227, 333, -103, -111, -103]
4577a03J45J4L7K27l67l0j02N49j15o0j08j06L1O1p4J31J7j33m3q0J36J42l67
4600a98l4J94Ln8J35%l0n5L1j32l28N10l17J41J75l09K46k6l1OJ03j89P0J07j35
4625a21qJ35j10K34j08o3j34L52j71J62o3j75J70j83L71L0j39j41J35q4Q5k16
4647d2L3J08o0J84L4j85m4M60k4k99N36k70l06k76M61m26L94r8l31M19J77j052
4669f07O81J88j22L5o87J92j77M4N22k50L96m48j21L41k00j84K66J75k11N7J30
4690B0K68l83j10O3p5K77j7r4k0q5j48J32L20j78k7q5K16j48N2P5L5P6k6j14J55
4715A79l0k64L84l66K08J71j47Q9j75l6P8n2L77k44J65r4p5J15j48j32K05j54
4737E4J70n6j75l1l5J53q2KL9L4L5k8j88l4K89p1n6J29k81J78j66J52k39J97k49
$$ y = [-103, 42, 56, 93, 320, -47, -77, -179, 370, 255, 195, 87, -19, 12, 73, -1, 130, 147, 14, -29, -109, 27, 169, -198, -232, -38, -35, -93, 42, 42, 12, -43, -12, -144, -472, 38, -279, -138, 37, -272, -26, -52, -83, -77, 26, -163, -93, 14, -121, -129, 6, -104, 130, 22, -41, -175, 177, 6, 168, 105, -70, 100, -83, 288, 318, 179, 38, 173, 89, 174, -42, -9, 99, 39, 223, 257, 72, 28, 488, 464, 165, 701, 431, 125, -151, 310, -116, 278, 180, -151, 268, 445, -607, 74, 262, 140, 175, -512, -320, -497, -453, 69, -181, 215, -233, -354, -13, -213, -397, -131, 44, -167, -110, 20, 288, -95, -205, -142, -217, 60, 43, -51, -71, -156, -304, -172, 148, -30, -57, -142, 74, -74, -22, 53, 88, 164, 138, 24, 179, 149, -115, 269, -97, 111, 282, 135, 224, 49, 13, 91, 39, 416, 172, 337, 243, 168, 283, 135, 3, 208, 54, 224, 168, -7, -38, -73, 80, -2, 0, 39, 73, 108, 80, -108, -142, 147, 76, 20, 149, -132, 46, -120, 32, -207, -10, -259]
4762b59J7L43j92j28mR2K1J04l75K54o1o0J35j26M68k43k03J12K7M2l9n2K32P7
4786A82J6j73p5J30N2p8J48o8n2r5L9K8j15Q4J35p9j37K27Q0k31L28m91J02o9
4810a12L68j12r5j44J99n8j53J93j04r3J95n4p8k8J47j4Km6k33L31k26j1J90j62
4834i8j45Q6j30K73Q6l12M6j86K10K40j60j69K18p5Jp1J93m5R4q7rJ52k05k5K12
4859I4j68J62j27J20J53j55j04P1j05R9K1R5L74m84J9R1J62j20K2k04P4J66j21
4882A35LJ2k68J43J26m9K27k73kJ07k82K74Q6k86R1l5qk28j38K28M3K06j76j34
4906a98K11j19J1O6l09q9L04J6L2L01o6l74N08k15m88L59o2N4q71P37j03L86J18
4929B09o3K36n04l90M72K98M8M0k2l18J99j9M34k43l57O00n0k76l20P94o28N91
$$ y = [-259, -242, 101, -91, -219, -223, -131, -110, -6, -381, -127, -188, -248, -113, -239, 229, -14, -217, -105, -78, -36, -75, -127, 105, 182, 198, 25, -50, 80, 132, 54, 202, 134, 82, -13, 26, 54, -61, 23, 158, 79, -58, 169, 249, 18, 346, -145, -43, -112, 256, 144, 49, -95, 104, 46, -107, 86, -18, -111, 84, 30, -48, -76, 71, 57, 59, 13, -220, 111, -115, -126, 64, -98, -243, -157, -287, -14, 72, -240, -194, -380, -170, 70, -90, -259, -41, -116, -115, -186, 7, -38, 56, -31, -40, 112, -93, -118, 94, -74, 88, -39, 81, 234, 79, -25, 46, -59, 40, 61, 156, 530, 46, 65, 156, 318, 198, 220, 16, 90, 256, 135, 138, 150, -118, 25, 151, 102, 329, 56, 54, 161, -121, 153, 239, -47, 44, 9, 1, -227, -365, -137, -94, 112, -64, -198, 13, -106, -95, -29, -338, -427, -123, -107, -75, 226, 160, -214, 294, 79, -409, -50, -112, -58, -929, -192, -295, 91, 209, 146, 382, -122, -512, -40, 258, 306, 346, 324, 6, 205, 186, 620, 377, 20, 620, 570, 294, -26, 768, 140, 731]
4951G31p26N52m13n03K24qL81j98L51k95K6L09m91P83o83m42O66r9M09J75r20
4972a71j56P13l03l23K10k50J79Q0j00N1L72j91l20j08K2J09N08j29m91J16o5
4993b47k85O14k49L01k11Q0j9o21O02k41N37k19K4p9J56n8J09J52p24j4N73l98
5015b17J85j60K47j39K41MK21k45ll13K84J28K01k28k63j03K44j01R5J06O7j01
5037A50O8k58J69K04k14l95M83k6j47o3n4Pl56L60M5j84P0L1J61O3j47J38j16
5060a1j12j0p1j1J25q4l9p3J55Q2j43K18k49mj19L21R2j0j20j37M36j48k47J4
5084a45J46O0k5n7P9J37J13r9k20J41r0K9J08j03L5N0j7q0K97k65j17l0L65l58
5108d6J73j29k1K48L2j08q4p0j5K46k44J46j15j12l0J44N7J0j53j83L07j69LN6
$$ y = [731, 5, 557, 144, -359, -135, -143, 238, 40, 391, 96, 122, 431, -60, 723, 40, -402, 264, 165, 574, 749, -171, -327, 386, 83, -240, -30, -280, -101, -21, -121, -70, 302, 111, -209, -317, -295, -186, 322, 193, -298, -182, -247, -532, 82, -167, 134, -77, 3, -16, -637, -35, -276, 261, 42, 66, -13, 143, 85, 194, 346, -378, -392, 181, -217, -32, -192, 55, -84, 157, 161, 382, 137, 134, -179, 105, 233, 434, 206, -57, -160, 84, -17, 78, 184, 251, 150, 218, -40, 129, 333, 119, -276, 207, 181, 34, -29, -83, -76, -432, -72, -27, -211, -141, -110, 51, 114, -33, 105, -11, -123, -133, -204, -215, -90, -174, -213, -286, -131, -49, -192, 26, -223, -227, -346, -25, 67, 57, -63, -200, 236, 88, -159, -145, 1, 61, 36, -21, 58, 195, 308, 209, -11, 130, 40, 69, 177, 74, 109, 159, 142, 62, 359, 94, -23, -53, 312, -46, 127, -2, -23, 225, 257, 149, 65, -5, -20, 226, -18, 128, 13, -99, -129, 15, 72, 82, -71, -254, 53, -116, -113, -57]
5132e7J29m92L52j58J48J60Q1j65j80op5J19K23k21K0K49j78p0J08m4q8N2j42
5155b35K37q6PL49l04J97j81J03j40K21n5kj2K49j07k49Q3O1j18J71k20Q3J9L1
5179A02K19l59J48O1mm4j17J38J07j82j05j8K32j01m6j67P9K61q3P0k38J02q0
5202b5j89K70k35q8L22l26L20j22J1R6k90J93J38k20r6K10O8j45j11L8J36j41
5224a86K35j13M2j19P5l38M62l58p3M56p1J2J53k80J09o2P2J0J64j15j04L05j02
5247A74l01K66L9j50l6K99j13k34K26O1k88L36m04K67k5q0J38n2O6j55J76m16
5269b06L94l25J35o6Q1J51j52j13n0J5J15j4j95L60k45j11l2J4Q6J68j96J79j93
5292b00J45O2L2j30l1q5J1m8J59J13k13R2j43P8J52P3j25P3k4q2J32k50K78j04
$$ y = [-57, 72, -420, -68, -226, -78, 82, 163, -2, -182, -188, -263, -144, 79, -142, -122, 127, -51, -121, -13, -57, -145, -93, -235, 2, -84, -77, 272, -32, 165, -16, 87, -53, 168, 113, 111, 99, 348, 241, -8, 75, 136, 18, 189, -31, 52, 71, 102, 321, -38, 110, 171, 167, 123, 6, 144, 251, 69, -36, -54, 178, 77, 31, -136, -57, 204, 121, 191, -47, 55, -25, -214, 56, -179, -267, 55, -271, 49, -73, -62, 34, -256, -63, 75, -145, -241, -31, 37, -108, -219, -181, -45, -186, 49, -64, -22, -141, -66, -404, 58, -300, -373, 83, 12, 24, 177, -103, 6, -56, 16, 26, 190, 75, -29, 276, 174, -127, 139, 178, 28, -8, 291, 178, -56, 170, 231, -57, 279, -125, 142, 117, 37, 175, 123, 189, 34, 210, -206, 188, -137, -2, -68, 13, 164, 12, -101, -151, -136, -21, -35, -230, 130, -115, -226, -258, -244, -158, 10, -186, -7, -200, -55, 7, 39, -91, -122, -207, -196, -244, -85, 28, -185, -93, -236, -158, -6, 67, -58, 15, -9, -91, 41, -209, 69, -35]
5316c5J81j85K10K0j23K1R0kj0k6n0K07k32j7P4j20J12j32k7j16L29n8q1K59j32
5341A57j7k09M8l10M90j67k66K83m0q6Q0k86J57K25R6j28K4k09P1k42K28r8K08
5364Ik50J94k6m40L54J75J46m54J51J77j20j82L90j90l8K19j15r0J67j05q5QJ55
5387E0j16J49J27l76J70J4J09p1k1Q0r8j99M17n1q8q1J06j35J67M9j23m4j52Q9
5411b8R2k0o5K76k47QL9J00J86j58l68K7Q3K10k91o2k4K68j90K22l24L46l93K53
5435f0r2L09j26J5l82K14l5N3R2J80n6k35J22j2k6r9J68O3r6L4j75OJ83k58K44
5460C1m0K2j55N14n13J03L11l36J38P8L6k28K07j26k1K02j76K96l8k0k17J63q9
5483A42o5j51J14K98l08J88j65J27k24K18j23q0m6J17m4M9k3L6Jr8J40j0p9n7
$$ y = [-35, 146, -39, 171, 191, 68, 89, 179, 177, 167, 141, 91, 298, 66, 49, 123, 3, 115, -17, -44, -160, 169, 111, 30, 289, 157, 140, -69, -21, -331, 159, -8, -274, 9, -31, -117, -37, -323, -166, 59, 155, 27, 51, -158, -87, -329, -101, -199, 9, -241, -47, -73, -513, -159, 16, 162, -292, -141, 36, -84, -266, 124, -66, -104, 115, 0, -90, 77, -28, -113, -105, 50, -66, 83, 210, -166, 4, 18, 127, 56, 35, 115, 17, -182, 235, 184, 96, 15, 121, -14, 153, 202, 79, 35, -117, -28, 64, 44, -21, 255, 8, 16, 55, 155, 341, 183, -185, -158, -75, 135, -156, -218, -242, 26, -164, 58, -266, 80, -313, -60, -152, 157, 31, 46, -336, -122, -157, -104, -12, 168, 112, -123, -1, -13, -39, -138, 30, 93, -3, 31, -144, -138, 45, -213, 31, -9, 13, -142, 372, -141, -38, 273, -63, 75, 153, 189, -39, 168, 42, 21, 223, 47, 343, 305, 285, 68, 231, 142, 77, -74, 40, 338, 30, 218, 53, 180, -44, 174, 51, -29, -75, 42, -2, 47, 24, 60, 61, -37, 103, 93, 14, -43]
5507d3O9k6j14J82k45J56k51K02J9n7J40l33Q7N5K87m42O6J97k04J4M15k54J60
5530H0K49j76j76n8K21j24O1J59l36m0O3J4J28L1l13K73O6j09J3K66k87J98R5
5553B98l3j73n7J93r0J50p3qk82L23j39j21j69K99%j43K6O5J08l16K0P1j4Q3k32
5578b14rP3J74l02Q3j49K31j19o0J29k1J37N6j80J08l0O8n6m7K21j7j55J1k8J66
5603G0J9J57p6j62j55L73j91k42K80J9j39J58j02Q1J77Lm5l05J08K79j95m9J6
5626G9m9Q8K3j79K53m2J7j06o8K60k62K23l03J50J18l44L53q5l12K72r0K36m2
5649A90j82j03J37q0J50k37O1J71o0r1M3k51j48K35M02j32r9j03j11J77o3J83
5671H9l24R4K06j64K46k15K22n3J61j75p0o6l01L81Mj4J3j11J76o0L7L1K3K2j16
$$ y = [-43, 26, 0, -114, 68, -177, -21, -272, -70, -51, -108, 32, -301, -214, -159, 128, -314, -248, -51, -255, -241, 174, -80, 80, 329, 153, -23, -81, 140, 16, 77, 236, -100, -140, -77, -63, 65, 96, -217, 56, 122, 13, 26, 292, 5, 203, 298, 265, 92, 35, 228, 138, 288, 215, 207, -75, 248, 109, -12, -181, 118, 118, -25, 1, 66, 174, -142, -122, -51, -65, 18, -214, -223, -150, 24, -278, -195, -344, -113, -232, -292, -163, -184, -47, 9, -171, -63, -93, -25, -81, -128, 93, 76, -79, -68, -96, 70, 89, 246, 170, 8, -147, 226, 35, -207, 73, 92, -47, 111, 9, 90, 267, 270, 225, -80, 28, 307, 112, 63, 79, 30, 118, 141, -38, 215, 173, 190, 84, 16, 276, 14, 237, -66, 84, 202, -142, 211, 126, -186, 86, -4, 232, 190, 8, -95, 42, -38, 112, -125, -64, 107, 47, -44, -1, -252, -400, -165, 237, 105, 6, -97, -208, -31, -94, 89, -235, -141, 65, -99, 147, -68, 154, 101, 262, 87, 17, -49, -350, 31, 35, 21, 34, -77, 99, 39, 76, 107, 130, 152, 36]
5696C6j33K56N3k00K36k31J32K3L5k6Lj08j5J72j32j91N9m8J19n1J0k25K56N5
5720H5j56JJ75j36n0K14k47O8J32j28l19L25m5P8m8rj11P2o2k28K76P1K10l94
5744b26q4O4M7J22j3J36o6j91M26j86j0j96L34M7j08k58K13j71M2ML83k99M4K70
5768C24j30o3q5J77j73K08j05k38K89j71K8L60l39r7R1J62J00j25j5q0M7j07j26
5791f8J9J27N4J14j84o3p2K07k88J08MP5r9p4J87j90L5j23P8K8M7j02j05K75l65
5816c75L48P7j55J7l2j57K01Q3J1j1Mj20N8J04o4P3j69K3K64k10rl4o6J98M3J10
5842B12j29k92J80M8J59k72J57j50L18j92j0J18K3N1j0k32J87k17R3m5o9J55K62
5865C45k27j30O7rj31J11O9P9l31K80k09J14o7l7J23o6j08oJ60n4K35k82K66m48
$$ y = [36, -97, 159, 212, 12, 248, 17, 149, 172, 207, 181, 184, 76, 61, 233, 101, -90, -31, -79, 40, -11, -1, -226, 30, 85, -71, -70, 105, -31, -81, 133, -114, -46, 86, -42, -361, -36, -81, -3, -51, -60, -171, -99, -161, -389, -113, -42, 168, -226, -310, -246, -199, -77, -90, 46, -20, -211, 215, 29, 19, -177, 157, 204, 96, -162, 51, -120, -78, -74, 309, 10, 54, 324, 194, 131, 46, 223, 50, 258, 153, -85, 204, 33, 61, 421, 82, -15, 76, 238, 338, 213, 198, 118, 165, 58, -68, -49, 78, 132, 246, 62, -1, -73, 134, -154, -46, -42, 33, -66, -140, 47, -143, -108, -231, -153, -125, -78, -180, -285, -10, -375, -27, 50, -105, -88, -120, -277, -76, 7, 18, 7, 11, -109, -51, 53, -11, 62, -107, -84, 180, -30, -39, -73, -139, 59, 102, 212, 83, -209, -29, 19, 178, -94, 63, -87, 231, 39, 29, 147, 170, 221, 211, -21, 166, -51, 42, -3, -72, 83, 345, 118, -12, 55, 46, -85, 26, 95, 174, -157, 123, -86, 28, -39, -76, 47, -19, -127, -133, 27, -27, 208, -74, 192, -256]
5889b56P5J31Q2l38k01R83q05r0N06l77L65L15j56n84Q44l10l78J9K08j74J71
5910C0k5l1K82k94l9J9m2L20j10q8J2J84j43r3J21l1j0n3L64m54K49J10j48N2
5934A82N4j79K16k31jk8j32J89j09J0J0o2J5K46k59Q4n5MJ0j36J24J99k52m0j17
5959b58J54J12l7K8j72J12j39K10m4J79M5j93k75K13J79k94J69j9J12r6m14K66
5981a62K56j68J69j60K6p1K01k32L66k02q1K17l3Q5lq2k32J81%l7J32k25J68O5
6005A78p8J36j16n5j1p1J78j42J39O2j24n3j8J03k27J23o0r9K31k96J14j86M05
6028A33j44j60K43o5J19l88m5N1k7K2L90k29J55k10J47j0KK6j03K0j4M8j83J56
6052f6j12J50J45k46L45j83j47M77k62k75K14N1O1l2m2J10j9j51m8K48j5K2j47
$$ y = [-256, -181, -50, 32, -306, -507, 476, -329, -419, 87, -290, 75, 390, 234, -350, 494, 184, -194, -175, 33, -141, 30, 5, -26, 256, -38, -77, -58, -100, 220, 110, 22, 34, 218, 75, -18, 103, 72, 62, 9, 373, -81, 168, 278, 130, 182, 236, 57, 273, 42, 41, 13, -119, 70, -39, -29, -19, -81, -66, 180, -79, 5, -50, -46, -36, -172, -48, 151, -101, -141, -258, -104, 8, -29, -1, -173, -61, -200, 10, -34, 145, 190, -3, -278, -65, 114, -180, -11, -30, 82, -14, -428, -162, 94, -74, 95, -65, -39, -110, 91, -141, 225, 23, -58, 159, 126, 211, 208, 126, -106, 75, 75, 38, 170, -55, 113, 178, 100, 236, 120, 65, 54, -17, 161, 19, 158, 220, 96, 43, 25, 128, -99, 24, -36, -135, 96, -200, -86, -272, 133, -11, -171, 72, 7, 126, -262, -307, -256, -283, -261, 129, -100, 55, -155, -8, -18, -16, 10, -93, -73, -87, -39, -222, -66, -178, -28, 117, -129, 216, 33, -114, 363, 101, -174, 40, 91, 152, 120, 78, 188, 169, 18, -30, 218, 203, 225, 78]
6075G8k8k2PJ87k30J70j3L0K30l18k60J92j78J35J79p8q8j68K44j44l1K18o5j20
6099g3K54j08k20o0J39K09l64L41l13K4J6J44o6M4j07K7j07J15o7K16r0n3Rm5
6123a35Q9J11k24P8p7K65j68J10J03n9k12k7K31k20lJ01J88J1k07rK81J49m75
6146i9K00K3k1k2qj2J5J73k18P6j97L74k16k6l1R2J3k39J89r1K20k33K46l50L58
6171B16l56J8K56j17r4R5k28K20j66L2J91k28L01l01J40o1j1r7L79l37r4l5J56
6194a21Q0j62L9L56m07M1n0J47OJ1j2L34l06j78M30p4j46J71n5j06J7K56j18k75
6218a22K71M5k60L19k02Q4j61r9N5J65R8K9k66pK49k27J91Q0k71M4J70p6k8o9
6242A2k11J30J89j71R5J82l00J59JJ00l03n2r9K58o1j03K41j75m7j3J72Pl03J75
$$ y = [78, 50, 28, 35, 222, -8, 162, 149, 179, 409, 91, -169, 23, -155, -20, 159, 81, -7, -175, 69, -75, -106, 112, 47, -73, 181, 73, -147, -207, -68, 141, -223, 118, -195, -171, -155, -11, -77, -33, -140, -113, -220, -105, -172, 44, -46, -99, -90, -135, -46, 65, -159, -81, -158, 107, -61, 49, 152, 93, -119, -146, 85, -135, -138, -37, 151, 162, -45, -54, 227, 376, -99, 101, 124, 103, 81, 73, 61, 76, 249, 31, 107, -90, 284, 68, 42, 11, 103, 116, -123, 66, -25, 195, -38, 208, -142, 216, -140, -122, 134, 17, -77, 18, -210, 10, -156, -124, 67, -161, 140, -161, -21, -82, -93, -190, 189, -148, -242, -277, -121, -41, -203, -164, 192, -215, -174, -224, -77, -71, -60, -72, 262, -44, -222, 208, 134, -12, 159, 104, -2, 15, 271, 153, -122, 149, 194, -66, 253, 51, 135, -26, -125, -70, 95, 193, 222, -44, -51, 198, -29, 162, 242, -29, 15, 185, 109, 81, 12, -199, -69, 120, -51, 44, 226, -74, 85, 86, 186, -117, -169, -268, -10, -71, -174, 67, -108, -155, -168, 4, 11, -292, -117]
6266a17L8n3P3j52J80m7J24j28j19J20K4j04J94j86K22k2j91J79q0q8M6J46r3
6289c4j69l3L52k60J06J54j15K3K3m8j06L20j1j47p3J2k5J07k23N02m92J55J42
6312A60k9m4j8J64r7j87J46J4j08n5J2M1mJ91J31l59N2j17R6k56NJ81N8k17K00
6337d0r1k7K7J0Q0N0k26J34k1J10Q5j56R5q1j20K18j93O8K26k09M9j86K93Oj9
6362H2j02P9O3J80m19J94j7o8K30j70j59J12K48l89P3L32l62P0Q1k6K48r5kk4
6386A59p0P2k85Q7Q1q2J67k5l12K59J39k40J83k94J75k08J58QMMN5L47m27k20
6410b65K11p0K88k41j09K06j03J64k23L9J20k11J21r2LJ61j87o7M17j29k04K73
6432A02P1k26R4p1K7J20l25L40l18K79Oj53K76j66m7Rk38M65j09k5o7j36J74j15
$$ y = [-117, -79, -132, -59, -211, -31, -78, 46, -82, -201, -81, -57, -161, 33, -153, 69, 47, -144, 35, -45, -133, -87, 59, -34, -203, -236, 116, -144, -38, 116, 1, 24, 47, -1, -107, 213, 202, 55, -18, -6, -31, 76, -147, 355, -137, 18, 160, 131, 87, 69, 233, 136, -51, 95, 109, 1, -54, -42, -1, -5, 186, 317, -42, 10, -107, -11, -267, -262, -81, -23, -240, -40, -131, -158, -131, -121, -41, 9, -217, -83, -104, 6, 91, -65, 30, -51, -171, 47, -146, -78, 148, -61, -12, -198, 95, 101, 82, -20, 59, 122, 302, -117, 77, 60, -8, 222, 52, -107, 5, 253, -136, -63, 269, -93, -23, 58, 32, 280, 185, 183, 159, 89, 161, -124, -37, 44, -38, 129, 104, -208, 51, 190, -50, 133, -161, 14, -194, -36, -28, -24, -20, 35, 382, -45, -265, -54, -124, 164, -77, -186, 20, -83, 81, -142, -103, 17, -194, -73, -165, -162, -1, -188, -255, 162, 33, -171, 102, 173, -53, 41, -30, -3, 117, -208, 132, -186, 93, 99, -54, 222, 56, 9, 18, -220, 245, 136, 111, 44, -92, 82, -33]
6456c3J15k62K19p6K7K70l15O9L22k09k7n2j97K6k6J49mO4j43j30Q8J81KN2l59
6481b49K85j46N9M3r6J08R0l12mO3Q6J14j66N6J27J13n8m45K95j48J71k13M8K86
6505A07k29J42M8j13O3J73mp8L8k90J91j47K14j14M54j75k36J16j14O5R5k14J61
6528A53j27J21L3J33L4l90J31j75M4n9K59J3j62j46L09j70K7O2j97J13j84QJ0
6551a60J0K04r2j47N3J47j05o4N2J63J7M3m76L55M2l04M47j39j22J57k02R1j54
6574a84L20j1q7n9L5k07k1L15k5j27J29j9m5M3J82j46K9j56M1J2J95j50P8k25
6598h3O0j36K52N3j12l3j30K15j8K4j86R7O3J33k21P7J87m52L20k42K43j00O5
6621G6j04j09r7L33k17j58K37r5J80k91J51J29O1J40j61l06R3j59K33K46k46l1
$$ y = [-33, 82, -180, 39, -37, -10, 260, -55, 14, 336, 127, 100, 48, -149, -123, -149, 0, -4, 60, -83, -213, -125, 56, 58, 110, -249, 36, -110, -51, -8, -104, 4, 94, -218, -222, -159, -73, 41, -125, -69, 58, 171, 113, -332, -37, -185, -14, -227, -179, 107, -122, 20, 68, -45, 18, 191, 187, 109, 147, -143, 48, -99, 115, 1, 455, 280, 44, 160, 46, 111, 206, -8, 153, 26, 147, 180, 313, 347, -43, 88, -87, -43, -102, 157, 170, 8, -138, 171, 1, 28, 90, -107, 6, -178, -170, -160, -150, 54, -38, -185, -132, 15, -90, -154, -102, 61, 78, 121, -355, 0, 42, -262, 185, 46, -76, 81, -121, -30, -184, 136, 125, 38, -21, 14, -193, -214, 101, 76, -51, 78, 59, 14, 57, 239, 93, 122, -34, 7, 19, 214, 64, 142, -83, -23, -159, 93, 146, 34, 1, -129, 86, 68, 92, -94, 3, 66, 199, -22, 55, 242, -210, 110, -132, 111, 11, 76, -28, -137, -234, 99, -118, -276, -39, -134, 46, -245, -94, 35, 96, 236, 75, -231, -138, -297, -64, 182, -64, -95]
6643i5R5j90K03j8Q2j56O7j93J36J66O2l82M29l18J36O5k98Q7K53J45m37N7J96
6666I2J43j25Q9l61J55K82m72m3L56j9j54j42K82R5j39j46Q3P3M2K06p1j40k03
6689a17P7L52l59N0J27k10J49m4j57J74k50J42P0P5j24j17K27J7j68J28j28J3
6711g3Nk69K41M0j6q8K17k54J70J53j38j26qkK55l67L34k89k6K84N7l86K18M5
6735b3m9J44r3L00o4j32J45l38J26K07p2j78q1J39Q8p9K10j82J27j39n9J44J24
6758B65j63mj52j04N0K09J13k18j07J34j54K54k83J28N4J6r2L2r7M0k18J21O4
6781a12l4Q5k08K14oj26k5L2p7K1j5J77q2J19j70K95l17K71j00K3p0J37j07k9
6805a04MK7l1oM8j11J27J17J19r3J84j53j92k7M07K9m09N4n6J26O5J94l18J68
$$ y = [-95, 0, -190, 13, -5, 77, -79, -12, -205, -69, 97, 159, -223, 206, -112, 24, 89, -209, -122, 131, 276, -161, -104, 92, 235, 110, 199, -162, -7, 275, -197, -240, 116, 97, -57, -199, 83, 178, 39, -107, -24, 49, 91, 297, 226, 86, -117, -40, 312, -47, 3, 130, -80, 69, 25, -132, 42, -208, -66, 4, 79, -45, -162, 65, 82, -86, 42, -86, -73, -68, -337, -96, -56, -72, -160, 57, -197, -27, 126, -12, -138, -146, -148, 107, -260, 74, -215, -241, 43, 100, -286, -68, -23, -72, 72, -21, 279, 215, 83, 228, -110, 16, 223, 151, -27, -108, 31, 119, 40, 250, 68, 195, 56, -3, 141, 265, 102, 98, -54, -158, -108, 101, 214, -4, -111, 23, -131, 123, -160, -32, 22, 38, -54, -22, -119, -79, -297, -176, -112, -146, -61, -269, -55, -61, -187, -212, -180, -257, -236, -251, -74, -156, -37, -207, 88, -229, 42, -58, -35, -105, 32, -75, -104, -100, -73, -104, -110, -62, -173, -46, 71, 190, 97, 281, 128, -64, -91, 316, 345, -64, -10, -66, 60, 125, 319, 1, 169]
6829A69j82P8k6R6J1j09J34r1Q4kk9k84K92j27K79j39j3l93L24Pj37Q6k9j55J59
6854Ck02j4J6Q8o1K28k66k8J61O0j53J99j02P1j90pJ11J36M0q2O4J1j67J16j70
6879a38K23p5j34P0N6J37j92J43r2K56k39R1J72j64J4J5O4o7j51K20j71P9J1j54
6903b6J14j22M3K17k4o6j05mQ0j13K3r4K66m16J92K53k15O5P6q9j41O3j59J8K09
6928D5J43l83kL32j31M7L4J0j19m3k9J65k16%j27K07j88J29K76l59o8J92K55j01
6952F9n4L19l15J71j41j27J32k51L15k62j39J34L95j14l01K33o6J98K7m85J49
6973a13J63K16pj05J46k99J35l08K76q3P2j46R8J04k2j61N9L56l06j87K34q8J50
6996A84l63J80R1n7J78k35j02N1m5L3J42k9k15OK67l63K4J09Q9M1j25N6O5J0%
$$ y = [169, -13, 65, 39, 135, 146, 37, 171, 80, 164, 162, 133, -151, 141, 14, 293, 154, 141, -252, 72, 79, -58, 28, -1, -156, 3, -199, -213, -197, -109, -170, 58, -208, -236, -75, -15, -168, 31, -71, 0, -190, -197, -86, 50, 90, 8, 72, 83, -84, 32, -138, 85, 10, -124, -54, 2, 139, -53, 90, -2, 254, 15, 106, 278, 114, 128, 143, 207, 140, -11, 209, 38, 117, 128, -26, 88, -34, 9, 226, 202, 136, 31, 27, 107, -6, 17, -77, 189, -227, -35, 218, 3, 68, 144, 55, -86, -23, -182, -164, 45, 188, -195, -197, 135, 4, 51, 85, 95, -24, -67, -96, 69, -147, -147, -274, -67, -255, -126, 150, -209, -277, -85, 170, 69, 15, 334, 19, 190, 49, -78, 54, -197, 118, -144, -283, -149, 246, 132, -169, 64, -2, 196, 223, -262, -113, 50, 266, 259, 154, 300, 1, 136, -172, 104, 21, 93, -53, 45, 149, 127, -34, 25, 381, 75, -112, 122, 34, 184, -179, 1, 92, 35, 213, -22, -124, -73, -118, -85, 57, 28, -187, -181, 86, -277, -253, -144, -55, -14, -139, -83, -18, -8, -8]
7021hp7L26k19j09lJ59J26k00j61J62j05L8N7O4rJ39p9j95J84N0j68L2j07J95
7045I2p5J05on1RO4j15J56m85K96K69k69K88l52Q4P2P5j26K1Q3m5q7J74k76k08
7070c07J16K39j01J11j41J67j35K4L2J43M0n41L20J46m45L64k34J00%O1L2K6N9
7093G6k10l2J41J02o3j32J15J5P8k4L4j46K05J6j03O0l9o4j05n5K96l6L7k25J57
7118I8nj70K78k11p9L67l07K00r2k08J75l6K59k49J14P0l0k67K39k3j07k6l8J33
7142H5k00L9J04k3N0J16n2K5j96J47o5n15N51k08l4j45K13M2J82k56J46J3o4n4
7166i9l8J99q9q7lR5j11R8R9J3p2p8J44j34J34K8j52j07J85R6j38j51J31J09r6
7191b4J01M9n8Q8j2l9p4K55r5j18J21j42J1M6O7l91K67O7jj04N6l25O0K69J9K1
$$ y = [-8, -85, 241, 22, -87, -90, 69, 195, -5, -166, -4, -109, -71, -14, 50, 41, 180, 101, -94, 90, 140, -28, 4, -103, 92, 17, 122, 116, 65, 74, 138, 23, 179, -306, -10, 259, -10, 278, -74, 10, 82, 157, 31, 52, 135, 90, 3, 177, -99, -307, -191, 48, -53, 58, -83, 84, -51, -27, 5, 148, 188, -353, -33, 113, -332, 32, -202, -102, -102, -41, -9, 17, 76, -134, -166, -25, 77, 14, -118, -3, 12, 90, 66, 100, -46, 159, 175, 72, 132, 93, 29, -76, -131, 165, 129, 166, -59, 98, 93, -77, 201, -10, -89, 278, -29, 171, 79, -129, 46, 10, 269, 20, 134, 204, 174, -93, 146, 123, 16, -10, -48, 85, -115, -76, 28, 5, 55, 171, 119, 144, -52, 95, 30, -485, 66, -142, -176, -321, -108, -66, 116, -140, 6, 19, -45, -99, -137, 62, -27, -114, -117, -22, -133, -35, 64, 77, 5, -73, 71, -63, 71, 99, -53, -160, 25, 121, -17, -168, -37, 72, -24, 77, 126, 68, 156, 144, 105, 31, 286, 191, 73, 194, 52, 63, 109, 176, -215, 52, 119, 118, 14, 70, -255, -195, 74, 93, 114]
7217A14j64o5Q3J09k67J1P4P6J79j21k07k0K58O2k92N7J69j67J62k21J00R0j54
7240a34N9m32K32L0L15j89m1n7N3J95m2J82k65P1J36k45m8K3J81Q8J3j91J95j08
7264B1J61k55J39k33K92j32N4o0K9l1Q5J08Q2k76J92m6J96k97l2J01PN1k98K09
7288F7o0M8j09O3Q7j13j2K3k3K00m95M86j67l2J30J1k21J23R8j70L6j54J80kk24
7313b30K84j55j18k7L9K64j48MQ6j41R6l9K41l69P9J26q3J08q9J64l0O6k03J6
7337e9J55k6m2K19k20j20K90k97M23k33j52L14j78K47k35j71J99k15o8J46N4l
7359B8j75K27K65m02K31l9k27j03K91ok3J42j43J6P1K4k47J16l6k12K80j63Rk9
7383a05n4J10k34N5J44j18K18J54p7m6l65M71O9k43l0K66m29J87j61M07k19j06
$$ y = [114, -50, -115, -32, 77, -190, -179, -105, -29, 150, 29, -178, -198, 60, 122, -170, -113, 56, -111, 51, -170, -70, 20, -134, -75, -507, -275, -245, 70, -119, -160, -217, -164, 31, -11, 171, -94, -23, 113, -132, -180, -157, 24, 112, 125, -66, 129, 21, 182, -73, 66, -167, 125, -7, 47, -13, 16, -15, 70, 178, 260, -16, 176, 130, 326, 29, -3, 98, 105, 156, -142, 67, 7, 55, -54, 9, 96, -17, -29, -6, -29, 171, -324, 162, -5, -37, 93, 104, -117, 6, 104, -66, -30, -184, -4, -6, -230, 54, -101, -219, -246, -207, 57, -91, -87, -1, -142, -46, -85, 156, -213, -134, -8, -91, 17, -72, 92, 62, 128, -75, -59, 96, 70, 28, 247, 27, -93, 197, -100, 323, 90, -62, 252, 74, 321, 86, -85, 114, -101, -169, -23, 31, 28, -147, 80, 345, -57, 174, 135, -92, -195, 96, 90, 67, 209, 66, 82, 153, 177, -70, 46, 10, -202, 78, -85, -76, -105, -159, -49, -283, -228, -84, -202, 16, 170, 93, 47, -318, 153, 222, -21, -51, 215, -214, -27, -188, 219, 0, -106]
7405a06L02r2j29j89L6K05j22N0J11l32J70j05J01KK21k10J05N8j25K10q3k08
7427a30J02K77l2k20J89k18K1J94o9k11J79J25j60J10m6r2j83K36K47m57O9J91
7449A22J55m39K82n1nn9l24K97ok40L64l32K5oK80O5l88L14k39K24n0p2J3j62
7473b32J70J63N9l05MK30j50n8J61l04N7K69J6p2j89L00l21L23l28QJ73J39j87
7496g4L56k84L6J08l8j39Q2K3p4N7Rj53J52P3j56L8p1J84R5k06Q7m27J98J11J8
7521En7J72n3r3K16o6j71l6j5o9L3k8r3M33m3l94J81K08k61O2j63L39l86J56n1
7546a74J13j5N0j16K57k5kk73R2K30k12K69k11K74o8l42K84o1p9o4K65k79J82
7569I5j54J21J36j86M1j36J34r3j37K08j74L32k69K33j52J36j40r6M1K27j48J7
$$ y = [-106, 196, 104, -25, -214, -178, 27, -95, -45, 66, -266, -96, -201, -100, -98, 123, -87, 18, 76, -49, 161, 78, -130, -28, 249, 217, -3, 186, -32, -11, 183, 114, -97, 82, 207, 47, 157, 111, 19, -164, 72, 319, -138, -69, 122, 277, -162, 120, 69, 64, 5, -319, -22, -28, -268, 96, -236, -211, -217, 63, 128, -260, 54, -185, 39, -11, -83, -70, -232, -62, 101, 160, -145, -141, 89, -61, -119, 42, -262, -205, 64, 80, 8, -181, 119, -202, 121, -207, -199, -26, 113, -74, 282, -2, 34, 142, 104, -35, 47, 70, -4, 53, 62, -91, 61, 134, -22, 16, -55, 129, 224, 18, 105, -322, -124, -13, 5, -52, 120, 67, -26, 190, 124, -47, -83, -98, -167, -134, -162, -255, 178, 135, -259, -78, 130, -131, -69, -232, 107, -279, -123, -174, -61, -76, -26, -142, 115, 90, 88, -185, -93, 137, -75, 194, -17, 257, 189, -153, 131, 70, -9, -73, 192, -87, 95, -59, 62, 198, 12, 53, -83, 51, -42, -179, 29, -145, 187, -82, 151, -1, 135, -5, -101, -60, 167, 19, 36]
7591C6r0N9J64j58Q6j46j38L14j46QL8P3l45L80k13m4K81k52L1j2K54l89Q4kJ1
7616a16j42J64J88k26K28k62K4Q6qj0k25L82o8j92M39o20J36K90j91K6R4N5n5
7639cQJ20j36Q2J33j15J47k8j27k64K50R0l1Q1k22K49J8j73L4k71O7J00J45n6
7663I8rr4K7O9n04L06O2M3Q4k52r3J13J24R7k85K16J09mq0k85M0J44k9l0K81j66
7689a8o7p3L7K22j02k16P8K67j52k02N45j15j52rJ39j78o1j62O9J5l9L1kJ14m1
7714g2R2L5N9j44J90l8Q6j3k80L09j04j27m9J08r6r8J71j64J93K03l66J24l1J16
7738A04K9j24j02L8j13Q3K27n7j81M4r9j09J48k8J81j87J72o9J23k12j05RM20
7761A92k77N1m3n7J53k75L33n6L7P6j81N6q1J84k46J02k8J50k11j8K98k04L2j01
$$ y = [36, -54, 5, 169, 11, 97, -49, -187, 127, -19, -11, 27, 100, -245, 135, -78, -122, 159, -93, -62, -74, 180, -209, -125, -127, -116, -258, -94, 94, -132, 96, -166, -142, -56, -64, -74, -299, 83, 15, -177, 262, -358, -222, 68, -123, -97, -3, 52, -3, 5, 125, -11, 71, 204, 89, 236, 208, 81, -183, 67, 157, 126, 207, -15, 234, 252, 79, 113, -158, -91, 9, 154, 98, 89, -5, 22, 91, -413, -107, -45, -2, 82, -170, -263, -150, -26, 71, -214, 2, 111, 107, 27, -258, -218, -74, -103, -133, 148, -18, -85, -158, -121, 101, -1, -217, -139, 128, -24, -226, 319, 204, 52, 43, 182, 4, -57, -219, -150, -135, -174, -143, -145, -31, -72, 20, 55, 114, -30, 160, 122, 208, 195, -85, 224, 120, -7, -56, 52, -44, -142, 29, -135, 58, 261, -105, 19, -12, 104, 133, 9, -93, -55, -168, -85, 142, 85, -96, -52, -151, -260, -112, -140, 41, -146, 26, -43, 80, -132, -237, -228, 192, -85, -34, -77, -134, 19, -256, 77, 21, 58, 134, -47, 9, -72, 112, -134, -32, -60, 90, -121, -139, 159, -45, -13, -114]
7785a14J46O4J6j1j12L8j09L07p9K5j21n0L7j23p9L15Om85K09J46J79l3j37j00
7809f5K04O1k04j39J95q6K74k25k94J43L04k28j18p1k2K37L02n33J83J88j97k2
7831a13K02j91J94J26l7k28K1J46j41K45l57J75J00j89J02J03j38j5q9m9K15k48
7853a66J41Ql2J39J06m3k07L96l53o8K35j70j00J77N1J3k36J58J44k32J94j26
7875B9L93l46k70M75k08p2PJ44k58K4J57k7r0K07k42M1m2L06k49n5J70qO3k18
7899f9J09j16j5j29K74k74o1K09r2J07R3P8m44O4L38k15J3J10J54l51J00K18l7
7922F4l41Q4J80O8J0q1J5J04k8p6L7K1m7J68j61J23k01K01p1PL6k23J01j63K83
7947A10l25L61k29K10k38Q7M9n9J55j75k3K45R9l64K40N8j38j80R4J27n2M6o5
$$ y = [-114, 32, 96, 112, 101, -11, 27, -82, 225, 146, 171, 50, 0, 37, -86, -165, 150, 156, -329, -120, 26, 205, 172, 35, -65, 139, 200, -4, -143, 52, -34, 240, 15, -279, -136, 168, -60, -178, -249, -271, -34, 268, -265, -82, 106, -91, -113, 89, -102, 92, 218, 181, -47, -26, 120, -21, 224, -133, 42, 142, -47, 55, 158, 20, 5, -84, -133, 82, -166, -25, -17, -49, 90, 196, 153, -54, 342, -11, -79, 156, -14, -114, 63, 114, 127, -109, 49, 193, -39, 155, 29, 422, 76, -194, 281, 73, 1, 8, 152, -106, -82, 75, 48, -42, 165, -77, -36, -78, 228, -21, -76, 94, 86, 149, -69, 40, -76, -91, -220, 54, -220, -281, -72, -164, -57, 36, 114, -330, -266, 72, -143, -130, -20, 134, -217, -117, 101, 64, -277, -193, -13, 55, 65, -16, -1, 103, 75, -1, 36, 57, 10, 178, 17, 140, -61, 140, 69, 76, 112, -111, -10, -173, 110, -215, 146, -83, 127, -111, -24, 25, -34, 121, -54, -77, 168, 267, -97, 143, 201, 63, -117, -23, 104, 52, 98, 33]
7970C3k68K69l19P7L87r1r1j14K15j45J58j97J41j05k88K98j62K46m01P70o15
7991b02O26m36pl60O74k31l26O2p31P87M15k88l71R53o33J73RN82n66J51l91L60
8013B50k10R30n99k94J01k48L43l65O0Q7p6J09j30K26j50o2P9k80L58k01r4K35
8035F9q8L9nP7PJ01j82l69N10m02K00j31J96J55j03O4k80R1m2l8J19r3j19J6Q0
8060a28L23k33n3J09J12l08M1k9J54M4R3l99K50r5q0K68Q7l50o4L11J5j7k89M4
8084a94M55l00o3K16j23J05Mj0P4j56J30j67K12o1j90N1Q5o9J20j00N4j74J75
8107G4j71J22j7P8N8R7k10J05Lj04j54O0J08j19J52o2n4J32l15K33k78P0L2J93
8131C3M1j13k7j06L3L06k90j35L73j64LK8K5J50l13N3m1J05L8j81oJ57j0n4L01
$$ y = [33, -235, 34, -285, -208, 179, 88, -3, -117, 98, -47, 111, -86, 55, -50, -338, -40, -202, 44, -357, 413, -202, 424, -12, -19, -379, 295, 64, -262, -200, -931, -144, 271, -17, -388, 565, -68, 105, 114, 696, 130, 281, -110, 250, 40, 970, 371, 77, 178, -70, 273, -92, -32, 55, -21, 88, -42, 184, 34, -28, 51, -229, 129, -72, -166, 69, -19, 20, 15, 92, 99, 200, 18, -351, 159, -243, -43, -174, 22, 177, 74, 138, -142, -51, -93, -131, -12, -105, -224, -208, -128, 195, -38, -91, 18, 130, -178, -137, -166, -12, 32, 125, -274, -24, -119, -199, 69, 156, -194, -258, 53, 68, 51, -238, -194, 261, -39, -102, 114, -9, 96, 100, 90, 164, 8, 138, -29, 183, 122, -68, -17, 68, -1, 119, 19, 73, -101, 74, -97, 25, 8, 86, 144, 241, 31, 136, 139, 35, -119, -59, 49, -70, 82, 20, -34, 98, -217, 16, -262, -192, -160, 33, 74, -39, -66, -172, -139, 167, -123, -258, 115, -49, -46, -18, 7, 157, -156, -103, -144, -39, -1, -182, -188, -31, -41, -95, 206]
8156B06l26L60n3Jj66m1K15p1Q6K9k12j03K76q4P6Or1j80p7N6K98j95O2N4J00
8181B26j85J1K0L4M7j31%o6J15k24
$$ y = [206, -120, 240, 187, 188, 22, -19, 196, 125, 211, 240, 28, -75, 201, 117, 193, 199, 108, -72, -149, -93, 205, 10, 72, 126, 226, 41, 52, 72, 106, 153, 22, 22, -44, 71, -153]
8191a53
$$ Imaginary data points
##PAGE= N=2
##DATA TABLE= (X++(I..I)), XYDATA
0@%%%%%%%%%%%Qj6J6k0K8l2M0m9N7p2Q8j04J25j49J76k08K40k75L16l63M16m74
33b52N38o10O89p77Q73r77J092j218J357j509J672j850K048k263K499k755L035
50A592l345L683m057M471m932N449o032O694p453Q335r372J0612j2129J4035j6509
65h958J9872k4739L2505m7463J27324l03603J90349K95392m73175K33647J78381
76B19532l46955J26078J78508k95733O8774J68140j37566k0273J04859q6269m7096
87f8001O5517J3940n9751M1887M1951j14792l216J41030j20339n3125J94031j08460
99b9328j21167K09475r7615j35913K54679p9189j85365K48564p1360j86586K51229
110E7424n0853j69451K13764n5284j34305J63747m5751p6466J17467l2229m4525
$$ y = [0, 0, 0, 0, 0, 0, 0, 0, 0, 0, 0, 0, 8, -8, 8, -12, 16, -16, 24, -25, 32, -40, 48, -56, 69, -80, 96, -112, 128, -147, 169, -194, 222, -252, 286, -324, 365, -412, 461, -516, 576, -642, 715, -794, 878, -972, 1076, -1187, 1312, -1443, 1592, -1753, 1930, -2127, 2344, -2588, 2861, -3171, 3523, -3930, 4405, -4967, 5645, -6484, 7551, -8958, 10914, -13825, 18680, -28783, 98541, -205062, -14713, 280679, -192496, 41151, 219532, -127423, -1345, 177163, -118570, -49796, 118344, -19222, -39495, 65364, -20905, -68001, -2484, 11456, -48295, -6408, 35543, -79249, -82465, 58565, -61774, -114899, 79132, -29328, -150495, 58980, -38635, -174548, 80131, 942, -184423, 64141, -7219, -193805, 57424, 6571, -162880, 50884, -4400, -138705, 25042, -20709, -97175, 20292, -11937, -56462]
121e6462L8453j2984J3266p759P34M5359n8885J90P6562p9586K013R9020r4697
134c4776l149J09550j07837j6345J26128q6456k4007J07084q9775j9109J10433
145G1741q3157k0809R9758p2732j3296P4247p1454Q215N9198o1748K3347K2411
157C5721n4782M2025k492l2354N3041l5463j6304N7559n5369j006N7003n8513
169a0934J2650M5760o4955J5560M0374n2372J9895K9956m7095J7018J9713l6336
181a0766J8689J4230k8334J9488N328k8161J9516K864j8528K5082q831j9268K9807
194B1116j8094j2511L5715k6620m241L5057l9521L385L3720m0792J4535K5642
206B7391m1484J7955J3602l4108K4502N787k5922K1871m279j7447J9161p446q784
$$ y = [-56462, -18009, -30993, -17727, -25486, -24752, 20607, -38278, -38088, 38474, -41112, -39099, 59921, -34776, -37925, 71625, -36212, -52557, 73571, -12885, -36892, 70192, -19583, -38692, 71741, -11416, -32225, 67533, -5199, -18495, 55752, -15702, -7487, 51711, -10037, 13310, 35721, -19061, 22964, 20472, -11882, 41159, 5696, -10608, 46951, -8418, -9424, 47579, -10934, 1716, 47476, -17479, -1919, 38455, -13917, 5978, 35934, -11161, 5857, 25570, -10766, 7923, 22153, -6181, 13307, 18635, -9526, 9990, 12854, -5674, 19408, 10577, -8691, 21116, 3022, -9489, 26226, -394, -4635, 30422, -9099, -5714, 28006, -12786, 1749, 27391, -14093, 3862, 17464, -16644, 7858, 13645, -12277, 9594, 5315, -12132, 7029, -417, -9201]
219i201J6733q348q043R769o544l532R805n011n056P401m705n725P839l707l154
234a1479R356q099l396Q896j0157M105P156j1969Q568J015j3956J4912l559r771
248a8378J9404j0693q501J9618j3794m474J9800j2046l453J5247j0972m529J3815
261A044l548o766J0967J071j1915Q814O064j4325J0781Q694j7412Q649Q974j5632
275d540P884Q337j0945M185M599n057j165L631M032p376Q39J1469j4159n83J7104
290A8255j6933o63J9860j9729l070K1103j6662n391K0005j2261j0254J8944p362
303E842j4838J9500j635j9977J8571J856k2394J8273L661k1642J5918L984j8870
316a1751J1675M206j1995N567L618m610k718M208K974j0257N580R890j8140O210
$$ y = [-9201, 7532, -816, -8859, 910, -5634, -9166, 639, -4372, -9428, -2027, -6732, -12457, -4618, -8325, -11479, -2123, -10222, -13618, -4722, -14879, -10774, -3618, -15587, -7019, -6004, -19960, -5048, -8607, -18378, 1026, -9667, -18168, 1450, -12344, -16818, 2982, -9064, -12517, 2730, -8242, -12771, 1044, -2504, -9270, 1697, 2768, -9147, -333, 5731, -8594, 2187, 10881, -6531, 2118, 11092, -4540, 3344, 11681, 736, 4921, 9520, 4463, 3298, 6929, 10961, 3585, 4424, 15893, 1734, 1151, 18255, 1322, 659, 20519, 790, -2280, 18823, 2161, -3230, 16775, 4514, -5740, 13204, 5842, -8996, 10504, 8869, -11108, 7463, 9319, -13075, 5198, 8859, -12783, 3135, 7119, -11751, -76, 4130, -7865, -2298, 1320, -3290, -6008, -1800, 1174, -9083, -3503, 6387, -11753, -5543]
330e543J4832k2458P504J7853k4615O213J8590k3100L578K0032k0367k21K0276
343A2574j6226n637K0850j1769r024K0743q882j1940J9431o496j1374J7199m896
356D553r164J1362k535n006L723K61n1l047L373K033j0308Q222M793j6711J1860
371C358N918j9703J3914M543k0087J4810M816j9449J3373M715j7422R629N832
384D247j3698O049O746j2009K860Q403j0516M34R896r264M4P219p707J480N023
399g93m780J939J75o32K056l722M110J476p347Q563r1r684J2094j698r308J3537
415E895m150q460J3447m901n898J1601n020l751P828l831j843N101j798j506K654
430E368p2k496J918J578l022K015M73k886K805p61k007K841k403K73J813n194
$$ y = [-5543, 9289, -13169, -5665, 12188, -12427, -6214, 12376, -10724, -7146, 12886, -7481, -7702, 12574, -3652, -9289, 11561, -208, -9232, 11511, 2629, -9311, 10120, 3624, -7750, 9449, 4553, -4611, 6751, 4216, -790, 2933, 3194, 3143, 96, 3469, 5502, -4806, 3416, 8209, -8502, 3358, 9276, -10427, 3487, 8030, -12057, 2753, 7569, -11880, 1493, 6208, -11214, -1585, 4247, -9451, -3402, 3344, -8665, -5805, 2598, -7918, -7484, 2412, -6852, -6808, 411, -7296, -5816, -793, -5573, -3634, -3459, -4091, -2035, -5757, -1647, -171, -7518, 1045, 954, -8730, 3364, 1666, -7642, 5895, 1745, -6715, 6732, 1831, -4067, 7534, 2514, -1237, 6591, 2760, 917, 6018, 4220, 2714, 5368, 5296, 2800, 4718, 6296, 3274, 5289, 5762, 2876, 5681, 4920, 2913, 5754, 3351, 3624, 5437, 243]
446B43L818K22n735P240l139m620P727n690l277P552n243j772O149p707J952M366
462B086o111J631J739l979L123j632q17K196k304L34J221k476J751N43j363K24
478c834K4N57o79M93R14j655K368N51l358M977j563l845O271k585k039N574l868
495a697k06L847k578J305J493k769L385j972m91L612l346P50L161m108K096J606
511D088m208L558k91k865L165j014j892K125p46l90n33J008m62k153K725j057
527A058k978M288k480k487M881l288j356L911m101R11J740l284J908j68q14J023
543a236k008J220O74k790L333j215k753M874k050k002M460k572j256L926k595
558a990L64J667j288O71K20O19k11j164L373j462j127L632k387o72L954l167N89
$$ y = [243, 4061, 4283, -1452, 5788, 2649, -1971, 5756, 66, -3211, 4341, -902, -2674, 3475, -4232, -2280, 2086, -4025, -2394, -655, -4634, -1511, -3143, -3960, -1764, -4068, -3734, -2513, -4989, -3238, -2695, -4058, -3834, -3810, -3253, -3932, -3439, -2525, -4180, -1812, -1261, -4619, 358, -1205, -5050, 1221, -1364, -3403, 2171, -1697, -1903, 1944, -634, 671, 2164, -605, 2780, 808, 317, 3929, 583, 1333, 4494, 386, 2482, 4088, -120, 3438, 3147, 282, 3447, 2433, 541, 2666, 1920, 1530, 997, 2005, 1543, -610, 2115, 1058, -1920, 2368, -112, -2599, 2282, -1006, -2362, 1549, -2552, -1641, 99, -3185, -1277, -1445, -2259, -1236, -3244, -2024, -1350, -4140, -807, -2022, -4775, 99, -1951, -3953, 507, -2065, -3321, 605, -1990, -1626, 41, -1247, -576, -356, 263, 52, -1112, 2261, 799, -328, 3304, 917, 245, 4199, 1032, 1621]
575A621K737l210J883Q75j919J533m09R1N06j613K009j020j645L340k197j206
591A376L279k916m85K456l174O72J492k296O09j22j128O58r78P22o23j543K218
608B17k018j040K453k719L14J987l217J158J067k401J401k61q85J385j169K68
624c460L92j125J833j356M7K101k317O76K182k277J423Q61j937K130J65j237J597
641c02j60L56L78p59J582m08l66K251j822L14J993k298J484J007k068J882j06
658B958j173J812j235K84N47r37J112q84n26J537j781L74J121k077Q14M40j934
675D52J484m40j165J125j291k10M48r49P62o67j233J657j414J11O41j671O49J039
693f72j821R13Q7j422J618q95j13Q82j149P45L7q24J806j287M74O37j195J198
$$ y = [1621, 4358, 1148, 3031, 3906, 1987, 3520, 3111, 3202, 3708, 2095, 4104, 3084, 1439, 4779, 2582, 1376, 4655, 1739, 1254, 3710, 536, 1208, 2700, 404, 1013, 891, -237, 421, -557, 165, -458, -2001, 217, -1801, -2841, -388, -3107, -2793, -806, -4023, -2865, -1798, -4199, -2798, -3059, -3944, -2559, -3728, -3460, -3068, -4193, -2360, -3716, -3669, -1568, -3885, -3209, -1027, -3304, -1881, -1020, -2957, -827, -662, -1899, -302, -462, -106, 272, -487, 1095, 687, 321, 2572, 750, 1064, 3057, 759, 2243, 3250, 1182, 3064, 2958, 1785, 3597, 2362, 2646, 3193, 2256, 3368, 2484, 1958, 3495, 1714, 2088, 3209, 1132, 1946, 2386, 452, 1936, 1496, 331, 1456, 165, -45, 403, -546, 216, -451, -1684, -27, -1441, -1330, -689, -2360, -1711, -672, -2493, -1580, -1493, -2915, -1297, -2192, -2305, -1423, -2572, -1827, -1790, -2614, -808, -2095, -1621, -984, -2179, -981]
711i81O57j554J847j01r57J499o28M93P26p69O86K67o80J051l70jJ296j361O25
730A745P69j144R59k69o26J054o82k01P19j060O43R8j122J166r45o89J447j272
748E90l9Q36j814Q21oj230R60q44k91P78j081K95Jj020R70p33n64Q57r58J53Q73
769a446j366O84k9K6J52m96L28L50n80R52j93p78J649j102j92J985j359M69J044
788I8j525J389N01j366J632k71k88J212q20M59Q17j038J102J40p88J398j184L17
806A785J292j172J16Q58j032M36K22m48j15JL0k09k41N17j270O62N47j725P30
825I84M21j714J084j49j649J692q05j076J046q96k03N69j477J193p6j350J409
842i97p69o40J292j674N10J440k004P89N18j315J107M26r40R30J00n41K12M35
$$ y = [-981, -324, -1878, -31, -132, -1089, 410, -218, 275, 1001, 232, 918, 1185, 505, 1556, 1186, 1185, 2481, 1120, 1745, 2514, 1370, 2329, 2060, 1434, 2488, 1806, 1605, 2324, 1264, 1907, 2005, 883, 2049, 1104, 415, 1862, 590, 551, 1387, -427, 394, 388, -842, 118, -726, -1017, -239, -1320, -1025, -1024, -2044, -1074, -1807, -2371, -1514, -2472, -2319, -1446, -2812, -2128, -2157, -2131, -1979, -2475, -2147, -1797, -2377, -1425, -1618, -2396, -747, -1849, -2041, -56, -1415, -946, 98, -1427, -38, 463, -903, 729, 458, 170, 1382, 562, 1021, 1838, 800, 1902, 2042, 1254, 2652, 1468, 1785, 3077, 1905, 2021, 2879, 1847, 2283, 2505, 2057, 1942, 1943, 1973, 1764, 1523, 2040, 770, 1432, 1979, 254, 984, 1405, -309, 775, 626, -1023, 669, -136, -1212, -166, -1062, -1265, -696, -2173, -980, -1056, -2406, -997, -1766, -2406, -1114, -2788, -2278, -838, -2842, -2053, -1535, -2850, -1743, -1317, -2257, -1327, -1227, -1768, -1556, -1121]
860a121K05n2N02k0m44J131k26n27J308m26l13J304r33L99P90r52J001j7o81J130
880B058n99j73J296j361M51J008j790J347Q3j718J919p66j303J831j018p44J217
897A738p29m46M81n71m50K53Q2o01j33L56o82l14N67q75L39O2r08Q27m18n85N83
918a424l08l03N58j061P93O23j395J354k20j148J959j101n64J956j198j61J568
935g2j432P81Q03j487J372L39o91Q33J44m7L69l25K97J00J62J86k20L27M86o15
955A310N37J17n1M6k74J65K30n83L89K05p57P08o61L9P04j366O1Q35j274N78J20
976A078j488J314m80j233J156r68M1O42j255L62K94j162O88l18k40N85o53j7L22
995a332p76N18o2k14J78j08l30O84k60J94M2j86N57j08J32L57k53K48L19j91N73
$$ y = [-1121, -916, -968, -466, -486, -930, 201, -25, -552, 756, 330, 17, 1321, 388, 787, 1577, 625, 1626, 1609, 928, 2058, 1459, 1286, 2582, 1221, 1672, 2680, 890, 2237, 2320, 602, 2521, 1755, 452, 2283, 1265, 521, 1738, 1009, 563, 1044, 473, 23, 276, 358, -243, -376, -20, -702, -1016, -449, -1324, -985, -923, -1831, -1004, -1422, -2007, -1424, -1732, -2035, -1477, -2538, -1745, -1122, -2517, -1163, -1383, -2531, -572, -1673, -2237, -281, -1479, -1640, -72, -1504, -723, 80, -1407, -35, 304, -387, 446, 590, 543, 912, 587, 884, 984, 1146, 1332, 1112, 1439, 1925, 1310, 1847, 1964, 1913, 1959, 1685, 1850, 2080, 1497, 1886, 2091, 1334, 2042, 1381, 1420, 2124, 758, 819, 1654, 380, 958, 1078, -410, 904, 424, -809, 347, -621, -580, 62, -1193, -831, -537, -1699, -1011, -1329, -1569, -984, -1637, -1654, -1332, -2108, -1590, -1652, -1866, -1688, -1796, -2126, -1442, -1702, -1508, -1466, -1652, -1095, -1203, -1071, -714, -967, -719, -400, -591, -18]
1016a8q4k46R91q02N00O17p85J067m06l36R53k75k62R98o06J1M11p35O52J54n89
1037A210N05n71L64M31j034M25K14j097R95j75q09O67n03n54N90m08o63P46n99
1056b66n5P8j63j11l01K70m28k29M14o18l5O16r86O15J0j065R63k48l61N69j70
1077a501K71K69o08O92J38q64J187l25n95J248o29k55J591q29O2J100r75M53P88
1096A218r24N25M06l09N5M87k29J88O4j27J08K84m18J23L05k29k0L01o37L03j93
1117A281n22Q24n91n20R07j025O3Q92j535N04M01j395N37N65j519R73L2j386J075
1136d39m11r65J043p0r46N60L6k37K19o17K64J26k53K04P9j83J10M37m89QN40
1157i84n43L92O73p94N64N77j097J223P5o71J071M0j010J825r58m50J766j200
$$ y = [-18, -102, -348, 643, -159, 341, 958, 173, 1240, 834, 498, 1451, 1176, 914, 1912, 1306, 1317, 1728, 993, 1645, 1799, 1210, 1715, 1144, 1508, 1939, 905, 1330, 1544, 447, 1442, 1267, 458, 1125, 622, 68, 658, 250, -413, 333, -266, -321, -243, -406, -517, -818, -548, -976, -1205, -791, -1409, -1444, -828, -1814, -1199, -1189, -2254, -1291, -1539, -1900, -1331, -1501, -1230, -961, -1569, -877, -739, -1603, -416, -741, -1336, -88, -717, -972, 619, -210, -148, 952, -23, 430, 1218, 294, 819, 1225, 916, 971, 1458, 1229, 1417, 1481, 1354, 1462, 1746, 1328, 1451, 1756, 1527, 1507, 1808, 1171, 1474, 1281, 759, 1583, 992, 472, 1379, 354, 417, 1309, -226, 278, 679, -716, -179, 386, -1133, -160, -128, -1514, -439, -850, -1815, -772, -842, -1788, -1228, -1192, -1429, -1210, -1827, -1563, -1437, -1690, -1486, -1407, -1590, -1480, -1043, -1532, -1524, -984, -1527, -1135, -462, -1256, -692, -115, -1212, 11, 86, -585, 486, 526, -484, 1341, 383, -67, 1699, 499]
1175D99L46J005j134Q8R31j006Q62Q1q14P80J9o80O87l89k06M83k02r2R6k96l70
1196F88M60k80n54M89j34n87O61n68o80J149j088j19R48j228K09O41j216L11M60
1215d38r58M91k00o51P28J9q12J046n11l83P02n27K41M06o45L45M69l83L83K25
1235d53n47N88N5j48M16k24M85m4L74l79K54N74o09L06N41o59N28o2m57R97k39
1256A297l65O87o79P7O96j003K74O53r94M37M16q90O44l58m82M83l59l56M69m94
1276A53j36K29m78l0M22n85J83k22o7j71p3P0l55J03p6k96L94k56k08N38p04M15
1298a150K71m52K28L36q33P57j52m23O53P1l06O42l24K84L17n58N41O9k63O34
1318C42j22j29L03J93J69J72j34L91n2k17K02J74j0j18RK80l44P3K06j85J96J6
$$ y = [499, 845, 1850, 716, 804, 1735, 729, 1591, 1672, 858, 1638, 1657, 977, 1664, 1275, 1069, 1552, 1350, 1258, 1354, 1058, 688, 1148, 868, 314, 803, 669, 82, 743, 175, -505, 644, -444, -563, 385, -843, -634, 7, -1209, -898, -438, -1396, -905, -1105, -1756, -1028, -1009, -1821, -775, -1286, -1669, -967, -1494, -1253, -847, -1492, -1147, -678, -1061, -678, -453, -1000, -412, -357, -505, -89, -313, 172, 128, 502, 123, 377, 951, 342, 648, 1189, 530, 1058, 996, 539, 1536, 1297, 932, 1619, 940, 1017, 1713, 710, 984, 1637, 643, 1080, 1496, 606, 1250, 892, 410, 893, 534, 178, 647, 153, 17, 246, -232, -262, 160, -425, -242, -464, -531, -702, -775, -705, -1060, -957, -1033, -1329, -935, -1191, -1399, -861, -1565, -1150, -879, -1331, -1103, -767, -1600, -843, -995, -1418, -765, -694, -1000, -358, -682, -398, -81, -639, -98, -29, -292, 342, 220, 91, 394, 587, 756, 928, 794, 1185, 1133, 916, 1118, 1292, 1282, 1164, 1173, 1453, 1109, 1182, 1388, 1203, 1399, 1415]
1340A415p34K23K29m42L03k02k86L63m90K1K48m65M8o2n29J14m6k59J02k18J41
1361e26j24l96J70k12j09L52j11l99L27j75J13n4m06N19j46l48K71Q3J33J52k81
1382a167L45oJ0J04K44m7L90k55J38J33q6O37k27L0M99j87L3M50k12j8L09j89
1404I28L8Q8j1J40k28K06J30k57K05n2l89N17k44j40R2l82J88R8m63K01j49k97
1426B19K4j75J04n1n37N3N4j70J14k9j57M5l69J34j10j8K74l58j67K18k01J28
1448i75o6j89L24o4m9J87j32J16K38k63M33K6K9M4j84K6P41l79K51K80j13P3J10
1471D64MJ89N2p9K24k90J29J07K8k17M40q8J56l9J05n6l16K06J2k57l01k8K79
1494G24j22J73k53N6o48O34k67j7j03l30P2P5l77Q2p5j13r6j27j07N9ol60J16
$$ y = [1415, 681, 904, 1133, 691, 994, 792, 506, 869, 379, 400, 648, 183, 231, 169, -360, -246, -292, -551, -449, -667, -526, -650, -1046, -876, -1088, -1197, -845, -956, -1355, -1028, -1203, -1090, -1144, -1550, -1031, -1177, -1525, -1254, -1171, -1038, -886, -1167, -822, -828, -818, -714, -470, -517, -127, -382, -244, -111, -197, 440, 213, 243, 742, 555, 588, 1038, 826, 808, 1117, 928, 966, 1054, 1043, 1183, 955, 1161, 1291, 1034, 1239, 1187, 798, 1315, 1071, 931, 1023, 641, 829, 927, 464, 665, 516, 219, 243, 68, 172, 121, -416, -363, -309, -479, -365, -394, -551, -506, -875, -741, -851, -869, -595, -953, -1120, -902, -1103, -975, -1041, -1230, -906, -970, -1019, -832, -964, -848, -610, -873, -440, -414, -385, -341, -525, -499, 242, -137, 114, 394, 281, 354, 464, 468, 657, 709, 630, 854, 564, 693, 800, 828, 611, 1051, 963, 1119, 1080, 1185, 1129, 813, 1019, 1031, 774, 473, 445, 724, 602, 775, 522, 578, -70, 564, 297, 280, 177, -153, -81, -6, -383, -301, -376, -489, -585, -712, -819, -760, -766, -1126, -1010]
1517a010q2P7j88KL7J68j38m5N2J55j09J84J46k85M25k43O8J28oJ9K08M10j45
1540a72l3L42l8P0J61l1J83J58n8J42k3K01o5J15K86k79r1j18M37o9k8j46R7N
1564A046j32K52l93K3j05J1j4l50J62K07m98Q5k4j43J09k42j29O6k64J33r1l74
1586f65J56j53K58r2m58r2M16l52L0L0k86K95J61m50L28J53l64J61Q6K15k10R6
1608g37L98j64q3J11M0J86J81K6O4jJ00K10l2J95P3j54J96j35K39m2q0J94K67
1631A052k2j49K93k62J02l31J36O1j60K7j42O8o5QN2k37p9k9j74j44R7j27l9J26
1655F2m19p2J61k16j64J24k55L82k01j60K12m99k7L36k98O9J4K0jlJ17n8j4j7
1679i07mqL47J90j02O1J12k56J76K29P2K02j07M2O5N22n7j77j67N03M4m9O6k43
$$ y = [-1010, -1092, -1015, -1203, -1201, -1164, -996, -1134, -1179, -1127, -972, -1081, -897, -751, -1036, -611, -854, -786, -658, -664, -645, -437, -27, -172, -205, 137, 99, 169, 330, 299, 482, 640, 582, 724, 701, 902, 837, 952, 1238, 959, 868, 750, 1187, 1118, 1090, 944, 1041, 1046, 914, 1166, 773, 796, 691, 702, 688, 338, 500, 707, 209, 294, 270, 127, 236, -6, -135, -69, -333, -200, -291, -665, -509, -662, -404, -496, -954, -1046, -630, -982, -952, -922, -1208, -913, -752, -1202, -874, -721, -1085, -924, -838, -623, -833, -737, -339, -503, -586, -475, -435, -249, -68, -42, 22, 21, 121, 331, 299, 494, 567, 413, 609, 474, 713, 671, 591, 785, 1052, 1030, 881, 1174, 912, 1014, 683, 819, 880, 720, 747, 605, 673, 608, 616, 668, 431, 352, 323, 149, 5, 102, -25, -64, 62, -357, -429, -268, -484, -648, -524, -779, -397, -598, -758, -546, -1045, -1072, -736, -1034, -965, -951, -931, -932, -935, -818, -876, -890, -907, -911, -919, -572, -382, -484, -423, -311, -567, -391, -162, -90, 112, 5, 47, 112, 634, 577, 400, 233, 736, 780, 731, 797, 554]
1703E54J95J09j5P0R5j52K33j09J35l21j00K90o5k66K50m29J61m8j43O5j65q3
1725B61Qj50L3j00n5k91K70k63K78m13j13J98k10j08j6m07J96R3j04J29l45K96
1747h13K0l68M39k14J40J3k76J92K91j41K39N6l1n9J96k64N77k93L81J4j07J36
1769A28M0k24pM57j31L58j04J26j23n8M15n8k9L53k30q1O3M2k15J46m26N50k76
1792G16r2J05m99K14N6p8ql05K48k08R7l24j66k2M7K85n73J99j57J95k66J86l52
1815g02m4Q9pM0j75K10j40j33J21nk52K70J05o1j18L35N3j41N3L01l62M17m0r2
1839b78L12j39L32n2K12k3J02j86K17j77K54J75l82j26N30j14m8l8L35j18j39
1860F49J52o2O4q0J90l12j41K76p7j14j02o7k44J89j67l2l03K07J3k70L30l96
$$ y = [554, 749, 858, 843, 913, 1008, 856, 1089, 980, 1115, 794, 694, 984, 919, 653, 903, 474, 635, 587, 444, 509, 344, 261, 269, 119, 152, 52, -3, -294, -24, -287, -9, -422, -535, -337, -547, -655, -671, -1078, -882, -789, -893, -764, -1109, -813, -793, -1161, -722, -936, -796, -783, -1059, -867, -576, -717, -478, -422, -453, -512, -316, -580, -3, -296, 85, 99, -8, 128, 168, -56, -63, 394, 263, 621, 517, 643, 520, 462, 877, 819, 790, 1143, 913, 832, 895, 937, 722, 868, 442, 992, 716, 624, 729, 230, 444, 500, 422, 414, 109, 357, 149, 246, -78, -244, -266, -219, 66, -507, -308, -465, -270, -536, -350, -702, -746, -657, -664, -624, -799, -589, -729, -862, -741, -746, -998, -728, -623, -684, -802, -467, -414, -555, -502, -201, -563, -146, -186, -278, 34, -105, 227, 175, 387, 364, 466, 280, 497, 320, 574, 749, 367, 241, 771, 657, 609, 571, 906, 788, 649, 801, 739, 803, 723, 913, 601, 460, 736, 659, 545, 443, 376, 132, 321, 154, 122, -181, 26, 39, -231, 99, -297]
1882b97k2j11j24M0j45L7L8j55j37M6LM4k65K16R0j04n0j26K66K01j8k18R2J02
1906e97q1L30O0k11L80k2R4j66J72J12N0K28j55o5J90J53O7Jk25K02J86q0J74
1929G97r4K9L56l95o1J60K5K34k60R8j01J34k97j15K95j99j81j14J32J17k66j65
1951A29k8K1ql22L11k15j43R8l48R3R1j00k68K80k08j41J77l91J30M7k86L26j20
1974h75K88j4n03L87K75r4j05j11J45J8l1R8K50j97J71K63n0M4K07n4J16q0J01
1997B49o7J45Q6J50j42J78j8R3J5o0J63k63p9M23l02K27pk92K76j8k99R7M2k28
2021C69K21rl87J68J34k57r8l09J76j41J64K70m86k08J98k77J74j47k10R0j1o2
2043f38j9m4J2j6R5j69J04K22Q9l70L33l7j38K68l29K30Q1K99j31K56j41K46l77
$$ y = [-297, -319, -430, -554, -514, -659, -622, -584, -739, -876, -830, -827, -783, -1048, -832, -742, -846, -896, -1022, -756, -555, -573, -791, -699, -597, -678, -348, -288, -499, -119, -141, -47, -213, -41, 71, 121, 349, 194, 129, 319, 472, 539, 540, 315, 517, 703, 623, 797, 703, 732, 1088, 693, 632, 792, 817, 1051, 791, 889, 788, 922, 625, 510, 805, 606, 425, 311, 443, 560, 294, 129, 101, 122, 114, -208, 103, -112, -255, -157, -505, -412, -321, -421, -689, -409, -617, -758, -581, -972, -842, -795, -1081, -755, -875, -587, -601, -1104, -717, -442, -536, -641, -752, -607, -589, -620, -522, -272, -469, -298, -35, -85, -41, 166, 112, 228, 148, 249, 182, 327, 413, 563, 421, 599, 581, 674, 689, 629, 792, 529, 450, 873, 571, 798, 791, 499, 775, 757, 458, 555, 597, 369, 590, 581, 194, 362, 496, 239, 141, -168, 8, -133, 31, 301, -185, -393, -195, -472, -298, -445, -655, -565, -576, -638, -657, -701, -689, -705, -610, -779, -675, -453, -364, -734, -401, -438, -576, -308, -637, -407, -326, -27, -158, 98, -43, 203, -174]
2066a74K43J64o0J82K46j88k39M79l38K40K74m50K19jj79J95J57l35K76K8j57
2087E82K16q7j18Or4K3k3j90J39p7O6k43j36r6m3J50k22j41R9m6o8K89k55k65
2111e34M27k14p8j60j77K06j97J3k1P7k1j94J99J1J62O3l9q1j52L42l56K83r2
2134e33j8K63J19j43K60R8k95L29K04k04L45j86P7O5J71M5j65N7J13k35K11K87
2156H65m44K74k4N3p1O4J5Jj36p7op7J95k29k97M50m99J12J56k97q4j14J47k9
2180e2j05j20O3L1j08J30j43J2j16j84rJ62q6j59m7L51k94j48J17j42M04j45J70
2203d18k04M4J37p8J34L7J90k20Q3K55j48J60k5Q6Q6K4J56K4J83l29K50J42j00
2226D69J47J36j39k25L91N0l24K16R8k58K20r7l46L59Mk43k1N6q2j04N3k54K78
$$ y = [-174, 69, 233, 173, 355, 601, 413, 174, 653, 315, 555, 829, 379, 598, 597, 418, 613, 770, 435, 711, 739, 582, 798, 711, 593, 599, 505, 528, 505, 315, 454, 377, 443, 200, 64, -32, -75, 75, -147, -288, -189, -235, -303, -14, -269, -534, -107, -321, -399, -559, -736, -530, -727, -714, -735, -658, -679, -873, -674, -663, -501, -438, -477, -558, -710, -368, -724, -441, -533, -551, -288, -169, -312, -52, 46, -249, 80, 284, 80, 425, 239, 316, 381, 552, 597, 432, 489, 602, 367, 578, 865, 421, 695, 671, 724, 653, 717, 732, 733, 597, 520, 514, 437, 632, 403, 106, 556, 57, 169, 325, 28, -56, -170, -23, -52, -157, -277, -214, -183, -291, -161, -304, -292, -408, -592, -601, -439, -525, -684, -731, -380, -674, -822, -705, -847, -443, -588, -418, -622, -578, -441, -519, -385, -348, -158, -378, -295, -40, -188, -28, -53, 33, 119, 143, 299, 323, 506, 177, 427, 569, 469, 616, 752, 613, 388, 779, 829, 505, 721, 819, 561, 781, 684, 338, 697, 701, 458, 437, 493, 411, 307, 360, 106, 384]
2249C84k61K52j70k74Q8k55J83l28L12j78m0l8m5l5J53j98k39K37k62L77k62k8
2271f27j7K67j44j26J23M3j11j37M89l55K76J46j47j04P5L42j74J84j91J4J59
2292a5Q9R3j43K13K51k61L4Q6R0J33K7J06j5P8l01J21J96l1k57K99k28J3j36M1
2316D83K08p7k99j42K93l79M1L00l54j5K03m68J47k14qK05n4q4q1N3j97K70l26
2339d95J35j19o6m7J28k16J91L6J35m30J48L40m78J93K05j54J09J74k44N6J0K78
2361a11r5J32k52N5m8K37L2L15j36L02j24Oj49K25J29j49O5k5J90m8N2j63J88
2384F28j93O1K13j83j19L60m02K03l22JM37k54j41k94K17j29p3J12J62l07n1j05
2406a79j41Q0Q9j67o5J3j26p8R2k3R4k75K59l9j09r2K09j70M12k18q2R8k78N79
$$ y = [384, 123, 375, 205, -69, 19, -236, -53, -381, -69, -247, -287, -325, -370, -405, -252, -450, -689, -452, -714, -337, -599, -627, -644, -377, -521, -647, -524, -481, -592, -729, -240, -595, -319, -173, -320, -424, -349, -7, -181, 3, -188, -174, -15, 74, 167, 24, 237, 488, 227, 261, 347, 437, 570, 597, 703, 688, 766, 465, 586, 782, 751, 494, 793, 565, 578, 442, 483, 691, 614, 315, 173, 466, 87, 128, 428, 74, 59, 262, -206, -59, -273, -281, -76, -130, -214, -295, -242, -439, -169, -495, -360, -479, -545, -592, -464, -680, -489, -453, -318, -748, -600, -260, -738, -545, -340, -494, -385, -211, -455, -399, -389, -111, -206, -74, -326, -271, -319, -82, -50, 265, 129, 431, 307, 313, 164, 389, 518, 369, 434, 409, 599, 551, 603, 440, 628, 435, 496, 709, 526, 407, 767, 365, 568, 246, 247, 684, 430, 289, -5, 212, 83, 10, 122, 284, -23, -74, -179, -320, -240, -151, -318, -383, -370, -496, -574, -482, -505, -411, -686, -427, -466, -575, -667, -458, -628, -216, -434, -516, -418, -696, -117]
2430a17m06J57kJ02lL42n15L51K13m9N9Q1j07R0k70N00j17j44L27M8k31K44j77
2453C76j0J01J20l9j50L17l04K17k18N2N8k75K43m5J00k36R1j44rK33o7j2j29
2476B70k37Q1j73j19J03j56k20M88j16j59o6j66K5j65K82j92r9K38J44l57o0Q1
2498e73m2Qk1P7J6J73o4K75o5Q4l9N6k76L71k48L84j90J0O3j65L11K21k77J71
2522B60K9j80L35k02J36Q1l76O17l49j48J06K66m0l48J69nK73l13K2j66L68l22
2544B13K05l82K56j79J53O2l24J36k91m2K77j86j69K64l55J23r6J65j80M7j05
2565d08O5j57J20L0j03j06O6KR0J12j51J85l6k18R2J60j82J56k0P5j52L31J09
2588F0j09o5o9M22j35n6J06p7J02j69M92j36O3k2M0P2M8k79K67p2k38J60j3l7
$$ y = [-117, -523, -366, -368, -266, -269, 73, -442, -91, 122, 73, 132, 213, 106, 196, -74, 426, 309, 165, 492, 540, 309, 553, 376, 366, 467, 587, 548, 398, 715, 411, 628, 410, 462, 520, 245, 488, 443, 543, 307, 398, 254, 245, 478, 411, 399, 270, 33, 114, -59, -178, -75, -231, -451, 37, -79, -238, -304, -470, -445, -610, -328, -520, -619, -381, -237, -594, -654, -573, -615, -607, -628, -551, -535, -362, -426, -151, -216, -132, -171, -115, -391, -20, -268, 116, -74, -64, -1, -166, 145, 366, 89, 260, 289, 109, 444, 242, 378, 459, 83, 700, 351, 203, 309, 575, 535, 187, 356, 351, 624, 311, 333, 167, 535, 213, 418, 36, 292, 113, 266, 328, 4, 140, -151, -193, 84, -102, -271, -7, -362, -239, -335, -170, -350, -303, -408, -343, -500, -380, -350, -453, -559, -493, -491, -401, -289, -440, -255, -291, -509, -417, -257, -439, -283, -303, -228, -380, -49, 60, -49, -114, -183, 239, 104, 48, 154, 77, 179, 10, 502, 366, 429, 407, 447, 519, 567, 288, 555, 483, 245, 405, 392, 355]
2612C55r8L5J05j01K4J47j69j23L68k72j36J13j80j31j21j15K35j44l6K68q5p8
2634a39j16k9J35j78j31n1J83K8J35n20J15K56l47L18j97J03J08j08l9Q5j2J87
2656b14q2J52J76j82m7M95l39pL4j70L56l64M19Q8m2P0j47K05K41l03J44j04J4
2679C93J0O6k59J30Q7p9J60j46J72R4k27j09k0J16J7p4l39m4K16P5m8j64M10k69
2703A68k25J11k86K54k07l4p0j63R6Q9Kj74J8L3P9j34l8p4O2J09j30J37N2k3L1
2728c17p5q7k8L35j10R2K2L1k57L08r5J93j86O3J64J19N9j30K16p0r1O8j84K95
2752C35J19k1J25l48J16q8M86j63k29p4J74l14K75k3j50j48K88k38J02J73l23
2773G4J45j47J06P8j38j90r3K5j21J19O3j04j87l5m6K10O4j85j09N9J80k91K49
$$ y = [355, 257, 292, 397, 296, 320, 467, 298, 175, 543, 271, 135, 248, 68, -63, -184, -299, -64, -208, -244, 24, -61, -139, -255, -284, -149, -327, -458, -509, -326, -298, -163, -683, -568, -312, -659, -341, -538, -435, -327, -435, -474, -389, -401, -214, -296, -144, 32, -150, -197, 298, -41, -48, -14, -184, 172, -192, 227, 315, 273, 343, 196, 401, 642, 339, 483, 379, 393, 403, 469, 210, 340, 427, 348, 508, 362, 534, 628, 401, 292, 272, 388, 405, 331, -8, -52, 164, 239, 191, 27, 437, 168, -57, 54, -232, 22, -185, -219, -289, -452, -356, -267, -265, -439, -421, -388, -309, -443, -481, -555, -493, -384, -514, -377, -325, -348, -317, -392, -479, -507, -172, -282, -190, -168, -137, -394, -86, -181, 12, -174, -111, 53, 172, 231, 101, 317, 247, 156, 224, 40, 335, 454, 433, 558, 210, 326, 238, 724, 561, 332, 258, 432, 118, 393, 370, 220, 72, 360, 122, 224, 397, 74, 219, 72, 178, 256, 118, -72, -165, -140, -261, -142, -79, -183, -370, -405, -451, -241, -177, -362, -471, -412, -232, -523, -274]
2796b74R7q5q7J10j83N0n4JJ11K63j20k74L62j8o6m4J66K4J55o7J89mp1j09J20
2821A92J77L2J63l32J41J76j74J69o2p5p8L95l92L3J56J7p8j9j46K2Q6j36J46
2844D13k40J46j66L7L3j04q6J8j82Kl1N4l07M5K74j74M9J8J12k97J2j1m9J09J11
2869b14m61L23k44L53l8l21K55j34J27Kj06J56m0J54k46L72j32r5L01k53J41K42
2891A42j24R2o3K99k63k0JMjQ2j68L15q0R4J43j18j1J59j27K90l99K5L16j78j97
2916B13K61p5j4k81J98l5p2k06L9m9m6J05ol1l01R0J55k47l6K60l33QJ01L7j49
2941d14N2j01J19K8q3L6L5o4j08J08J54q3q8J50k8Q5K5J16k04K8M2J23O8oj14
2966a24l8K75J16l04J98R9J04j32Q4k00K44R6l58J75N5K06j24J8%l9m1J00Ok18
$$ y = [-274, -177, -262, -349, -239, -422, -372, -426, -425, -314, -51, -171, -445, -83, -101, -167, -211, -45, -21, 134, 67, 256, 252, 181, 72, 192, 369, 401, 564, 232, 373, 549, 375, 544, 482, 407, 329, 724, 332, 365, 521, 538, 460, 441, 295, 317, 403, 267, 413, 173, 319, 153, 190, 223, 119, 33, 51, -131, -129, -160, -106, -413, -368, -94, -268, -219, -201, -89, -386, -374, -385, -434, -325, -214, -675, -352, -596, -243, -281, -602, -347, -481, -354, -352, -458, -302, -342, -188, -434, -62, -194, -289, 12, -241, -100, 142, 18, 110, 47, 346, 83, 63, 64, 68, 67, 149, -19, 296, 216, 310, 453, 335, 324, 483, 356, 646, 247, 272, 588, 410, 213, 474, 399, 385, 104, 302, 267, 195, -11, 28, -21, -67, 38, 32, 1, -300, -210, -55, -302, -338, -78, -411, -403, -302, -265, -414, -362, -463, -344, -316, -399, -363, -328, -392, -500, -392, -238, -321, -409, -259, -287, -202, -177, -61, -265, -237, -195, -72, -4, -10, -124, -162, 113, 229, -75, 123, 222, 326, 194, 278, 78, 322, 418, 60, 235, 290, 496, 372, 390, 390, 351, 310, 410, 416, 198]
2990A98K08k32r3J13K4L6J01k52J0NL6o7j91J43q5j49j05k4M14j51j38k81K63
3013b17k56R1J76j88k3j04L17j17r7K1n4PJ20o5K48p3O8N0j31k7k28J46J12K17
3037go0J04j90o3K84J04J0m1k05K38j03K81M8J15l07L49j73j20n4j06K59k46L42
3060D59j8lK7k92R8M3Q8l31L7Jk17N06l95J37L6k61r5Q0jj84K14k58R8j35L12
3085e4m3l31J51q1o8k0J16k1j4j44J95J1J00J22k78N2q8j70M35j57M6K35j23M6
3109h3J75l24L4K57j42J30Lq0P6Q8k84K38J22N7L64j16o16N96j24o9Q1q2K6K90
3133F17J38k96p4J72J61j35k4m03J56n2M94m89r2k32L06k56K30m23O82q10P06
3154C76o66m77R18l30J91r08K04J03M51K02j91j77k48J61j39J83j06l66J40N03
$$ y = [198, 406, 174, 81, 194, 218, 254, 355, 103, 113, 118, 154, 87, -104, 39, -46, -195, -300, -324, 90, -61, -199, -480, -217, -473, -382, -206, -394, -417, -521, -204, -321, -418, -397, -451, -444, -324, -389, -141, -214, -146, -96, -227, -254, -482, -336, -224, -7, -67, 37, -153, -216, 68, 172, 182, 141, -64, 174, 71, 352, 400, 515, 208, 557, 384, 264, 210, 104, 363, 117, 459, 441, 438, 465, 173, 271, 314, 402, 71, 108, 109, -108, 398, 3, 140, 176, -85, -180, -100, -101, -285, -71, -329, -231, -366, -54, -97, -428, -277, -358, -426, -446, -330, -351, -365, -509, -314, -303, -203, -81, -359, -307, -395, -565, -130, -287, -241, -6, -129, -83, 92, -232, -198, 59, -83, 47, 50, -30, 46, 134, -150, 88, 210, 267, 631, 515, -101, 495, 371, 302, 383, 301, 327, 617, 755, 459, 385, 557, 718, 583, 559, 156, 312, 260, 754, 265, 173, -59, 247, -9, 221, -202, 480, -330, 376, -290, -767, 151, -179, 12, -896, -692, -589, -138, 64, -127, -304, -552, -391, -530, -347, -453, -819, -679, -176]
3174a76l23J54L00j74j61K15j66j58K10J54j06Q4q4K13J06l52M26J41o6L3j62
3195A08lR6l3K23r1m0m1J18J02l5k11l0K27k14J91On4n4J30j81L2J75l75L12j99
3220A59R2j26q1J68l09M3J77l06J18J38j00q5k14J5K78o0l92K27m6O1p5m6J94
3243a70k09qR2j81Q0j7J8J17M4m52K85l9J40K42Knm5l1k49M86j27m4J17j03L67
3268C10J2j53j42J04k71M72Q8l39mjJ41J26j91R4J31j36K82l78K35j92K5K10m8
3291C75j89L1j84M3R6k66L74k87K37k41P5j3O2J75l58j86K09l04K65j47j70J07
3313b96K57l86O7n0J83J11M7k05k77M37l27M05m14P7N2J92n1J67j62N5J13r8o7
3336a70Q7K9Q4J6j56L89j72K01j96m61O82J7j96K17m0MJ3k72J84J90l17K97j79
$$ y = [-176, -499, -345, -45, -219, -380, -165, -331, -489, -279, -125, -231, -147, -231, -18, 88, -264, 162, 303, 237, 270, 108, 105, 201, 168, 391, 300, 260, 219, 337, 439, 404, 193, 163, 390, 176, 367, 373, 319, 265, 395, 214, 246, 421, 46, 358, 159, 251, 125, 44, 212, -97, -54, 123, -183, -65, 73, -27, -112, -326, -311, -33, -93, -485, -258, -304, -243, -318, -364, -170, -379, -387, -295, -476, -396, -413, -395, -278, -234, -686, -401, -440, -300, -58, -56, -61, -106, -137, -386, 100, -27, -71, 46, -57, 310, 322, 169, 27, 131, -140, 332, 420, 81, 77, 76, 217, 343, 152, 246, 377, 241, 523, 145, 380, 188, 213, 423, 375, 186, 217, 33, 76, 172, -94, 280, -7, 230, -11, 64, 51, 113, 288, -70, -256, -47, -351, -86, -233, -403, -296, -39, -425, -358, -408, -225, -114, -67, -272, -549, -112, -439, -34, -448, -371, -319, -127, -178, -11, -173, -118, -5, -103, -170, -83, -54, 30, 46, -110, 279, 107, 308, 112, -349, 333, 350, 154, 371, 331, 335, 348, 76, 260, 450, 133, 430, 251]
3359B51lN0jJ33k18O8k15l1O1L9K9j4J2P6q0o0j49M1pJ52k88R9k85K41p5J68k58
3386b64K23l03J43j81r1K86j4J9o6l3R2k29K18o9p4K67l86K02k20L76j26O3M3
3409a24k04L79j52R7l6R4J22n7K36k64J40o2k32J08J01J11j19J9J83r0M5j81J45
3432B59j09N9R3r0K6O2P8k86N23j60k26j17N1j19l36N59p3l18J89j65j09L42k29
3455i6j01K06j95K16k12j8Q1j82J55l0L7K2k46P4k7Q8p6J40p8o8n6J88k03J46
3479b35R7K1k02J29K6l7K14J7j51kJ34j8M3J62j38M4M0J53Nj92K02j63P8Q6n4
3504B59R1N3j58M2L27m03J3J53k74J26K43l19j26J25o6K78j65o2J7l69L67l9o1
3527E2k43J03R6j84R0k32J00L0J66j83r5n8r9L77k5k89J47K03k99J12n4p5J25
$$ y = [251, 248, 298, 297, 430, 212, 280, 65, 34, 95, 134, 163, 149, 161, 237, 157, 97, -52, -11, -18, 134, -154, -55, -340, -99, -174, -6, -264, -41, -344, -201, -382, -473, -187, -201, -182, -248, -281, -189, -418, -200, -269, -343, -76, -462, -260, -480, -104, -230, -167, -124, -328, 51, -101, -4, -40, 54, 176, 119, 355, 91, 231, 169, -63, 45, 146, 257, 138, 157, 340, 250, 295, 114, 259, 150, 209, 302, 212, 238, 300, 378, 92, 615, 455, 229, 112, 163, 44, -292, 267, 194, -124, 65, -100, -209, 133, -96, -197, 9, -186, 30, -182, -200, -119, -301, -146, -176, -139, -117, -363, -289, -316, -228, -304, -164, -242, -310, -366, -178, -381, -235, -138, -117, -319, -190, -164, -201, 13, 30, -121, -123, 11, -7, 36, 198, 60, 104, 144, 297, 302, 110, 312, 149, 227, 313, 259, 350, 403, 245, 287, 614, 211, 224, 377, 103, 229, 472, 153, 27, 152, 86, 364, 199, 137, 154, -215, 152, 113, 52, -191, -88, 8, -176, -86, -318, -218, -188, -22, -205, -300, -358, -457, -80, -105, -394, -247, -44, -343, -231, -285, -360, -235]
3550b35j0J48k95j61M14j90P1MKJ32p5J23P5k7K49j98P1j2j9J66k2q8J63n5P4
3575C05oj47M6K05m14K98j47J38K5j37M11L2k92l7J29P0l69qM9M05m39j29K60
3598B48j06j31J83jq7l13M83j12k3l26J63m7M61k27q5k97M3m0L49k09r1J64K2
3621B1m50N42o5o6R9Pn73M17j70k11O38J6m68P3K18j5m25O26J21p6J24l50K45
3644B78j50o3J95k9Q0j81k01K48l6J14J90k00j09M9J74J65k63M7J63P5l81j44
3666B1J13O4l25M31n8j17J10l03K93r4j41q6j0K64j23j57N0p8j52J95o3o0J6J61
3690d9r3k12P0L0j82J90J18j19J3J55j42J02P9j25j64QJ69N3j77K17J58k35j31
3713b67M12n8k09K12J50j77j25J79K02J67l10J28l5k29L47n6k06K18Pj22n0P9
$$ y = [-235, -245, -97, -392, -553, -139, -329, -258, -254, -252, -120, -195, -72, 3, -24, 225, 27, 98, 86, 67, 233, 211, 123, 286, 231, 305, 299, 152, 198, 403, -11, 287, 140, 278, 303, 166, 577, 609, 317, 280, 409, 479, 110, 102, 151, 556, 117, -12, 248, 142, 11, 194, 193, 106, -207, 276, 164, 141, -185, -22, -69, 392, 165, 80, -217, -174, -214, 135, -74, -165, -1, 21, -429, 113, 48, -18, 81, 88, -485, -68, -238, -449, 189, 205, -263, -190, 28, 13, -412, 214, 335, 259, 383, 33, 278, 128, 65, 260, 231, 311, 130, -71, 177, 141, 255, 445, 245, 136, 185, 359, 524, 261, 308, 471, 546, 165, 21, 134, 198, -127, 304, 246, 129, 239, -64, 229, 135, -6, -92, -102, 162, 39, -118, -68, -146, -298, -103, -166, -226, -210, -49, -142, -354, -284, -254, -436, -246, -128, -247, -234, -79, -221, -119, -40, -165, -329, -321, -152, -99, -276, -59, 99, -136, -267, 145, 87, -122, 90, 240, 63, -62, 117, 319, 486, 176, 304, 269, 40, 387, 331, 125, 343, 350, 228, 178, 257]
3735B57Q4l18L44j16K6Nk01L70k58o3o60J174m63l45J53M0o12Q05m70M89l66k81
3757d06L20k07q5J59k0l1O1p5Nk31J22p6K00k03K60k19K65O9j59J46l62L55L5
3780g7K54l90K25k45r2K43m0j56l3L64K6j67l6K97J5j88J55K19l26K19R3l4nj32
3804A89L38l55j06J46j5Q9K2k60O9JM6P2M5rK52k65m16M44l68J62K1j62r4K10
3828E6o7r4l6p0K57Lj12j62m8P3J95k18j53J38J4J03K9j36p1r8L00K1j32k07O9
3853c46J05nK97k18K45j2k16J03J57j31J08k8j62Q8K64k85R4J88r9r4m5K02M8
3876B58J25j10k72K83j22j72J92j23K46j2nj53K5O9j43P1K4L3j15R3j25j09J58
3899A16j62j71J53o4m6P9K46k55j07K10j34l4j26K03j64J08m2k27L71J5J6k23
$$ y = [257, 341, 23, 367, 251, 277, 282, 81, 451, 193, 130, -530, 644, 181, -164, -11, 29, -583, 222, -248, 241, -125, -406, -86, -293, -378, -219, -239, -270, -209, -284, -279, -510, -388, -464, -264, -467, -207, -426, -161, -92, -251, -105, -467, -112, -77, 177, -213, 12, -233, -325, -82, -122, -278, -311, 53, 79, -88, -124, 173, 188, 0, 155, 374, 48, 267, 360, 326, 321, 189, 527, 172, 66, 212, 197, 286, 308, 48, 117, 118, 164, 236, 281, 272, 524, 259, -157, 287, -81, 81, 102, -60, -154, 56, -11, -105, -141, -211, 46, 49, -63, -225, -273, -200, -5, -223, -376, -238, -224, -121, -92, -228, -299, -397, -97, -76, -208, -415, -346, -241, -246, 51, -167, 78, 66, -150, -47, 110, -21, 87, 59, -103, -15, 249, -36, 58, 246, 147, 53, 8, 210, 258, 383, 273, 1, 284, 162, -10, 182, 59, 305, 293, 288, 135, 160, 229, 86, 157, 181, 214, 99, 192, 67, -42, 116, -46, -217, -64, -128, -174, -95, 151, -104, -211, -1, -135, -169, -295, -92, -256, -148, -190, -417, -46, -31, -15, -238]
3921b38k07M07j20J30m42L83k79o7M92k71K06k87J80o0J62l9jJ22J88j62J47j57
3943H7J56k29k56M35J02k00K78j7k42K61k35k21K84k57J22J86l00L37l26O0j52
3964a27K91J5N11n12k10K96K08p32P83m29m0j51N38n02K25l35N23l33m12M68P2
3985A47m42P74l07o24O36l12K65n10K06j121M84J103N1o01r18J305l49L91O58
4004H36q96k59K95j62n6J10k1N98l04j45o28L54K59m12L70j6m65M7L45K71j98
4025g7J73m4L41k78P1l8J22m8k4J87l18r7J25J07JoJ41j73j83J73k62O7K15k09
4049c4J26J83l12j79M08l33J75k32J21r7j16K85k35K42O5n43K95J35l35J16M7
4070b18k40M07j94K62o5o2j5M5q3J75j92K5N46o65K72K6m65K93k9l13O87k80J66
$$ y = [-238, -445, -38, -158, -28, -470, -87, -366, -433, 59, -212, -6, -293, -113, -173, -11, -50, -51, 71, 259, 97, 244, 87, 243, 14, -242, 193, 295, 95, 373, 356, 114, 375, 140, -81, 203, -54, 68, 254, -46, 291, -35, 25, -127, 164, 179, 690, 178, -32, 264, 472, -260, 523, 94, 54, -97, 441, -61, 164, -171, 352, 19, -393, 75, 147, -295, 479, 172, -452, 184, -128, 137, -373, -167, -1288, -804, 299, 350, -251, -1169, 136, -213, 178, 836, -60, -319, -24, -186, -242, -132, -153, 445, 141, -4, -632, -278, -19, -431, -61, -77, -542, -495, -150, 121, -77, 96, 52, 393, 115, 186, 148, 270, 222, 198, 385, 67, -30, 95, 202, 203, 197, 338, 165, -18, 155, -107, -40, 175, -34, 92, 275, -37, -216, 192, -141, 34, -198, -77, -174, -290, -5, -240, 2, 67, -476, -181, -46, -381, -265, -218, -458, -51, -245, 17, -48, -110, -125, -80, -163, 12, -180, -155, 391, -274, -2, 24, -441, -148, -177, -490, 197, -83, 83]
4093H3R9j76m1n2O14k06j19n25k00O7O12k14J294j107L7j03P23J53n26q9k96J86
4115B14K91l71J28k30M97R4l31k72k7N6l0j46J16J03nm61K55k52O7K72k19J26
4137a25n8Q7q3j47J18lJ18R0l12J60J15j82K12j34j52Q4k4KJ38J29j97K97j10
4160B3k47Q0j56K99k04N8L13l05M26j68O8k00K20n0R0j07j10O8k6M12j14K53n76
4183D7J51l28L28j0j95L31K20k75j48k2K38k49k7J96l96J14j16K12P6K9n3j67
4205d4J22%k40J85l53P9L7q0J0L7J16L8Q9l28J85m8m8L00k13j66K03o0M5j23K04
4230e3q0J04j51n0K50k86kJ47K10j10J0m7r1J79P2K36j20m35K71r8L17j84J22
4253B11m6mO6l03J84Q6J29K6o06M15J38j87J17k01K05L3k82K0J38k74m5M5q5J70
$$ y = [83, 182, 6, -35, -87, 527, 321, 202, -323, -523, -456, 156, -58, 1236, 129, 166, 63, 786, 939, 413, 324, 28, 214, 505, 134, 262, 32, 529, 623, 292, 20, -7, 49, 19, -127, -11, 92, 87, -374, -119, -371, -304, -32, -251, -125, -183, -96, -179, -326, -208, -211, -93, -3, -315, -155, -40, -222, -10, -144, -296, -212, -236, -234, -96, 33, -164, 133, 23, -224, -144, -300, -1, -205, -147, 166, -139, 287, 119, 187, -13, 207, 157, 247, 140, 30, 98, 72, 484, 370, 623, 47, 198, -130, 198, 188, -7, 324, 544, 269, 121, 99, 337, 88, 61, 257, -139, -25, -141, 71, 147, 176, 123, -44, 78, 78, -162, 23, -330, -251, -214, -294, -284, -247, -131, -93, -4, -332, -147, -195, -243, 57, -156, -322, -119, -179, -134, -257, -53, -133, -29, -180, -230, 20, -266, -268, -121, 89, -21, -11, -58, -149, 30, 102, 338, 218, -217, 54, -44, 273, 89, 211, 165, 161, 227, -76, 108, 194, 323, 349, -257, 158, 296, 109, 226, 25, 230, 263, -19, 1, 139, -135, -180, -135, -220, -50]
4277e0r4R3P7k35J96j31O7p1m7j0K5O8L0j46o1K24r6O5k1r6J03k18L91j65K40
4302A38j89k23L28k66N9p0Q6J06L6k06K45k23J28k4p0R6Q6m2K26j53K6j27J95
4325A62j55K46K8k10J18q5j33p4M97k40N4j07K95j26o8l04J74r4m2Q0onJ22L6
4349A63j21P5j4q8k75K59k2j49j8J07q7L1J83m9P7k22J45j95K91m0l58N6P4l16
4373d93M11M2j95K39k30j21R8J95l16J89J03j44J78Q2l20J38K73j71K26j17J86
4394B53L6k74j3R8J61k49K6qM6K02K2L9k20R3J34j74k21L01L0o0L2q2j14Q5J31
4419B74j77l4L8j23k68N29j10k23N6R4M0J8k64r4J61k20K13j49J54j12O8j06J79
4442e6P1j84j72Q1j54K33j55K86M5j44K9j40J67R6o7q4M9OOl3K08j4n0NqJ47k8
$$ y = [-50, -144, -51, 26, -209, -13, -144, -77, -148, -195, -205, -180, -112, -82, -228, -289, -65, -161, -96, -117, -213, -110, -328, 63, -102, 138, -51, -274, 54, -212, -153, -223, -137, -31, 5, -201, 44, -179, -51, -75, -145, -49, 37, -5, 221, 68, 94, -33, 162, 7, 253, 281, 71, 189, 104, -29, -103, 394, 154, 208, 101, 396, 270, 202, -102, 72, -22, -64, 16, 10, 5, 127, 163, 42, 117, 103, 15, -260, -1, -23, -172, -190, -83, -170, -139, 44, -5, 72, -150, -5, -200, 91, 51, -307, -251, -177, -493, -82, -40, -235, 4, -226, -347, -249, -54, -370, -181, -78, -222, -44, 38, -282, -144, 129, -42, 184, 67, 253, 289, 15, 2, 100, 261, 12, 38, 30, 76, 278, 300, 339, 119, 212, 346, 172, -49, 252, 282, 222, 254, 172, 58, 143, 274, 97, 63, 101, -22, -290, 239, 129, -94, -38, 56, 96, 114, -150, -244, -83, -303, -90, -239, -85, -197, -129, -235, -56, 15, -169, -341, -260, -414, -181, -336, -50, -5, -149, -120, -260, -93, 3, -64, -148, -99, -93, -87, -120, 88, 74, 24, 29, 21, 168, 140]
4469A40n2n1o5N5RNLR2J37M6p2j07J37J5j21j88j2K65k67K07j49J61L2j73K1r7
4495b9N5N8j81R8P3K8J9k24J15rj16j17J56k05L19j4p1N5j38j80M31j22l54Po9
4520d15J44Q4O8N2j24L4j37oJ05k40L71q3J36k21K08%K3k2P4m62M43k30J46K72
4544B20j92p2L80m59R6K68k16O3L11k36k10OK50J45k04P3J26J03l36j07M24k84
4566A49j55P40q40K08q96M79j86P83l12k82O14l84L4L28l62rKJ35j99K94j04N4
4588I1j57N3M7j97o5J45O7j42j40J61P0l15M66k64q8Q5nm1J0J17J6O9M35m32p5
4613h9p1J48K15j88J61k17J54j09O7j7j13K87k88L34J11j32r6p9O5J58m7J11j30
4636B35j31k1R7J33r4k00r8J9j9L6O4J15j51o7J51J53r1J9o4k53L03o20M00o39
$$ y = [140, 88, 37, -28, 27, 36, 41, 44, 136, 273, 319, 247, 140, 277, 292, 171, -17, -29, 236, -31, 176, 27, 188, 220, 47, 68, -29, 26, 84, -97, 1, 74, 102, 121, -103, 12, 3, -113, -230, -74, -279, 40, 26, -45, 10, -128, -308, 123, 1, -353, -346, -415, -271, -187, -119, -67, -191, -157, -294, -300, -195, -435, -64, -147, -11, -232, -24, -24, -1, -23, 51, -411, 32, -198, -52, 220, 28, -44, 336, -123, -27, 241, 25, 88, 399, 163, -47, -41, 209, 354, 150, 223, 349, 452, 116, 9, 433, 149, -6, 734, -106, 102, -794, -315, -501, 282, -30, -312, 302, -82, -48, 280, -82, -91, -89, 46, -153, 141, 37, 91, -66, -13, 34, -163, -228, -83, -16, -158, -298, -137, -67, -382, 84, -180, -268, -183, -188, -229, -219, -102, -86, -17, 418, -14, -89, -160, -12, 203, 15, 176, -41, 113, 4, 71, 54, -59, 228, -60, 274, 385, 253, 157, 78, 143, 301, 254, 365, 235, 104, 83, 180, 313, 219, 19, -79, -60, -79, -43, 21, 136, -15, -82, 69, 222, 131, 150, 86, -167, 136, -484, -84, -723]
4660g23P73K3o37K22N92p09J77n73k64Q77Q3jQ5n29k64J286j069J16M76j38l22
4681e19M96j89K08N6O08m96l67p3L42n73K29M10L3j16m0kL14J52m30J84l37L40
4703B30J8J48k54K2K31l99l0L5O9L4K39j12l13K29j80K4K20m4j90K31n1n7L8l01
4727a63J74j20P4j31j29J11LK1R9q9J64q2j5k8L55l68J92j80p2J7K2o0J50L6n0
4752f9J3j86L0j43K83k5J73k12m2J00M8O4j54OM2J35R6r6j48J50j13K23j51J6
4776D0J97r5L4j79M7L04j29r9j69J82J11l64L19m9l3L4j55J21J46j90K3j30n5
4799h9J50r6K45l39p7J63P0k27N02l85n8r7QK09m43M09o5k0K7m3p2N7K6l8M5j7
4825a55j44j15L16J02k18J69q7oK91j34j50J31l4L1L8J08j96l8K64qj13j08J77
$$ y = [-723, 50, 73, -564, -342, 250, -459, -282, -855, -1119, -242, -159, -160, -75, -604, -868, 418, -651, -535, -59, -197, -519, -23, -212, -4, 52, 660, 164, -203, -276, 66, -507, -278, 132, 165, 49, 9, 7, 321, 473, 43, 227, -110, 230, 248, 396, 142, 164, 395, -4, -34, 1, 70, 104, 343, 231, -82, 147, -33, -9, 211, 167, -23, 208, 157, 100, 138, -163, 11, -109, -35, -166, -295, -184, -181, -160, -61, -150, 14, -68, -83, -111, 244, -124, 68, -112, -184, -167, -145, -205, -55, -19, -69, -56, -242, -212, -355, -72, -97, 76, -136, -178, -78, -30, 34, -120, -114, -72, 63, 159, 63, -85, 65, -48, 175, 24, 40, 237, 142, 176, -3, 44, 348, 219, 120, -49, 133, 244, -120, 199, 150, 117, 151, -4, 117, 263, 73, 96, -34, -89, 61, -35, 210, -129, -206, -43, 27, -200, 302, -83, -141, -238, -230, -21, -464, -55, -120, -140, -113, -156, -228, -171, -145, -183, -138, -155, -299, -414, -98, 4, -214, -45, -132, -138, 153, 19, -131, 0, -34, -3, 35, 143, -53, -91, 173, 165, 52, -56, 121]
4848A21k80L75j16j00O4K21k0k5l2j32O6K00j52k44Q1k1O4O1p8j81L71K4j36J96
4872C27k96Q2m7L2o9p8P8j05K61j78r2j07L65k17m8L2j12J97k4J0j29k23K52j10
4896a99j61L15k41K90l6J45l87K42L7k95L29j99L39l25k28P50l77J53p6k34L00
4917A42L13j23l43J5P80k44j83m71L51M64o75p2R9L88m34J83j42l85k0P78k40
4938A81m9M32M08j312N38M85j023L09K92K35m98J60M94J65q85n08P62J41q29Q14
4958C12n80k63J94l39N21k59k3L72J82k56l82L30k33L44r7K59k71L06n39n59J290
4979C09%m63O17n63L19j56j91K39l34n0L30P9J8K2m07N47n56P49j70o3j35k14
5001g3M10K04j009P03k11J54J91l80k55q5K64PJ72K96m52l93K77L01PL25n73K68
$$ y = [121, -159, 216, 100, 0, 64, 285, 265, 240, 208, 76, 142, 342, 190, -54, 27, 6, 70, 131, 53, -128, 243, 267, 131, 327, 31, 113, 66, 98, 29, -49, 29, -76, 185, 7, -85, -192, 173, -44, -92, -60, -172, 25, 1, 11, -118, -341, -89, -199, -360, -45, -286, 4, -32, 113, -274, -32, 5, -290, 39, -160, 179, -146, -374, 376, -1, 152, 76, -158, 142, 455, 332, -11, 4, 784, 540, 357, -114, 237, 701, 26, -46, 53, 441, 7, 190, 48, -337, -357, 421, 181, 132, 564, 972, -340, 198, 683, -340, -31, 261, 496, -2, 158, 652, 817, -68, -576, 186, 327, -502, 312, -268, -531, -337, -676, -155, -414, -437, -65, 117, -139, -521, -191, -424, -80, -177, 82, -189, 117, -422, -981, 309, 309, -154, 463, -100, 219, 63, -128, 111, -223, -273, 57, 136, 154, 176, -231, 316, -240, 509, 339, 276, 141, -73, 337, 541, -468, 235, 24, 178, 369, -11, -266, -351, -87, -80, 92, 388, -64, -457, -180, 121, 128, 453, -120, 148]
5023A48k24k82K13N1L9j02L99n80K75k04K28R0O2l19o7L18j39O2n22L23K42l7
5045b6m0j7l11K01J22N4Rnq9J32j60K36l23j58P4J16J88R7j47j90K69J17o3O6
5069A52r1K6k6q0j1L25k99J69q2QJ81j19Pj62j19K48N0j2K06m60M30l73j60M24
5093B32j74J63k12R9n7j31J08q4J54j41N3J4K77m82J09J37l1k19o8R5p8R8r1K47
5117A8J34j88p8l3j2K78k00l6n1%J95r3j28R9O0k56M05j49J36j57R1j3q5N3J92
5142A82k72J98Kj28N7k19K32pr3M32l87J31m6m3q8j43K75J86k6j41j64L5L41j66
5166A48J18p9m8m6Q9j55J86o4q0K07m24K92j53J06j53Q8pp3K7r9M6p1nJ4J55j02
5192h3j48K63k42L1J61qoP4J00j63l1j76J28n3j45O9j77M62j49J99j49J69p3n5
$$ y = [148, -76, -358, -145, -94, -55, -157, 242, -338, -63, -267, -39, 51, 113, -206, -273, 45, -94, -32, -554, -231, 11, -26, -66, -83, -394, -193, -71, -17, -8, -13, -102, 30, -130, 106, -217, -375, -301, -185, 3, 100, -47, -237, 32, 149, 86, 152, 61, 87, 61, -19, -30, 295, -4, 165, 83, 91, 272, 153, 160, -2, -121, 127, 177, 165, 371, -89, 341, -32, -192, 232, 58, 221, 9, 108, 51, -80, 28, -56, 98, -43, 10, 24, 301, -181, -72, 65, 34, -185, -253, -158, -236, -138, -229, 18, 152, -36, -114, -147, -159, 119, -81, -117, -168, -168, 27, -66, -194, -95, -35, -291, 114, -35, 101, -56, 35, 22, -63, -10, 182, -90, 108, 110, -18, 39, -180, 52, 45, -48, 384, -3, 128, 82, 39, -49, -192, 83, 269, 243, 102, -62, -27, 314, 148, 266, 187, 139, 93, 182, 27, 213, 149, 69, 276, -148, 144, -9, 97, -56, 32, 25, -48, -21, -120, -74, -145, -150, -136, 19, -83, -231, 32, -210, -179, -18, -26, -32, 42, 142, -21, -52, -228, -100, -153, -298, -229, -406, 56, -93, 106, -43, 126, 53, -2]
5216bK49l10J15l86K35K31l17J36K87q7J6l2n1L3O7J02j74L79l70k0J1m7k9J93
5240B29m7j30J07k42M5J34j05K5K80M3k77j47K0q9J35O2j13n8J03P8r7K4O3j73
5264a30J36P5jk85J28KN0j39J55O2j58j32j3J61P7J32k17j03J86O0k2j79L01l76
5288b30J20Q4R5j05Nj70J64rL05k50N0J35n8n4j08K69m15Q7J60j47K42J0n0j96
5312f6K56J48j47r1J43j11k08R6q9j32L05j78M9j0o6m6P8K10j39r4l4K51k58j16
5336b49O2j95K37l9J29j97J14K67l19j98J69K7M1J1K9j74L2L38j38k35K33p9p1
5359b05K13j3K5l07K08J4o1N4K06k42L94pJ7j08m8l8j69Q5J45k50J58K14j37J26
5383B74k50l4j45J52P3p6K20k3j40P0J22p4j86rK2MJ29k82J24R5j36k7J19L5j53
$$ y = [-2, 247, -63, 52, -334, -99, 132, -185, -49, 238, 151, 167, 135, 84, 117, 184, 286, 112, 491, 121, 101, 112, 65, 36, 229, 182, 52, 159, -83, -38, 96, -9, 16, 296, 339, 62, -85, -65, -154, -19, 43, -70, -128, -25, 53, -44, -20, 43, -130, 6, 81, 80, -205, -77, -75, -25, -164, -9, 53, -105, -237, -250, -89, -12, 120, -97, -200, -14, 46, 24, -155, 146, -230, -110, -26, 69, -36, -31, -201, -37, -46, 259, 9, 59, 194, 136, 82, -26, 243, -172, -85, 75, -72, 170, 180, 130, -66, 190, 338, 191, 100, 243, 132, -76, 20, -69, -201, 104, -74, -25, -35, -101, -147, -69, 141, 2, -92, -126, 125, -133, -249, -187, -382, -145, -184, -55, -252, -138, 129, -190, -388, -219, -192, -151, -140, -111, -285, -253, 85, -53, -288, -55, -134, -205, 8, -5, 20, -287, -79, -65, -126, -72, 134, -108, 286, 279, 296, 188, 140, 102, -67, 18, 163, -87, 71, 285, 148, 274, 24, -10, -155, -3, 70, -6, 214, 191, 51, 121, 243, 169, -17, -26, -4, 0, 129, -153, -29, 66, -70, -97, 22, 57, -96]
5408i6Oj62p5K55rp3K54l72J72j19L4M9J88k97J11q0jJ56l05J37J09K46j63j73
5432b08K21N8n5n0o8K22l03L39q3j16P6p2RK12p3j17M9K24J13j50j29l0p1M5L1
5457G4j8J21k05R2N8J87j20q7P6J17j89l8j06J70j77K05Q3j35j07m2k7J18k18
5480a68K40j53k2J47J13l34J75j70K44k89M0qj6R4N3j29M6j50K68j19L5O5j23
5503a61j21K96k4n1O6j98K29p3L6j4j11J8K64j85O1Q0q3L3O4j77K98L5j96j87
5527a01J40J1P8Q1k33o7J10Q1j49J21P7p5kq7K0K27q4l0l5N8J41q0j90k37M16
5552A91j65j18j6J23O9n2j89M2M6Q2K4j21j93J49j69J60M14o91R7j48L70K39l75
5575b31Q3KO3J60l30J33J21nm7q6J69kj20n9J22J10j1K06k92j56K31K1J37k86
$$ y = [-96, -90, -252, -327, -72, -81, -154, 100, -272, -100, -219, -185, -136, 52, -245, -134, -214, -215, -59, -364, -227, -118, 128, -35, -208, 13, 71, 16, -34, -102, 120, -183, 156, 73, -43, 33, -39, -30, 182, 109, -8, 41, 265, 378, 228, 99, 69, -2, 43, 74, 56, 177, -28, 64, 122, 309, 189, 102, 178, 295, 106, 68, -38, 132, -45, 160, 243, 108, 1, -41, -68, 50, -168, 72, -81, -103, 44, 157, -177, -2, -172, 72, -217, -177, -185, -201, -107, -54, -183, -137, -287, -19, -138, -103, -38, -161, -282, 14, -10, -61, 5, -193, 36, -37, -1, -15, -126, -108, 156, -29, 32, 112, 29, 62, 126, -51, 247, 282, 86, -101, 39, 50, 128, 209, -24, -91, 19, 100, -49, 72, 149, 74, 72, -15, 5, 232, 148, 118, 83, 141, 282, 202, 12, -225, 191, 26, -92, -108, 15, 84, 32, -157, -115, -69, 13, 37, -84, -277, -128, -297, -137, 277, -414, -317, -465, -95, 144, -231, -148, -146, -83, 77, -253, -120, 1, -4, -51, -137, 32, 30, -90, -149, -27, 83, 72, 278, -14, -170, 61, 82, 219, -67]
5599f7j5L64k13J54k30J61l0k87J42J43p3K07j70p0j76L21k3q1jP7n2J66q6J4
5623A75j29p1K8l3j21K33j19k3K15k92J74l53K59j6R8j66R9Mm3O3j26q9K38m2
5647c7K4K2l39J53K12p3j67J88j65L64m26P2O8J67p3j65K05O2k50M6k6N2K01j4
5671A01%j41L4K10m19J51K08J4Q3j12Q5j81Q3O6j93J21L4m9k55L9J91k24K86j18
5695A4Q8R3l31m7J83PQ2l2n4J38j81o0J4k3K52k17j3O8J8K6l15L72m52J43K75
5720D8j36j50L0K69J28j70j74n8P3J42j24J11j50L1Mk36K36J86j8j16j02P3j43
5743b46L00K31m82K34q0n7K14j61j55K95J49j87J21l5j66J91k9o9J99j58k5J70
5765B54l54J86k98K45J71o6j39j56K4J37m8k08J19J31P0m9oMKk18O8J66j32k21
$$ y = [-67, -82, 282, 69, 223, -7, 154, 124, -163, -21, 122, 49, 256, 86, 16, -160, 161, 138, 57, 56, 133, 81, 247, 161, 175, 46, -25, 3, -30, -151, 82, -37, -60, 155, -137, 37, -316, -57, -73, 25, -141, -42, -38, -81, -18, -144, -233, 5, -37, -13, 9, -330, -177, 35, -38, -205, -17, -182, 182, -244, -172, -104, 63, -10, -175, 30, 92, -158, -112, -138, -86, 115, 101, 101, -40, -6, 204, -215, -64, 144, 158, 241, 129, 214, 33, 116, 182, -11, 110, 144, 95, -160, -121, 70, -154, 132, 14, 102, 195, -136, -183, 0, 7, 89, 57, 3, 141, -40, -100, -86, -109, 143, -74, -87, -19, -1, 25, -290, 82, -370, -227, 48, -88, -238, -208, 61, 189, 19, -155, -213, -140, 2, -122, -11, -161, -130, -126, -362, -126, 60, 42, -74, -176, -103, -246, 54, 285, -197, 37, -43, -100, 114, -47, -202, 93, 242, 55, 176, 141, -25, 166, 137, 68, 267, 109, 84, 254, -100, 86, -212, 33, 204, 138, -1, -157, -133, 4, -44, -252, -133, -2, 68, 19, 13, 17, 19, -199, -131, 35, -97, -318]
5789c18N8R8l5J04K20k85R8J2p7j31L2P0K31l6r3o5J02J56k45j56J73J16j1j91
5813a73J84j4j10K68k21J21j87K07O3k85J89J03p4j17J9J8%r7K32n3N2nk6K11
5837C05k38L3R7rj32O0J79l99J82n3r4O6j84J97n2J49k91N2J03J70p4k26j02j64
5861d25K77M9R1q1l63K75L5K76p1K8j97l6l9q1L4O2q4K12p7o4N4N5l8j17J59J94
5887A28k94K30j0q9R6LJ08K17m33L44l22J86KJ19k90j49J11K07K38l09J88l47
5909f6K47Qr6m3J02j74K62k40J10k38J86J55j06r7O9p5K16o23M41J11j24j3J2
5932B4L2k57J18k32L79l54L87j98k03K48l07M38k88p4J2L43l04J30r8J92JN6J78
$$ y = [-318, -260, -162, -197, -93, 127, -158, -60, -48, -125, -256, -224, -154, 77, 41, -52, -117, -15, 141, -104, -260, -87, 29, 18, -173, 11, -3, -113, 155, -66, 55, -132, 75, 138, -147, 42, 145, 71, -46, -27, -9, -9, -106, 126, 73, 125, 120, 94, 305, 67, 100, 197, 188, 56, 116, 295, -104, 78, 25, -69, -3, -187, 10, -42, 107, -184, -132, -29, 141, 67, -159, -261, -425, -148, -99, -8, -89, -452, -177, -142, 134, 63, 91, -106, -142, -181, -262, -228, -166, -250, -38, -115, -179, -125, -70, -108, -225, -66, 128, -166, 64, 54, -35, 61, 64, 172, 389, -44, 300, -22, 164, 166, 285, -5, -154, -43, 164, 402, 93, 281, -66, 181, 189, 93, 50, 152, -22, 240, 0, 110, -128, 58, 213, 107, 10, 79, 4, 220, -403, 38, 149, 25, 12, 24, 56, -201, -83, -315, 64, -290, 97, -101, -304, -56, -363, 75, -213, -287, -275, 68, -236, -106, -204, -12, -11, 45, 223]
$$ [...]
8191c3
##END NTUPLES=NMR FID
##END=
