##TITLE=1H_LR-731-CR7
 CDCl3, 8 sc, 
 22.12.2020
##JCAMPDX= 6.0         $$ Bruker NMR JCAMP-DX V2.0
##DATA TYPE= NMR FID
##DATA CLASS= NTUPLES
##ORIGIN= UXNMR, Bruker Analytische Messtechnik GmbH
##OWNER= root
$$ XWIN-NMR		Version 3.5
$$ Tue Dec 22 12:33:57 2020 Russian Standard Time (UT+4h)  she@DPX200
##.OBSERVE FREQUENCY= 200.1315066352
##.OBSERVE NUCLEUS= ^1H
##.DELAY= (6, 6)
##.ACQUISITION MODE= SIMULTANEOUS
##.ACQUISITION SCHEME= undefined
##.AVERAGES= 8
##.DIGITISER RES= 18
##SPECTROMETER/DATA SYSTEM= spect
##.PULSE SEQUENCE= zg30
##.SOLVENT NAME= CDCl3
##.SHIFT REFERENCE= (INTERNAL, CDCl3, 0, 15.7039)
##AUDIT TRAIL= $$ (NUMBER, WHEN, WHO, WHERE, WHAT)
$$ ##TITLE= Audit trail, XWIN-NMR		Version 3.5
$$ ##JCAMPDX= 5.01
$$ ##ORIGIN= Bruker BioSpin GmbH
$$ ##OWNER= she
$$ F:/spectra/data/she/nmr/H-F/1/audita.txt
$$ ##AUDIT TRAIL=  $$ (NUMBER, WHEN, WHO, WHERE, WHAT)
(   1,<2020-12-22 12:33:07.70 +0400>,<she>,<DPX200>,
      <created by zg, POWCHK disabled, PULCHK disabled
       configuration hash MD5:
       00 E9 B6 7A A2 85 ED C7 34 08 36 98 17 FE 4E 26
       data hash MD5: 16K
       FB DF B0 E1 3F B8 65 7F 31 4A E6 5B B7 17 1A C9>)
$$ ##END=
$$ 
$$ hash MD5
$$ 70 15 E4 7A F8 B9 1D F7 3A 18 A7 F0 F4 AC 32 6A
##$RELAX= 
##$RELAX= 
##$RELAX= 
##$RELAX= 
##$RELAX= 
##$RELAX= 
$$ Bruker specific parameters
$$ --------------------------
##$DU= <F:/spectra>
##$EXPNO= 1
##$NAME= <H-F>
##$PROCNO= 1
##$TYPE= <nmr>
##$USER= <she>
##$AMP= (0..31)
100 100 100 100 100 100 100 100 100 100 100 100 100 100 100 100 100 100 
100 100 100 100 100 100 100 100 100 100 100 100 100 100 
##$AQSEQ= 0
##$AQ_mod= 1
##$AUNM= <au_zg>
##$AUTOPOS= <>
##$BF1= 200.13
##$BF2= 200.13
##$BF3= 200.13
##$BF4= 200.13
##$BF5= 200.13
##$BF6= 200.13
##$BF7= 200.13
##$BF8= 200.13
##$BYTORDA= 1
##$CFDGTYP= 0
##$CFRGTYP= 5
##$CHEMSTR= <none>
##$CNST= (0..31)
1 1 145 1 1 1 1 1 1 1 1 1 1 1 1 1 1 1 1 1 1 1 1 1 1 1 1 1 1 1 1 1 
##$CPDPRG= <>
##$CPDPRG1= <>
##$CPDPRG2= <>
##$CPDPRG3= <>
##$CPDPRG4= <mlev>
##$CPDPRG5= <mlev>
##$CPDPRG6= <mlev>
##$CPDPRG7= <mlev>
##$CPDPRG8= <mlev>
##$CPDPRGB= <>
##$CPDPRGT= <>
##$D= (0..31)
0 1.2 0 0 0 0 0 0 0 0.06 0 0.03 0 0 0 0 0.0002 0 0 0 0 0 0 0 0 0 0 0 0 
0 0 0 
##$DATE= 1608625987
##$DBL= (0..7)
120 120 120 120 120 120 120 120 
##$DBP= (0..7)
150 150 150 150 150 150 150 150 
##$DBP07= 0
##$DBPNAM0= <>
##$DBPNAM1= <>
##$DBPNAM2= <>
##$DBPNAM3= <>
##$DBPNAM4= <>
##$DBPNAM5= <>
##$DBPNAM6= <>
##$DBPNAM7= <>
##$DBPOAL= (0..7)
0.5 0.5 0.5 0.5 0.5 0.5 0.5 0.5 
##$DBPOFFS= (0..7)
0 0 0 0 0 0 0 0 
##$DE= 6
##$DECBNUC= <off>
##$DECIM= 32
##$DECNUC= <off>
##$DECSTAT= 4
##$DIGMOD= 1
##$DIGTYP= 9
##$DL= (0..7)
0 120 120 120 120 120 120 120 
##$DP= (0..7)
150 150 150 150 150 150 150 150 
##$DP07= 0
##$DPNAME0= <>
##$DPNAME1= <>
##$DPNAME2= <>
##$DPNAME3= <>
##$DPNAME4= <>
##$DPNAME5= <>
##$DPNAME6= <>
##$DPNAME7= <>
##$DPOAL= (0..7)
0.5 0.5 0.5 0.5 0.5 0.5 0.5 0.5 
##$DPOFFS= (0..7)
0 0 0 0 0 0 0 0 
##$DQDMODE= 0
##$DR= 18
##$DS= 0
##$DSLIST= <SSSSSSSSSSSSSSS>
$$ [...]
##$SUBNAM2= <"">
##$SUBNAM3= <"">
##$SUBNAM4= <"">
##$SUBNAM5= <"">
##$SUBNAM6= <"">
##$SUBNAM7= <"">
##$SUBNAM8= <"">
##$SUBNAM9= <"">
##$SW= 16.9725356469052
##$SWIBOX= (0..15)
0 0 2 0 0 0 0 0 0 0 0 0 0 0 0 0 
##$SW_h= 3396.73913043478
##$TD= 16384
##$TD0= 1
##$TE= 0
##$TE2= 300
##$TE3= 300
##$TEG= 300
##$TL= (0..7)
0 120 120 120 120 120 120 120 
##$TP= (0..7)
150 150 150 150 150 150 150 150 
##$TP07= 0
##$TPNAME0= <>
##$TPNAME1= <>
##$TPNAME2= <>
##$TPNAME3= <>
##$TPNAME4= <>
##$TPNAME5= <>
##$TPNAME6= <>
##$TPNAME7= <>
##$TPOAL= (0..7)
0.5 0.5 0.5 0.5 0.5 0.5 0.5 0.5 
##$TPOFFS= (0..7)
0 0 0 0 0 0 0 0 
##$TUNHIN= 0
##$TUNHOUT= 0
##$TUNXOUT= 0
##$USERA1= <user>
##$USERA2= <user>
##$USERA3= <user>
##$USERA4= <user>
##$USERA5= <user>
##$V9= 5
##$VALIST= <valist>
##$VCLIST= <CCCCCCCCCCCCCCC>
##$VD= 0
##$VDLIST= <DDDDDDDDDDDDDDD>
##$VPLIST= <PPPPPPPPPPPPPPP>
##$VTLIST= <TTTTTTTTTTTTTTT>
##$WBST= 1024
##$WBSW= 4
##$XGAIN= (0..3)
0 0 0 0 
##$XL= 0
##$YL= 0
##$YMAX_a= 88479
##$YMIN_a= -116085
##$ZGOPTNS= <>
##$ZL1= 120
##$ZL2= 120
##$ZL3= 120
##$ZL4= 120
##$ABSF1= 10
##$ABSF2= 0
##$ABSG= 5
##$ABSL= 3
##$ALPHA= 0
##$AQORDER= 0
##$ASSFAC= 0
##$ASSFACI= 0
##$ASSFACX= 0
##$ASSWID= 0
##$AUNMP= <proc_1d>
##$AZFE= 0.1
##$AZFW= 0.1
##$BCFW= 1
##$BC_mod= 2
##$BYTORDP= 1
##$COROFFS= 0
##$CY= 11.3945322036743
##$DATMOD= 1
##$DC= 2
##$DFILT= <>
##$DTYPP= 0
##$F1P= 15.9154993809931
##$F2P= -4.1035820241983
##$FCOR= 0.5
##$FTSIZE= 0
##$FT_mod= 4
##$GAMMA= 1
##$GB= 0.15
##$INTBC= 1
##$INTSCL= 1
##$ISEN= 128
##$LB= 0.24
##$LEV0= 0
##$LPBIN= 0
##$MAXI= 10000
##$MC2= 0
##$MEAN= 0
##$ME_mod= 0
##$MI= 1.114404
##$NCOEF= 0
##$NC_proc= 0
##$NLEV= 6
##$NOISF1= 3.799351
##$NOISF2= 2.8
##$NSP= 1
##$NTH_PI= 0
##$NZP= 0
##$OFFSET= 15.70392
##$PC= 1
##$PHC0= -10918.67
##$PHC1= 9.600951
##$PH_mod= 1
##$PKNL= yes
##$PPARMOD= 0
##$PSCAL= 0
##$PSIGN= 0
##$REVERSE= no
##$SF= 200.130013532006
##$SI= 16384
##$SIGF1= 3
##$SIGF2= 2
##$SINO= 400
##$SIOLD= 16384
##$SREGLST= <1H.CDCl3>
##$SSB= 0
##$STSI= 0
##$STSR= 0
##$SW_p= 3612.71676300578
##$SYMM= 0
##$S_DEV= 0
##$TDeff= 0
##$TDoff= 0
##$TI= <>
##$TILT= no
##$TM1= 0
##$TM2= 0
##$TOPLEV= 0
##$USERP1= <user>
##$USERP2= <user>
##$USERP3= <user>
##$USERP4= <user>
##$USERP5= <user>
##$WDW= 1
##$XDIM= 8192
##$YMAX_p= 0
##$YMIN_p= 0
$$ End of Bruker specific parameters
$$ ---------------------------------
##NTUPLES= NMR FID
##VAR_NAME=  TIME,          FID/REAL,        FID/IMAG
##SYMBOL=    X,             R,               I
##VAR_TYPE=  INDEPENDENT,   DEPENDENT,       DEPENDENT
##VAR_FORM=  AFFN,          ASDF,            ASDF
##VAR_DIM=   8192,          8192,            8192
##UNITS=     SECONDS,       ARBITRARY UNITS, ARBITRARY UNITS
##FACTOR=    0.0002944,     1,               1
##FIRST=     0,             0,               0
##LAST=      2.4114304,     0,               0
##MIN=       0,             -116085,         0
##MAX=       2.4114304,     88479,           0
$$ Real data points
##PAGE= N=1
##DATA TABLE= (X++(R..R)), XYDATA
0 0 0 0 0 0 0 0 0 0 0 0 0 0 0 0 0 0 0 -8 8 -8 8 -8 8 -16 16 -16 18 -24 24 -32 32 -40 42 -48 56 -61 68 -76 84
39 84 -94 105 -116 128 -140 156 -172 189 -210 230 -252 276 -308 340 -375 416 -462 513 -575 649
59 649 -739 846 -982 1161 -1402 1749 -2280 3177 -4977 9781 -46004 -99322 88479 -19122
73 -19122 -81573 73740 -15018 -79864 52542 -16177 -74390 32636 2756 -50454 6600 -7408
85 -7408 -38680 -13497 -4065 -13867 -19946 -4726 -8453 -43884 -3148 14147 -51326 -3759 30792
98 30792 -58526 -13218 34017 -59712 -6541 49550 -58887 -15584 47494 -54385 -14525 50740
110 50740 -42428 -13443 43217 -35330 -13428 34560 -21878 -5972 27566 -10408 -7174 10591
122 10591 1905 3611 2130 10896 7296 -11031 16157 13751 -18235 21936 20398 -23774 22257
135 22257 20911 -29247 23825 27364 -26740 21196 22632 -27159 21348 22905 -23706 19362 21146
148 21146 -18747 14221 13895 -13110 14952 11886 -7003 10209 3854 -2183 8897 635 4957
161 4957 6968 -5175 8228 4192 -9403 12069 4605 -9423 13980 326 -12830 14774 981
174 981 -10707 15125 -861 -10674 12803 -2916 -8455 12622 -2589 -5712 9574 -5613 -4508
187 -4508 7606 -4743 -72 5108 -6936 601 1998 -6875 3459 423 -6204 4589 -3378 -7380
201 -7380 5022 -4393 -5078 6142 -7097 -5635 4732 -8902 -3618 5348 -9564 -2722 3409 -11404
215 -11404 -2179 2674 -10621 -284 1611 -11396 -1097 -133 -10113 355 -427 -8947 -228 -2291
229 -2291 -7934 -216 -2655 -4862 330 -4019 -3871 -633 -4737 -531 368 -5101 1465 -277 -6269 3286
245 3286 515 -5597 5822 943 -6407 6334 1268 -5690 8082 2708 -4997 7853 2699 -4690
259 -4690 7822 4353 -2776 7254 4607 -2195 5548 5256 1 4865 5749 1300 2651 4964 2970
274 2970 1626 4898 5003 164 3128 5850 -1041 2041 7655 -1420 110 7903 -2281 -1870 8334
289 8334 -1664 -3229 8005 -1793 -5271 6966 -899 -6016 6031 -315 -7166 4104 282 -7454
303 -7454 2781 1295 -7239 643 1417 -6846 -818 2013 -5591 -2275 1710 -4547 -3774 1440 -2578
318 -2578 -4408 869 -942 -5215 -205 1025 -5106 -935 2909 -5006 -2230 4210 -4366 -3080 5722
333 5722 -3333 -4178 6098 -2394 -4775 6499 -1077 -4959 6481 -85 -5433 5678 1188 -4756
347 -4756 4961 1776 -4424 3751 2206 -3584 2730 2611 -2330 1261 2198 -1239 -64 1848 373 -997
363 -997 1105 1184 -2372 411 2601 -3004 -422 3582 -3491 -1450 3849 -3729 -1740 4560 -3839 -2558
379 -2558 4507 -3673 -2854 4462 -2993 -2848 4019 -2705 -2870 3510 -1985 -2332 3114 -1253 -2142 2061
395 2061 -545 -1091 1525 137 -237 685 564 592 -6 1220 1669 -633 1435 2332 -1259 1735 3232
412 3232 -1283 1708 3359 -1587 1672 3791 -1474 1482 3869 -1288 1098 3419 -1092 1114 3128
427 3128 -924 627 2395 -743 404 1810 -454 2 911 -441 -329 36 -304 -405 -710 -340 -706
444 -706 -1709 -411 -682 -2264 -435 -816 -2898 -603 -860 -2996 -767 -948 -3057 -915 -1059 -2984 -967
461 -967 -704 -2594 -1259 -838 -2196 -1166 -625 -1750 -1015 -478 -1196 -1076 -383 -413 -774 -239 152 -490 -119
480 -119 587 -198 161 1196 236 152 1506 723 268 1782 1149 339 1911 1327 378 1831 1726 698 1489
499 1489 1722 898 1232 1697 996 936 1686 1076 418 1389 1051 248 1261 1062 -108 792 896 -537 506
518 506 814 -787 72 617 -1019 -248 398 -1028 -571 217 -1002 -1059 -52 -838 -1120 -252 -844 -1267 -427
537 -427 -626 -1255 -546 -443 -1050 -758 -280 -921 -876 109 -608 -949 258 -345 -856 485 -77 -732 619 192
557 192 -654 740 560 -481 663 721 -369 774 919 -159 707 1003 6 521 1038 236 383 832 301
576 301 217 806 309 21 618 459 -201 203 412 -236 -86 328 -403 -481 281 -590 -810 125 -690 -955 -27
597 -27 -678 -1152 -220 -789 -1312 -378 -642 -1382 -577 -534 -1272 -638 -550 -1219 -646 -428 -933 -621 -318 -616 -577 -132
619 -132 -386 -440 61 -66 -279 183 275 13 352 571 173 420 900 392 524 1178 699 636 1262 875 828 1361
641 1361 917 800 1340 1124 779 1192 1206 841 1056 1174 688 936 1104 523 662 936 456 368 643 289 81
662 81 441 102 -184 207 -60 -393 -125 -234 -657 -522 -414 -778 -727 -583 -902 -972 -746 -1012 -1088 -890 -1067 -1049
684 -1049 -1022 -974 -1176 -989 -868 -1115 -993 -687 -934 -915 -562 -807 -692 -366 -661 -525 -187 -284 -395 40 -62
705 -62 -209 262 220 -32 408 410 209 638 539 397 707 804 650 674 772 694 674 731 794 693 789 798 568 629 873 550
731 550 378 724 418 293 523 319 140 449 166 -114 244 81 -289 -47 -58 -428 -117 -266 -560 -204 -386
752 -386 -707 -431 -433 -714 -496 -573 -686 -479 -555 -576 -525 -500 -498 -504 -509 -330 -385 -521 -123 -198 -469 54 -93 -410 329
777 329 75 -254 450 357 -112 539 537 -93 673 474 178 747 605 242 793 684 346 805 615 521 767 632
799 632 526 695 493 372 473 308 431 300 147 570 -147 193 340 -50 -378 269 -177 -368 187 -538
819 -538 -716 -211 -268 -648 -19 -114 -918 -342 -661 -1273 -523 -794 -970 -366 -719 -876 -500 -711 -743 -544 -625 -579
841 -579 -514 -533 -362 -474 -367 -156 -379 -261 90 -263 -35 291 -104 107 501 5 373 758 158 372 909
862 909 291 484 917 461 519 956 557 558 964 678 573 867 708 526 775 709 437 607 731 280 413 632
884 632 202 157 564 94 -44 344 -169 -187 175 -242 -393 68 -341 -493 -109 -457 -590 -311 -555 -676 -444
905 -444 -564 -689 -589 -525 -668 -689 -600 -561 -693 -460 -481 -704 -374 -321 -670 -271 -90 -601 -169 33 -459 17
927 17 144 -358 161 324 -246 280 477 14 361 395 186 539 430 213 591 531 432 576 490 515 583 307 522
950 522 637 330 450 497 226 523 379 -40 490 282 -181 307 157 -147 271 -64 -401 161 -133 -567 4
971 4 -236 -586 -127 -437 -665 -208 -615 -639 -250 -580 -611 -344 -598 -452 -389 -680 -420 -347 -564 -359 -249 -414
993 -414 -184 -256 -425 -16 -50 -441 136 49 -152 220 156 1 398 250 35 583 516 223 544 571 376 711
1015 711 547 448 782 583 502 640 616 540 597 505 535 474 406 445 433 346 361 277 234 261 198 13 60 131 -194 1
1041 1 -44 -376 -110 -124 -544 -225 -263 -719 -285 -290 -752 -438 -436 -803 -468 -442 -898 -458 -425 -853 -467 -406 -720 -450
1065 -450 -412 -616 -360 -368 -478 -283 -324 -304 -100 -244 -136 98 -249 40 243 -161 291 327 -111 533 501 -89
1087 -89 593 506 26 747 585 72 808 627 182 825 622 203 786 577 163 758 503 221 610 313 182
1108 182 563 131 192 418 58 80 208 -168 93 64 -319 59 -50 -413 75 -238 -558 34 -406 -652 52
1129 52 -514 -677 -3 -559 -665 -52 -616 -555 -27 -581 -508 -103 -470 -394 -27 -448 -267 25 -351 -66 54
1150 54 -190 103 80 -130 164 77 13 363 130 145 437 195 279 555 188 339 611 183 363 636 222 407
1172 407 536 220 381 448 102 338 425 145 331 264 83 249 100 64 61 8 -35 -46 -168 -121 -135 -243 -134 -217
1196 -217 -380 -219 -371 -485 -295 -424 -522 -362 -430 -629 -349 -505 -529 -311 -428 -480 -283 -392 -407 -234 -310 -290
1218 -290 -155 -280 -141 -142 -168 9 -27 -49 156 47 64 271 131 219 429 219 322 554 324 424 579 377
1240 377 498 596 380 491 601 387 473 523 406 485 406 272 491 346 219 424 209 155 282 115 109 140 -50
1263 -50 23 70 -246 -84 -20 -294 -204 -172 -467 -276 -306 -538 -337 -390 -565 -404 -430 -637 -358 -447 -613 -420 -438 -552
1287 -552 -385 -455 -466 -283 -394 -403 -249 -315 -283 -182 -220 -143 -59 -148 5 38 -55 111 134 31 325 265 146 401 293
1312 293 212 387 400 285 461 465 318 465 462 370 545 404 325 485 409 289 348 322 237 280 262 238 263 163 57
1337 57 99 58 37 6 -93 -4 -46 -179 -139 -154 -278 -204 -223 -350 -187 -255 -430 -234 -343 -426 -302 -311 -435 -304 -335 -418
1363 -418 -301 -341 -356 -242 -325 -259 -128 -181 -153 -39 -86 -112 44 -6 33 124 72 108 192 62 211 280 149 261 313
1388 313 291 382 337 272 401 343 283 400 381 295 412 266 292 348 209 184 226 171 115 210 123 73 84 44 -35 41 -61
1415 -61 -129 -51 -177 -224 -132 -216 -253 -210 -325 -322 -347 -332 -300 -382 -387 -326 -378 -380 -376 -443 -405 -301 -297 -302 -271 -282 -288 -193 -325 -226 -151 -144
1447 -144 -102 -57 -57 -27 31 39 113 121 161 183 235 240 316 246 284 314 347 293 336 390 415 403 353 409 380 393 411 383 312 298 337 328
1479 328 245 271 212 187 155 134 91 56 89 26 -38 -50 -77 -106 -135 -148 -225 -225 -336 -235 -241 -321 -323 -318 -322 -367 -385 -362 -338 -351 -352 -358
1511 -358 -361 -315 -321 -279 -324 -216 -165 -240 -216 -147 -133 -77 -116 -75 -32 -56 23 21 69 71 169 123 220 254 201 276 290 257 274 343 299
1542 299 315 357 347 356 310 328 287 308 315 285 306 285 247 214 188 196 202 63 35 55 45 -56 -40 18 -85 -126 -119 -175 -161 -229 -220
1573 -220 -268 -267 -244 -283 -302 -302 -281 -330 -309 -305 -333 -298 -356 -340 -357 -266 -270 -289 -209 -241 -196 -129 -161 -64 -95 -36 23 0 66 35 87 70
1605 70 148 146 182 175 179 220 315 277 259 289 277 267 355 299 329 331 263 269 305 266 330 202 183 286 259 148 254 198 139 129 78
1636 78 21 81 5 -92 -18 -76 -73 -119 -154 -137 -204 -225 -229 -301 -268 -263 -287 -286 -333 -368 -328 -344 -309 -331 -292 -289 -338 -226 -291 -251 -190 -230
1668 -230 -206 -131 -182 -120 -49 -61 2 -12 -36 31 126 123 83 179 237 130 261 238 228 259 277 331 305 247 281 287 328 348 242
1697 242 318 298 306 267 259 267 206 225 161 152 198 121 116 81 2 112 54 -3 -49 -28 -95 -135 -58 -130 -225 -195 -241 -292 -293 -228 -302 -233
1729 -233 -301 -284 -267 -286 -260 -333 -244 -262 -288 -302 -214 -197 -231 -255 -212 -100 -101 -105 -90 -36 -33 -17 -18 67 59 100 125 147 176 196 195 221
1761 221 242 227 298 239 234 279 281 300 293 265 263 267 256 298 253 167 241 189 165 227 153 195 338 127 103 108 55 -32 -28 -27 -102 -132 -105
1794 -105 -152 -169 -220 -196 -213 -234 -238 -260 -316 -324 -270 -232 -279 -269 -233 -296 -273 -292 -248 -201 -237 -293 -216 -152 -179 -82 -120 -77 -20 -33 -4
1825 -4 64 63 78 121 102 106 138 181 173 197 234 214 253 306 308 305 302 256 303 306 271 172 335 255 239 232 236 217 161 160 170 147 161 94 111
1860 111 57 27 -19 31 -30 -53 -96 -113 -147 -100 -175 -225 -126 -247 -257 -136 -228 -188 -197 -272 -321 -237 -273 -256 -225 -305 -250 -284 -211
1889 -211 -247 -242 -195 -160 -72 -61 -196 -53 -70 -69 -118 -16 10 137 -74 40 51 61 52 149 203 237 238 275 316 263 311 245 179
1918 179 290 322 234 196 211 284 311 289 239 191 254 212 106 173 81 170 83 79 70 28 -14 41 -41 -67 -141 -68 -142 -137 -168 -135
1948 -135 -145 -187 -178 -227 -185 -206 -276 -210 -181 -280 -203 -187 -204 -243 -230 -256 -175 -132 -180 -134 -115 -166 -95 -88 -152 16 -133 -48 34 10
1978 10 69 92 126 114 114 158 154 172 220 214 167 244 271 259 278 231 198 185 222 211 192 189 201 211 186 236 121 101 129 94 58 17
2010 17 63 -72 -52 17 -96 -50 -45 -36 -134 -149 -248 -231 -267 -214 -347 -293 -211 -313 -323 -272 -300 -158 -303 -264 -225 -146 -123 -89
2038 -89 -149 -169 -245 -83 -66 30 -116 -105 58 -2 -120 -250 258 299 -95 332 331 112 203 375 119 155 71 242 62
2063 62 319 353 167 342 100 48 246 228 163 264 283 191 254 416 229 196 115 156 88 5 177 -47 68 49 -137
2088 -137 -99 145 -47 -123 -76 -234 -103 -388 -74 -88 -91 -113 -114 -6 -7 -234 -130 -388 -244 -275 -430 3 -111 -339
2112 -339 -223 -62 -37 2 159 -324 -177 -236 -104 -201 67 -152 -21 -75 139 36 -268 7 436 207 87 205
2134 205 212 -3 341 381 29 135 472 396 246 276 1 93 348 128 93 330 178 209 -42 32 287 -47 498
2157 498 323 -6 112 84 59 89 27 12 -94 198 -103 -69 261 131 -113 -121 -293 -221 152 -82 -33 -338 -439
2180 -439 77 -257 -478 -30 -275 -85 -70 -189 -15 -222 17 -578 -194 -129 -166 -179 69 -148 -21 128 440
2201 440 132 98 46 -34 -92 -38 131 77 79 80 49 197 257 116 33 76 56 450 111 195 154 200 382 320 118 151 323
2228 323 175 126 -4 262 34 -5 10 -170 113 -39 -41 -118 -37 -96 -243 9 -194 -141 -165 -144 -303 -325 -287 -77
2252 -77 -157 -186 -277 -174 -221 -357 -177 -174 -183 -207 -195 -186 -256 -84 -129 -138 -95 -94 -68 -62 -21 -44 14 14 21 62 69 84 94 91 111 150 182
2285 182 184 131 142 230 225 171 157 134 235 186 213 213 133 183 140 154 175 179 87 135 115 67 107 44 33 29 -5 -15 34 -67 -98
2316 -98 -51 -84 -72 -137 -138 -125 -165 -157 -157 -167 -213 -193 -233 -182 -148 -210 -213 -162 -218 -138 -204 -180 -144 -135 -142 -139 -102 -63 -126 -63 -11 -11 5 6 45
2351 45 30 15 85 129 85 105 140 105 233 182 151 208 169 168 183 205 218 183 256 224 198 181 163 143 150 135 142 106 64 157 88
2382 88 48 52 37 35 45 8 -20 -33 -54 -73 -66 -77 -167 -104 -53 -121 -156 -182 -157 -169 -181 -164 -201 -195 -178 -178 -201 -211 -169 -115 -147 -149 -149 -179
2416 -179 -136 -77 -92 -87 -22 25 -14 -25 1 12 1 -21 71 84 128 117 124 150 173 152 133 149 148 165 165 195 179 179 197 160 191 132
2448 132 135 157 187 115 129 152 145 100 60 35 82 36 -18 -16 -11 16 -95 -56 -171 -117 -127 -97 -141 -139 -173 -165 -193 -145 -199 -234 -198 -178
2480 -178 -181 -158 -199 -197 -135 -168 -171 -202 -156 -95 -153 -101 -138 -25 -119 -50 -85 -48 -3 -11 42 12 41 74 26 119 110 128 162 58 117
2511 117 190 150 194 161 151 171 156 217 152 204 187 164 138 178 164 100 117 81 104 93 85 60 -6 8 26 6 -82 -46 -58 -12
2541 -12 -105 -91 -76 -132 -92 -136 -133 -103 -197 -161 -160 -188 -172 -176 -157 -202 -191 -129 -176 -131 -180 -166 -127 -70 -144 -140 -44 -60 -32 -11 -60 -49
2573 -49 26 45 52 -28 9 112 99 176 89 123 53 -9 124 74 137 146 145 209 191 209 229 165 142 155 181 256 226 156 225 227 142
2604 142 130 122 84 65 -19 101 -129 -55 -64 -149 -17 11 55 128 -104 -171 -165 -324 -85 -163 -199 -263 -277 -83 -176 -255 -168 -171
2632 -171 -256 -260 -94 -48 11 -110 -253 -74 308 -166 -97 -64 -41 -91 -132 10 -182 73 72 166 230 292 343 157 -72
2657 -72 122 99 106 74 276 263 353 55 252 -17 183 -10 -37 254 200 67 108 38 273 70 107 14 166 250 -304
2682 -304 135 232 -162 162 55 -85 93 -99 -113 -109 -118 -187 18 -104 -188 -104 -126 -27 7 -150 -40 -482 -282 -119
2706 -119 -208 -122 -171 -186 -96 -40 -131 -176 -99 -53 -120 -91 -131 -123 -117 -132 -43 13 94 -6 -71 7 78 3 157 149 88 108 144 230
2736 230 -19 -24 159 59 343 187 185 113 159 16 162 138 46 278 -9 149 104 -16 168 -89 287 42 18
2759 18 138 -41 -83 -60 68 -183 155 115 12 -224 97 -30 -69 -70 -150 -124 -108 -61 -120 17 -177 240 -306 248
2783 248 126 13 -114 -133 233 -344 -333 -170 13 12 -142 7 -209 -1 -197 -163 25 112 19 -113 65 -148
2805 -148 -50 193 249 135 140 107 147 233 109 61 198 133 98 260 221 46 -101 174 196 -49 293 -59 13 13 137
2830 137 -11 -55 77 63 159 -20 71 -30 -31 -35 94 115 -199 -233 -271 -331 -192 -100 -59 -247 -68 -85 -197 -346 -170
2855 -170 -182 -161 -10 -33 -195 -41 -60 -157 -87 -241 -179 -72 36 -28 -167 -123 -122 109 -42 -117 63 94 185 0 190
2880 190 -12 0 134 48 186 212 19 227 104 267 361 131 -75 20 362 7 82 335 -105 77 237 118
2902 118 52 -24 220 -149 393 94 257 -158 -363 -152 375 -20 -122 190 -106 -97 -68 -29 -179 -16 -119 -150
2924 -150 -201 -248 -236 -70 -56 -117 -183 -26 -185 -209 -333 179 -346 100 -438 -307 -195 -122 18 304 152 9 224
2947 224 74 223 -32 -37 -47 -14 121 242 58 -19 276 156 149 131 225 63 100 117 87 -9 -23 165 -1 190 94
2972 94 44 139 98 66 55 30 79 16 26 -6 38 -47 16 -40 -8 -14 -47 -23 -106 -123 -52 -109 -92 -93 -103 -166 -128 -83 -128 -127 -99 -164
3004 -164 -71 -129 -142 -153 -166 -84 -35 -58 -42 -143 -338 -277 112 -479 -78 222 49 71 60 -104 -397 -49 -114 31
3028 31 240 81 146 166 103 499 248 6 50 73 -19 338 69 102 59 53 237 82 -29 116 170 217 103 115 251
3053 251 309 28 -42 67 81 -9 -198 -161 -76 -22 -142 -93 17 -30 -56 -78 -123 -34 -89 59 -53 -89 -142 -112 -84 -108
3079 -108 -159 -183 -42 -129 -130 -142 -50 -104 -122 -40 -90 -101 -52 -10 -41 -31 -52 -49 -17 -42 4 3 21 78 54 35 105 13 74 91 46
3110 46 84 41 101 81 138 53 129 89 65 143 88 90 98 91 94 29 78 72 29 -26 22 15 56 10 -22 -9 -68 -32 -32 -58 -36 -28 -68 -31
3144 -31 -51 -102 -35 -23 -115 -99 -131 -115 -116 -60 -93 -113 -175 -124 -45 -76 -88 -79 -78 -43 -44 -33 -38 15 27 7 24 13 -2 18 -14 15 11
3177 11 35 39 103 86 49 67 86 38 93 66 94 119 115 159 127 145 73 7 97 100 37 57 44 130 75 70 60 64 34 26 48 21 14 -25
3211 -25 1 -46 -42 -41 -62 -58 -72 -116 -52 -59 -100 -145 -84 -131 -128 -122 -105 -103 -113 -73 -98 -66 -58 -95 -54 -61 -75 -41 -31 17 -70 -64 -61 14 -31 -26
3247 -26 -34 -38 -65 17 33 52 6 67 201 162 121 110 22 120 -48 -6 104 131 150 163 98 116 -30 127 171 129 -37 516
3275 516 25 197 203 14 577 163 351 -73 412 -194 -251 190 -117 31 28 -19 28 -32 -175 -131 -129 -91 -84 -176 -1
3300 -1 158 -72 -161 -51 -79 -255 -175 89 -220 -98 -83 -54 -87 -33 -62 -41 -77 -54 -23 -20 0 -9 72 28 48 21 30 31 54
3329 54 25 24 97 81 91 75 30 112 95 63 81 97 40 35 141 58 77 99 51 99 67 43 44 54 82 37 -8 39 -24 14 -2
3360 -2 -40 -5 -4 -17 10 -8 -66 -63 -76 -76 -53 -70 -73 -110 -72 -82 -106 -51 -101 -113 -52 -87 -78 -108 -65 -86 -56 -99 -56 -31 -43 -52 20 -30
3394 -30 12 22 16 6 63 57 19 70 -1 36 90 94 61 56 107 75 57 128 66 128 46 98 138 52 90 65 45 65 65 54 55 99 71
3427 71 9 71 32 21 63 17 -43 35 5 -38 -32 -120 -97 -10 -39 -20 -62 -32 -73 -43 -44 -94 -81 -152 -135 -64 -88 -84 -71 -95 -73 -99
3459 -99 -106 -69 -78 -75 -57 -43 -26 -93 -25 -30 -76 -103 80 29 76 79 98 133 -25 15 122 101 12 89 108 72 104 99 105 43 99 119
3491 119 97 73 82 83 93 93 104 29 99 77 57 76 18 39 38 -12 25 -46 -5 -9 -22 -52 21 -46 -80 -54 -44 -84 -89 -53 -67 -68 -73 -35
3525 -35 -50 -86 -166 -113 -168 -34 -78 -45 -54 -67 -100 -13 -106 -42 19 4 -58 -21 -17 -14 -12 -32 -60 -17 55 -38 47 -26 178 158 13
3556 13 57 -43 63 47 8 102 134 140 112 119 17 115 25 15 64 35 103 58 81 80 -4 -41 77 -37 -27 53 24 -22 23
3585 23 15 3 -41 -57 -27 -34 -63 -61 -23 -42 -49 -76 -15 -65 -66 -25 -85 -92 -76 -80 -39 -91 -50 -60 -4 -84 -47 -44 22 -80 -51 35 63 -69
3619 -69 36 -50 3 -6 37 65 -13 154 6 100 -4 85 -37 138 98 103 115 68 51 29 42 -2 49 165 160 138 72 -22
3647 -22 9 200 88 -110 0 -12 194 30 -14 -25 19 19 -55 -32 -27 50 -23 91 -99 -55 -79 -6 -32 -62 37 -92 -114
3674 -114 -94 -89 -82 -57 -138 -35 -131 -109 -16 -74 -102 -37 -74 -82 -122 -28 1 -55 6 -47 -39 -11 12 -13 2 21 44 13 23 99 59
3705 59 54 75 64 57 36 54 75 83 92 118 69 64 69 127 45 62 66 7 97 21 50 39 50 70 -5 8 18 2 13 -9 -43 -78 0 -18
3739 -18 -20 -49 -43 -60 -9 -19 -54 -48 -55 -53 -63 -34 -37 -55 -50 -85 -101 -43 -67 -56 -26 -83 -76 -34 -59 -40 -12 -27 -25 -30 16 13 23 8 -31 19
3775 19 50 89 43 48 26 66 75 40 67 18 51 49 49 29 95 67 31 87 111 64 57 33 19 68 90 19 66 46 -15 21 -4 -16 18
3808 18 -46 13 -21 -38 -21 -6 -16 -23 -38 -31 -38 -56 -41 -112 -17 -27 -57 -59 -105 -124 -80 -59 -84 -83 -38 -65 -15 -43 -29 -26 -12 -80 -22
3841 -22 10 -39 -4 -9 11 45 -26 100 55 -4 47 56 71 12 73 76 98 36 57 52 52 107 67 68 53 26 146 67 72 121 102 52 78
3874 78 15 14 35 0 -12 -14 53 5 -10 27 17 29 -21 -17 -3 -30 -1 -12 -2 -37 -54 -65 -54 -51 -42 -76 -57 -86 -106 -87 -103 -76 -81
3907 -81 -53 -4 -70 -45 -59 -21 -55 -8 -20 -31 -1 45 -30 -15 6 -18 7 -11 54 19 50 3 29 87 141 30 70 44 112 60
3937 60 90 17 53 52 52 59 32 36 75 68 7 26 -10 13 -10 49 11 -18 -41 10 -20 -13 -32 16 -13 -28 33 -2 -81 -54 4 -33 -32 -34
3971 -34 -3 -117 -110 -70 -69 -89 -96 -64 -98 -30 -22 -108 -56 -101 12 -43 -7 -59 -21 57 -27 -12 -30 -26 8 -23 16 -5 36 2 17 34
4003 34 76 42 47 59 45 63 52 57 37 61 63 77 21 59 44 63 -4 42 21 12 52 31 17 0 -8 11 40 -26 1 1 61 -108 -22
4036 -22 -162 -22 -42 -37 -50 -97 -105 -114 -83 -201 -81 -82 14 -149 -68 58 55 -197 27 -96 -181 -84 -208 -47 -108 -45 45
4063 45 -115 -21 -3 -99 5 -46 -26 -50 -132 -57 -43 157 75 263 -18 62 -39 2 -116 39 292 155 -195 101
4087 101 63 207 167 59 101 30 168 16 -15 -121 262 40 -9 -88 34 -34 19 -273 31 95 -63 -79 -23 142
4111 142 53 -93 -38 -65 -24 -27 66 -157 174 -41 -18 155 104 -3 -242 -197 37 -120 -35 -44 -189 -15 -32 -112 -289
4136 -289 -40 -37 -54 25 138 -399 -68 111 143 80 -156 12 -179 187 181 235 154 -94 53 199 71 -91 169
4159 169 134 89 -37 -22 171 124 103 -30 29 142 45 -78 -11 49 80 23 19 234 213 48 249 167 -302 -281 47
4184 47 70 -177 52 -44 -39 -259 -130 86 -24 -29 -308 254 79 -102 -61 -77 43 -42 272 -56 -181 43 -145
4207 -145 -205 -110 -165 -134 48 51 -40 -51 -22 41 -37 52 30 3 -164 18 176 -65 141 -6 53 207 61 160 51
4232 51 103 138 173 220 -3 -32 -115 89 115 -40 101 35 62 174 58 -176 52 376 163 -18 17 126 -55 -210
4256 -210 -103 318 -211 -372 90 104 10 40 -74 -60 -3 173 -65 -144 -55 -24 25 -163 -54 -292 -66 -14 -129
4279 -129 -26 1 -165 -153 99 168 -180 -53 -14 2 -4 -36 42 175 -30 -73 -113 68 -20 104 5 -168 -111 -19 -64
4304 -64 -46 76 -65 137 60 -69 -134 -53 -21 -27 190 99 -34 111 4 -4 -20 179 1 11 71 47 4 58 -20 19
4330 19 6 31 11 -8 4 -28 -42 -26 -39 -38 -37 -19 -15 -34 -25 -37 -34 -4 -52 -19 -53 -48 -84 -47 -64 21 -29 -32 -6 23 -57 -36 -27 -55
4364 -55 -56 -4 -37 -33 -2 84 66 -9 41 38 67 62 27 22 41 90 58 37 2 20 50 48 70 65 52 34 -6 75 47 0 26 41 12 31
4398 31 37 -42 54 -2 11 54 -26 -18 18 -43 14 11 11 -29 9 8 7 -42 -86 -9 -78 -82 -28 -130 -76 -93 -37 -32 -44 -62 -36 -73 -94 -27
4432 -27 -34 -25 -75 -36 -14 -44 -52 22 -52 -14 -36 -6 16 14 16 21 38 16 39 63 18 61 53 41 67 36 23 36 103 84 -11 47 67 54
4466 54 53 4 6 50 36 7 10 9 12 62 19 -9 -51 60 5 -22 -3 -33 12 4 -26 -7 -35 24 -10 -47 -39 -60 -22 -41 5 -40 -60
4499 -60 -84 -70 -26 -25 -33 -11 -22 -68 -16 -55 -41 6 -49 -7 -27 -43 27 23 26 -35 47 20 -29 23 51 13 -12 42 7 17 29 59
4531 59 25 1 56 49 25 79 43 80 101 15 73 68 65 41 16 62 55 20 36 54 9 -4 -45 21 12 3 -64 11 -21 17 -44 3 -73
4564 -73 -2 17 -14 -47 3 -60 -71 -34 -52 -49 -8 -31 -38 -73 -34 -25 -61 -103 -62 5 -21 53 -42 21 -158 28 -89 76 167 30
4594 30 -8 66 48 -376 166 31 33 197 -281 26 -111 -251 193 -192 416 60 -297 -15 -99 246 -16 106
4616 106 74 19 125 59 -137 -94 98 -16 141 110 71 16 60 192 -98 -234 -118 120 61 19 22 17 -38 -113 -186 -65
4642 -65 -78 -48 -18 -163 90 -89 -58 85 74 -48 -93 105 -86 -215 -3 -82 -32 -123 -35 38 -25 45 -72 -188 -4
4667 -4 147 -16 -52 -79 -105 -29 103 -66 -122 -23 59 20 30 90 -202 102 -56 362 8 -287 -4 64 -11 134 123
4692 123 44 8 43 25 26 53 32 2 39 15 12 26 33 24 -23 14 -6 -5 -54 -6 -86 -56 -39 -58 -24 -66 3 -39 -51 -36 -35 -38 -29 -20
4726 -20 -20 26 -21 -29 -55 8 10 19 -1 -33 -15 9 7 -45 0 -12 2 12 13 8 36 37 30 -21 44 15 33 43 47 22 -21 44 64 -19 62
4761 62 78 51 46 70 50 44 5 11 14 22 53 68 6 -30 49 -36 4 -12 -1 -2 -6 -41 -29 5 -8 23 23 -21 -75 -31 19 -27 109 -22
4795 -22 33 -123 24 -18 -125 -27 7 43 -57 -64 27 23 -31 -26 -52 -33 -33 -50 -21 -1 -7 35 -40 19 -67 17 46 53 -8 -6 -36 19
4827 19 42 12 -18 23 55 -28 67 66 62 20 36 36 34 65 15 48 46 -8 39 23 53 68 4 1 38 -9 6 59 -18 10 -26 -29 -9 17
4861 17 66 7 3 -32 -18 22 -25 -54 -45 -47 -60 -69 -32 -12 -10 -71 -38 -5 -28 -32 -13 1 -68 9 -25 -2 -14 24 12 13 -19 3 -12 -10
4895 -10 5 -53 20 12 15 -5 -9 33 3 -7 2 22 39 24 58 -23 23 64 52 12 2 13 55 31 27 59 28 -13 -25 26 8 -1 56
4928 56 19 20 45 -10 10 -71 -26 -3 -65 -5 -48 -48 -73 -18 2 -12 0 -46 -22 -33 -41 -29 -55 5 6 -42 -42 -13 6 -33 -22 -71 -58
4961 -58 2 -15 16 13 -24 2 -20 11 -5 -19 15 -56 -25 34 17 77 12 27 41 25 13 12 57 -17 33 64 -3 -11 17 24 20 67 -26
4994 -26 24 2 15 -6 -20 41 9 -4 35 19 -12 -7 1 -24 -46 22 -36 -13 -25 -3 18 -23 -49 -28 -25 -13 -65 -47 18 -14 0 -14
5026 -14 -58 -58 -65 -23 -21 -42 -42 -103 -71 -65 -48 -11 -20 -58 -23 -8 0 -4 -24 17 35 43 27 4 48 -17 34 16 51 27 84 35 17 36 62
5061 62 50 32 45 -5 38 16 15 48 -15 -9 -18 15 7 -15 31 64 19 -27 -27 -6 7 -20 -64 34 6 1 -13 -20 -40 -42 -30 -12 2 -12
5095 -12 -20 -46 -11 -76 -33 -31 -96 -54 -16 -24 -19 5 -29 -60 -5 -10 1 -3 -27 16 -38 23 -11 -5 1 9 4 49 40 28 66 14 45 10 18 20 12
5132 12 18 73 -2 39 63 -3 48 61 45 61 60 7 34 42 28 17 18 -8 -22 18 34 -25 -64 -40 10 -9 7 -36 -22 -22 -112 -67 15
5165 15 -7 7 -36 8 -33 -27 -46 -36 -61 -22 -12 -7 9 -2 -43 -65 -84 -42 -28 -19 6 36 0 9 32 -34 -15 -7 6 9 -6 -1 29 55
5199 55 -3 60 31 1 -27 70 24 16 67 25 7 44 33 13 40 80 61 28 10 -1 34 39 28 6 58 20 26 16 -22 -21 -8 55
5231 55 -4 20 -15 -2 -13 9 -79 -66 -64 -13 -22 -56 -13 -28 -6 -16 -17 -56 40 -36 -2 -57 -53 -16 -12 -50 -42 2 -81 11 -22 43 -27
5264 -27 1 -13 -6 8 -7 38 48 -4 -7 73 3 27 9 28 31 11 34 36 52 11 25 32 14 -12 2 32 37 15 49 -16 -3 -21 64
5297 64 17 34 -8 17 -31 -23 4 74 -6 0 -26 51 -42 -139 -133 -23 15 -53 -48 46 232 83 52 40 -115 226 -62 -240 -215
5326 -215 -75 -70 16 -112 -184 8 -83 -5 -47 5 -83 31 -36 34 -70 -1 -31 -30 -4 31 -26 56 -30 -29 18 60 13 67 23
5355 23 35 42 41 7 38 67 -24 6 -7 21 38 -2 63 -16 29 58 49 35 5 -1 39 39 16 37 -9 -5 -4 -9 14 19 -17 1 1 -4 -41 15
5391 15 -45 -60 7 -84 48 -46 -44 -26 -34 -23 -53 -2 -50 -23 -4 23 -46 -13 27 -26 -36 15 24 20 -4 -1 -12 2 -42 -2 5 45 13
5424 13 9 2 -28 -1 21 17 10 40 45 19 7 5 44 91 20 28 34 67 -3 62 -55 -15 19 41 19 51 4 -21 -26 -16 19 -34 -16 -33
5458 -33 64 28 -11 3 -78 3 17 -34 -22 -109 -13 -50 -5 -15 -38 -77 -45 5 -29 6 -30 -14 -3 -45 -54 -53 0 -4 26 -40 -9 8
5490 8 -1 26 16 7 13 0 13 42 51 18 35 58 6 10 44 6 -17 59 39 36 49 -18 11 -7 24 25 103 -44 22 5 15 31 -14 29
5524 29 21 21 22 -21 -5 22 -51 -20 -16 23 -21 -20 6 5 -23 -14 -22 -88 -32 -23 -28 -77 -49 21 -39 -32 21 -19 -58 -19 7 -34 -44 -1 -16 -30
5560 -30 -17 -43 -36 -10 4 24 16 22 -20 20 1 -10 -19 53 3 -17 46 -7 57 55 -21 -1 55 65 38 55 -7 36 19 48 2 -17 26
5593 26 1 -41 1 -1 2 -3 81 48 -14 24 19 -23 -64 6 6 -18 -11 -16 -12 -35 -16 12 -28 -8 -11 -29 22 13 36 -28 1 -25 -21 22 -84
5628 -84 -55 -45 19 25 -28 -23 3 -43 10 -21 -55 -71 43 19 11 -18 -17 -31 6 33 52 -8 19 26 -2 34 10 43 14 -5 31 31 39
5661 39 2 12 -9 43 32 -17 37 -6 82 -10 -1 42 2 -6 12 -16 -37 -8 -21 -12 -9 -27 -28 -65 9 -84 -59 27 7 26 76 31 -13
5694 -13 -53 -1 -40 -60 -28 -26 -32 -30 12 -6 -1 -19 -48 -9 -21 -38 17 -47 -13 -9 5 9 -1 54 -1 13 -11 -30 1 38 -47 33 -26
5727 -26 24 49 1 58 6 -26 6 30 5 2 32 25 24 11 20 52 9 -10 28 -3 55 27 24 22 32 -15 11 -21 9 -41 30 -40 -57
5760 -57 -20 -15 -9 4 -13 -7 -38 -72 -14 -41 34 47 6 -44 18 20 18 -49 -19 19 -54 -55 -10 -22 -10 -47 -3 -17 23 6 -49 -29 -32 -32
5794 -32 -50 -24 -52 12 -49 -6 9 35 -49 -9 24 41 4 -8 5 12 25 -10 18 31 1 69 29 -4 13 -21 24 -34 13 31 51
5825 51 1 -49 48 -21 65 9 4 -58 -20 -30 -48 -43 30 -5 23 -40 -47 -46 -35 -22 5 -29 -34 -3 -45 -48 -61 -1 -7 -74 -19 -25 -46 66
5859 66 39 -36 -30 1 9 -32 14 4 13 23 0 18 50 -33 -43 -25 -1 -11 10 13 50 42 46 0 6 38 -27 13 -38 -5 52 1 22 27
5893 27 -16 -20 2 -15 12 -19 34 35 13 -21 10 -6 -32 19 54 33 7 8 17 5 -69 -11 -24 -1 -37 -10 -3 9 3 -40 -20 -66 -21
5926 -21 4 -15 -107 -62 6 6 -11 0 1 51 -46 12 29 -20 0 38 19 10 14 -33 5 -1 31 16 -8 14 -19 -30 49 77 19 49 21
5959 21 6 8 -8 59 -22 33 -23 -6 9 31 75 -5 37 -33 21 55 74 33 -35 24 -18 -51 9 29 5 22 -48 -9 19 26 -52
5990 -52 -10 -14 -37 -23 -13 -83 -20 -16 -13 1 -29 -6 -28 -59 -59 -20 -39 -46 -11 -15 -1 -34 40 1 33 -31 5 35 26 43 13 -20 11 -6
6024 -6 9 23 6 15 60 -50 -3 6 -19 11 0 -43 -29 33 -11 6 -12 -32 9 36 -24 -9 -24 -29 -3 -4 -30 -9 27 -21 6 12 11
6057 11 44 29 -23 -12 -13 -24 -24 -58 -45 18 -4 -54 3 -47 4 -16 -90 3 -31 3 -86 -17 -25 -32 2 -49 -14 -66 -5 -31 3 -20
6089 -20 -9 58 -7 -19 -2 10 -79 17 75 47 16 20 17 17 21 38 72 18 -35 14 65 -9 38 -13 30 -37 20 59 -13 26 30 7 20
6122 20 -28 -10 -5 18 25 12 2 24 11 -16 -12 -28 19 5 -12 13 -23 -36 -28 -10 6 -41 5 -46 -9 -8 -39 -36 0 -36 -34 -13 -9 39
6156 39 -64 -31 -34 24 -5 7 25 19 4 -28 16 24 -6 7 32 -10 22 36 39 28 18 10 6 54 9 12 20 11 37 20 -28 -10 53 40
6190 40 20 40 4 10 2 14 36 -41 37 -3 -24 12 -15 -59 -5 -4 -39 -38 -2 23 -6 -23 4 -72 -59 -37 -56 -8 -3 -2 -18 7 -28
6223 -28 -13 -11 -57 -15 -25 -72 -29 29 3 -23 -8 -13 27 21 40 -6 -6 38 6 -8 -33 41 8 -10 21 -31 14 22 -17 49 49 24 -33
6256 -33 17 28 7 33 -7 47 2 -3 -3 55 -13 31 37 -27 25 -28 54 -18 -21 25 3 -31 -19 -19 -1 -28 -18 -26 4 13 34 11 -10 25
6290 25 -36 -29 -14 -78 -5 -16 -42 -43 -5 -12 4 -12 -8 -36 -13 -13 -17 -44 1 -17 18 -5 -28 16 -9 29 6 18 4 -22 -13 7 -14 -9
6324 -9 -48 12 4 13 20 12 47 -71 19 34 -25 36 1 2 31 33 23 -19 36 52 20 67 -15 -36 4 24 32 41 1 -8 -7 -19 -31 18 37
6359 37 0 -14 -31 -50 -13 -48 6 12 -69 -20 -40 6 -11 8 38 -35 -37 9 10 -27 5 -25 -1 -31 -12 -52 18 -54 -16 -48 -19 -26
6391 -26 3 -37 21 -38 17 -7 14 -27 -41 1 -26 -64 15 -30 9 4 9 -7 9 -17 -7 -41 -3 56 39 50 43 -2 53 49 16 53
6423 53 31 14 34 28 12 -12 -12 18 -7 24 11 24 -31 0 41 -11 -24 -2 -44 -46 -6 9 9 -1 -21 1 -22 -28 -13 -26 19 26 19 -14
6457 -14 20 -37 -38 -16 15 27 -17 20 -4 25 -26 46 36 41 -22 42 32 -15 5 55 38 20 35 -17 -38 0 46 -6 16 -16 -20 -32
6489 -32 50 6 -21 -31 50 8 -11 -3 -2 6 -9 25 8 16 46 84 63 -4 -31 25 -3 -54 0 -15 26 20 -10 -2 -32 -31 -79 -25 -33 -45
6523 -45 13 -52 23 -7 -20 -28 -22 0 9 -23 -58 -16 -23 41 -20 42 -13 3 12 -49 42 16 39 31 17 39 42 -27 63 68 -10 81 88 49 5
6558 5 45 -8 42 -7 69 53 123 28 11 57 19 37 21 -5 14 23 89 -43 -56 48 36 -29 -42 -96 -62 -20 39 71 -34 -63
6588 -63 -87 -61 -96 6 -15 43 -52 75 40 9 15 6 3 29 -23 9 -115 -18 33 64 -92 -72 -64 60 -17 77 -1 53 -51
6617 -51 57 -110 -153 157 6 -14 -89 -9 -55 -281 0 170 -101 -120 64 -127 74 68 -188 52 -111 -23 -86 -193
6641 -193 -24 14 -26 1 108 223 -212 32 45 38 -135 291 75 -93 -287 116 -125 227 61 -65 -71 91 135
6664 135 96 42 -118 30 15 104 -54 30 10 -52 36 2 -161 36 22 -75 163 77 -37 0 -35 -20 -39 -26 -13 -12 -23
6691 -23 16 29 18 1 27 47 23 -14 -3 45 17 13 36 55 -18 69 13 -1 53 8 19 6 17 26 27 8 -32 7 -19 21 -13 -5
6723 -5 -36 14 7 -7 19 -17 -13 -47 5 -15 -33 -4 -14 -10 -3 11 24 -34 -6 -42 -32 -10 -19 -19 -16 -8 -22 -11 -93 -17 -41 -18 -31 -54 -64
6758 -64 -45 -37 17 2 -10 30 -9 20 -19 -11 -1 -24 21 19 -2 5 38 20 20 42 5 17 14 49 59 19 -7 43 -35 24 10 49 -28
6791 -28 19 -12 -8 2 5 19 -62 27 25 -25 -44 -13 -2 -18 -8 13 10 -41 1 23 -20 -13 -15 -22 -12 -1 -4 6 -10 -68 -31 17 -48 -37
6825 -37 7 42 -26 10 -19 -24 -4 -35 -24 2 3 -39 -5 -24 -46 -24 38 -7 13 26 -22 -11 72 1 18 22 -5 33 -30 23 9 29
6857 29 -7 64 50 9 24 19 -8 7 40 63 -16 -4 51 13 -16 -27 35 21 27 -39 40 10 14 -7 16 34 -23 -28 1 -68 -37 -36 3
6890 3 -19 -44 -46 -34 -36 -27 21 -27 -34 -12 -20 -29 13 -11 46 -37 -31 -17 -16 -9 -39 -26 -42 -18 -24 -25 -56 -3 -16 17 -36 20 10 44 7 33
6926 33 44 13 24 24 -4 -16 26 -26 36 24 -18 28 16 22 16 32 13 32 9 44 0 3 35 -11 34 -8 -18 -46 -40 21 -35 0 -18
6959 -18 8 -37 -66 -46 16 0 22 -5 -30 5 -49 -44 -29 -48 -46 13 -54 36 -144 -2 -13 -114 -107 6 73 -60 85 -9 -89
6988 -89 75 22 127 -13 171 165 18 45 -74 115 49 33 26 4 -28 -4 15 -41 -8 -9 4 -4 2 -9 -26 15 56 -7 5
7017 5 -22 9 34 -52 15 17 5 13 55 28 5 28 39 1 -8 -7 -7 6 29 -15 -52 1 1 -41 -66 -54 -2 32 -66 4 -41 -30 -14 -4
7051 -4 15 -11 -64 -51 0 -87 15 -44 12 33 58 1 -2 -1 10 19 -12 64 -2 13 18 6 31 -56 5 -54 -15 -14 4 -26 9 -3 4
7084 4 -27 -8 26 15 24 20 15 4 42 29 20 -8 35 45 54 46 33 51 -31 63 -41 -14 -6 10 6 12 25 -12 -5 -43 -24 -19 -7 23 -9 -53
7120 -53 -38 -50 -19 -10 -34 -15 -2 -55 -118 3 -28 -24 -20 6 -4 26 8 25 -28 -40 10 18 13 -3 48 5 5 -2 -21 50 -40 11 29
7153 29 -1 -1 15 -24 8 -31 14 35 -1 17 16 -3 -1 -34 44 109 16 -41 7 -76 62 -29 100 52 51 21 48 3 5 31 -153
7184 -153 21 52 21 -19 -93 42 -83 -82 28 -23 -23 -65 76 -95 -166 -91 -71 -14 93 -132 17 -54 44 -331 126
7209 126 -64 197 -232 -210 98 -49 81 -234 5 207 331 102 -89 31 -74 -11 19 -67 -28 16 48 10 37
7232 37 17 -1 40 21 66 14 27 -32 -23 48 21 48 -43 48 38 57 -23 -20 18 13 -22 24 13 10 -38 -16 9 40 -48 45 -16 4
7264 4 33 20 17 48 -26 -17 20 0 -36 -26 -2 5 -52 19 3 13 -2 -49 -37 -32 -22 6 4 -2 -24 0 -5 -8 11 -6 13 32 25 -29 38
7299 38 7 -2 -14 26 22 18 -9 42 14 67 23 -15 -3 3 46 8 56 8 27 -17 -14 14 14 -15 -3 -7 -1 38 -34 -25 0 7 58 -55 12
7334 12 -50 16 3 -14 10 9 17 -54 1 1 -25 -9 6 2 4 -79 -9 -11 1 3 -34 -20 16 -11 -43 -25 11 -40 12 -72 -1 -36 8 -9
7368 -9 -55 -23 30 -8 12 -45 32 26 -9 28 1 -27 -62 -38 20 43 -23 14 17 55 20 33 -5 -13 -51 35 -7 -14 46 23 43 31 72
7401 72 4 -9 -21 17 -9 49 31 16 -31 -37 -42 65 -25 19 -35 -15 9 -26 -6 -51 37 9 -39 55 -45 31 6 -13 -51 12
7431 12 62 39 -13 -9 14 -25 -22 14 -8 41 -23 23 44 16 -29 52 -31 -30 -10 -8 -31 6 25 -22 41 20 0 -22 -32 1 -16 -29
7463 -29 23 48 -15 75 43 -10 45 2 31 50 19 -13 -44 -2 15 -22 -23 -16 28 -5 5 -70 18 1 -32 -62 20 -8 -38 -49 3
7494 3 29 19 -38 14 -30 -13 -22 2 29 -31 -9 8 -8 13 37 -19 27 4 -19 1 -26 15 -40 6 -44 -28 2 0 2 -5 -10 2 -7 4
7528 4 -49 31 16 13 38 -42 -7 -19 51 -15 -32 16 7 -24 50 39 44 47 29 6 25 22 -22 -10 -8 45 -25 18 44 2 -23 -22 39 23
7562 23 -28 -65 -9 -14 -20 -4 -10 -24 -12 29 -15 -26 4 8 -50 22 -31 -64 -27 -25 -3 -20 39 30 -23 -14 30 15 -2 3 54 7 -19 -2
7596 -2 32 6 13 32 28 -17 -10 20 3 -8 -33 22 9 -36 4 -30 34 -9 25 40 -25 -1 33 10 37 29 3 -33 34 -8 5 -3 -7 31
7630 31 15 35 -30 1 25 -16 -41 -46 -25 -33 24 -12 -45 7 -8 -26 -60 -32 24 -24 -6 -39 -9 -11 -26 -51 -56 -13 -21 -10 23 40 23
7663 23 18 -16 -1 -31 13 40 18 11 60 41 -47 -10 7 22 -42 4 91 -31 -36 42 19 -12 -16 -38 38 -10 7 26 27 -4 -21 9
7695 9 -20 -11 -24 68 3 -15 22 22 -11 3 -37 -14 8 -3 -15 16 -5 2 24 -21 -21 -28 -63 -9 3 -34 -30 13 -62 -73 -1 11 -37 -29
7729 -29 -30 1 14 5 -40 -57 -36 -7 -14 2 -10 5 -24 12 3 16 -14 5 37 4 39 -42 48 21 2 23 -35 5 14 25 -31 -3 28
7762 28 -1 -17 38 -29 7 7 -17 -35 -14 4 -37 -1 21 -6 -15 23 -6 30 9 19 -35 -44 36 41 -16 20 19 60 -43 45 -31 57
7794 57 -33 65 -78 55 -10 -105 4 -42 -15 40 82 -16 84 70 -130 -43 31 -113 160 105 -44 76 93 -116 51
7819 51 92 61 40 -25 -145 4 -38 24 6 32 14 52 26 16 -11 -16 -32 14 9 26 2 -5 -20 31 59 -23 -9 29 28 -7 -3 20
7851 20 -7 34 -48 22 -21 -5 28 14 74 -23 -7 -16 18 6 28 4 -7 -28 -17 1 -3 12 26 -8 -45 -8 -59 -1 -12 -11 25 -81
7883 -81 4 -25 -22 35 6 -24 23 -11 -19 -14 -9 -1 8 3 -2 -25 -24 32 44 34 15 41 -1 21 26 14 -2 -9 -8 21 -62 50 -10 -20 -5 -15
7919 -15 -8 13 -37 -55 0 -23 40 -49 -46 -28 -14 -11 4 -13 19 -5 -8 12 6 -23 -26 39 -8 -14 -21 -29 -17 2 -14 25 -8 -44 -7 5 -31
7954 -31 -28 7 -10 -37 74 -10 36 -31 -27 -5 6 -54 -38 -9 0 8 0 22 -28 12 -57 -26 25 -36 26 1 21 5 -9 35 42 22 26
7987 26 9 26 -3 51 2 -5 -8 3 40 17 -24 -8 18 7 -5 -51 23 14 -46 21 19 -39 -22 -19 -32 -42 -38 29 -38 -15 29 -22 -36
8020 -36 -37 10 2 -26 -68 -8 10 -43 -2 -18 16 45 38 1 28 -51 7 -40 -3 13 -38 10 -18 -20 -10 -40 -53 3 -39 -58 4 -15
8052 -15 0 15 -36 14 0 41 -65 -11 -2 15 7 -10 -31 61 46 -24 72 -9 42 -57 -14 12 -28 -42 27 3 -19 -15 -5 17 49
8083 49 43 -28 -5 7 8 -29 32 -38 16 -36 -18 -37 29 8 -2 -71 -56 -25 -14 -11 23 3 -36 2 -13 -11 -16 13 -7 -7 -23 12 47
8116 47 29 -22 -1 -24 7 27 8 21 2 -18 41 -37 -16 -36 2 38 -17 32 2 8 -11 -3 -37 -14 16 50 -39 8 -16 11 -41
8147 -41 -2 21 10 6 -8 -18 -14 -23 12 22 22 -10 16 -14 32 -33 -36 -99 -22 -13 -93 33 -82 -37 -8 -45 -65 -42 19 -25 13 20 -57
8180 -57 -5 -25 17 27 28 -2 -25 2 28 38 26
8191B6
$$ Imaginary data points
##PAGE= N=2
##DATA TABLE= (X++(I..I)), XYDATA
0 0 0 0 0 0 0 0 0 0 0 0 0 0 0 -8 8 -8 8 -8 16 -16 16 -24 24 -32 32 -40 48 -56 64 -72 83 -96 110 -122 139
35 139 -158 176 -198 221 -246 275 -305 339 -375 415 -459 506 -558 615 -678 746 -822 906 -1000
54 -1000 1104 -1222 1354 -1505 1682 -1889 2137 -2437 2812 -3294 3942 -4859 6269 -8725 14225
69 14225 -52940 41343 40270 -116085 48567 19245 -96316 26432 25526 -83027 24738 31265
81 31265 -52421 -1805 16572 -32043 -2513 13871 -741 -7950 2739 6677 -18122 1654 37014
94 37014 -21052 -7265 51192 -24139 -20758 60050 -18266 -15882 70755 -20664 -28854 69808 -13439
107 -13439 -25044 70546 -6887 -25768 59452 -4590 -21103 50746 3233 -11678 38504 4175
119 4175 -8966 21640 11244 6071 9232 9561 11500 -5077 9594 21424 -13079 8879 27874
132 27874 -21320 4145 29881 -25872 4382 35397 -26787 -1402 29949 -27153 511 29500
144 29500 -25872 -1154 25156 -23265 -3664 17623 -17715 520 12632 -15229 -1658 3773
156 3773 -10212 1958 -945 -5373 2290 -8871 -2741 3546 -13139 1536 6035 -15583 2373
169 2373 3116 -18716 5526 5424 -17687 5620 2780 -18090 5235 1525 -15290 6757 355 -13699
183 -13699 4669 -3257 -11116 5471 -3260 -7270 3493 -7284 -5481 2871 -7475 -1665 2013 -8661
197 -8661 -141 -705 -9819 2634 -449 -8511 4111 -3423 -9281 5022 -3887 -6833 6909 -5134
211 -5134 -6333 6380 -6427 -4318 7508 -5790 -2171 6875 -6941 -1549 6671 -5093 1106 6335
225 6335 -4773 1344 4945 -3343 3208 4848 -1047 4151 2672 -306 4883 2120 2698 6371 381
240 381 3543 6257 -1331 5299 7618 -1783 6442 7423 -3691 6476 7886 -3591 7306 8071 -4470
255 -4470 6001 7235 -4456 5663 7619 -3703 3977 5958 -3721 2365 5422 -1948 1061 3863
269 3863 -1557 -1239 1949 28 -1864 491 1118 -3315 -2303 1844 -3515 -3836 3237 -3530 -6268 3085
285 3085 -3393 -7852 3551 -2199 -9044 2921 -1796 -10131 2355 -106 -9811 1413 673 -9831
299 -9831 199 1857 -8617 -482 2860 -7407 -1952 3168 -5646 -2391 3724 -3742 -3130 3252 -1948
314 -1948 -3331 2976 433 -3153 1845 2029 -2907 735 3921 -1937 -435 5192 -1208 -2082 5995 45
330 45 -3094 6680 1037 -4444 6363 2122 -5037 6021 3179 -5457 5154 3617 -5866 4065 4429
345 4429 -5191 2892 4123 -4874 1631 3915 -3930 684 3476 -2899 -592 2330 -1608 -1228 1348
360 1348 -50 -1684 -113 890 -2053 -1012 2346 -2069 -2144 3323 -1960 -3231 3864 -1398 -3376 4587
376 4587 -1167 -4122 4710 -590 -4046 4925 136 -3822 4427 367 -3465 4112 928 -2639 3661
391 3661 1187 -2148 2751 1527 -890 2215 1382 -112 1269 1124 888 707 993 1735 -240 313 2317
408 2317 -967 4 2957 -1284 -727 2861 -1826 -1026 3041 -2053 -1643 2661 -2152 -2128 2047 -2099 -2115
425 -2115 1548 -2260 -2511 718 -2075 -2283 162 -1861 -2294 -606 -1768 -2053 -1086 -1455 -1545 -1605 -1444 -1218
443 -1218 -1952 -1099 -493 -2151 -960 -12 -2251 -668 518 -1959 -418 896 -1602 -173 1050 -1169
459 -1169 221 1610 -563 312 1600 66 629 1748 574 870 1747 1002 966 1660 1607 1174 1432 1902
477 1902 1304 1167 1998 1427 1160 2079 1268 661 1978 1520 390 1632 1498 184 1248 1243 -173 863
495 863 1237 -267 265 803 -331 -263 374 -262 -671 27 -340 -1192 -428 -308 -1351 -667 -360 -1583 -1041
514 -1041 -296 -1646 -1202 -222 -1682 -1356 -224 -1587 -1408 -125 -1248 -1362 -73 -1031 -1356 -41 -544
531 -544 -1106 -54 -218 -868 12 165 -627 8 495 -177 -47 612 162 -19 877 516 -174 903 818 -132
551 -132 945 980 -132 977 1096 -202 820 1111 -185 558 1162 -240 322 1003 -212 106 798 -311
569 -311 -188 587 -182 -497 144 -192 -635 -57 -257 -753 -272 -207 -921 -657 -288 -812 -806 -303 -756 -1115 -226
590 -226 -622 -1209 -75 -398 -1168 -53 -189 -1036 -14 -18 -774 57 290 -577 64 508 -232 148 674 16
610 16 343 877 415 417 1025 739 565 1057 865 677 1081 1138 735 1022 1245 831 959 1207 789 815 1235 798
632 798 532 1128 751 303 925 551 163 652 351 -105 389 225 -278 -17 93 -464 -379 -176 -650 -634 -389
653 -389 -902 -951 -506 -987 -1153 -803 -954 -1238 -928 -1041 -1317 -913 -940 -1325 -960 -857 -1236 -1017 -742 -998 -949
674 -949 -612 -797 -832 -440 -538 -666 -286 -239 -349 -111 -20 -52 88 350 196 196 557 444 441 783 582 557 921 713
698 713 593 999 856 684 1002 989 650 945 1003 594 897 1007 609 810 885 520 618 699 405 346 425 309 191
721 191 197 147 -4 -4 -10 -176 -197 -49 -311 -472 -225 -378 -680 -416 -445 -719 -471 -579 -875 -520 -466 -885 -599 -446
745 -446 -785 -574 -301 -783 -405 -239 -702 -329 -85 -413 -228 -92 -209 -30 16 -54 178 177 187 227 233 386 469
768 469 311 498 671 269 636 626 242 759 849 239 716 722 109 687 737 67 608 631 -40 526 486 -9 295
791 295 527 -232 294 175 -264 117 29 -230 -291 -311 -392 -291 -454 -396 -696 -599 -680 -404 -938 -551 -539 -872 -499
814 -499 -527 -1295 -180 -489 -945 -206 -389 -960 -80 -172 -814 -26 -328 -569 -41 -7 -423 211 33 -175 275
835 275 309 96 371 346 351 503 515 631 545 505 826 591 657 931 638 557 1079 607 505 1017 601 555 1024 494
859 494 374 890 440 249 749 371 108 600 208 -62 348 175 -242 43 -27 -342 -231 -227 -477 -395 -234 -548
881 -548 -651 -303 -639 -789 -406 -625 -882 -453 -761 -921 -376 -654 -935 -394 -588 -861 -399 -474 -663 -264 -403
902 -403 -573 -235 -224 -322 -134 -17 -36 -76 62 183 13 231 399 131 412 547 162 390 763 252 351 835
924 835 287 418 887 300 547 915 232 467 826 258 423 611 259 448 474 120 362 419 89 196 108
945 108 62 149 -171 -173 54 -274 -241 -166 -453 -275 -146 -649 -262 -188 -716 -420 -264 -712 -362 -322 -848 -328 -326 -838
969 -838 -281 -169 -723 -240 -188 -622 -158 -174 -464 66 -54 -197 94 -36 85 239 33 172 384 129 316
990 316 490 263 434 563 302 538 640 240 583 754 322 596 673 329 600 637 278 593 652 181 417
1011 417 478 209 375 272 12 263 162 -72 48 65 -119 -137 -217 -213 -282 -359 -356 -377 -405 -454 -509 -602 -532 -465 -736 -601
1037 -601 -435 -744 -655 -469 -748 -582 -346 -769 -522 -306 -720 -441 -118 -635 -377 6 -470 -256 83 -303
1057 -303 -85 258 -191 64 373 19 223 396 145 413 522 289 530 605 380 583 520 461 773 458 494
1078 494 851 410 519 792 260 566 823 121 482 701 -43 473 568 -107 389 467 -263 135 354 -394 119
1099 119 178 -522 -14 -4 -541 -118 -208 -589 -183 -410 -634 -238 -526 -557 -300 -577 -512 -262 -720 -425 -265 -692
1121 -692 -287 -241 -709 -167 -217 -696 -2 -160 -617 192 -92 -450 303 32 -290 375 95 -149 497 181 39
1142 39 548 219 170 558 243 251 564 306 427 523 246 472 442 173 422 370 141 476 198 127 438 160 -5
1165 -5 372 -4 -32 303 -77 -144 192 -245 -220 31 -377 -288 -56 -376 -350 -174 -471 -362 -340 -480 -370 -368 -463 -379
1189 -379 -405 -382 -348 -458 -370 -266 -408 -288 -168 -400 -158 -127 -259 -95 -15 -216 109 99 -87 199 102 -10 306
1212 306 232 236 428 329 311 517 383 371 444 345 558 446 440 576 495 424 546 390 311 505 337 319 483 214 231
1237 231 408 93 63 252 34 32 147 -123 -109 6 -200 -198 -95 -292 -220 -270 -429 -292 -361 -510 -354 -477 -527
1260 -527 -361 -503 -536 -348 -579 -550 -336 -599 -483 -291 -556 -365 -256 -482 -277 -83 -337 -216 -51 -282 -61
1281 -61 27 -149 46 112 -22 138 243 68 267 273 208 371 341 316 462 396 433 552 421 426 536 346 480 528
1305 528 362 439 508 332 456 412 243 340 310 179 236 291 -7 143 109 -38 68 16 -100 -59 -105 -240 -150 -242
1329 -242 -283 -238 -250 -400 -354 -332 -486 -336 -399 -378 -339 -416 -379 -314 -411 -350 -304 -383 -245 -260 -316 -180 -158 -275 -141 -63
1355 -63 -175 -22 1 -118 101 78 14 170 197 102 243 266 170 349 338 263 362 382 274 417 361 302 402 329 341
1380 341 402 295 276 317 203 310 281 137 169 178 38 131 189 -15 13 -8 -126 -155 -197 -250 -189 -216 -339 -256 -256 -344 -269
1407 -269 -267 -385 -252 -344 -493 -312 -334 -410 -285 -402 -373 -279 -307 -306 -238 -294 -258 -200 -237 -117 -118 -128 -63 -24 -57 71 69 28
1435 28 213 206 132 192 254 227 329 315 233 383 382 333 397 407 324 434 375 405 378 393 361 324 345 290 318 263 296 241 180
1464 180 169 143 92 82 41 -32 -15 -59 -109 -98 -90 -209 -170 -236 -210 -260 -280 -303 -331 -365 -375 -366 -404 -386 -396 -421 -434 -393 -352 -363
1494 -363 -374 -260 -309 -266 -242 -227 -211 -154 -136 -125 -140 -53 -96 -41 30 65 45 145 115 121 181 202 258 282 258 281 281 314 359 344
1524 344 336 332 386 387 335 282 290 351 300 349 215 247 256 143 189 184 120 175 141 44 51 9 -40 7 -73 -85 -127 -150 -134 -255 -198 -231
1556 -231 -325 -311 -293 -253 -329 -319 -353 -268 -370 -317 -327 -365 -292 -294 -241 -217 -220 -233 -229 -196 -136 -129 -107 -102 -74 -18 4 13 66 125 89 136
1588 136 142 182 246 218 230 244 222 299 322 275 353 293 323 334 360 316 321 293 286 353 250 230 249 202 133 143 117 151 68 74 38
1619 38 78 -23 -83 -33 -111 -127 -135 -179 -173 -179 -270 -249 -277 -292 -269 -322 -369 -302 -305 -336 -287 -308 -323 -284 -295 -326 -183 -326 -231 -263 -215
1650 -215 -156 -155 -126 -109 -66 -63 17 -49 33 104 147 56 168 172 174 236 212 246 239 297 304 282 296 313 326 341 319 294 334 308 352 281
1682 281 285 246 248 191 234 189 144 131 105 124 35 -14 21 4 -105 -59 -82 -181 -191 -168 -187 -196 -169 -256 -252 -277 -264 -245 -324 -323 -309 -306
1714 -306 -298 -348 -323 -330 -231 -273 -263 -205 -198 -210 -150 -212 -152 -100 -153 -100 37 16 41 40 40 84 76 97 151 202 147 221 243 267 205 272
1746 272 249 325 338 320 294 271 223 302 339 234 249 229 210 196 192 116 187 147 78 131 76 18 44 1 -80 -54 -69 -168 -142 -102
1776 -102 -202 -135 -254 -182 -117 -168 -153 -204 -259 -413 -340 -381 -201 -291 -266 -334 -217 -267 -235 -186 -205 -181 -153 -105 -174 -89 -101
1803 -101 -83 -47 -47 22 31 76 69 127 127 159 189 125 181 246 230 248 309 247 300 275 246 323 289 254 325 292 237 248 269 253 213 168
1835 168 189 180 163 92 70 71 49 19 -2 -27 -24 -43 -81 -113 -167 -149 -172 -156 -249 -197 -268 -264 -252 -288 -249 -279 -309 -275 -328 -352 -299 -234
1867 -234 -346 -320 -209 -204 -145 -249 -211 -191 -139 -204 -16 -104 -111 -20 40 85 31 128 180 103 112 251 265 156 100 187 166 313
1895 313 285 336 306 277 345 229 414 294 221 265 312 208 313 209 192 256 138 238 162 187 74 115 -48 -53 9
1920 9 -46 -65 -77 -51 -66 -80 -91 -155 -158 -127 -134 -235 -209 -195 -229 -265 -199 -249 -320 -207 -224 -284 -249 -277 -206 -225 -220 -106 -102 -215 -115
1951 -115 -154 -20 25 -47 -71 36 -60 79 17 90 113 87 137 132 60 190 247 170 212 195 222 250 309 275 223 269 242 217
1979 217 224 129 203 179 172 181 159 150 128 96 170 18 26 62 -5 29 6 -46 -90 -134 -85 -127 -99 -156 -119 -191 -178 -261 -216 -272 -193 -143
2011 -143 -223 -217 -208 -327 -150 -270 -181 -214 -101 -180 -130 -300 -107 -140 -81 -101 -214 6 61 -20 -57 -89 125 233 10
2036 10 37 -36 189 118 166 189 129 236 -11 129 374 261 14 309 175 127 56 118 232 230 -68 319 377 187
2060 187 112 275 257 209 -28 188 125 82 16 -136 -24 -199 -200 -37 -143 -167 -196 -237 71 -327 -393 -274 -210 -220 -420
2085 -420 -375 -178 -266 -50 -112 -272 -253 -129 -367 -175 -478 -77 -191 -337 -194 -181 -2 -111 103 -58 -265 -61
2107 -61 26 64 179 214 149 231 68 87 116 185 468 194 -103 365 277 60 254 233 242 318 252 442 5 324 638
2132 638 159 374 146 239 347 184 334 -252 -28 25 -87 -131 75 75 -244 118 -98 -131 -94 2 -357 -58 -325
2155 -325 7 1 -408 -10 -194 -256 -270 -280 -219 -115 -94 -136 54 -460 -83 -153 -275 83 -130 -87 -71 -107 -104 -150 -134
2180 -134 98 -12 179 0 79 184 -78 62 -21 422 34 -20 448 299 372 295 423 304 295 55 78 133 435
2203 435 564 128 245 114 -151 37 209 319 180 -129 95 -43 205 -41 1 134 63 46 -59 76 39
2224 39 -17 -22 -301 43 -227 -531 -241 -203 -175 -257 -420 -436 -245 -156 -329 -213 -44 -173 -260 -150 -293 -322 -175 -111
2248 -111 -233 -160 -157 31 -139 -98 21 -76 41 -33 16 134 53 85 104 135 153 176 142 203 195 193 166 231 185 220 220 177 217
2277 217 255 258 208 168 136 158 163 71 121 92 102 67 122 55 45 27 29 -24 -60 -43 -87 -50 -89 -137 -145 -170 -88 -132 -141 -135 -182 -219 -163
2310 -163 -233 -161 -169 -204 -179 -153 -162 -199 -177 -153 -187 -121 -153 -172 -124 -91 -25 -15 -13 -22 9 25 104 76 62 88 120 117 132 126 136 128 174
2343 174 175 191 191 167 200 219 189 265 245 232 171 182 243 188 124 163 107 140 64 30 86 21 52 18 9 20 11 -100 -81 -41 -79
2374 -79 -125 -98 -147 -110 -195 -146 -164 -163 -207 -200 -183 -155 -158 -177 -172 -216 -152 -185 -173 -124 -185 -151 -156 -77 -125 -47 -31 -73 -61 -2 36 30 17
2407 17 44 113 101 108 145 122 102 108 193 125 163 196 137 176 219 205 212 201 151 260 195 155 172 166 138 196 136 139 102 72 71 62 96
2440 96 84 15 46 2 -18 -18 -46 -33 -89 -106 -110 -121 -145 -149 -200 -160 -194 -144 -189 -185 -151 -164 -231 -185 -172 -134 -182 -196 -189 -170 -147 -169 -144
2473 -144 -114 -105 -65 -37 -28 -22 -60 15 60 -8 35 75 76 107 100 132 124 129 166 153 176 156 206 180 204 262 179 158 203 224 105 95 115
2506 115 199 183 146 72 80 104 96 52 30 27 23 -18 -9 -71 -33 -48 -61 -69 -31 -138 -159 -101 -113 -124 -132 -184 -161 -192 -142 -135 -173 -147 -146 -146
2540 -146 -207 -153 -142 -111 -136 -128 -120 -106 -56 -84 -58 -81 -2 -22 -13 -17 13 29 -50 79 89 62 136 150 109 119 155 175 154 164 192
2571 192 173 109 163 156 186 114 144 152 153 158 166 109 137 103 56 46 117 3 14 13 42 -7 -65 -35 -49 -34 -95 -90 5 -13 -168 -119
2603 -119 -69 -198 -107 -148 -42 -56 -47 -192 -236 -185 -154 -77 -99 -308 30 -177 -203 -93 -266 41 2 -83 -58 -35 -42 -2
2629 -2 38 156 200 -36 10 169 240 110 57 190 244 18 230 174 295 149 164 288 183 478 70 19 321 38
2653 38 73 84 -120 177 192 47 165 -11 -68 174 -104 65 20 55 -22 56 -44 -34 -95 -11 -128 64 -137 -107
2677 -107 -81 -50 -248 -121 -310 -361 -181 21 -26 -264 128 -106 -179 -147 -137 -146 -138 -60 -75 -177 -102 -5 -128 -111 -48 -34
2703 -34 -40 -42 17 -47 -62 -15 96 -118 239 -22 77 215 120 24 207 108 61 76 89 26 -94 125 97 67 133 31 177
2730 177 186 118 21 121 123 21 59 -19 135 65 17 166 -72 -4 41 107 -12 17 -134 -239 89 -46 -188 -144 -249
2755 -249 -333 -35 -74 -300 -81 -34 137 -111 -302 -280 -52 28 25 -72 104 15 41 11 -114 36 -26 111 -103 -200
2779 -200 -117 25 -64 -128 30 -72 145 11 99 -143 27 222 48 187 318 192 52 41 -28 380 107 147
2801 147 -96 53 180 75 42 73 90 132 100 188 129 33 -119 -40 72 -16 -87 -80 -13 -22 192 -169 -35 -11 -175 -30
2827 -30 -107 -46 -314 -270 -311 -181 -253 -19 -255 -207 -101 9 -110 -204 -44 -128 -229 -6 -50 39 -32 -50 77 22 -72
2852 -72 -109 7 58 -15 31 320 85 19 -35 363 139 212 129 205 199 201 152 37 304 204 376 -44 72 122 220 72
2878 72 119 121 25 197 47 -46 92 202 111 72 7 155 -232 -12 60 38 -15 -57 268 -188 -346 146 109 -189 -140
2903 -140 -203 -235 -217 179 -169 -148 -253 -169 -8 -259 -159 -69 100 91 233 -343 -37 -293 -81 -416 -190 13 18
2926 18 -297 28 47 326 16 38 -86 362 101 273 13 -220 76 -41 127 15 288 391 5 234 209
2947 209 -124 -121 262 209 23 157 416 -55 48 235 173 -52 51 18 60 89 37 -204 55 152 -22 -114 26
2970 26 -133 -83 -86 -154 -128 -23 -68 -126 -108 -90 -132 -133 -58 -102 -125 -180 -108 -97 -136 -87 -96 -103 -107 -51 -99 -45 -50 -56 -61 -28 -32 3 -25 -41
3004 -41 60 -26 119 26 40 67 41 30 101 185 -142 -78 21 139 -271 223 -47 467 230 343 94 208 258 203
3028 203 40 109 83 21 51 58 41 49 -128 8 229 -102 -111 -142 -32 -18 -73 -67 84 187 -59 -126 62 87 -415 -105
3054 -105 10 -128 -256 -164 -91 -31 -263 -182 -127 -58 -92 -240 3 -172 -49 -135 -16 -60 20 -37 -17 7 -21 -51 11
3079 11 -21 13 39 24 -1 70 23 53 70 73 82 85 113 116 72 125 95 73 104 64 54 114 94 59 139 117 53 42 46 89 53 107 14
3112 14 32 23 23 11 -3 -22 -16 1 -10 -8 -85 -54 -55 -108 -63 -111 -88 -107 -152 -61 -115 -100 -98 -147 -91 -100 -96 -103 -112 -50 -93 -122 -97 -86 -72
3147 -72 -73 -85 -24 -41 -28 13 -17 31 10 -1 68 21 51 88 75 56 80 95 113 68 131 83 55 106 85 111 142 94 122 139 79
3178 79 62 67 120 70 57 79 64 88 42 5 28 -1 29 13 -37 -44 0 -43 -45 -93 -82 -74 -83 -53 -108 -78 -103 -115 -104 -91 -95 -148 -112
3211 -112 -97 -150 -52 -86 -52 -63 -93 -16 -75 -39 -72 -66 -60 9 6 -35 36 37 29 68 28 65 48 99 116 43 82 109 67 42 52 39
3243 39 141 107 109 50 103 118 48 33 189 65 122 93 -4 164 136 83 8 106 39 -67 87 35 125 -61 -117 4 -143
3270 -143 -25 -3 81 -107 -29 -141 -74 -125 147 -584 -388 -80 -110 -188 -337 -145 -96 -12 -155 -236 -92 -194 -84
3293 -84 -39 -27 -42 5 -103 46 -74 -197 22 -77 -187 -8 -27 315 81 -67 40 7 32 69 61 102 36 74 65 72
3319 72 106 46 73 89 77 123 84 115 74 82 110 39 121 58 41 15 68 35 25 38 1 29 0 -9 -88 -51 -60 -48 -16 -62 -4 -93
3351 -93 -50 -89 -87 -63 -114 -43 -76 -89 -129 -40 -141 -79 -113 -80 -29 -81 -49 -101 -75 -100 -42 -25 -38 -3 24 -1 -70 -11 24 30 57
3382 57 24 29 26 59 69 59 113 68 100 57 41 96 77 79 119 83 74 105 86 140 90 107 57 24 82 25 28 18 15 8 17 -2 37 39 -37
3417 -37 -3 10 -81 -52 -9 -46 -42 -65 -84 -139 -60 -62 -83 -79 -50 -50 -145 -65 -91 -59 -88 -74 -53 -60 -97 -13 -114 -63 -18 -34 -20 -68
3449 -68 -17 4 -38 19 56 32 23 31 47 15 111 70 79 47 56 61 65 35 -25 115 35 147 71 44 143 108 14 92 125 140 83 88 -6
3482 -6 20 68 37 18 78 49 -3 17 13 -1 -47 -40 25 -37 -54 -12 -20 -62 -124 -86 -22 -96 -129 -117 -73 -142 -56 -95 -76 -61 -56 -161
3514 -161 -65 -39 -88 -30 -110 -56 -51 -15 79 -41 -25 -35 -22 -6 13 50 74 35 -13 42 -12 78 105 96 163 131 113 80 124 50
3544 50 78 55 166 110 83 200 54 -7 199 21 81 58 -13 68 53 69 3 51 14 60 6 10 -35 51 -73 -49 -10 -92
3572 -92 -90 -53 -66 -71 -90 -84 -78 -52 -104 14 17 -80 -52 46 -56 -23 -60 -45 -40 -14 -71 -70 -73 -62 -55 -57 -52 -74 0 8 22 48 78 11 99
3607 99 42 -11 86 89 50 56 87 124 119 138 88 86 129 118 17 42 -26 133 71 21 108 -3 132 8 37 -28 74 59 -2
3636 -2 159 71 24 -3 -46 -11 33 -67 78 91 -192 -207 -30 -47 -92 142 -1 -54 -119 -165 43 69 -183 71 -45
3661 -45 -70 37 -85 -112 -63 -63 -18 -26 53 33 156 -73 -61 50 -23 -1 -7 25 -1 38 16 76 7 8 52 11 118 172 99
3690 99 77 66 63 29 68 62 76 95 83 29 63 65 73 107 88 51 33 74 40 -28 -41 28 58 35 2 -2 76 -28 0 -25 44 -36
3722 -36 3 -61 -64 -105 -101 -68 -62 -78 -72 -99 -76 -47 -47 -40 -108 -107 -36 -30 -79 -61 -1 -61 -8 12 -51 -2 -8 -26 2 -51 -20 79 13 34 33
3757 33 9 49 36 25 25 59 48 49 69 38 43 92 27 87 53 83 65 73 74 86 55 96 -10 39 73 70 75 4 23 29 -24 -3 7 6
3791 6 -11 -30 -12 -93 -3 -68 -18 -28 -10 -112 -103 -69 -73 -29 -71 -80 -126 -123 -81 -88 -102 -91 -76 -35 -58 -71 -54 5 -73 -16 -42 -49 -18
3824 -18 -47 -28 36 -23 35 43 13 29 4 63 85 26 42 105 39 64 94 110 85 43 67 96 56 -9 22 52 66 82 10 88 53
3855 53 48 65 24 31 50 25 10 72 -3 -56 58 6 7 -32 -8 -82 -38 -54 -87 -45 -50 -49 -41 -65 -64 -70 -59 -66 -81 -80 -56 -64 -43 -47 -49 -12
3891 -12 -69 -82 -40 -9 -41 -44 -30 38 -3 17 -44 15 22 7 4 58 50 43 65 61 9 50 92 25 53 42 84 26 62 104 89 103 31
3924 31 49 69 52 28 104 33 69 -35 4 38 -20 45 34 -38 -63 15 -31 -29 -49 -42 -38 -65 1 -17 -58 -39 -105 -3 -39 -41 -33 -79
3956 -79 -66 4 -98 -18 -52 -39 -55 1 -36 -6 -90 -28 -41 -23 -40 26 -40 -7 13 -33 7 -12 12 31 42 28 39 127 45 -1
3986 -1 40 115 66 36 79 117 75 35 113 100 26 51 62 78 45 80 73 -20 52 66 50 -6 93 -20 11 16 30 21 -56 -47 -39 -65 -54
4019 -54 -11 -62 -62 -25 -43 -88 -89 -74 -62 -65 -43 -87 -12 -77 -135 -83 -145 -44 -66 -55 -52 71 -98 -11 -115 106 49 21 9 -75
4049 -75 -152 18 27 164 105 83 8 20 42 57 105 10 168 37 103 33 217 100 81 147 5 149 103 153 4 238
4075 238 56 63 14 54 -22 166 -50 -63 167 94 55 85 122 105 -113 -22 218 157 -25 -18 -124 -296 10 -164 -87
4100 -87 -45 -25 -243 -177 -269 34 46 -132 -126 43 -48 -83 -37 -46 -48 -152 24 -61 306 41 75 -125 83 98 -101 45
4126 45 87 -46 139 47 60 -272 129 121 96 190 42 309 -396 163 -50 187 -229 261 142 284 43 91 28
4149 28 -132 178 -20 26 49 -56 65 45 17 36 -72 -41 69 -129 -70 105 -210 -82 -130 -31 -121 -40 0 188
4173 188 -95 -62 -92 -26 99 -137 -136 47 104 -708 -488 137 -29 -424 -256 -201 22 123 18 -19 -39 35 -458
4196 -458 -126 109 20 221 -203 202 -190 -106 -127 -34 139 -117 -71 161 27 143 -57 -130 -56 19 83 -1 99
4219 99 159 5 63 225 -117 286 131 -106 -111 -93 79 -136 211 -147 -162 -12 148 42 45 139 -120 190 -54
4242 -54 262 8 -51 -203 -13 -304 -61 121 36 -244 -179 20 64 -43 -146 -94 -156 -48 64 -205 326 -67
4264 -67 29 101 3 -52 -145 -221 -35 -131 76 17 -43 83 -114 -92 136 106 15 -21 22 -69 46 -22 94 7 41 -63
4290 -63 -50 74 -200 31 193 40 0 67 47 57 74 -70 43 84 -34 -146 13 -118 -82 17 -115 -187 -110 76
4314 76 120 71 -276 -107 -169 -23 27 104 -101 -230 -102 90 -79 -19 -56 -55 -55 26 -92 -57 -59 -30 -74 -4 -94 -15 -1
4341 -1 -62 -52 -44 20 -20 -17 -65 -7 21 15 37 16 44 28 46 -2 57 -4 25 67 29 66 19 50 38 51 18 40 57 30 34 56 20
4374 20 60 -39 65 -5 -3 112 -10 11 77 49 26 3 4 34 -25 3 10 -14 2 4 12 27 -42 -47 -10 -3 -54 -87 -49 -32 -57 -54 -22
4407 -22 -5 4 14 -50 -23 -26 -56 8 -62 8 -9 -56 -49 -18 -53 -15 0 0 59 16 41 41 12 29 36 8 7 79 48 45 53 42 88 62 24
4442 24 11 32 28 37 36 63 55 97 18 49 6 61 15 0 39 79 32 33 11 -27 -17 -34 40 -49 9 -4 -37 -7 -61 -26 -42 -36 -37 -51
4476 -51 -46 -25 -83 6 -1 -62 -62 -80 -22 -52 -19 -33 -56 -45 -46 -5 -26 -20 -61 -30 10 8 -7 -14 -5 -15 -14 -15 39 55 22 40 -24 50 40
4511 40 35 30 89 46 13 15 59 43 100 17 31 37 42 74 40 63 4 8 38 32 23 111 22 -45 -3 -29 -32 -44 35 -12 -7 3 -50 -53 -57 -48 -15
4548 -15 -68 -30 -77 -38 -49 -19 -61 -15 -28 -22 7 -54 -19 -81 -60 -54 -49 1 -14 -10 -35 -38 -45 -23 -32 -26 -16 5 15 59 18 42 15 8 35
4583 35 -29 33 49 90 93 -6 -38 179 85 235 34 113 -47 44 195 -140 66 229 -121 58 391 31 -5 327
4607 327 -14 313 145 -88 -5 -64 -135 -69 -141 -35 29 -37 -118 -94 -353 -95 -158 -174 52 -196 86 -239 -26 -55
4631 -55 -298 -75 -26 -132 76 -44 154 -153 -70 91 -136 -152 -171 -96 -12 -107 -51 -147 -102 -3 74 189 -44 175
4655 175 63 24 -40 115 -34 13 37 42 -73 100 41 177 21 18 20 123 1 5 32 -72 350 -101 24 145 -15
4680 -15 61 -91 -135 -151 222 -93 -17 158 -172 -105 103 25 0 7 -15 16 -8 -26 -26 -56 -23 -37 -59 -94 -57 -44 8 -13
4708 -13 -81 -52 -44 -17 -10 -2 14 50 -25 -25 -14 -47 -15 12 11 10 0 45 29 40 -5 38 -12 54 29 21 56 28 42 20 38 99 61 20
4742 20 45 16 18 38 38 52 22 22 44 60 27 0 54 19 36 -4 22 17 -43 -23 17 -25 1 2 2 -84 -69 -45 -2 -27 -55 -30 -21 -52
4776 -52 -39 -65 -19 -67 -15 -30 -35 -59 -79 -70 -14 -54 -3 -24 -11 -15 22 -4 -15 11 -57 -50 -84 95 -4 -141 74 49 -83 111
4806 111 -6 36 -20 51 12 47 4 65 57 40 58 1 50 76 13 -9 13 -4 -7 -7 35 19 69 15 81 -4 -5 3 10 -32 32 5
4838 5 0 -8 -14 -32 -77 -21 -36 -44 -9 -32 -65 -50 -47 -44 -41 -16 -33 -19 6 -36 -1 -16 -32 -22 -34 -49 -44 -49 -39 16 -51 0 -5 -16 49 19
4874 19 -7 22 86 -5 -5 59 -22 83 23 48 -42 89 15 42 25 39 54 42 10 48 73 54 43 -26 65 66 32 52 24 -10
4904 -10 50 -20 48 -8 -27 56 14 -9 -8 -4 11 32 0 11 43 7 -2 -33 -42 -7 -20 2 -46 -52 -10 -45 8 -26 -1 -36 -70 -49 -54
4937 -54 -25 37 -52 -71 0 -11 -39 -25 10 10 12 8 3 -4 15 20 31 15 14 75 -1 14 41 70 17 48 43 14 -24 46 25 25 19 31 8
4972 8 4 42 0 41 -13 -3 0 14 -51 27 31 34 44 -26 -20 -14 -1 28 19 -26 -27 -48 -41 -32 -60 -33 -3 -29 -37 -53 -19 -42 -49 -61 -32 40 -23
5009 -23 0 -51 -30 21 -6 -17 5 -30 -38 10 25 -1 12 -28 -22 -12 7 7 -2 9 12 43 31 57 55 62 51 39 42 -3 28 58 13 -8
5043 -8 24 60 -8 58 24 39 37 16 46 18 -7 -6 43 -3 11 23 8 12 29 2 -4 -21 -55 -24 -28 -8 1 -12 5 -44 -29 30 -1 -29
5077 -29 -36 -16 -42 2 28 -35 -9 -80 -22 -54 -38 15 -36 -21 -43 12 -25 0 -93 -9 -1 -27 -5 -3 10 -36 51 56 -5 -26 27 31 48
5110 48 13 36 22 4 7 74 26 37 69 24 35 -12 6 53 22 12 41 10 44 46 67 9 5 40 -12 -38 -20 -49 -3 -11 14 -37
5142 -37 10 -1 28 -2 -46 -14 -40 -36 -24 -11 -46 -1 -42 -57 -4 -37 -10 -55 -51 -90 -25 -32 -64 7 -42 30 -34 -17 -11 2 -30 18
5174 18 50 -17 18 65 -38 28 -41 -14 55 10 39 27 11 26 20 76 53 -26 34 42 16 44 54 1 27 2 -11 35 85 9 44
5205 44 -14 9 8 23 37 -59 22 -21 -8 14 40 -32 26 -57 -16 49 -31 -70 -52 -25 -34 -8 -24 -33 -24 -53 3 -26 -27 17 -24 17 -53
5238 -53 -55 -30 -9 -37 -11 6 8 -32 -29 -51 -31 7 2 1 13 -12 34 6 -15 18 36 -10 63 34 -7 68 25 13 52 1 59 6 5
5271 5 -18 -11 39 -29 5 82 -3 12 35 25 50 33 -7 39 15 4 35 -5 8 -13 3 -5 -26 20 -7 -57 -35 -40 -30 -61 -22 -66
5303 -66 -23 -29 -11 -39 -4 -11 -66 -205 14 -17 -24 -5 32 -58 -23 -90 -39 -11 146 -151 171 139 84 38 -109 132 84 254
5331 254 98 18 -22 -6 -13 -52 28 -41 15 4 27 -6 2 49 52 5 -6 31 0 6 -30 17 44 51 -6 -19 -10 -11 17 3 -13 32 28
5364 28 -22 -11 -14 -47 -6 5 -53 -4 -72 -3 -49 -38 -9 36 -22 -33 -32 -72 -21 -11 -33 -40 -27 -32 -63 7 -4 10 12 46 -32 -49 -31
5397 -31 -17 41 -21 55 24 56 9 29 23 -15 -1 11 -11 26 3 54 60 52 55 12 -29 7 23 -1 0 -40 -22 36 -8 39 22 -42 46
5430 46 19 -14 7 -5 15 -6 6 58 8 1 48 -13 -31 -26 7 -49 -24 -46 -31 -24 -47 -18 -33 10 -59 -36 -73 -57 -33 -52 -73 -50
5462 -50 38 5 -10 -29 1 -23 -3 57 3 -32 1 47 7 -5 -23 14 56 16 33 43 17 23 49 70 70 61 54 61 65 -52 62 13
5494 13 43 20 49 28 15 -8 20 38 -9 32 -10 5 -13 -2 30 -52 26 35 14 26 -5 -35 -34 -36 -16 -9 -42 26 -16 -38 36 26
5526 26 -28 -18 -6 -35 -26 -19 -26 -30 -66 -26 -3 -8 0 -4 -10 -12 -28 40 -40 -7 -7 -50 35 3 23 -54 -3 -19 -2 -4 10 41 41 24 22 40 31
5563 31 20 47 39 0 32 33 63 26 53 46 62 19 16 -10 -7 -4 2 16 -19 62 -19 9 -29 -2 9 -12 -27 -37 0 35 -9 9 -15 -39
5597 -39 -28 -33 -15 6 -52 2 -18 -31 10 -24 -21 -1 -13 13 -22 0 -28 -21 -6 29 -5 5 -13 -17 40 -9 -3 -3 -4 20 23 6 11 53 8
5632 8 -68 -3 61 7 -11 43 22 23 31 60 5 53 72 15 36 3 3 -14 12 39 4 -13 12 56 36 15 13 -45 16 40 8 42 -14
5665 -14 -18 1 7 -33 -38 -13 -78 -17 -13 -5 23 -11 -8 -26 -32 -32 1 -16 -79 23 -7 -36 -37 -43 -12 5 8 -29 -10 -70 -44 -22 21 27 39 74
5701 74 29 17 -11 18 29 9 26 25 -33 51 8 -11 25 50 11 87 43 83 45 42 21 16 14 13 -9 -8 35 -29 35 15 29 64 -15
5734 -15 -10 0 1 41 18 21 6 -13 -23 0 -9 28 -24 -24 20 36 11 -38 5 44 -19 -18 2 -15 5 5 3 -30 -66 -58 45 3 24 3
5768 3 -1 7 -28 -28 -18 0 6 -29 -24 29 61 -31 58 -5 43 -15 -8 36 -38 59 6 33 52 -20 65 25 19 8 7 -34 32 -18 2 84 -9
5803 -9 46 10 41 -72 36 -31 -5 21 26 -57 -25 20 -49 -13 -53 10 -3 -43 -20 11 14 -15 29 37 -16 -35 -17 28 -16 -2 -31
5834 -31 8 6 2 -4 -17 -16 -56 5 -34 -11 16 -48 0 58 -13 -31 26 -16 36 2 15 -11 -2 0 31 33 -10 37 24 83 26 62 -1 -4
5868 -4 35 29 32 17 18 5 -34 1 30 15 45 -29 16 9 12 0 -8 38 -3 58 -19 20 -1 -19 -34 -18 -50 -19 -62 16 -27 -35 -29 -39 -13
5903 -13 -3 -31 -21 -26 -4 -39 -16 10 33 -31 -14 52 -11 -28 5 7 -47 29 15 -11 -40 59 -16 16 -4 18 19 59 16 31 53 5
5935 5 51 -6 51 10 52 22 22 65 -2 -18 -46 12 28 20 27 17 16 -5 -15 6 9 -4 30 -4 10 -1 0 -16 11 -12 -2 29 -74
5968 -74 -14 -11 -11 13 4 -27 -80 -12 -31 -35 4 -22 -52 -11 -28 -4 -51 23 -60 -21 -26 -36 -18 13 -45 -30 -25 8 26 -11 -34 -15 44
6001 44 36 59 14 19 19 68 5 16 44 9 38 36 76 57 12 -24 -32 36 -14 -11 12 3 15 12 24 59 27 58 40 24 52 8 -57 28
6035 28 22 26 9 -2 30 5 -31 -4 -19 48 -17 -6 0 0 -4 -5 30 -23 -11 -48 15 -18 -5 -17 -11 -51 -77 -25 -12 -91 31 -24 -17 -12
6069 -12 -10 -32 -21 -3 -6 -6 10 68 33 18 -16 15 52 24 47 -10 3 27 48 46 5 71 44 12 9 28 7 -47 44 10 27 1 6
6102 6 23 57 36 -15 -6 -31 4 -38 -32 42 3 -35 -23 -18 -17 -5 14 23 -18 -25 -10 -29 6 -50 10 -65 -29 -17 -5 12 -44 0 21 -7
6136 -7 -15 -31 -20 14 3 20 -71 16 -66 55 20 -11 10 -8 -15 38 42 15 31 -17 -9 4 6 57 51 68 34 46 24 62 35 -14 7
6169 7 44 11 23 -15 17 -7 -10 -19 32 -16 -38 -11 -55 -43 48 -9 -31 -25 -52 -3 -8 -46 -12 28 3 -30 -3 15 65 -26 -32 -29 7 -25
6203 -25 2 -52 -8 -54 -34 24 -2 -14 -58 38 0 60 29 -47 -4 6 -35 -18 20 30 24 12 48 23 16 60 16 58 24 7 60
6234 60 5 60 4 -31 39 32 58 19 73 20 30 39 -33 27 14 50 25 -29 21 23 37 -4 -31 -40 -19 25 -38 -25 7 5 -4 6 -12
6267 -12 -32 -38 -77 -71 -25 -17 -29 32 12 -29 -17 -12 -25 -40 17 -44 -39 -4 -14 5 22 -43 9 9 -23 6 -3 25 16 59 24 -21 35 38 15
6302 15 -33 26 43 -3 64 21 7 -24 1 -17 -3 -13 -13 58 25 -5 34 11 62 2 31 42 33 10 28 -20 1 30 38 24 20 -13
6334 -13 -41 42 46 42 -10 -28 -6 -34 -12 -25 -31 -1 -6 -68 0 -24 -22 -36 1 -19 -27 -36 -27 -22 52 -55 25 -20 25 -18 12 1 -35 -14
6368 -14 4 -30 6 -34 14 57 12 37 -51 38 -10 -1 52 57 12 29 24 10 24 -24 51 7 29 21 -7 13 6 -2 -12 60 30 -7 -13 -9
6402 -9 46 6 71 31 -29 14 4 28 8 45 28 24 -23 -36 25 -46 20 3 -23 12 -49 -50 -51 -13 -41 -70 -23 -29 -45 12 45 1 -6
6435 -6 24 9 -37 -16 39 -36 9 46 37 -4 70 19 9 -36 38 -20 23 -26 8 26 78 -21 -10 61 -37 -1 7 -20 46 33 8 19
6467 19 16 24 -25 -10 10 8 -20 26 5 2 -29 14 34 56 3 -10 8 32 15 26 -35 -21 -56 16 14 -17 -27 7 24 -40 12 -60 -6
6500 -6 -19 18 -14 -68 -22 -37 -4 -18 18 8 -43 -26 30 -19 -8 19 -9 -6 10 -49 5 -9 43 0 15 68 12 79 48 44 37 62
6532 62 -12 -14 21 -19 -29 35 34 11 -17 -7 24 -22 41 -45 42 26 -21 31 56 -42 -43 -3 -33 15 14 14 25 -54 22 -78 173 57
6564 57 5 60 7 133 4 33 27 -10 -15 -42 -10 -39 90 3 74 -42 88 -81 -33 -39 60 -54 -64 112 116 30 -2 99
6592 99 52 -11 -12 102 21 23 2 -26 7 5 -42 -55 -40 148 16 -6 15 -91 84 12 35 -30 -65 30 71 -70 75 179
6620 179 -75 59 109 13 98 -86 -28 -14 72 26 170 -74 180 -34 -71 71 49 158 -65 34 -12 -194 13 71
6644 71 68 41 -193 -75 -4 -60 38 -13 -29 -371 -97 97 -67 197 24 80 -145 55 -31 -151 74 41 -76 70
6668 70 -83 93 -30 -142 -133 109 -175 53 -211 -15 37 -17 -71 77 16 39 43 5 39 -12 -14 12 7 -1 -22 -10 30 18
6696 18 40 2 -10 -48 6 7 31 13 -56 16 7 2 -20 -7 8 -39 9 15 25 -12 -11 -6 -51 -10 11 -3 -55 -16 -2 2 -9 -1 -40 18
6730 18 4 5 -68 -35 -21 -9 -29 6 11 7 14 -28 -9 -52 -26 17 8 13 -33 4 -8 53 -3 51 30 13 -11 10 26 32 19 64 -45
6763 -45 32 10 7 37 13 18 -5 32 26 23 22 29 -13 12 35 12 4 -5 11 -36 31 12 -27 52 -20 -18 8 -5 -12 -67 -33 -39 -62 14 -46 -36
6799 -36 8 11 -25 -20 -12 -89 -35 -1 -35 -44 -28 -5 -5 38 -37 -44 -32 24 -31 -13 17 58 12 17 -8 -30 17 39 7 41 -12 20 38 13
6833 13 -15 12 -23 -7 -9 33 3 15 40 60 14 -23 49 44 30 17 34 -23 29 2 12 6 33 -11 -9 16 -8 38 24 -39 18 -10
6865 -10 -42 -2 2 -19 -32 10 -54 -15 8 0 -41 -62 -22 12 -2 -6 -14 -41 19 -18 31 7 44 20 -3 18 36 -27 -31 -2 17 28 26
6898 26 31 -40 34 -21 -37 45 -11 14 -8 36 30 12 36 43 -1 61 -2 19 -21 -23 34 10 11 7 7 9 35 40 3 29 13 1 -12 2 -15
6933 -15 -44 21 -19 17 1 19 -81 -4 -7 -42 -6 50 3 32 -30 -58 -49 -19 20 -31 -15 40 33 -34 1 11 -20 32 29 -27 -8 3
6965 3 -23 0 -17 25 -3 -7 24 60 -3 42 -83 -6 24 9 37 88 -43 -162 68 -57 317 60 62 88 -104 180 416
6992 416 48 42 5 -72 64 -14 -56 36 -67 16 -6 -21 -15 -28 1 -27 -10 24 -12 5 -22 14 -5 -49 11 -67 -31 -21 28
7021 28 -13 -8 -33 -10 -17 0 -2 -23 -71 32 45 -13 -29 -5 42 -35 2 -7 0 -39 -10 23 1 -39 -11 5 -50 -1 13 2 -20 -5
7053 -5 11 22 -28 -26 -9 75 2 -41 44 23 24 -5 26 44 -20 34 46 26 -20 77 29 4 28 7 -15 5 7 8 -15 17 29 5 35
7086 35 -1 54 -15 -25 50 -37 2 -17 5 -3 -12 -14 -8 -43 30 1 -45 -8 -61 -11 -1 11 1 -24 -46 -21 -46 13 9 9 -12 7 10 15
7120 15 1 17 3 19 29 25 19 11 39 -18 31 56 25 -35 28 39 35 23 -9 -23 23 1 -3 11 53 24 28 51 34 22 16 -23 -18 21
7154 21 -26 -25 8 14 26 -15 98 -68 13 -13 37 -19 -24 34 -10 27 40 -44 -170 47 4 -87 -94 -46 56 34 -47 40 57 26
7184 26 -80 -8 -1 26 79 48 -69 131 -63 -118 -321 70 109 4 -136 -28 143 157 -153 -84 -29 -29 289 -120 12
7209 12 199 99 -14 -57 -44 -170 14 -268 113 -101 -168 -164 67 51 -93 62 17 -42 10 8 7 -25 -49 -48 29 24 -28
7236 -28 -32 23 -8 4 -43 -10 -42 3 8 16 -28 -2 -29 10 -28 -10 -2 -21 15 -8 56 -13 -23 -55 -31 -25 -34 -22 -44 27 -6 -25 25
7269 25 -64 -4 -21 -15 -5 -19 24 10 26 6 -27 -10 32 -27 2 7 -11 1 32 41 16 -18 -22 9 77 32 -13 19 -13 36 -7 -15 12
7302 12 53 -22 31 -20 44 -1 10 26 -2 -17 29 -33 -42 40 -23 41 5 29 -17 -43 -38 3 -27 30 -45 -5 -7 -56 -11 -27 -11 28
7334 28 23 -12 -64 -38 30 38 47 -32 16 -16 -3 -12 1 -16 -21 -8 -58 -15 -4 7 30 18 -13 26 -6 -15 20 -14 2 58 21 0 13
7367 13 68 24 19 39 -1 6 0 32 2 6 39 32 0 -2 -39 6 26 12 29 -3 -41 -41 49 -6 0 -22 -20 -33 -40 -11 -23 -9 13 -20 15
7402 15 3 -50 -1 53 19 5 35 7 38 -1 -5 43 -26 24 41 -17 -50 -14 -9 -8 -38 23 16 -4 11 0 -30 -51 -1 4 8 27 19 49
7436 49 -13 -28 20 32 41 34 26 5 20 45 -3 -3 37 68 -23 9 -9 44 -14 -4 -14 3 -41 19 22 22 4 -42 -15 -19 16 15 -9 39
7470 39 -30 -50 31 15 2 -30 -46 -21 26 -62 18 -62 -65 -23 0 31 62 -19 75 -15 -27 41 -9 -27 32 47 0 -60 2 -16 13
7501 13 0 28 -37 -22 -42 -4 2 33 43 29 -3 30 -11 42 -29 10 80 25 43 -13 13 1 -2 -27 -22 2 -53 49 7 -21 19
7532 19 -27 -25 73 -32 -10 -34 3 12 -8 -9 5 10 -8 -25 -62 38 -39 0 -9 -5 10 55 -6 -5 -33 -46 11 -23 -3 -51 -49 9 -29
7565 -29 28 -12 -22 -11 12 12 -24 -66 -11 -7 21 -10 27 11 5 33 11 9 16 8 32 25 50 7 -31 -5 31 6 64 40 -9 2 7 43
7599 43 38 14 45 21 -8 4 -34 -37 0 21 6 -3 29 75 24 6 -24 13 -58 -4 -3 33 -34 -12 -30 10 -13 -62 -30 -7 -28 27
7631 27 -31 60 -24 -18 5 -44 -38 13 14 10 18 13 8 -6 -24 46 12 -4 9 24 27 -17 11 -21 12 33 2 11 82 -35 64 -24 30 -31
7665 -31 -33 29 -15 9 -17 -6 -15 -7 41 3 13 14 -17 2 33 19 -25 13 32 33 0 6 -17 11 -28 -34 -9 -1 -35 55 -10 -59 -16 -9 -19
7700 -19 15 -26 -6 19 -4 -5 -31 -30 27 -30 -9 -33 17 2 -48 -2 -59 34 -32 -2 -21 -25 70 32 -3 12 41 -7 21 17 70 53
7732 53 -8 12 -29 8 58 -4 4 7 34 4 13 9 0 50 12 28 36 27 62 -16 -8 44 9 8 -10 -35 -21 41 22 -30 -47 -2 56 -13 -1
7767 -1 25 5 -27 -8 11 -51 11 5 20 -33 23 -34 46 6 -39 -14 -18 -22 -38 -71 -10 -68 -15 10 -17 -18 11 -36 30 55 -59 -37
7799 -37 38 -31 20 -1 46 -110 -58 -5 130 -34 -36 184 93 33 -48 -98 106 198 -39 -154 186 -1 144 15 78
7824 78 23 -3 13 1 -24 7 -34 -22 15 35 88 48 -42 0 2 21 4 39 2 23 12 49 -3 -18 -14 -19 -24 38 15 4 -27 -25 -18
7857 -18 -1 -17 6 -5 11 -38 41 37 45 -7 -9 20 16 6 -16 44 5 12 -5 6 16 36 -32 -20 17 45 -24 6 -9 -3 34 -9 85
7890 85 53 53 -7 44 59 50 27 17 0 10 -4 41 -27 25 51 12 -35 -13 3 51 14 -33 -35 8 17 -7 16 -2 -37 -44 -3 -30 -55
7923 -55 -4 -30 -13 33 -15 27 51 18 41 -8 7 13 -24 -13 7 5 5 24 -21 61 -4 -4 31 57 -22 -34 0 38 -40 -3 -15 -7 -37
7956 -37 27 25 72 11 41 47 17 13 47 47 7 -36 38 7 29 -11 -13 10 -10 67 16 16 -2 -30 16 37 -16 4 -4 -4 -75 57 11 34
7990 34 -33 -19 1 59 31 -2 -16 18 1 26 -44 -4 25 -13 0 -2 61 -42 21 1 42 -15 -13 10 18 -14 -9 26 4 8 6 43 -3
8023 -3 -27 -2 23 10 13 15 -4 33 2 -6 36 -15 -17 0 -4 35 43 -16 7 2 19 -40 56 28 67 6 -3 25 32 -22 -16 0 -5 13 -22 -2
8059 -2 59 41 21 1 -38 -39 -36 -31 -30 -15 19 28 -57 18 -42 -53 -79 -11 -20 -22 -16 -19 8 35 8 -16 -2 52 42 -9 -17 -37 -8 -23 -27 34
8095 34 -10 24 34 -13 -9 -17 -15 53 21 13 -30 -3 -23 -32 2 7 -24 -32 2 -19 -13 4 49 -3 -1 -33 2 -13 -9 -9 23 -26 -13 5 11 -12
8131 -12 -3 61 8 47 17 29 -57 -20 35 -16 51 12 24 -7 21 9 -16 9 -33 19 -17 -30 15 4 -31 -43 4 -33 -14 -46 4
8162 4 -26 -29 2 -53 4 6 16 4 10 -2 -12 -13 -14 -12 71 33 15 57 23 37 42 33 13 8 19 0 -1 -7 42
8191D2
##END NTUPLES=NMR FID
##END=
