##TITLE=1H_LR-731-CR6K
 CDCl3, 8 sc, 
 23.12.2020
##JCAMPDX= 6.0         $$ Bruker NMR JCAMP-DX V2.0
##DATA TYPE= NMR FID
##DATA CLASS= NTUPLES
##ORIGIN= UXNMR, Bruker Analytische Messtechnik GmbH
##OWNER= root
$$ XWIN-NMR		Version 3.5
$$ Wed Dec 23 10:03:14 2020 Russian Standard Time (UT+4h)  she@DPX200
##.OBSERVE FREQUENCY= 200.1315066352
##.OBSERVE NUCLEUS= ^1H
##.DELAY= (6, 6)
##.ACQUISITION MODE= SIMULTANEOUS
##.ACQUISITION SCHEME= undefined
##.AVERAGES= 8
##.DIGITISER RES= 18
##SPECTROMETER/DATA SYSTEM= spect
##.PULSE SEQUENCE= zg30
##.SOLVENT NAME= CDCl3
##.SHIFT REFERENCE= (INTERNAL, CDCl3, 0, 15.7039)
##AUDIT TRAIL= $$ (NUMBER, WHEN, WHO, WHERE, WHAT)
$$ ##TITLE= Audit trail, XWIN-NMR		Version 3.5
$$ ##JCAMPDX= 5.01
$$ ##ORIGIN= Bruker BioSpin GmbH
$$ ##OWNER= she
$$ F:/spectra/data/she/nmr/H-F/1/audita.txt
$$ ##AUDIT TRAIL=  $$ (NUMBER, WHEN, WHO, WHERE, WHAT)
(   1,<2020-12-23 10:02:16.60 +0400>,<she>,<DPX200>,
      <created by zg, POWCHK disabled, PULCHK disabled
       configuration hash MD5:
       00 E9 B6 7A A2 85 ED C7 34 08 36 98 17 FE 4E 26
       data hash MD5: 16K
       99 44 3B EB 9E 43 E5 E8 52 42 41 66 D2 5E F1 A1>)
$$ ##END=
$$ 
$$ hash MD5
$$ 0D CB C8 8C 05 FB 2A 40 EE D8 E1 B2 D2 8D 15 29
##$RELAX= 
##$RELAX= 
##$RELAX= 
##$RELAX= 
##$RELAX= 
##$RELAX= 
$$ Bruker specific parameters
$$ --------------------------
##$DU= <F:/spectra>
##$EXPNO= 1
##$NAME= <H-F>
##$PROCNO= 1
##$TYPE= <nmr>
##$USER= <she>
##$AMP= (0..31)
100 100 100 100 100 100 100 100 100 100 100 100 100 100 100 100 100 100 
100 100 100 100 100 100 100 100 100 100 100 100 100 100 
##$AQSEQ= 0
##$AQ_mod= 1
##$AUNM= <au_zg>
##$AUTOPOS= <>
##$BF1= 200.13
##$BF2= 200.13
##$BF3= 200.13
##$BF4= 200.13
##$BF5= 200.13
##$BF6= 200.13
##$BF7= 200.13
##$BF8= 200.13
##$BYTORDA= 1
##$CFDGTYP= 0
##$CFRGTYP= 5
##$CHEMSTR= <none>
##$CNST= (0..31)
1 1 145 1 1 1 1 1 1 1 1 1 1 1 1 1 1 1 1 1 1 1 1 1 1 1 1 1 1 1 1 1 
##$CPDPRG= <>
##$CPDPRG1= <>
##$CPDPRG2= <>
##$CPDPRG3= <>
##$CPDPRG4= <mlev>
##$CPDPRG5= <mlev>
##$CPDPRG6= <mlev>
##$CPDPRG7= <mlev>
##$CPDPRG8= <mlev>
##$CPDPRGB= <>
##$CPDPRGT= <>
##$D= (0..31)
0 1.2 0 0 0 0 0 0 0 0.06 0 0.03 0 0 0 0 0.0002 0 0 0 0 0 0 0 0 0 0 0 0 
0 0 0 
##$DATE= 1608703336
##$DBL= (0..7)
120 120 120 120 120 120 120 120 
##$DBP= (0..7)
150 150 150 150 150 150 150 150 
##$DBP07= 0
##$DBPNAM0= <>
##$DBPNAM1= <>
##$DBPNAM2= <>
##$DBPNAM3= <>
##$DBPNAM4= <>
##$DBPNAM5= <>
##$DBPNAM6= <>
##$DBPNAM7= <>
##$DBPOAL= (0..7)
0.5 0.5 0.5 0.5 0.5 0.5 0.5 0.5 
##$DBPOFFS= (0..7)
0 0 0 0 0 0 0 0 
##$DE= 6
##$DECBNUC= <off>
##$DECIM= 32
##$DECNUC= <off>
##$DECSTAT= 4
##$DIGMOD= 1
##$DIGTYP= 9
##$DL= (0..7)
0 120 120 120 120 120 120 120 
##$DP= (0..7)
150 150 150 150 150 150 150 150 
##$DP07= 0
##$DPNAME0= <>
##$DPNAME1= <>
##$DPNAME2= <>
##$DPNAME3= <>
##$DPNAME4= <>
##$DPNAME5= <>
##$DPNAME6= <>
##$DPNAME7= <>
##$DPOAL= (0..7)
0.5 0.5 0.5 0.5 0.5 0.5 0.5 0.5 
##$DPOFFS= (0..7)
0 0 0 0 0 0 0 0 
##$DQDMODE= 0
##$DR= 18
##$DS= 0
##$DSLIST= <SSSSSSSSSSSSSSS>
$$ [...]
##$SUBNAM2= <"">
##$SUBNAM3= <"">
##$SUBNAM4= <"">
##$SUBNAM5= <"">
##$SUBNAM6= <"">
##$SUBNAM7= <"">
##$SUBNAM8= <"">
##$SUBNAM9= <"">
##$SW= 16.9725356469052
##$SWIBOX= (0..15)
0 0 2 0 0 0 0 0 0 0 0 0 0 0 0 0 
##$SW_h= 3396.73913043478
##$TD= 16384
##$TD0= 1
##$TE= 0
##$TE2= 300
##$TE3= 300
##$TEG= 300
##$TL= (0..7)
0 120 120 120 120 120 120 120 
##$TP= (0..7)
150 150 150 150 150 150 150 150 
##$TP07= 0
##$TPNAME0= <>
##$TPNAME1= <>
##$TPNAME2= <>
##$TPNAME3= <>
##$TPNAME4= <>
##$TPNAME5= <>
##$TPNAME6= <>
##$TPNAME7= <>
##$TPOAL= (0..7)
0.5 0.5 0.5 0.5 0.5 0.5 0.5 0.5 
##$TPOFFS= (0..7)
0 0 0 0 0 0 0 0 
##$TUNHIN= 0
##$TUNHOUT= 0
##$TUNXOUT= 0
##$USERA1= <user>
##$USERA2= <user>
##$USERA3= <user>
##$USERA4= <user>
##$USERA5= <user>
##$V9= 5
##$VALIST= <valist>
##$VCLIST= <CCCCCCCCCCCCCCC>
##$VD= 0
##$VDLIST= <DDDDDDDDDDDDDDD>
##$VPLIST= <PPPPPPPPPPPPPPP>
##$VTLIST= <TTTTTTTTTTTTTTT>
##$WBST= 1024
##$WBSW= 4
##$XGAIN= (0..3)
0 0 0 0 
##$XL= 0
##$YL= 0
##$YMAX_a= 296604
##$YMIN_a= -343724
##$ZGOPTNS= <>
##$ZL1= 120
##$ZL2= 120
##$ZL3= 120
##$ZL4= 120
##$ABSF1= 10
##$ABSF2= 0
##$ABSG= 5
##$ABSL= 3
##$ALPHA= 0
##$AQORDER= 0
##$ASSFAC= 0
##$ASSFACI= 0
##$ASSFACX= 0
##$ASSWID= 0
##$AUNMP= <proc_1d>
##$AZFE= 0.1
##$AZFW= 0.1
##$BCFW= 1
##$BC_mod= 2
##$BYTORDP= 1
##$COROFFS= 0
##$CY= 11.3945322036743
##$DATMOD= 1
##$DC= 2
##$DFILT= <>
##$DTYPP= 0
##$F1P= 15.9154993809931
##$F2P= -4.1035820241983
##$FCOR= 0.5
##$FTSIZE= 0
##$FT_mod= 4
##$GAMMA= 1
##$GB= 0.15
##$INTBC= 1
##$INTSCL= 1
##$ISEN= 128
##$LB= 0.24
##$LEV0= 0
##$LPBIN= 0
##$MAXI= 10000
##$MC2= 0
##$MEAN= 0
##$ME_mod= 0
##$MI= 1.114404
##$NCOEF= 0
##$NC_proc= 0
##$NLEV= 6
##$NOISF1= 3.799351
##$NOISF2= 2.8
##$NSP= 1
##$NTH_PI= 0
##$NZP= 0
##$OFFSET= 15.70392
##$PC= 1
##$PHC0= -10763.61
##$PHC1= 14.00095
##$PH_mod= 1
##$PKNL= yes
##$PPARMOD= 0
##$PSCAL= 0
##$PSIGN= 0
##$REVERSE= no
##$SF= 200.130013532006
##$SI= 16384
##$SIGF1= 3
##$SIGF2= 2
##$SINO= 400
##$SIOLD= 16384
##$SREGLST= <1H.CDCl3>
##$SSB= 0
##$STSI= 0
##$STSR= 0
##$SW_p= 3612.71676300578
##$SYMM= 0
##$S_DEV= 0
##$TDeff= 0
##$TDoff= 0
##$TI= <>
##$TILT= no
##$TM1= 0
##$TM2= 0
##$TOPLEV= 0
##$USERP1= <user>
##$USERP2= <user>
##$USERP3= <user>
##$USERP4= <user>
##$USERP5= <user>
##$WDW= 1
##$XDIM= 8192
##$YMAX_p= 0
##$YMIN_p= 0
$$ End of Bruker specific parameters
$$ ---------------------------------
##NTUPLES= NMR FID
##VAR_NAME=  TIME,          FID/REAL,        FID/IMAG
##SYMBOL=    X,             R,               I
##VAR_TYPE=  INDEPENDENT,   DEPENDENT,       DEPENDENT
##VAR_FORM=  AFFN,          ASDF,            ASDF
##VAR_DIM=   8192,          8192,            8192
##UNITS=     SECONDS,       ARBITRARY UNITS, ARBITRARY UNITS
##FACTOR=    0.0002944,     1,               1
##FIRST=     0,             0,               0
##LAST=      2.4114304,     0,               0
##MIN=       0,             -343724,         0
##MAX=       2.4114304,     296604,          0
$$ Real data points
##PAGE= N=1
##DATA TABLE= (X++(R..R)), XYDATA
0 0 0 0 0 0 0 0 0 0 0 0 -4 8 -8 8 -16 16 -18 24 -32 37 -42 50 -61 72 -82 96 -112 130 -149 170 -194 220 -250
33 -250 284 -319 359 -400 448 -502 560 -620 689 -764 844 -933 1029 -1134 1250 -1375 1515
50 1515 -1668 1839 -2029 2240 -2477 2745 -3054 3410 -3826 4323 -4924 5672 -6623 7888 -9644
65 -9644 12250 -16492 24490 -44459 189101 185175 -343724 229601 124724 -285531 206644
76 206644 115234 -239527 199353 76672 -177556 150996 38235 -104888 141837 -9454
86 -9454 -35311 111202 -64034 18563 97452 -98138 85224 68083 -142324 129815 48279
97 48279 -174490 168899 40024 -188990 183286 20249 -205806 193284 21797 -201305
107 -201305 185705 12573 -194784 166983 6460 -167359 144118 -881 -133130 108312
117 108312 -15822 -94379 76011 -19615 -47390 36985 -37491 -9072 11087 -44383 26611
128 26611 -8688 -56169 52849 -24287 -69020 75564 -28063 -74469 88124 -32330 -83192
139 -83192 89794 -26960 -76473 86689 -23888 -74215 74394 -13691 -66525 58336 1247
150 1247 -53933 37482 6522 -45106 21069 18598 -29921 3323 21918 -19781 -13491 26454 -5355
163 -5355 -23348 26650 2621 -30763 23374 4898 -28921 23547 6349 -24762 15222 1519
175 1519 -14577 9626 -1411 -974 2023 -9573 10461 -4755 -15952 24430 -8055 -21677 34626
188 34626 -16383 -29001 47332 -18748 -31357 54955 -25239 -32232 60011 -30628 -27687 63707
200 63707 -34378 -21654 61032 -39761 -12638 59081 -42246 -1221 52530 -47765 10850
211 10850 45501 -50279 25110 36249 -52802 38160 24615 -53368 51023 13898 -50235 60005
223 60005 820 -47237 66177 -9964 -39554 69849 -21166 -32386 69910 -31900 -22489
234 -22489 68506 -40997 -11251 62374 -51422 438 56060 -57545 12478 46272 -63425
245 -63425 23216 35469 -66247 33309 25625 -67114 40177 14556 -66133 45594 4255 -61640
257 -61640 49371 -5868 -56911 49708 -14913 -48186 48706 -23131 -37931 44704 -30584 -26873
269 -26873 40259 -34844 -15195 33888 -39273 -3922 27662 -42158 7847 21993 -44111 17391
281 17391 16175 -44903 26037 11546 -43588 32398 6952 -41510 36092 3348 -37678 37895
293 37895 1857 -33108 37086 259 -27906 35006 -309 -22355 31185 -671 -16375 26674
305 26674 -1479 -10636 21953 -1668 -5197 16665 -2137 -585 12420 -3357 3420 8654 -5290
318 -5290 6908 6261 -7259 8837 4683 -10059 10202 4390 -13420 10665 5294 -16336 10412
331 10412 6670 -18915 9544 8508 -21312 7886 10575 -22683 6393 11747 -23466 4916 13360
344 13360 -23112 3610 13390 -22373 3151 13233 -20872 3461 11671 -19118 4642 9075 -16715
357 -16715 6281 5439 -13531 8565 1341 -10070 11062 -2889 -6569 13521 -7345 -3626 15893
370 15893 -11764 -770 18560 -15599 1837 20272 -19520 4176 21504 -21915 6421 20955
382 20955 -24231 7977 19804 -24803 9217 18346 -23778 9734 15258 -23152 10393 12263 -21771
395 -21771 10880 7821 -19649 11366 2659 -16668 12399 -2370 -13109 12330 -7572 -9803 12150
408 12150 -11514 -5930 11975 -14612 -3574 11523 -17686 -1168 11848 -19392 1155 11750
420 11750 -21063 3470 11543 -21231 5876 10030 -21148 7475 9444 -18991 8625 8059 -16808
433 -16808 8863 7050 -14063 9725 5935 -10830 9801 3710 -7886 10684 1386 -4434 11423
446 11423 -1136 -1489 11233 -3317 1571 11280 -4680 3848 10776 -6108 4190 10287 -6416
459 -6416 5325 9653 -8343 5352 9471 -9165 5861 8573 -9589 5896 6886 -10395 5277
472 5277 5970 -9953 3901 4443 -9319 2526 3176 -8689 1880 2118 -8352 1067 272 -7554 697
487 697 -1249 -6000 691 -3715 -5161 676 -4671 -3530 1057 -5258 -3500 1311 -5385 -2463 2188
502 2188 -5881 -2195 3246 -6013 -1909 4234 -5870 -391 3918 -5951 608 4903 -5018 997 5241
517 5241 -3943 936 5453 -3369 1470 5947 -2570 1942 5506 -2505 2300 4999 -1445 3080 3690
532 3690 -845 3335 2290 -340 2954 2031 -135 3333 679 -632 3343 68 -539 4046 -1499 -1302
548 -1302 3864 -2487 -883 3725 -3794 -892 2968 -4320 -1358 2508 -3923 -1940 2117 -3910 -2387
563 -2387 2204 -4011 -2637 2035 -4348 -2168 1704 -3840 -1346 504 -3318 -456 173 -2406 -786
578 -786 -27 -1026 -99 -451 -701 352 168 -854 1747 724 -382 2328 -154 179 3677 -275 897
595 897 4013 -258 1040 3549 734 1158 3244 899 986 3419 1193 3 3656 1295 -19 3069
611 3069 442 754 2217 -314 763 1458 62 -229 315 292 -310 -631 -51 -774 -891 -707 -1842 -938
629 -938 -906 -1742 -1135 -2216 -1205 -1961 -2611 -1138 -2025 -2218 -1563 -2365 -1701 -1983 -1985 -1395 -2130 -1128 -3082 -1496
649 -1496 -241 -2843 -527 -1296 -1977 -315 -97 -2184 -209 693 -983 -379 1254 -419 -142 2679 -326
666 -326 808 3001 -634 1235 3310 106 2090 2828 655 2471 2254 1415 2574 2354 1178 2269
682 2269 2492 1078 2532 2302 248 2899 1537 -413 3324 882 -541 2920 -398 -287 2289 -1105
698 -1105 -659 1758 -1021 -1371 1575 -1355 -2118 1340 -2295 -2244 1451 -2874 -2558 1071 -3350 -2042 890
715 890 -3540 -1964 -115 -3686 -1487 -354 -3191 -1032 -355 -2966 -726 -262 -2837 274 61 -3257
731 -3257 1180 100 -2844 1959 -80 -2116 2607 -148 -2008 3309 -35 -1470 3829 258 -1012
746 -1012 3838 149 -726 4833 -76 -697 5030 45 -280 4612 -934 221 4474 -1219 779 3929
762 3929 -1160 816 3166 -1512 1182 2286 -2200 1309 2182 -2990 1233 1135 -3385 2114 181 -3994
778 -3994 2236 -541 -4056 2046 -1128 -4382 2350 -1835 -4162 2410 -2268 -4234 2366 -2449 -3992
793 -3992 2712 -3047 -3481 2465 -3099 -2704 2695 -3288 -1929 2576 -3177 -1103 2848 -2786 33 2465
809 2465 -2940 824 2504 -2446 1910 2136 -2374 2809 2103 -2069 3669 1739 -1806 4321 1507 -1686
825 -1686 4709 846 -1610 5092 796 -1361 5134 135 -1288 5065 117 -1077 4604 -679 -983
840 -983 3994 -989 -907 3566 -1774 -758 3059 -2199 -1057 2336 -2790 -904 1852 -3117 -924 1123
856 1123 -3285 -689 494 -3855 -358 -92 -3806 -186 -414 -4068 167 -750 -4321 726 -779 -4341
872 -4341 1221 -574 -4388 1422 -380 -3791 2082 -325 -3450 2547 -25 -3389 2942 16 -2789
887 -2789 3783 -50 -2255 3902 -405 -1227 4226 -651 -991 4365 -650 -12 4224 -834 668 4216
903 4216 -1470 1154 4067 -1743 1801 3494 -2540 2316 3465 -3034 3274 2730 -3816 3367 1735
918 1735 -3884 3884 881 -4220 3761 386 -4444 3667 -174 -4380 3677 -1263 -4424 3425 -2081
933 -2081 -4044 3534 -2894 -3378 3051 -3875 -2570 2706 -3947 -1989 2040 -4158 -1177 1940 -4172
948 -4172 -740 1627 -4216 442 1644 -4702 1491 1346 -4648 2654 1141 -4173 3452 511 -3556
963 -3556 4016 225 -3217 4121 543 -2392 4450 586 -2277 4492 477 -2035 4573 143 -1614
978 -1614 4974 -711 -210 4623 -868 218 3896 -1169 712 3393 -1262 664 2673 -1773 895
993 895 2496 -2458 1063 2157 -3328 1319 1346 -3871 1618 823 -4153 1942 91 -4038 1667 -566
1009 -566 -4202 1419 -396 -3751 1288 -614 -4137 1552 -704 -4090 1552 -1331 -3496 2007 -1771
1024 -1771 -3023 2100 -1776 -2027 1886 -1689 -1281 2059 -1692 -760 2480 -1791 -200 3134 -1783 302
1040 302 3187 -2303 1446 3512 -2517 2227 3137 -2202 2494 2689 -1827 2571 2510 -1829 2859 2176
1056 2176 -2221 2964 2234 -2317 3211 1886 -2290 3698 795 -2544 3275 -56 -2199 3138 -851
1071 -851 -1860 2821 -1798 -1800 2659 -2045 -1675 2407 -2726 -1432 2175 -3429 -1031 2268 -4249 -505
1087 -505 1417 -4385 -284 935 -4421 743 765 -4460 596 641 -4094 903 454 -3974 1610 312
1103 312 -3593 2026 147 -3335 2795 -63 -2497 3110 -495 -1750 3225 -665 -1100 3309 -640
1118 -640 -525 3438 -1007 -22 3500 -1186 531 3634 -1505 1072 3238 -1369 1702 2692 -1653 1986
1134 1986 2344 -1789 1978 2008 -1724 1752 1464 -1909 1964 1088 -2371 2162 590 -2320 1667 -295
1150 -295 -2054 1798 -818 -1908 1407 -1183 -2075 955 -1503 -1936 881 -1665 -1960 843 -1834 -2065
1166 -2065 1110 -1924 -1669 880 -2248 -979 996 -2315 -672 669 -2096 -574 655 -2097 12
1181 12 931 -1776 506 1432 -1841 950 1909 -1467 1712 1620 -1471 2105 1253 -1418 2640 1434 -1011
1198 -1011 2422 1401 -777 2447 1268 -322 2633 1005 -794 2720 926 -601 2722 -54 -382
1213 -382 2641 -473 -351 2454 -623 -61 1684 -1097 94 1185 -1464 -202 1097 -1875 -5 463
1229 463 -2317 123 414 -2560 75 4 -3038 468 -183 -3049 435 -525 -2576 311 -862 -2173
1245 -2173 380 -506 -2328 591 -534 -1899 1003 -786 -1468 1291 -865 -1316 1552 -795 -782 1358
1261 1358 -657 -247 1424 -770 265 1745 -348 507 1815 -567 808 2016 -308 1233 2092 -630
1277 -630 1639 1880 -452 1426 1637 -449 1477 1305 -703 1375 1242 -583 949 772 -962 1199
1293 1199 464 -914 1087 20 -1112 947 -485 -1070 948 -788 -971 420 -1008 -963 431 -1223
1309 -1223 -1052 189 -1978 -1193 173 -1689 -962 224 -2119 -896 -23 -1978 -325 297 -1927 -209
1325 -209 270 -1989 -119 515 -1511 433 443 -1169 822 296 -1159 914 690 -642 1132 403 -356
1342 -356 1687 643 -319 1687 510 168 1737 228 462 1884 390 684 1944 122 773 1588 -120
1359 -120 701 1577 -86 398 1320 -374 762 965 -485 494 858 -787 386 460 -1001 273 432 -1449
1377 -1449 0 -262 -1337 46 -280 -1410 -120 -575 -1249 2 -881 -1287 -193 -853 -1346 -204 -1171
1394 -1171 -1126 139 -1168 -1035 -78 -1136 -479 246 -1102 -290 475 -624 -356 156 -634 -343 816 -444
1412 -444 86 767 -65 434 975 88 920 849 69 916 1146 199 1097 845 475 1357 1172 194 1252 1171
1432 1171 279 1062 647 222 953 562 96 863 449 125 500 -67 121 378 -107 -476 107 -336 -322 310
1452 310 -639 -650 21 -740 -752 -202 -1237 -522 -328 -1076 -600 -683 -964 -982 -832 -1278 -872 -702 -1008 -740 -294
1473 -294 -888 -455 -185 -537 -195 -315 -674 302 -210 -604 278 -45 -147 317 234 242 678 537 444 729 558
1494 558 99 1175 477 739 931 405 511 1192 418 744 997 540 835 637 607 840 798 813 503 602 390
1515 390 289 685 102 277 379 -204 -81 55 -580 -48 -170 -247 -380 -651 -546 -585 -537 -622 -852 -585 -1060
1536 -1060 -538 -852 -1342 -761 -738 -877 -647 -835 -759 -491 -794 -194 -546 -591 -323 -616 -332 -529 -273 460 -548
1557 -548 -9 214 -75 691 -4 251 480 133 419 485 363 624 264 860 513 508 730 371 832 873 353
1578 353 1257 1014 403 860 107 858 176 222 365 522 524 411 362 196 -140 458 88 -1 403 -2 -85 236
1600 236 -499 -106 -100 -802 -156 -317 -788 -458 -785 -632 -392 -582 -683 -648 -422 -952 -563 -644 -1118 -560 -460
1621 -460 -890 -215 -601 -811 190 -605 -476 -192 -499 -143 -201 -2 -80 -32 241 -82 436 320 37 519 -67
1642 -67 424 799 -176 727 796 313 746 769 506 826 610 397 734 879 668 427 984 492 464 706 299
1663 299 597 424 88 555 130 -78 389 -112 -208 49 -159 -341 56 -378 -404 -259 -672 -476 -269 -782 -758
1684 -758 -198 -802 -797 -461 -1239 -457 -511 -856 -717 -617 -877 -594 -464 -809 -617 -504 -819 -466 -126 -603 9
1705 9 -112 -577 -126 131 -55 101 283 149 587 190 192 652 656 193 623 646 614 789 521 319 1069 494 359
1728 359 855 372 714 887 487 676 859 354 395 635 263 72 722 -47 250 612 51 -284 333 -556
1748 -556 11 30 -339 -380 -395 -633 -302 -118 -452 -422 -390 -752 -833 -477 -1056 -382 -446 -1127 -521 -303 -978 -209
1770 -209 -685 -650 -257 -610 -1004 -316 -470 -624 -225 -401 -145 172 -304 -112 508 -210 71 526 211 196 586
1791 586 274 632 762 407 638 782 258 832 710 454 673 701 397 850 545 494 732 722 237 717 567
1812 567 299 754 54 -25 448 27 -33 427 126 -137 107 -243 -134 149 -351 -406 -215 -542 -794 -245 -863
1833 -863 -533 -366 -801 -599 -353 -684 -679 -390 -917 -392 -483 -919 -547 -266 -825 -469 -115 -548 -115 -435 -621
1854 -621 145 -60 -468 339 7 -466 225 97 -195 275 297 114 729 119 273 865 343 239 746 493
1874 493 496 1084 492 521 1086 367 582 931 179 516 848 214 290 643 183 519 504 -271 64 -6 1 322 147
1897 147 -192 132 29 -540 -98 -395 -464 44 -319 -959 -243 -590 -880 -152 -507 -735 -376 -1111 -753 -393
1917 -393 -835 -417 -285 -821 -643 -358 -434 -424 -92 -277 -556 -108 -459 -91 144 -391 38 115 -280 245 383
1938 383 9 492 426 76 284 353 212 596 566 326 666 781 596 860 691 524 749 435 494 838 376
1959 376 436 586 300 308 620 210 -145 348 72 -25 381 9 -208 468 -473 -181 29 -573 -261 -392 -598
1980 -598 -377 -557 -586 -433 -621 -803 -781 -567 -569 -727 -620 -1010 -565 -440 -861 -201 -459 -588 -343 -439 -539 -251
2002 -251 -448 -234 -161 -73 -448 17 82 -47 401 27 -383 741 209 109 562 -5 236 495 114 618 834
2023 834 182 597 627 319 488 586 496 442 581 78 425 786 382 538 456 58 503 162 -178 351 227 -114
2045 -114 93 -31 59 95 -281 -295 -105 -329 -539 13 -661 -617 -38 -695 -417 -173 -941 -506 -391 -749 -137
2066 -137 -339 -561 -416 -389 -572 -406 -145 -574 -479 -121 -463 98 -340 -340 202 -356 -368 111 -5 48 -89 -142
2088 -142 302 391 -76 72 457 463 293 309 398 495 737 496 303 998 228 590 842 235 386 547 527 687
2110 687 328 330 336 510 304 -117 402 84 39 307 -233 89 15 -332 -125 -252 -345 -132 -678 -486 -609 -361
2132 -361 -673 -556 -382 -771 -630 -278 -932 -429 -537 -1002 -172 -766 -794 -320 -422 -483 -227 -760 -382 -290 -170
2153 -170 -359 -30 -72 -203 -176 111 166 560 -33 -235 542 324 544 337 173 485 159 38 1347 652 564
2174 564 331 625 646 703 340 709 779 468 139 604 549 223 360 372 217 411 -123 4 270 36 249 18
2196 18 -131 1 -145 -181 -304 -172 -282 -386 -208 -346 -557 -400 -672 -184 -517 -818 -407 -617 -579 -559 -544 -494
2218 -494 -649 -632 -419 -645 -264 -605 -511 -449 -414 -350 -156 -459 -19 -242 157 -120 76 151 94 282 251 317 606
2241 606 315 243 523 257 549 649 157 380 399 320 823 306 401 657 307 468 180 499 403 409 172 247 404
2264 404 288 121 499 68 146 228 -262 182 44 -426 -66 -131 -241 -30 -319 -434 -301 -558 -627 -133 -226 -459
2286 -459 -517 -364 -715 -205 -320 -465 -463 -342 -294 -230 -514 -563 -253 -643 -215 -110 -123 -384 -119 -235 -109 -64 -78
2309 -78 81 0 -124 105 333 218 376 320 490 391 607 435 772 451 349 390 418 273 486 636 281 479
2331 479 628 109 437 527 130 170 174 313 120 132 8 117 -29 -2 115 -14 43 -123 -378 -183 30 -166
2353 -166 -280 -370 -446 -633 -472 -374 -263 -288 -492 -365 -318 -490 -343 -352 -231 -516 -487 -132 -66 -271 -347 -375 -22 -260
2377 -260 -392 95 -264 57 138 -167 -83 57 17 298 338 93 202 230 440 395 453 347 369 512 535 567 407
2400 407 485 587 453 370 505 210 554 294 321 528 471 463 289 336 308 139 250 302 12 66 -79 -261 45
2423 45 -140 -188 -66 -530 -78 -484 -456 -268 -320 -418 -242 -472 -285 -538 -471 -351 -466 -648 -509 -230 -381 -577
2445 -577 -357 -353 -377 -233 -544 -542 -218 -476 153 44 -241 82 -55 -196 94 39 151 446 26 211 164 195 168
2468 168 378 242 333 168 359 552 465 337 353 440 440 445 57 597 686 144 501 418 356 468 495 463 301 60
2492 60 -62 -146 63 162 198 -7 -78 -172 -77 -130 -238 -380 -185 -353 -526 -2 -243 -400 -490 -298 -557 -315 -548
2515 -548 -288 -595 -332 -493 -457 -263 -406 -374 -233 -378 88 -89 -391 -175 -202 156 192 -108 35 80 -81 214
2537 214 121 104 482 170 200 442 153 452 389 550 639 590 374 462 660 558 378 569 297 276 302 264 186 452
2561 452 402 428 303 233 232 -32 189 155 46 -70 122 -197 -341 -81 -226 -415 -37 -388 -358 -61 -486 -600
2583 -600 -339 -609 -317 -323 -626 -431 -581 -275 -455 -666 -392 -574 -142 50 -230 -169 -457 -154 -88 -369 52
2604 52 -133 73 18 -90 -22 251 84 55 187 36 67 391 340 242 680 601 422 552 60 506 379 89 602
2627 602 627 325 417 401 421 435 315 304 68 335 227 209 208 251 214 213 -33 165 -138 59 -40 -85 91 -226 -350
2652 -350 -126 -317 -205 -464 -567 -210 -694 -595 -120 -233 -464 -470 -610 -560 -571 -328 -466 -444 -352 -299 -325 -105 -182
2675 -182 -298 -204 -177 49 -320 -45 -12 -24 84 42 247 330 260 369 34 327 238 311 383 385 75 153 415 301
2699 301 248 181 473 358 398 484 445 436 536 159 376 275 466 193 325 251 -117 172 -109 -82 236 -56 -44
2722 -44 110 -58 -190 -486 -351 -22 -535 -305 -304 -312 -550 -538 -349 -303 -724 -158 -291 -638 -336 -523 -313 -263 -166
2745 -166 -51 -567 -165 -197 -252 -386 -107 -359 103 -166 44 -60 -2 304 -256 215 9 316 260 163 -56 536
2767 536 346 249 343 371 463 358 588 424 318 570 393 524 528 325 250 147 312 220 308 291 502 170 278
2790 278 135 -47 50 80 -110 -32 -169 -164 -68 -15 -263 -263 -218 -244 -338 -221 -248 -118 -482 -392 -244 -496 -229 -423 -236
2815 -236 -316 -315 -381 -100 -510 -466 -371 -317 -488 63 -334 -349 -187 -66 -135 59 -188 121 -71 -48 332 274 124 482
2839 482 227 210 146 366 462 324 521 260 468 336 365 284 60 376 517 320 300 437 41 451 197 204 188
2862 188 73 -144 461 134 11 186 -27 44 112 -44 -319 -38 -280 -169 -267 -218 -459 -371 -355 -269 -165 -228 -284
2885 -284 -445 -540 -245 -589 -621 -349 -364 -464 -16 -159 -321 -136 -394 -174 -184 -663 -186 80 98 -13 115 -278
2907 -278 76 -67 28 121 33 -34 278 329 275 240 362 338 420 241 242 327 -44 47 570 476 470 482 308 210 320 324 78
2934 78 347 220 296 213 250 245 36 -12 288 79 -179 -52 -300 69 -202 38 149 -254 -214 -422 -276 -257 -572
2957 -572 -650 -506 -273 -258 -384 -376 -488 -413 -66 -536 -356 -210 -470 -219 -296 -267 40 -579 -307 52 -301 -31
2979 -31 134 -25 147 -5 -99 104 216 90 238 40 456 317 81 122 215 617 322 377 457 203 335 165
3001 165 425 249 294 513 354 106 149 409 75 312 1 181 279 8 167 207 -122 -195 -152 -272 -257 104
3023 104 -263 -359 -179 -357 -176 -196 -314 -272 -76 -310 -312 -381 -226 -567 -344 -321 -462 -309 -362 -575 -206 -376 -343
3046 -343 -136 -299 -108 -395 -417 -350 -126 -118 -55 -127 -85 5 269 164 151 40 -66 73 273 382 447 140 252
3069 252 592 154 313 366 219 548 373 66 319 -146 347 403 145 281 25 218 23 240 175 -68 119
3090 119 192 -11 -40 -55 -114 137 -203 268 -159 -327 -76 -41 -499 -179 -310 -309 -324 -730 -313 -454 -293 -391 -372
3113 -372 -383 -241 -136 -599 -459 -371 -386 -97 -134 -109 89 -164 -394 2 -175 -133 -33 56 -34 181 23 -262 -33
3136 -33 135 161 446 297 287 175 278 133 307 420 23 253 22 579 308 317 321 254 298 318 58 308 58
3159 58 156 200 240 71 145 295 -43 118 -139 -67 199 40 -99 -243 -254 -90 13 -116 -158 -333 -310 -353 -284 -78
3183 -78 -278 -269 -278 -301 -457 -213 -680 -100 -348 -295 -217 -522 -235 -340 -246 -50 -96 -64 34 -255 -133 29 -225 34
3207 34 114 19 308 230 68 134 343 100 371 285 251 138 380 47 292 0 412 312 252 106 103 346 378 207
3231 207 368 149 152 2 204 284 -89 75 23 159 98 37 7 -268 -131 -191 22 -189 -159 100 -189 -322 -181
3254 -181 -473 -138 -167 -329 -253 -257 -419 -568 -316 -338 -323 -385 -351 -269 -17 -321 -268 -73 -224 -171 -223 -180 107 -158
3278 -158 -223 -112 102 9 -64 194 137 -41 285 165 184 262 198 77 345 410 430 245 330 137 254 530 307
3301 307 369 231 227 317 115 275 407 101 204 -38 26 249 38 -49 298 -170 -14 26 -137 -160 -159 -93 -217 -320
3325 -320 2 -120 -24 -475 -259 -385 -390 -342 -87 -304 -141 -423 -217 -367 -426 -269 -148 -51 -264 -156 -585 -282
3347 -282 -360 -15 86 -34 30 -57 -255 -47 18 138 -84 134 15 184 115 83 175 438 333 70 -7 140 172
3370 172 206 93 288 349 427 321 234 175 316 325 419 253 -61 232 47 321 228 99 37 180 102 166 12 -60
3394 -60 -185 77 -202 -121 -145 -99 -165 -139 -298 -602 -149 -292 -187 -214 -222 -182 -294 -228 -295 -233 -115 -476 -267 -168 -260
3419 -260 -258 -27 -45 -73 -207 75 -166 -121 -52 -191 116 -72 -143 366 123 155 112 138 -51 24 140 -198 190 168
3443 168 303 213 239 239 424 82 224 154 502 429 136 209 167 412 346 402 217 81 145 386 39 -33 -166 -68
3467 -68 120 -174 -124 342 -118 -257 -47 -195 -150 -168 -218 -120 -61 -347 -96 -263 -193 -287 -463 -239 -515 -338 -309
3490 -309 -264 -129 -308 -125 -171 -429 -220 -52 -205 -175 -227 -27 61 -99 -104 -24 159 326 143 247 71 -116 173
3513 173 -73 288 169 73 -41 26 273 580 423 341 446 274 335 159 372 318 90 38 324 221 321 401
3535 401 322 159 199 115 -52 114 -23 -52 -185 -79 -253 -115 -138 -85 54 -7 -202 -388 -408 -84 -435 -253 -256
3558 -256 -208 -140 -431 -478 -335 -194 -188 -238 -134 -145 -189 -65 -139 -49 -127 -27 12 -364 -242 -61 13 -19 -71 -56 120
3583 120 57 98 137 202 176 -17 176 -192 312 101 161 303 29 268 353 383 401 -66 308 247 431 290 311 146
3607 146 259 40 34 -87 33 139 -142 -60 74 39 69 14 -329 -74 -219 -475 -121 -132 0 -320 -234 -127 -196
3630 -196 -212 -123 -354 -247 -309 -175 -313 -448 -291 -171 -99 -98 -464 -406 -49 -128 -76 -465 -108 -19 -268 28 -14 -83
3654 -83 230 149 170 100 81 57 71 321 226 323 277 107 220 -6 267 221 147 284 253 104 148 278 57 52 -25 320
3680 320 84 210 353 -2 164 34 82 -55 -73 -109 137 79 -198 176 -181 21 -61 -163 -271 -231 -75 -242
3702 -242 -206 -225 -125 -87 -211 -183 -170 -364 -445 -300 -230 -175 -262 -249 -373 -240 -71 42 -86 -72 -143 -47 8 -240 -207
3727 -207 146 270 -167 -58 160 21 118 -89 13 466 136 30 209 211 251 126 390 458 233 426 188 258
3749 258 345 18 94 222 253 349 286 318 411 220 -41 -94 132 -90 141 234 240 -28 87 104 -12 -278 -135 110
3773 110 -320 -149 103 -82 -301 -211 -306 19 -200 -324 -35 -394 57 -76 -429 -218 -339 -165 -343 -130 -87
3794 -87 -129 -105 -131 -151 -14 130 199 -83 190 -147 -55 -99 88 -198 25 -89 218 392 356 83 366 223 362
3817 362 -2 288 211 258 122 254 128 311 242 147 237 191 313 109 82 187 277 8 45 -3 -4 32 66 25 75
3842 75 18 -41 -119 160 -158 205 -158 -69 -244 -75 -139 -156 -131 -170 -330 -224 -292 -334 -104 -341 -282 -213 -186 -256 -324
3867 -324 -8 -304 -259 -306 -70 -329 -161 -44 -201 31 67 280 -56 -207 -181 36 131 197 131 109 322 180 78
3890 78 267 -103 -74 382 275 143 233 166 306 1 97 197 305 112 150 320 -169 241 249 -22 112 170 -58
3913 -58 355 -65 -1 -94 -149 -114 54 44 -149 -236 -100 -274 81 -263 -202 -148 -10 -163 -90 -41 -162 -194 -119 -270
3937 -270 -262 -41 106 -240 -328 -268 -402 -282 -122 -83 -206 -334 -152 -32 -102 -224 3 139 -274 -16 77 -72
3959 -72 139 192 -32 -110 47 193 459 229 352 469 170 372 311 220 115 331 15 112 264 321 227 298 164
3982 164 443 33 203 180 246 -86 -131 -11 -80 -21 31 156 -267 -117 -1 65 -250 14 10 -93 -356 -96 -239
4005 -239 -169 -218 -399 -84 -83 -626 -254 -200 -351 -85 -219 -345 -20 -152 -238 -227 -335 169 -64 -291 -40 -261
4027 -261 -157 -238 94 -24 -39 99 141 330 76 160 106 108 165 176 15 76 375 407 363 103 219 194 106 -45 65
4052 65 235 240 274 110 254 289 139 189 98 100 142 59 224 -49 155 -317 -12 -60 -38 -183 -174 -122 -135 -129 -289 -252 -154
4079 -154 -86 -522 -189 -35 -240 -77 -80 -239 -163 -125 -93 -169 -75 -298 -119 -152 -195 -109 -111 -62 -139 -78 -211 22 42 21
4105 21 -281 175 119 161 121 -64 280 -175 219 281 112 177 86 246 322 327 241 111 313 301 229 220 -52 213 340
4130 340 407 -62 168 291 201 68 20 -125 228 4 277 -138 -165 -44 -259 -200 -40 -283 -254 -82 -31 -218
4152 -218 -167 1 -248 -331 -186 -143 -356 -310 76 -131 -176 -144 -222 -147 -24 -187 40 -209 -95 -113 -204 -130 88 -71
4176 -71 139 -1 57 57 -79 26 86 5 67 140 105 318 76 246 104 152 343 -4 392 142 -39 205 122 -7
4200 -7 194 137 246 236 178 -238 209 186 3 207 91 55 219 -28 64 315 -10 28 -173 -50 -137 -76 -112 -141
4224 -141 -49 -212 -248 -181 -108 -185 -297 25 97 -222 -196 -382 -118 -219 -308 -72 -174 57 -77 -232 -172 -256 73
4247 73 -70 -117 -9 261 -17 27 -169 -169 13 121 372 108 175 326 211 -95 208 182 89 111 -58 329 363
4270 363 132 421 295 147 73 317 35 3 248 274 -9 -169 123 64 -36 186 43 90 269 -20 -2 -46
4292 -46 60 185 -70 164 44 -159 -209 -260 -222 -37 -315 -401 -224 -148 -221 41 -179 -132 -418 17 -74 -375 -24
4315 -24 67 -6 -278 -153 67 -193 42 3 -252 113 -65 -199 17 137 316 -110 157 328 93 -255 -105
4336 -105 -116 25 271 340 16 38 161 181 312 196 61 150 179 266 135 220 6 115 186 122 116 336 41 111
4360 111 340 100 -58 126 -33 -98 30 -180 25 -60 -31 -147 -65 -316 -290 -123 -167 -139 122 -329 -432 -483 -472
4383 -472 -148 -274 101 -358 -183 -326 -188 -46 -177 -194 -120 82 22 -355 -207 108 -228 440 -299 -415 -507
4404 -507 -719 463 74 83 -436 -196 -5 -341 38 623 600 -473 -225 -35 1071 613 160 -274 100 138
4424 138 280 -133 -209 524 616 -35 92 178 297 36 -379 -88 -909 201 22 -677 343 212 -286 -74
4444 -74 -318 69 -61 -165 -358 -32 -665 -166 -398 -154 -271 -488 658 -564 -216 250 -187 -150 -247 -559
4464 -559 -86 -76 -530 -341 -288 -69 -162 301 103 164 -94 -126 -116 110 -652 248 -29 586 -71 -68 354 125 -544
4487 -544 363 623 -40 425 -265 335 375 124 94 -41 -246 -13 -370 -3 -106 -247 632 -252 151 505 501
4508 501 806 -444 -76 59 358 507 308 -250 332 86 -616 -541 209 73 -484 -364 294 -118 539 -483
4528 -483 -621 -128 630 149 -854 -210 -363 -567 332 -377 318 -274 162 -98 -558 280 -60 530 -467 -65
4548 -65 -315 -707 -370 -11 55 114 68 -190 23 -705 103 897 -285 -172 -336 -401 64 -371 54 -111 -133 312
4570 312 389 356 -73 -152 -21 -48 312 399 427 -42 -147 182 195 371 -72 68 -190 17 83 -240 182 -118 32
4593 32 86 45 43 -201 120 -255 -96 -291 103 -11 -134 79 -392 -147 -46 85 -168 -332 219 -125 -266 -243
4615 -243 -241 43 61 -395 -284 182 -113 61 -286 -64 -483 -193 169 457 -215 243 241 498 78 -389 278 -545
4637 -545 524 236 87 131 401 -112 110 281 101 99 332 -140 234 229 77 352 31 141 129 -90 -49 338
4659 338 52 165 77 72 -84 -85 -139 14 -49 -351 69 -167 -53 71 -151 -175 -387 -41 -79 127 -246 -249 -451 -381
4683 -381 -16 -22 75 -239 -230 -289 -101 -42 -166 -194 -36 -298 -313 -147 -117 31 -248 -44 123 -60 -48 -18 -56 83
4707 83 -77 -11 255 204 -25 -32 136 305 135 5 115 -61 167 220 194 165 360 292 293 87 38 166 99 34 29
4732 29 -6 9 81 -15 122 224 -49 187 -161 192 289 -167 -33 -143 -150 -64 -69 -180 -315 -46 -416 -240 -158 -342
4756 -342 -359 -232 -247 -132 -86 42 77 1 -83 -137 -175 -170 -83 87 -63 91 -46 -29 -69 173 47 74 213 -39 -7
4781 -7 16 229 25 -112 -139 33 95 136 219 162 44 104 8 -76 282 127 264 186 368 140 227 43 290 158
4805 158 -116 157 65 205 212 235 82 -179 186 51 168 -54 -109 234 -104 -7 -90 -75 -45 -148 85 28 -80
4828 -80 -133 -166 -262 -200 -480 -452 -310 -82 -103 -180 -333 -61 -125 -227 -192 184 -85 -249 -52 29 -99 -230 19 106
4852 106 138 -46 -116 43 -174 192 -52 -295 383 263 -193 -26 -302 131 325 -9 81 -67 -18 110 425
4873 425 173 270 52 185 449 360 -334 106 220 -73 31 87 366 -5 60 235 -185 -459 138 -107 -130 219
4895 219 -482 -69 124 99 30 -360 -282 -168 119 210 -27 30 -49 -563 -9 -306 -92 -225 -726 36 -393 -200
4917 -200 -225 230 106 -246 -88 -2 641 225 -15 -57 819 -335 -101 193 -75 160 121 -66 146 -22 179
4938 179 318 212 120 41 312 170 371 248 -37 288 197 160 189 327 195 -106 91 226 9 -127 263 -99
4960 -99 113 -36 175 203 28 -141 21 110 -45 -120 -162 137 -157 -38 -86 -365 -191 -50 -284 -114 -50 -70 -223
4983 -223 -354 -191 -274 -36 17 -175 84 -164 -76 -291 -1 -31 63 -97 -49 -200 -135 -119 -377 70 334 208 -144
5006 -144 50 68 40 -9 456 29 169 97 136 -35 -28 10 130 181 87 48 320 190 -54 1 176 177 240 6 -69
5031 -69 155 96 -94 45 168 4 110 219 -15 16 -21 -177 46 -55 -108 135 46 -131 218 -68 -140 -135 -22
5054 -22 -56 -120 -6 -22 -349 -212 -283 -106 -126 -57 -49 -1 -302 -141 -251 -150 -90 -246 -32 -55 240 25 -179 -44
5078 -44 -145 21 0 168 213 -61 169 12 -47 226 -72 142 213 123 126 -16 -2 299 118 70 181 140 328 94
5102 94 280 589 450 -334 -245 203 234 227 127 30 432 116 81 -297 -131 134 616 -545 339 -240 -578 797
5124 797 339 -68 -246 285 347 -648 -518 -397 82 265 -323 251 276 109 -371 -72 -10 50 -146 -18 -10 141
5146 141 -81 -46 -52 -43 -171 89 -171 -69 174 207 -11 238 91 54 -76 172 188 73 361 253 142 284 172
5169 172 224 412 163 288 155 103 41 -123 43 183 -144 29 -54 16 13 -54 233 80 97 196 -10 13 124 -100
5193 -100 -39 -301 -58 -240 44 -68 -127 -66 -179 -238 3 72 -110 -100 -359 24 -266 -73 73 -161 44 53 71
5216 71 -313 -96 -203 42 -38 54 100 -2 -98 -197 -104 -127 313 -45 -4 184 110 250 163 147 118 -112 52 30 -19
5241 -19 243 66 214 -159 263 182 -31 -125 239 236 -4 105 178 123 165 52 190 126 -16 242 -231 -18 238
5264 238 68 -437 87 -151 198 43 -268 -15 23 -68 -281 -96 47 -179 -341 -102 -176 -123 -270 -5 -54 -89
5286 -89 -158 14 -240 138 15 -69 -170 -138 -69 39 -24 14 -121 93 -15 -49 -17 95 -25 -29 79 183 213 146
5310 146 -110 -82 206 -121 173 95 412 85 375 61 178 124 79 171 236 -102 144 172 66 20 271 303 -44
5333 -44 48 18 348 207 108 -6 -160 -24 -53 -380 113 -93 -20 -543 -93 -45 -31 -93 -286 -280 29 -242 -167 -218
5357 -218 -354 -151 -245 -232 -40 153 -262 -305 -91 -16 -111 -62 243 -51 -51 -45 49 -40 111 -57 -156 337 161 91 208
5382 208 101 80 -5 -127 79 55 59 43 116 41 95 122 266 58 -59 155 -7 79 143 111 45 -52 105 71 196
5407 196 82 -44 23 -8 16 56 -57 127 -112 -132 50 -72 19 -400 -88 -231 -368 -210 82 -39 -364 -139
5429 -139 -342 -66 -184 154 -183 -103 82 -153 -151 -14 40 25 -256 51 -51 -235 -57 -24 110 11 -214 -80
5451 -80 -21 131 -167 258 130 215 287 309 -116 -60 -74 146 136 183 58 336 214 28 255 86 145 95 272 211
5475 211 292 155 265 -86 -158 157 65 49 66 -75 136 -196 -158 19 355 8 6 -249 -45 -63 84 -131 -72
5498 -72 -160 35 -129 -119 -106 -302 -77 -105 3 -210 -77 -120 -194 -200 -241 -150 -45 119 -165 -95 29 -20 -87 263 -145
5523 -145 -13 -139 -89 96 135 177 -40 11 15 63 192 25 208 71 385 220 111 51 -66 8 82 133 35 9
5547 9 52 116 158 236 259 25 -6 86 180 138 -34 -25 -117 120 -147 142 46 -202 -140 -106 -116 -148 123 -293 95 -56
5573 -56 -249 34 -48 -175 -164 -380 -194 -211 -240 -180 -111 -165 -16 -176 15 -206 -5 -218 -128 -316 59 128 17
5596 17 -16 -65 -74 -7 -26 -68 -83 129 -122 20 -45 104 111 -74 -149 126 153 54 229 66 97 176 36 142 2 263
5622 263 394 -38 179 169 191 399 11 -106 58 82 -15 -42 -76 -66 -220 27 -23 7 -71 -245 -7 105 -222
5645 -222 -181 24 -303 -141 -83 35 60 -5 87 -90 -304 22 5 -3 25 -137 -109 -148 -58 2 -44 -147 -130 -35 -82 157
5671 157 12 -13 -211 -47 -7 -167 -20 -5 -105 25 163 -37 -120 140 110 47 -48 86 68 418 182 105 36
5694 36 182 -54 246 67 272 -167 205 -25 -15 249 -81 169 39 -23 -28 33 137 20 -102 -190 52 -65
5716 -65 -64 36 -231 -49 -217 -25 -64 -197 66 -105 11 -92 -424 -125 85 -308 -106 -57 -33 -313 -158 -98
5738 -98 -24 75 56 -296 -150 152 -56 132 -74 25 -38 -108 94 -2 98 64 241 240 129 45 165 -16 227 -37
5762 -37 142 299 -101 165 42 215 -267 -62 131 112 476 103 249 313 205 81 150 -45 165 222 2 87
5784 87 18 -66 142 -104 60 -41 -10 -12 117 7 -364 117 -269 -117 -67 -281 51 -16 1 -85 -236 -107 -61 -164
5808 -164 -266 -297 -93 -61 -487 -56 -115 7 88 -124 -73 -205 100 -47 -5 -9 41 -11 140 44 -44 15 43 302 173
5833 173 61 180 -128 -58 -10 152 55 83 100 146 290 34 250 -149 245 120 284 157 -145 104 11 170
5855 170 90 232 -90 -13 -4 110 -84 185 50 -169 25 -58 -40 -204 -71 -126 -206 -124 -77 -74 -87 -39 -2 -27 91
5880 91 -41 156 86 -6 -75 -166 -124 -2 -107 -138 27 205 69 -94 -172 -151 -275 229 -274 145 -193 -35 86
5903 86 242 173 -144 37 128 99 -24 104 21 24 41 318 131 42 277 305 -37 129 97 235 344 210 37 25
5927 25 111 24 226 125 125 183 172 95 69 -188 -166 133 -363 -106 -23 138 -193 -208 -120 -125 -42 -128 -289 -202 -90 37
5953 37 -232 -98 6 -408 -217 -456 99 -268 -180 -257 127 -262 -179 -61 -9 -43 121 -205 -41 129 0 55
5975 55 108 -112 12 154 -19 -126 82 235 193 39 357 -72 -172 112 194 -73 409 -191 248 198 -62 106
5997 106 153 276 -29 -784 776 189 -58 344 280 -236 -318 205 130 146 -71 160 -21 155 -4 -174 100
6018 100 -8 -9 -211 -185 -182 -141 -62 -311 -104 -165 -111 14 -374 -227 -51 89 -239 -3 213 -157 -157 202 -1 -143
6042 -143 -205 -43 -148 238 62 165 -20 -289 105 -101 203 -255 115 76 56 132 104 -55 -211 -9 157 196
6064 196 282 161 -55 361 342 45 159 17 96 153 169 0 252 157 12 178 80 132 161 -1 34 298 -88
6087 -88 112 -127 -250 -19 -36 -183 -31 44 57 -282 -226 -232 -213 -214 69 -134 34 -73 -227 -194 -9 -62 -266 14
6111 14 -220 -177 -246 4 -105 -145 -16 -62 61 53 -145 95 127 -185 -5 317 45 75 170 60 186 -197 -37
6134 -37 -68 68 -1 59 81 25 106 -86 228 -30 163 220 -65 -106 122 351 156 64 -36 -64 -51 30 -176 -108 -65
6159 -65 -179 -45 59 -25 19 20 -152 -47 -242 -100 -198 -59 -11 -96 -42 -182 -78 -59 -159 -178 -188 -117 -19 -160 -238
6184 -238 -13 -270 -159 -216 -89 -106 -193 59 51 -52 147 -152 -37 31 132 -54 -54 356 -119 -281 203 -79 -95
6207 -95 175 38 308 -86 215 81 85 -211 120 229 63 171 131 59 139 12 183 22 -11 100 -45 -10 -46
6230 -46 -126 365 -30 -86 -33 147 -38 -40 -69 -207 -188 48 63 84 53 -4 200 -44 -93 129 -3 165 19 -130
6254 -130 -205 -75 -12 109 -151 -260 -169 108 -278 -231 -97 -124 -64 -25 103 43 -151 -230 -104 -88 -49 180 -50 206
6278 206 46 47 -69 -62 271 82 -122 42 25 192 288 38 205 -34 257 232 162 239 -33 251 129 293 105
6301 105 182 193 35 -63 -53 225 34 -59 -120 171 -130 -44 195 -37 144 -77 -106 84 -145 -31 -24 -38 -203 32
6325 32 -92 -40 -203 -78 5 -48 59 -60 -185 -57 -61 -106 64 -154 -227 81 -6 -14 -63 -8 67 -222 177 52 56
6350 56 -300 -2 -21 63 159 57 24 216 6 -40 -81 35 211 -22 224 80 278 46 9 120 83 220 185
6373 185 46 137 72 318 153 73 86 119 -38 35 208 86 -25 355 154 -38 -35 -146 -176 -129 -101 -4 -35 -10 -113
6398 -113 -110 -151 -155 -246 36 117 -10 11 -45 -100 -172 26 -105 -174 -87 -236 -15 -123 230 174 -53 -129 -7 208 -208
6423 -208 70 -218 -32 -29 104 -92 37 267 -28 110 401 -95 280 208 58 165 55 188 -7 115 -12
6444 -12 -115 -89 39 70 334 59 235 -288 -69 76 268 93 219 81 67 258 21 167 -113 68 28 -148
6466 -148 -90 -62 84 -170 82 -24 -82 43 -304 103 -21 -99 34 -157 46 -81 -70 -27 39 -9 -134 -84 -18
6489 -18 -142 -215 19 -175 -98 113 107 143 -200 165 272 -37 194 73 50 23 66 -117 -4 171 249 -54 27 225
6513 225 121 147 55 230 -27 59 -18 2 43 220 18 -16 164 31 -49 36 -9 -12 46 272 59 77 -48 212 8
6538 8 -171 209 -17 -45 -143 157 -19 -138 -30 -145 -133 -170 23 169 -118 -74 -58 3 -285 -50 -73 -43 6 -180
6562 -180 58 111 -277 20 -61 -198 8 45 -95 -260 -152 11 24 -100 -83 -155 216 231 207 39 -159 50 -182
6585 -182 136 115 89 -60 134 -114 423 -49 245 212 156 157 135 -5 22 28 -46 -117 -40 -84 17 107 -76 229 -203
6610 -203 13 351 157 201 -167 -90 -106 -174 119 14 -154 -78 26 -146 -344 -10 -171 -76 -233 -23 -30 -53 33
6633 33 47 -118 -88 89 -142 -122 -328 -22 200 -218 6 -205 300 82 189 -103 -178 104 -83 30 17 219
6655 219 -59 147 70 229 106 56 185 187 -8 8 -10 376 -58 213 52 -35 128 290 107 -85 64 184
6677 184 -16 12 130 -171 186 -32 58 22 119 -62 -150 108 164 -179 40 -40 -23 -1 -47 26 139 -40 -213 149
6701 149 -129 91 159 -206 -124 -216 302 122 102 -193 -178 -43 -251 -77 -41 28 32 -222 188 -34 75 50 54 117
6725 117 -40 -80 -23 -143 -167 -2 161 124 -91 -22 103 -252 265 174 -155 318 89 -31 14 69 153 -120 22
6748 22 49 -26 69 -33 17 -21 100 90 49 156 242 41 47 32 22 -17 -67 -70 -45 -314 -194 111 -24 -98 -87 57 -109
6775 -109 17 -95 -10 -133 -129 23 266 115 -219 28 15 -147 6 24 -9 129 -213 -78 4 -113 85 38 -198
6798 -198 -82 155 163 -14 27 228 -123 -201 -72 0 43 -59 153 95 185 275 37 0 38 41 82 39 19 -27 28 -129
6824 -129 94 367 -9 -27 48 -182 180 -288 -69 230 87 87 37 -179 -153 -47 -231 -62 8 -32 -416 15 -119
6847 -119 101 44 -14 -52 51 -109 13 58 -67 -167 45 -73 71 -104 -32 79 -198 247 -128 -224 113 -125
6869 -125 154 284 -161 238 -108 -51 129 -39 -36 -117 123 84 -223 186 169 173 229 225 61 -6 237 228 87 -55 119
6894 119 178 -1 38 133 157 286 38 39 71 154 118 144 16 173 48 184 10 -24 9 47 -34 36 113 25 -293 -168
6920 -168 -34 -54 -18 37 -28 -1 -28 147 -22 -38 113 -194 -56 -16 96 -43 -267 1 28 -51 -165 50 75 47
6944 47 -134 -161 201 57 46 34 -30 42 -106 20 -70 41 160 137 116 -110 97 97 381 79 340 -128 67 -125
6968 -125 -140 53 -102 168 240 54 11 146 122 102 148 -37 64 331 -93 -185 -93 -137 24 -202 148 118 -143
6991 -143 -19 -132 -30 53 -8 -127 169 -289 -58 -179 49 139 21 -316 -104 124 -29 -29 5 14 -120 9 23
7014 23 139 144 -142 -63 76 89 66 141 -2 46 -8 15 -75 -4 -62 9 152 -79 108 -143 -136 28 99 128 151 26
7040 26 39 182 385 18 -108 -20 21 144 -70 -8 163 21 75 101 16 143 -48 75 114 -102 151 220 161 214
7064 214 -102 102 49 58 -66 5 72 -106 77 25 -9 -151 75 28 0 -225 114 48 68 48 -117 -62 18 38 54
7089 54 -67 -311 102 139 -326 -50 -91 -50 79 -215 66 -165 -79 -182 284 148 -129 71 98 146 97 176 64
7112 64 -1 62 43 84 18 -47 147 43 142 -102 54 245 283 62 -57 152 -168 -50 176 38 -49 -191 49
7135 49 -209 118 -200 -99 -111 -11 -242 182 -41 37 -56 71 -19 -203 -172 53 114 -453 -13 97 -132 -283
7157 -283 -27 -466 293 -15 31 -92 84 -131 69 -161 -214 42 116 -158 -84 -33 234 -40 -24 179 38 53
7179 53 -160 -87 -17 224 81 77 292 75 55 -4 -6 -124 31 384 129 37 -123 91 296 -92 237 115 174 -159
7203 -159 142 232 -48 -13 -152 -4 -100 147 187 153 -143 -140 -172 -54 -22 88 99 -114 128 26 -210 325 212
7226 212 -58 -170 153 -56 -186 253 -333 -73 -488 -362 -55 -288 -832 1 88 -32 -186 -139 88 164 4
7247 4 -11 -3 37 -65 -6 219 46 220 -49 -32 114 77 -40 209 -2 439 -138 231 -89 286 94 -62 133
7270 133 292 117 167 152 72 -960 -229 239 -37 325 -11 -48 363 -94 -138 288 312 -24 -105 117 -114 116
7292 116 -144 -237 87 -170 13 -18 75 -193 -107 -74 -86 181 -182 -213 2 -55 231 -71 -9 98 -73 30 -188
7315 -188 146 32 -89 124 11 -171 -145 -61 28 -82 14 -120 54 67 147 95 -59 -25 128 222 -118 -48 95
7338 95 -36 36 -56 66 124 -97 189 142 -55 49 12 34 237 135 -40 -140 307 39 55 25 -123 -173 101
7361 101 88 135 87 -54 -61 220 -21 -166 -61 106 62 -321 -38 -133 56 15 -93 -158 -65 63 25 -26 -213 -156
7385 -156 -125 56 -137 96 -56 -29 -138 -11 50 -152 -42 -179 254 -59 -34 -156 23 -13 -157 -64 -71 88 -83
7408 -83 96 -62 191 147 -137 -92 154 50 3 -63 -101 -49 150 41 209 212 228 -25 -42 101 247 -6 145 32
7432 32 -12 202 -157 194 -123 98 -281 13 160 -230 -159 312 9 -227 42 136 -156 63 85 -3 147 -116
7454 -116 -179 -157 -79 120 -87 62 -113 -87 86 -168 -71 38 -165 115 -221 116 200 250 -76 57 -217 -38
7476 -38 40 170 175 -3 -59 29 84 -290 -35 174 -116 89 106 -85 25 61 -70 -27 160 -37 121 -168 10
7499 10 -70 -55 48 -9 97 46 117 209 -75 185 -166 -24 194 -47 -135 -23 38 -43 -92 -604 -52 -48 -228 -132 -190
7524 -190 -151 -290 -198 -78 91 -209 44 116 -34 -174 -376 -1 -67 -139 -74 32 -209 51 -19 -87 -13 -87 1 -59
7548 -59 -99 77 212 -107 110 168 133 92 86 123 -120 -89 22 271 -193 310 223 42 28 21 5 267 -34 63 22
7573 22 39 263 -11 -283 31 14 105 99 -178 56 -71 -47 7 -118 81 6 77 81 128 86 -46 138 100 -38 -113
7598 -113 -408 -49 20 -68 -128 -113 354 -127 -153 -136 -126 100 -289 -83 276 -58 -18 -51 -62 -223 9 -4 -43 203
7622 203 36 33 0 -130 -33 -126 126 -57 10 48 -83 -17 -48 -63 96 154 30 170 78 -12 -34 86 160 44 60
7647 60 -15 102 145 260 -117 109 -18 15 110 249 290 -63 -30 155 95 195 113 12 64 -18 -14 63 184 -180 114
7672 114 55 63 81 40 -103 13 -85 -115 -194 -3 -98 -134 37 -272 64 -98 -280 10 166 93 -66 -26 42 -27 -13
7697 -13 112 -257 149 -4 128 38 48 31 99 43 -197 67 296 167 10 42 93 58 11 -186 209 19 29 173
7721 173 3 28 29 38 -58 58 69 12 -20 25 -146 -173 -48 -143 159 79 -16 -33 96 293 -93 -29 -18 150 15 -41
7747 -41 77 -226 -45 -358 101 78 -351 -457 311 -316 -107 24 45 5 173 -18 133 -226 26 5 -304 95
7769 95 34 -116 33 -156 -266 200 -260 63 193 3 -65 185 36 65 -169 -27 99 288 179 -31 -230
7790 -230 109 43 268 333 78 158 -96 27 182 5 202 195 166 -73 -92 84 -67 -23 -126 238 -23 -20 38 -7
7814 -7 121 -131 -162 -78 60 82 -117 170 114 92 173 -21 -151 -82 -198 24 34 -178 8 -24 -41 -36 -365 -109 -297
7839 -297 -103 -62 -34 76 -100 -288 -111 -213 -194 172 28 87 68 174 9 10 -63 28 -126 105 46 60 251 245
7863 245 -36 64 107 127 199 228 17 -18 136 -42 -1 65 -22 16 -130 225 8 -120 159 -9 107 226 91
7886 91 27 11 283 -84 -55 10 -134 -49 141 117 -332 -65 -95 117 -80 -68 103 -96 -33 -105 125 -228 69 -33
7910 -33 -146 -315 -14 -87 -123 -28 71 80 53 -192 180 213 67 -83 -213 -45 -70 190 -182 138 -123 211 63
7933 63 27 -57 58 -81 52 111 55 -99 -62 42 -93 98 88 163 153 65 128 -45 -69 181 37 142 -37 -93
7957 -93 51 -89 -62 -81 236 -40 139 -177 103 -159 172 -50 97 -128 -1 -134 0 -163 -117 2 -129
7978 -129 -56 33 -222 67 122 47 19 89 12 -20 41 15 81 -80 130 53 163 -275 -12 -97 30 -39 22 -59 -72 49
8004 49 -93 84 -82 -19 -249 46 -101 -19 140 100 154 54 20 217 325 6 179 206 -25 -157 -114 -246 -100
8027 -100 -128 106 219 192 169 187 70 21 -61 -137 -8 -130 -55 -70 129 -77 -89 -99 -334 -39 -67 -210 -24 16
8051 16 -142 48 -286 127 94 -81 37 -56 57 103 -17 -230 -100 -34 61 -34 -127 -57 -28 -273 9 -84 29 -61
8075 -61 209 -32 -114 -7 93 50 -50 39 -57 -43 -92 -52 84 97 115 -15 2 279 -40 71 212 -134 -67 234
8099 234 330 -196 197 156 -37 89 38 -5 97 -51 -14 -149 -22 93 239 -58 55 236 98 -198 -3 -173
8121 -173 43 -238 64 104 -485 -33 -121 -19 19 77 -94 -53 -76 -86 -115 13 80 122 47 30 44 -161 -116 -225 -41
8146 -41 -230 -116 58 -67 -245 202 13 124 216 -44 31 -67 160 -7 -16 178 90 -7 -130 86 -108 128 -80
8169 -80 -12 167 -156 7 -14 48 -63 32 99 313 240 42 -37 58 -61 -163 94 -218 -56 189 -173 -82
8191h2
$$ Imaginary data points
##PAGE= N=2
##DATA TABLE= (X++(I..I)), XYDATA
0 0 0 0 0 0 0 0 0 0 0 0 -1 8 -8 8 -16 16 -16 24 -29 32 -40 48 -60 72 -82 97 -113 133 -153 177 -202 230 -262
33 -262 299 -337 381 -429 480 -537 601 -669 746 -827 915 -1013 1122 -1239 1367 -1507 1660
50 1660 -1826 2013 -2218 2446 -2699 2982 -3302 3669 -4089 4578 -5160 5857 -6716 7803 -9229
65 -9229 11183 -14048 18692 -27829 86401 -272140 20731 296604 -306161 76276 229564
76 229564 -248922 59634 187482 -226075 62615 116963 -152633 69742 51996 -117531
86 -117531 79737 -28221 -65990 96602 -78229 -24269 98771 -148136 19140 105814 -190270
97 -190270 52992 117166 -223606 67618 109262 -240065 85291 118830 -242719 83165 107821
108 107821 -234756 79469 100937 -206998 74209 79368 -173685 60156 51551 -128222 53099
119 53099 27642 -80649 34145 -6493 -34333 29596 -29355 4354 23085 -54332 31373 21360
131 21360 -73707 55698 27032 -87389 66444 27018 -97602 72582 34450 -93538 69720
142 69720 31576 -88966 60997 35393 -75957 46997 39108 -59482 26420 34680 -42434 13971
154 13971 37068 -24800 -3295 29557 -9661 -15270 26685 7877 -24176 19164 17178 -30610
166 -30610 13450 22728 -28269 13119 21834 -27114 8051 15594 -16667 8510 7914 -5879 6259
179 6259 -4802 4902 6702 -14302 17657 8972 -25749 25720 7699 -35425 38342 10638 -43786
192 -43786 44981 7696 -48702 52685 5052 -48553 58883 -913 -47149 59826 -7629
203 -7629 -40289 62011 -14829 -32472 60071 -25688 -22482 58844 -34778 -10039 54461 -45823
215 -45823 2169 47872 -54633 15738 41243 -60774 26926 30698 -65073 37482 20990 -65381
227 -65381 45484 8715 -63998 50988 -3410 -59045 56374 -15491 -52344 57643 -29131
238 -29131 -42307 59597 -40485 -31394 57159 -51109 -19384 53812 -58861 -6488 49899
249 49899 -65099 3686 43878 -67816 14402 37497 -68062 23633 29705 -66203 31079 21924
261 21924 -60429 37229 12861 -52554 40843 3060 -42651 43754 -4784 -31663 43801 -13495
273 -13495 -20470 43587 -20564 -8893 42240 -27573 371 40218 -32811 9813 37748 -36742
285 -36742 16758 34222 -39047 22137 30814 -39054 24865 27043 -37564 25038 22537 -34073 24409
298 24409 18224 -30312 21910 13774 -25788 18717 9610 -19920 15584 4762 -15593 11758 790
311 790 -10339 8806 -2815 -6343 6479 -7141 -3063 5486 -10096 -1152 5056 -13410 477
324 477 6237 -15976 681 8257 -17680 104 10623 -18831 -1217 13752 -19287 -2413 16124
337 16124 -19010 -3693 18110 -17946 -5266 20171 -17015 -5907 20760 -15160 -5754 20636
349 20636 -13915 -4799 19642 -12853 -2902 17504 -12011 -154 14215 -11013 3919 10087 -10300
362 -10300 7724 5768 -9655 11246 1080 -9380 15161 -3618 -9783 18688 -7698 -9842 21554
375 21554 -12019 -9911 23909 -15497 -9385 24873 -18446 -8593 25121 -20043 -7344 23693 -20800
388 -20800 -6343 21226 -21153 -4253 18840 -20790 -2010 15475 -20155 980 11316 -18908
400 -18908 4698 6906 -17068 7907 2004 -14697 11215 -1809 -11751 13658 -5593 -9793 16093
413 16093 -7653 -7466 18046 -9583 -5781 19455 -11485 -3531 20614 -12549 -1465 20516 -13965
426 -13965 725 20166 -12979 2421 17911 -12540 3508 16166 -11259 4541 14222 -9768
438 -9768 4982 10879 -8855 6508 7591 -7842 8001 3553 -6686 8552 -468 -5261 9418
451 9418 -3415 -4442 9145 -6208 -4580 8838 -7284 -4254 8343 -9274 -4336 8617 -10568
464 -10568 -4452 8201 -11535 -4127 7178 -12224 -3269 6685 -11614 -3434 5325 -10507 -3352
477 -3352 4624 -9382 -3031 3943 -8145 -2348 3357 -6719 -1100 2070 -5482 806 378 -4072 2217
492 2217 34 -2661 3479 -534 -2193 4375 -376 -1288 5542 -493 -1285 6872 -706 -1146 8165 -452
508 -452 -680 7760 -1337 44 8425 -1319 -38 8062 -1068 -359 7209 -890 -782 6848 -1161 -1069 6049
525 6049 -1782 -1039 5193 -1824 -794 3281 -2400 -126 1870 -2696 163 912 -2516 -20 -380 -3173
541 -3173 200 -1030 -3934 1145 -1552 -4629 1770 -1829 -4375 2222 -2865 -4355 2770 -3248 -3725
556 -3725 2847 -2572 -3423 2513 -1975 -3062 2927 -1477 -2847 3583 -817 -2720 3556 -696 -1266 3491
572 3491 -508 244 2763 -246 829 2422 998 1197 1652 972 2043 2041 627 2350 2160 -118 2427
589 2427 1401 -306 3451 758 -797 3430 -43 -975 2815 -75 -763 1654 -287 -1673 1033 3
605 3 -2303 813 -172 -3106 411 -1012 -3005 112 -1975 -2595 -710 -2163 -2394 -1644 -1604 -2035 -2410 -1013
623 -1013 -1961 -2392 -1419 -2137 -1346 -855 -1781 -1315 -1392 -398 -292 -1642 -66 -1301 -860 512 -644 -250 451
642 451 27 342 484 1274 101 1197 2466 741 1429 2692 596 1398 3394 761 2169 3366 1554
659 1554 1318 3303 1951 976 3577 1573 390 3564 806 440 3564 213 339 2611 -123 618
675 618 1606 -349 845 1056 -276 -361 717 -787 -829 215 -1802 -736 -278 -3005 -341 -777 -3526
692 -3526 -216 -1322 -3383 -72 -2014 -3213 120 -2090 -3407 -335 -1696 -3353 36 -1482 -3453
707 -3453 766 -1434 -3869 1589 -1257 -2599 1837 -1228 -1715 1864 -1426 -348 2095 -897 -101 1723
723 1723 -267 257 2465 -223 1038 2880 -842 1574 3283 -923 2517 2928 -1163 3130 2504 -1453
739 -1453 2947 2135 -1606 3376 2101 -1820 2950 1590 -2143 3106 1134 -2952 3225 608 -2904
754 -2904 3101 -661 -2647 2878 -1424 -2789 2353 -1559 -2563 1770 -2356 -2349 1574 -3136 -1730 1476
770 1476 -3708 -1581 1120 -4221 -785 1009 -4440 117 775 -4635 850 1153 -4579 1564 859 -4607
786 -4607 2064 1062 -3921 2745 1075 -3664 3561 913 -3218 3962 672 -2366 4273 480 -1809
801 -1809 4560 287 -703 4751 -6 -276 4429 -390 166 4406 -844 852 3960 -1336 1305 3553
817 3553 -1954 1958 3066 -2943 2147 2551 -3148 2325 1661 -3569 2532 1082 -4073 2238 703 -4217
833 -4217 2068 136 -4278 1935 -784 -3903 1584 -1073 -4028 1626 -1711 -4164 1518 -2138 -3641
848 -3641 1557 -2510 -3225 1540 -2446 -2477 1524 -2813 -2196 1159 -2679 -1325 1615 -2551 -464 2039
864 2039 -2581 280 2049 -2603 1110 2539 -2576 1830 2661 -2664 2136 3040 -2323 2604 3177 -2189
880 -2189 2911 3286 -2013 2895 3092 -2317 3536 2847 -2043 3731 2158 -2462 3688 1240 -1928 3879
896 3879 709 -2015 3364 -113 -1813 3113 -766 -1603 3163 -2028 -1743 2879 -3009 -1359 3167 -3916
912 -3916 -872 2649 -4896 -321 2175 -5645 71 1844 -5664 136 1510 -5956 967 1152 -5758
927 -5758 1198 1131 -5706 1971 538 -5274 2941 -102 -4786 3231 -484 -3483 3826 -932 -2646 3434
943 3434 -1341 -1609 3964 -1345 -910 4277 -1577 -173 4642 -2016 726 4830 -2375 1697 4474 -3044
959 -3044 2447 4291 -2988 3046 3248 -3170 3240 3095 -3147 2902 2554 -3019 2871 1969 -3380 3206
975 3206 1370 -3627 3000 474 -3453 2952 -614 -2756 2112 -1420 -2034 1900 -1798 -2413 1218 -2180
991 -2180 -2137 1367 -2767 -1963 1857 -3289 -1705 1715 -4018 -1100 1575 -4322 -214 1546 -4496 219
1007 219 1051 -3742 367 1349 -3346 609 1875 -3363 1168 2271 -2743 1686 1815 -2523 2227 1539
1023 1539 -2322 2908 1434 -1790 2916 1032 -717 3403 709 -711 3615 449 -688 3814 88
1038 88 -444 3991 -641 -186 4282 -1309 -37 4021 -2238 351 3309 -2346 310 2795 -2598 274
1054 274 2385 -3072 56 2175 -3399 197 1954 -4071 459 1256 -4569 1018 538 -4443 1257 -364
1070 -364 -3974 1195 -961 -3805 1401 -957 -3459 1768 -1072 -3097 2186 -1704 -2556 2737 -2492
1085 -2492 -1982 3046 -2604 -1234 3095 -2712 -197 3119 -2608 240 3426 -2378 768 3073 -2396
1100 -2396 1289 3231 -2286 1570 3214 -2349 2463 2854 -2289 3308 2034 -1747 3467 1586 -1599
1115 -1599 3359 839 -1588 2895 302 -1726 3134 -215 -1396 2943 -965 -1449 3016 -1417 -1088
1130 -1088 2464 -2201 -458 2022 -2952 -684 1549 -2861 -690 1021 -2971 -285 806 -3313 -311
1145 -311 677 -3715 -304 541 -3244 213 29 -3145 789 35 -2825 705 -180 -2403 538 -164 -2132
1162 -2132 1224 -65 -2075 1468 -45 -1354 1805 -3 -967 2241 -165 -349 2531 66 276 2238
1178 2238 153 541 2508 79 583 2545 -203 484 2769 -585 685 2926 -1220 1116 2344 -1523
1194 -1523 1235 1862 -1344 1400 1223 -1370 1038 1012 -1455 576 593 -2050 447 735 -2381 625 -237
1211 -237 -2440 774 -737 -2563 935 -1104 -1982 862 -1569 -2011 594 -1823 -1640 749 -1645 -1583
1227 -1583 489 -2141 -1466 1204 -2370 -769 1014 -2249 -146 1267 -2139 313 1124 -1839 456
1242 456 1221 -1284 862 1284 -1385 975 1397 -1101 1344 1321 -845 1971 935 -671 2404 1036
1258 1036 -189 2186 752 -412 2149 479 -186 2278 308 -201 1898 45 223 1737 -319 -49
1274 -49 1503 -943 -219 1326 -1058 81 1124 -1432 -176 1036 -1845 -509 653 -1598 -381 207
1290 207 -1875 -561 113 -1926 -604 0 -2140 -281 -675 -2201 -46 -505 -1867 136 -804 -1699 261
1307 261 -687 -1125 402 -589 -928 792 -673 -735 1458 -329 -666 1401 -285 -10 1659 -396 303
1324 303 1734 -635 623 2010 -356 741 1630 -489 1003 1685 -239 1186 1708 -179 1032 1384
1340 1384 -48 1396 1271 -279 1136 619 -452 1036 496 -337 1044 -65 -784 940 -291 -794
1356 -794 783 -612 -909 463 -979 -977 555 -1242 -940 239 -1285 -1079 111 -1668 -1019 79 -1554
1373 -1554 -997 168 -1366 -881 -50 -1713 -492 -165 -1316 -281 0 -1035 -28 34 -654 163 -22
1390 -22 -583 340 296 -379 735 381 143 935 122 358 1246 603 383 1172 541 300 1139 490 486 1306 543
1411 543 732 1501 522 534 1243 239 688 1219 159 434 894 -153 152 561 -306 58 454 -483 -169
1430 -169 163 -818 -384 -207 -596 -255 -307 -1088 -424 -635 -1404 -359 -626 -924 -497 -977 -1183 -629 -892 -1025
1450 -1025 -485 -775 -1005 -157 -674 -896 -60 -801 -690 240 -459 -393 330 -447 -32 287 -122 287 466 -134
1470 -134 182 774 418 226 959 249 581 1129 447 937 907 425 1188 825 808 1011 816 733 512 765 436
1491 436 706 560 -26 885 317 234 694 184 72 577 83 -194 250 -466 -181 -108 -463 -394 -560 -142 -968
1512 -968 -456 -363 -749 -654 -850 -896 -531 -970 -645 -776 -1407 -643 -706 -1003 -748 -647 -848 -319 -571 -746 -506
1533 -506 -368 -275 -474 47 -383 -271 113 -185 356 91 38 305 230 454 657 348 737 573 497 652 364
1554 364 1106 719 491 986 695 933 881 546 908 461 620 926 335 554 262 529 667 361 417 170 132
1575 132 508 -540 189 -189 -393 334 -528 -167 663 -38 -363 -201 -644 -643 -840 -448 -544 -661 -378 -972 -879
1596 -879 -560 -1083 -297 -758 -659 -279 -1205 -525 -334 -930 -320 -486 -408 25 -298 -106 -64 37 -89 -174 442
1617 442 -83 252 439 132 410 606 -51 947 490 205 768 521 519 866 767 577 627 710 222 714 942 331
1639 331 773 614 343 960 221 220 773 195 328 592 197 -5 206 -4 -173 139 -259 -494 -36 -520 -663
1660 -663 -308 -549 -212 -220 -1024 -587 -482 -1197 -400 -723 -1014 -762 -806 -707 -477 -500 -842 -163 -409 -371 -188 -423
1682 -423 -649 -18 -488 -603 359 -331 -405 383 -293 256 167 -3 39 743 403 317 706 472 647 733 583 663
1704 663 1064 318 443 1153 676 750 909 254 660 752 237 619 776 279 478 336 238 308 379 -199 249 221
1726 221 -477 194 -163 -467 -199 -382 -442 84 -412 -562 -236 -584 -731 -277 -587 -862 -402 -881 -914 -331 -831
1747 -831 -1024 -360 -849 -624 -350 -904 -669 -334 -741 -620 -241 -312 -339 41 -433 -264 192 -239 258 354 -205
1768 -205 411 279 87 744 496 93 876 530 208 946 822 320 975 604 357 1147 832 555 1074 928
1788 928 121 1195 83 286 1056 390 109 712 -33 272 451 42 280 0 -134 -294 -10 -511 -64
1807 -64 131 -706 -158 -192 -698 -371 -427 -930 -360 -491 -1030 -356 -587 -963 -451 -824 -1078 -219 -650 -882 -609
1828 -609 -541 -855 -419 -540 -641 -95 -562 -370 -3 -221 -420 158 -132 -2 568 264 301 408 36 115 674
1849 674 144 444 950 294 606 799 363 749 856 498 687 858 396 618 528 325 606 814 215 701
1869 701 280 105 778 292 6 475 95 -77 185 -293 -429 7 -144 -736 -199 -497 -364 -127 -599 -654
1889 -654 -318 -602 -539 -113 -925 -568 -316 -992 -465 -439 -912 -614 -273 -512 -364 -225 -925 -358 -375 -750 10
1910 10 -63 -523 172 -196 -61 407 136 238 430 72 61 686 179 40 555 488 211 714 624 341 869 707
1932 707 353 1096 155 750 1006 128 756 647 322 516 564 216 482 572 249 132 285 11 104 318 -197
1953 -197 201 25 -347 164 -317 -355 -63 -357 -610 -260 -361 -860 -355 -473 -734 -430 -641 -1067 -242 -728
1973 -728 -932 -387 -760 -674 -300 -504 -652 -217 -327 -629 -110 -266 -308 58 -197 -308 350 -136 -205 469 -82
1994 -82 324 594 23 395 318 -42 376 836 213 477 715 431 722 740 240 618 577 436 470 583 129 755
2016 755 522 267 742 5 244 563 87 149 339 79 -112 -94 48 -211 430 -222 -275 249 -448 -208 -104
2037 -104 -453 -281 -296 -909 -485 -511 -892 -315 -352 -683 -707 -537 -654 -580 -545 -711 -487 -202 -540 -91 -396 -650
2059 -650 49 -463 -265 -33 -185 6 158 79 88 109 376 124 496 236 323 550 428 434 479 337 771 546 125
2082 125 688 720 160 623 277 539 913 314 398 362 433 439 275 441 -261 85 32 -449 236 19 -179 -8
2104 -8 -192 -213 -144 -152 -293 -282 9 -272 -396 -273 -478 -690 -685 -1017 -197 -715 -605 -309 -646 -593 -599 -402 -201 -673
2128 -673 -411 -247 -347 -568 -485 -86 -41 -389 86 -102 -169 113 -101 245 337 -279 233 515 11 581 334
2149 334 503 587 552 484 333 488 327 557 669 575 581 924 108 597 564 618 581 409 -352 826 171 -47 534
2172 534 419 257 251 -140 -112 -7 0 -110 -229 -443 -459 -159 -732 -78 -262 -392 -174 -441 -456 -129 -491 -560 -292
2195 -292 -460 -782 -673 -706 -257 -335 -476 -741 -281 -481 -560 -349 -420 -398 -77 -53 31 182 -100 -30 -141 228 256
2218 256 169 165 276 565 341 -23 345 742 277 739 442 517 637 454 1059 429 435 480 337 664 561 418
2240 418 549 198 284 130 194 506 275 70 206 136 28 121 -206 -65 -29 -58 -58 -65 -188 -319 -265 -426 -546 -329
2264 -329 -538 -237 -510 -631 -360 -669 -453 -622 -617 -507 -189 -559 -157 -387 -564 -242 -47 -637 -497 148 -196
2285 -196 -283 -313 -90 -85 -6 -120 223 151 1 271 287 228 401 261 295 777 431 369 753 323 338 375 617 581
2309 581 662 383 412 391 138 302 259 408 258 268 31 547 252 -53 275 136 -35 14 -94 -66 37 -104
2331 -104 -265 -277 -366 -385 -242 -229 -205 -311 -599 -628 -353 -717 -736 -349 -689 -409 -537 -601 -483 -762 -406 -266 -410
2354 -410 -701 -236 -303 -26 31 -157 -56 71 60 -92 7 64 65 -211 216 373 287 135 514 284 395 297 584
2377 584 388 463 344 632 279 373 271 651 498 478 254 487 424 262 430 409 213 202 415 215 96 17
2399 17 111 250 -2 -223 62 46 -329 -126 -262 -186 -314 -343 -565 -478 -370 -472 -392 -270 -648 -329 -602 -371
2421 -371 -270 -553 -505 -303 -622 -92 -147 -507 -204 -247 -176 -192 -289 -31 200 -324 -216 -151 -43 118 77 230 -120
2444 -120 253 326 110 336 446 608 651 68 333 427 208 734 520 249 580 460 383 476 408 566 350 100
2466 100 304 278 440 79 369 273 73 401 -90 115 107 -53 32 -80 -245 -166 -524 -328 -181 -480 -611 -293
2488 -293 -465 -229 -338 -367 -392 -392 -432 -364 -454 -263 -711 -207 -517 -371 -323 -551 -130 -266 -561 -292 -282 -345 -172
2511 -172 -156 -105 -154 -177 288 -146 -56 -18 322 393 379 202 5 98 330 371 246 391 326 591 247 391 598 463
2535 463 793 338 320 712 561 347 356 129 296 92 192 306 199 -74 -164 24 140 -174 -46 -238 -397
2556 -397 -32 -278 -55 84 -298 -352 -628 -697 -307 -430 -318 -452 -545 -623 -405 -263 -433 -285 -382 -463 -404 -488 -561
2579 -561 92 -261 -600 24 -156 -95 -137 -480 34 -120 76 199 98 129 224 443 9 179 465 -3 329
2600 329 431 319 398 231 208 485 356 200 432 441 321 490 383 307 481 237 270 404 335 -161 225 195 190
2623 190 26 -83 139 181 -46 -77 -34 -131 -130 -419 -272 -274 -345 -484 -565 -344 -282 -252 -466 -443 -644 -454 -560 -469 -508
2648 -508 -550 -551 -454 -269 -574 -389 -38 -235 -334 -443 -26 -17 -80 -117 -164 66 196 175 -37 300 21 505 363 69
2672 69 600 251 271 331 253 296 389 396 442 413 395 284 491 569 472 234 493 -25 388 204 283 230 -64 278 193
2697 193 -7 363 -96 -4 111 -156 -270 -159 185 -39 -284 -135 -353 -242 -68 -299 -294 -579 -418 -319 -658
2718 -658 -308 -166 -465 -369 -534 -528 -404 -537 -509 -509 -167 -236 -439 -93 -413 -63 -125 -241 -111 196 -213 59 149
2741 149 201 400 113 -13 217 328 335 168 225 497 204 545 134 566 453 317 393 571 163 695 336 430
2763 430 444 330 417 327 283 326 125 68 391 22 146 152 -93 142 -117 -174 -8 -121 41 -282 -247 -206 -278 -302
2787 -302 -318 -289 -429 -474 -201 -476 -121 -387 -475 -243 -242 -552 -159 -202 -361 -373 -295 -210 -78 -106 -96 -58 -119 -250 77
2812 77 -180 70 49 -228 165 80 277 310 214 242 368 471 295 538 -3 226 528 408 431 520 106 435 420
2835 420 273 125 257 235 180 186 285 209 398 118 -28 197 358 183 56 135 -165 -53 -283 -67 -77 -339 -131
2858 -131 -272 -74 -281 -316 -368 -273 -318 -571 -313 -387 -450 -374 -465 -637 -331 -459 -339 -384 -293 -352 -426 -187 -424 -137
2882 -137 -106 -5 -236 -92 11 -91 31 -34 155 31 266 127 -37 389 287 254 416 -33 242 316 50
2903 50 313 609 384 382 264 406 247 312 234 310 278 340 307 187 260 133 76 -7 176 8 -121 -41 -134 15 26
2928 26 -43 145 -181 -75 -276 -223 -369 -311 -360 -322 -366 -263 -269 -416 -399 -507 -131 -449 -314 -234 -258 -333 -425 -278 -425
2953 -425 -193 -200 -229 -65 -272 37 -263 23 -72 -174 122 -27 -167 -208 287 -21 270 570 96 133 476 180
2975 180 514 383 234 494 257 369 333 189 625 247 209 247 375 336 264 153 185 337 153 293 233 54
2997 54 -87 87 -116 -124 -167 -52 106 -2 -266 -176 -343 -256 -108 -345 -91 -403 -574 -385 -170 -269 -377 -344 -300
3020 -300 -376 -380 -127 -594 -119 -398 -368 -337 -323 -157 -249 57 -126 -37 -62 -49 -42 -119 -124 176 -102 -51 107 168 199 370
3046 370 193 326 363 -72 378 276 396 421 424 175 316 334 423 279 137 464 337 190 67 185 191 116 400
3069 400 108 153 410 -142 -75 7 -173 238 38 -76 -259 -258 9 -244 -103 -197 -337 -288 -363 -420 -48 -446 -587
3092 -587 -151 -243 -453 -548 -278 4 -285 -327 -615 -366 -179 -432 -129 69 -170 -128 -131 -100 -29 227 75 74 194
3115 194 223 163 199 72 -47 244 141 266 288 24 308 259 303 270 -44 578 399 273 389 368 361 254 267 386
3139 386 307 397 -41 241 259 132 120 293 200 475 -62 -139 8 -125 -117 -65 -21 -194 -304 -297 -23 -298 -610 -239
3163 -239 -282 -257 -95 -171 -390 -247 -193 -335 -445 -340 -96 -242 -319 -209 -190 -268 -162 -403 -198 26 -195 -303
3185 -303 10 142 -156 145 140 66 223 131 -13 106 104 261 464 -23 124 58 319 174 471 443 540 228 275
3208 275 308 377 211 114 122 236 243 150 2 300 298 -72 30 51 -95 117 -98 254 -20 -304 -172 23 -14 -183
3232 -183 -322 -257 -403 -72 -498 -442 -121 -242 -362 -279 -229 -297 -208 -540 -132 -270 -352 -318 -354 -137 -158 -196 -176 -407
3256 -407 -283 -1 -166 16 -163 24 -135 -144 -100 93 124 272 392 -47 295 232 207 32 91 385 171 121 230
3279 230 472 344 384 310 238 291 -29 274 118 -20 37 215 226 300 64 165 62 312 -66 -103 38 -8 -22
3302 -22 -124 192 -72 -60 -193 -233 -269 -350 -182 -249 -240 -455 -384 -99 -334 -76 -83 -259 -421 -405 -303 17 -585 -205
3326 -205 29 -445 -171 -73 -428 -156 73 -239 -57 1 -119 -85 262 -48 -185 153 161 176 -64 -11 -7 178 400
3349 400 373 241 228 353 105 204 300 123 246 181 268 242 286 237 250 381 356 102 161 245 248 -130 89 155 -61
3374 -61 -73 53 -81 0 -109 -261 124 -117 -56 -245 -375 -151 -378 -171 -414 -385 -329 -332 -514 -408 -299 -547 -399
3397 -399 -171 -49 -205 -119 -119 -206 17 -291 -76 -307 -118 -120 -39 -169 53 -48 -1 225 159 202 211 214 -86 444 368
3422 368 193 263 161 201 382 239 427 240 101 147 189 253 277 446 86 265 119 -19 284 68 -39 11
3444 11 105 -72 249 232 -72 -30 72 -167 10 -144 -204 -112 -12 -88 -195 -240 -459 -299 -121 -332 -357 -253 -153
3467 -153 -61 -146 -411 -106 -455 -292 158 -223 -344 -264 -192 -140 1 -130 35 -234 -7 -47 -17 -81 -135 96 127
3490 127 113 213 247 207 209 205 212 289 157 149 210 63 314 34 -72 338 371 237 34 38 177 160 353 125 274 106
3516 106 173 11 109 -23 221 16 -11 -34 58 -229 -63 33 47 -213 -296 2 -362 -280 -517 -195 -60 -117 -332
3539 -332 -12 52 -234 -174 -67 -28 -360 -418 -218 -116 -269 -228 -155 55 -106 -225 -151 -241 -41 187 61 -58 -359
3562 -359 17 103 -47 106 -102 -41 240 326 309 135 283 357 8 247 218 236 -110 68 32 397 197 -52 88
3585 88 178 82 134 63 78 -38 111 259 126 -21 51 335 -128 -178 -34 82 -136 -113 -192 -105 -148 -315 -264 -300 -384
3610 -384 -436 -136 -123 -348 -9 -248 -363 -224 -238 -35 -426 -258 -214 -409 -267 -132 -208 -302 -206 -223 -239 -357 -105
3633 -105 -72 60 -177 -196 86 -70 -47 356 19 203 153 85 410 22 287 361 234 213 101 340 228 293 336
3656 336 206 225 170 66 467 227 10 231 -36 125 178 -88 104 319 36 192 145 -203 103 -195 69
3677 69 -231 -174 -198 -304 41 -275 -238 -174 -172 -159 -294 -217 -159 -172 -290 -312 -491 -227 -535 17 -113 -166 -288 -267 -213
3702 -213 20 -102 7 64 33 15 -211 -398 43 -242 234 56 -144 68 7 175 183 -20 252 154 119 171 212
3725 212 457 359 314 348 253 127 152 306 349 118 234 260 393 421 122 293 170 112 22 85 140 -86 114 -182
3749 -182 276 -75 -101 -54 -144 134 -139 -111 -96 -212 -20 -389 -100 -257 -480 -129 -89 -176 -217 -156 -194 -372 -280 -219
3773 -219 -303 -120 -167 -183 -225 -185 -161 45 -146 -86 133 114 130 147 1 186 73 120 134 185 307 269 87 -61 176
3798 176 252 63 215 29 300 86 212 297 136 198 252 -15 224 208 392 256 328 177 -206 -102 -52 -9 81
3821 81 7 -67 -101 78 -32 -11 -10 -44 -231 -103 -228 -53 -57 -240 -301 -42 -91 -115 -216 -183 -287 -382 -359 -240 -392
3846 -392 -96 -122 -101 266 -150 -45 -207 -41 19 -90 41 -95 46 34 102 -52 158 213 100 170 25 76 497
3869 497 -147 -224 280 303 176 243 273 210 310 45 242 17 368 300 394 96 404 475 35 336 394 72 265
3892 265 239 -251 -165 118 -85 -120 129 57 -65 -13 -123 -37 -114 -215 -196 -221 -130 -211 -85 -269 -63 -664 -261 -254
3916 -254 77 -319 -251 -368 -152 -7 -360 -206 -122 -13 -320 -228 -146 -236 75 127 5 -104 -3 66 297 -4
3938 -4 126 140 56 8 128 13 78 154 143 181 205 221 297 287 144 6 187 209 83 194 178 541 -104 -17 -91 210
3964 210 -112 186 268 66 -7 107 28 -52 -156 -37 141 -123 -68 158 77 27 -180 78 -65 -152 88 -86 -130
3987 -130 -279 -134 -153 -299 -279 -405 -364 74 -296 -278 -64 -174 -219 -209 -289 -132 -194 -317 60 51 22 -263 -70 -33
4011 -33 49 306 33 249 29 -6 116 122 230 185 120 343 333 168 290 34 194 22 236 229 40 497 131
4034 131 127 159 315 113 270 283 62 -76 206 132 226 46 -313 -77 25 71 9 84 -66 -75 -122 79 -323 -167
4058 -167 -435 -231 -122 -270 -377 -89 -231 -113 -262 -70 -126 -95 -202 -150 -230 65 -46 -30 -85 -108 -124 -3 -140
4081 -140 -226 -97 -12 -10 -12 -28 -36 224 11 110 64 173 144 94 106 338 29 97 144 72 309 56 62 202 64 277
4107 277 197 115 318 445 148 28 169 242 -168 -13 85 -38 35 -113 84 -201 -31 47 -138 -28 86 -112
4129 -112 140 -234 -254 -73 -143 -168 -171 -218 -300 -224 -45 21 19 -214 -223 -177 -251 -214 -208 -293 -106 -11 -34 -14 -113 -1 215 -5
4157 -5 -286 -18 45 9 216 -164 -93 72 36 -39 95 3 351 -42 198 196 90 274 -15 -134 165 322 275 252
4181 252 205 181 468 131 140 338 327 -73 164 199 41 213 97 188 -105 -70 5 -184 -268 149 -88 -149 -150 -356
4205 -356 -341 -102 -466 -302 -67 -244 -111 -189 -148 -378 103 -351 -274 -167 -163 -157 -265 -304 -236 -283 27 -212 -94 -280
4229 -280 95 19 36 2 141 140 62 33 -82 -60 47 70 283 162 79 29 230 287 140 121 153 275 300 247 97
4254 97 323 -30 233 -87 287 210 135 187 303 195 277 137 173 233 -160 -113 75 52 8 -184 60 -153 8
4277 8 -201 -102 -305 -196 -239 -151 -83 -190 -239 -13 -53 -205 -262 -114 -29 -122 -161 -54 -221 -285 -58 -210 -298 -73 -192
4302 -192 65 -104 -150 27 -132 -122 -7 71 8 125 211 119 172 304 2 132 83 60 194 -65 191 317 278
4325 278 229 177 -8 388 67 83 292 -7 166 144 -92 119 -54 400 173 139 -98 -204 146 112 59 113 -139
4348 -139 -85 359 84 109 6 58 37 -207 -24 -63 -283 -178 45 -226 -416 -344 -33 -366 -525 -329 -134 -103
4370 -103 29 -163 -99 125 -440 -391 42 67 -540 -563 221 -15 -19 -157 -261 -387 43 163 -26 -256 306 174
4392 174 -31 45 194 64 402 718 -67 197 126 -112 566 118 83 461 89 -91 806 -94 1064 -10
4412 -10 8 870 -545 -6 -232 -37 548 255 -139 -356 -57 -330 244 -534 -300 194 -759 -698 -413 178 -39
4433 -39 125 -997 -277 -272 -270 -612 305 195 -50 -593 -437 -236 -467 -159 -608 257 -334 -969 -744 -125 -505
4454 -505 -43 155 -551 -628 -196 93 208 -219 -215 266 -402 32 55 -107 -325 363 372 -32 -378 11 334 165
4476 165 247 282 -460 -136 292 -63 436 103 178 44 -176 68 114 905 292 504 102 -543 385 462 102 242
4498 242 67 129 -530 -582 30 179 -313 -13 -249 -482 69 -911 30 -571 -398 302 -596 430 -49 46 182
4519 182 -291 -588 -523 -68 41 -378 -250 490 -190 -152 -314 -772 75 -174 -117 292 -344 70 97 -592 -460
4540 -460 969 -67 -152 1020 466 -8 290 49 142 277 279 -26 -133 439 170 -328 793 948 770 -124
4560 -124 -478 154 -610 -600 588 485 -209 7 -150 -335 -353 -247 136 88 -65 -34 146 125 -207 -57 -372
4581 -372 -241 38 -109 -217 -293 -11 -489 -269 146 -28 -214 -56 -239 -272 -227 -400 123 56 -488 -254 -151
4602 -151 -63 -432 -390 94 -201 -580 234 -394 -172 226 40 -110 9 239 160 340 -299 102 -123 -119 221 595
4624 595 21 227 100 -405 273 -130 191 -90 464 433 52 116 -274 -76 276 307 -295 684 377 44 -37
4645 -37 45 18 211 -27 32 -232 -89 -127 -348 -158 106 -206 -245 -136 -30 -349 -247 -158 -192 -191 -496 -186 -237 -198
4669 -198 -74 -20 -206 -270 -119 48 -265 -116 85 -41 -149 -70 15 103 -59 -16 -61 -58 65 -173 126 6 28
4692 28 209 206 121 271 351 19 148 216 45 226 194 222 251 84 96 213 172 147 -33 11 71 -76 105 -17 99
4717 99 54 -10 103 -110 125 -6 6 -77 -174 -231 -148 -232 -31 -36 -211 146 -387 -266 -231 -187 -194 -209 -269 -221 -132 -279
4743 -279 -407 -229 -133 -98 -112 -41 -197 30 -90 -290 -46 -21 -320 10 -155 -63 -66 204 172 -16 43 -145 19
4766 19 14 -146 264 183 396 152 -213 219 175 174 359 -33 321 145 -163 86 262 73 88 308 25 195 99
4789 99 224 25 69 -243 4 75 4 -101 -238 -70 12 -106 -118 -26 -199 -52 -154 -72 -71 -138 7 -106 -101 -76 16
4814 16 -155 152 -69 -195 -176 12 -301 -84 -237 -133 52 -50 16 -54 -86 177 102 111 18 -173 -144 -41 106
4837 106 -162 126 -156 123 364 284 -9 174 -52 -33 -35 310 330 352 38 405 -64 276 101 318 287 -179
4859 -179 -235 38 249 345 -372 313 170 -84 -400 -342 596 246 -42 -310 54 -29 -280 -151 400 298 -49
4880 -49 -163 -104 246 518 40 73 253 -21 -276 -103 -40 -22 -95 -275 -173 -465 -168 89 -152 -75 -488 376
4902 376 -520 -27 -203 -2 312 -161 63 -192 -82 116 46 261 335 372 436 315 139 127 256 140 158 191
4924 191 403 58 321 402 -79 26 600 122 -44 201 -394 281 -2 68 247 168 328 50 296 3 241
4945 241 171 -6 -174 35 255 3 -57 34 -80 -206 -273 -15 -248 2 -92 -606 -89 -125 -138 -188 -14 -480 -85
4968 -85 -115 -113 -220 -154 -63 35 -54 -162 18 0 9 -137 -318 -79 -168 -103 -18 -100 72 334 186 -52 112 125 162 179
4994 179 276 111 121 263 232 -68 128 14 1 251 263 -14 323 113 82 273 164 50 -180 252 40 -106
5016 -106 254 112 106 -306 -67 -140 8 -157 -9 -266 52 151 -30 -181 -164 -452 -85 -4 -230 -361 -83 -244
5038 -244 -189 -63 24 -84 -250 -185 -27 -31 -209 -35 -85 -145 -25 -66 -162 54 120 116 78 122 -94 93 161 190 160 73
5064 73 102 31 -52 22 -95 66 491 73 75 188 -6 19 372 32 90 -26 44 330 -50 106 -9 36 45 89 -73
5089 -73 194 132 102 146 131 -220 -30 -1 16 181 1 -291 -242 284 -158 111 322 311 185 -110 547 -155 377
5112 377 194 301 -201 312 64 522 222 261 -79 447 -313 285 202 86 178 598 -117 -86 -232 521 61
5133 61 10 428 320 -105 -151 -105 73 294 350 176 7 89 139 245 123 -50 132 290 292 153 241 54 49 201
5157 201 343 95 89 27 153 216 99 254 191 -62 88 79 -10 50 131 209 -118 25 99 -130 -71 -2 -42 74 112
5182 112 -154 -96 -205 -397 -134 -126 -67 -16 -152 -174 -235 -19 -171 -319 -231 1 2 -99 -120 -35 50 -143 184 -106
5206 -106 -134 69 -22 29 149 178 -5 -9 -64 -39 240 239 203 213 170 11 -53 291 261 132 380 203 107 193 199 70
5232 70 273 410 44 85 113 220 -53 330 116 -30 -111 -185 -13 120 91 15 -14 -67 142 -31 11 -157 -182 -115
5256 -115 -179 -29 -200 -143 -64 -184 -65 -41 -54 28 -38 -356 -192 -182 -106 -166 -144 -155 -300 -252 -16 -30 -38 -129 44 16
5282 16 -39 38 -129 -94 174 131 156 158 311 33 -68 32 126 187 160 132 148 114 -25 395 283 283 361 -32 107 -71
5308 -71 161 247 265 128 358 66 20 -4 -20 161 332 99 -123 106 120 -34 -49 22 -154 -118 -156 14 -117 -146
5332 -146 38 -229 -173 -299 -37 -26 -60 -66 -319 -198 -335 -216 14 -147 -32 -179 -276 -265 -42 -174 34 -120
5354 -120 162 -120 -192 -84 -243 117 47 -51 90 74 151 179 135 -71 432 120 151 51 176 143 243 205 264 169
5378 169 6 -128 49 323 146 -52 73 95 46 224 68 -208 215 -38 109 -46 22 60 -118 51 -185
5399 -185 -95 -106 -88 -57 -59 -48 -75 -136 -87 -169 -74 -275 -159 -105 -232 -64 -11 -341 -233 -139 10 24 -19 -126 -87 -71
5425 -71 -129 -9 -18 -26 9 -136 96 3 -66 315 120 281 -90 27 -8 219 155 -3 -95 156 96 65 73 172 68 -12
5451 -12 202 119 92 210 184 9 188 234 48 127 98 -68 227 -46 -88 -109 -61 -154 54 -66 -116 -63 33 4 28
5476 28 -85 83 -158 -294 -88 -121 -62 -243 10 -59 -127 -118 -216 -53 -79 -52 -226 -205 -99 -93 -100 -147 192 51 -257
5501 -257 -18 -24 64 72 183 -263 -9 -163 31 48 -66 7 8 44 100 113 299 56 134 139 -14 92 53 194 199 163
5527 163 30 266 75 167 81 106 -71 304 15 -39 -44 193 207 63 -14 -233 142 18 -72 -48 -178 158 -244
5550 -244 -151 -168 -301 -326 -170 -77 -53 -165 -115 -68 -282 -379 -228 25 -174 145 -101 -136 -9 -100 -324 -54 -72 -29
5574 -29 -263 -85 16 -41 -138 -83 -264 148 12 -24 152 158 -27 63 -1 219 -216 -14 85 18 96 24 450 202
5598 202 -76 214 232 67 147 201 197 178 -159 -24 166 197 -134 100 89 76 227 185 86 18 -21 -86 171 272 93
5623 93 -95 102 -155 73 -83 2 -98 14 -45 -215 -128 -415 -47 -256 148 -59 -78 -1 -147 -238 -275 -165 -138
5646 -138 -79 -166 87 -67 20 -66 -102 -256 -211 -63 39 45 -10 -77 92 -86 46 -74 139 -101 42 -105 93
5669 93 167 -56 192 -87 121 98 -80 258 180 214 218 46 -101 -24 52 108 109 27 144 -14 73 42 87 11 43 302
5695 302 -11 -183 -67 106 -54 64 -25 -31 -200 -26 -176 50 -148 72 18 16 -151 -17 -160 -279 10 -20
5717 -20 -262 -208 -133 39 114 133 11 -130 -34 -108 -20 -108 106 125 99 27 65 91 67 105 31 115 -135 129 78 -56
5743 -56 -61 173 23 88 187 86 266 233 71 192 185 230 -38 131 116 287 259 83 -57 341 -121 59 83 11
5767 11 -50 -91 64 113 -76 -47 -278 -64 87 -338 -17 163 -139 68 -33 -40 -263 9 -93 -128 -77 -117 -227
5790 -227 -99 -213 -170 -260 -194 -49 -16 -61 66 -223 -191 164 102 -140 136 -218 -156 -227 146 1 15 30 -75 33
5814 33 -182 91 -1 174 162 226 -11 137 234 60 194 22 30 222 64 -15 219 120 196 279 24 67 110 107 145
5839 145 91 -16 23 -217 -49 64 66 -241 38 -105 -10 -155 -247 88 14 41 -262 -254 -276 -90 31 -236 -100 -142
5863 -142 -163 -116 -105 -174 -146 7 -75 41 -49 -229 -161 -209 31 135 -66 -155 -33 202 -172 -174 14 16 228 73 25
5888 25 123 198 -70 -199 159 117 -161 160 205 33 130 174 102 -41 -96 116 99 -74 -78 -131 148 105 11 80 94 24
5914 24 -135 -201 -78 21 -333 74 -163 -338 76 -35 -218 -36 72 -230 -78 -95 -11 -120 77 -211 -26 -180
5936 -180 -47 -179 -220 -18 -174 -115 -43 -211 -249 -486 100 7 -35 -146 -68 -67 -9 9 -63 34 60 117 142 -126 -71 184
5962 184 -252 173 222 60 40 -233 -130 115 72 80 200 67 -4 -68 240 127 320 70 190 176 59 293 220
5985 220 -63 101 -116 9 -31 -134 -122 -48 144 225 127 -13 201 232 -258 331 288 48 -139 -96 -3 160 -108
6008 -108 -289 -192 -370 -81 -266 -75 -93 -158 -191 74 15 -196 -73 -86 -7 221 -81 19 263 195 -138 -214 168
6031 168 150 -51 -87 -87 -301 85 59 -62 60 60 153 138 239 120 248 -4 189 46 -111 -61 153 142 158 152 276
6056 276 26 -9 126 115 118 101 -44 73 -19 101 155 88 22 -89 -180 89 -107 -41 -64 -148 -306 -2 49 -183 -173
6081 -173 -127 55 -28 -151 -155 -30 -103 -52 -22 7 188 -5 -100 127 -159 -101 -92 -121 -151 -55 -139 -60 -204 -193 64 -60
6107 -60 47 163 -44 36 -85 73 140 247 -178 31 165 104 -11 75 245 -176 -17 85 -82 3 34 238
6129 238 326 19 15 -22 160 170 107 -20 -108 97 -176 112 -77 158 21 -116 -134 -256 136 50 -176 25 -202
6152 -202 69 -111 -69 59 72 -106 -203 -307 -162 -105 -10 -95 -109 81 -161 -100 -28 -29 149 -36 -97 147 151 -47 -16
6177 -16 -20 -107 121 -199 -15 -52 179 13 93 -67 10 141 381 229 128 -211 72 -50 19 68 70 98 -6 64
6201 64 144 222 11 169 10 193 -177 0 118 -41 40 126 64 -169 19 -11 -149 -50 -259 -85 124 96 -36
6224 -36 -12 38 -36 -77 -156 36 119 -188 -136 -13 -318 -269 11 -229 126 77 -169 -195 -360 -203 121 -101 -97 -138 45
6249 45 53 -161 -17 41 -127 -6 27 147 251 36 -268 -151 19 293 41 13 -68 -30 -5 -120 213 138 -228
6272 -228 247 -62 -30 121 279 69 31 103 165 176 -122 -7 -64 50 41 243 -104 141 336 265 -96 -78 -26 -212
6296 -212 -42 28 -346 102 -289 13 -10 -46 -9 -60 -234 173 113 -118 97 -118 54 -65 60 -319 -49 -25
6318 -25 -168 123 -249 -11 -147 267 -216 -167 -51 -268 149 -77 20 -49 -245 89 36 -122 92 -223 -22 70
6340 70 -36 13 88 -26 17 -47 240 200 26 -98 -97 72 -114 211 -9 143 20 -30 31 -165 94 63 -37 91
6364 91 225 -30 -34 -168 -52 2 -87 -45 -32 -39 2 228 -35 -179 -210 -119 -107 -216 -46 -75 -118 -352 -41 -83 -26 -75
6390 -75 -22 -187 6 -160 -401 164 -9 29 -78 -105 21 -83 -129 69 138 43 33 -5 28 7 -22 98 -13 -117
6414 -117 -63 -175 -82 126 173 35 114 2 48 132 90 -88 312 35 175 200 115 163 26 54 89 74 126 153 29
6439 29 119 152 77 37 -50 -41 -108 -78 -145 -197 -110 68 26 73 134 -91 70 -251 -111 39 166 -76 -70 196 13 -51
6465 -51 -189 -101 103 -263 -10 -64 -14 -126 -38 -23 -30 -105 48 -162 41 -13 33 35 -257 169 79 -165 -192 17 -137
6490 -137 348 80 33 322 -37 287 244 186 277 -19 -216 29 57 156 125 373 82 83 189 22 -48 28 -97 -50
6514 -50 131 36 249 -77 233 81 117 121 -238 173 -160 -155 -99 11 169 9 15 -209 -185 -80 -71 -185 2 -77 -43
6539 -43 -225 -204 67 -68 160 45 116 -139 20 -21 -43 304 103 139 -121 22 143 177 -77 -37 95 80 138
6562 138 50 -84 222 174 162 45 23 9 101 -58 3 13 133 141 -12 216 -58 -139 91 90 158 29 -9 183 132
6587 132 -77 29 72 11 -141 30 315 113 36 -116 6 77 -284 118 -137 164 -213 175 1 -259 -279 -78
6609 -78 -95 -308 -156 -189 207 -43 174 -248 -148 -31 -162 -197 71 51 -6 -57 36 -89 -86 -2 53 -101 37 -6
6633 -6 198 129 103 -130 78 88 154 155 97 151 222 74 -14 69 128 47 -36 -73 -91 170 180 34 -67 -65 309 -68 165
6660 165 185 -75 194 64 340 42 74 271 49 -273 -144 -122 -124 193 342 -172 27 -101 -111 22 -127 -144
6682 -144 -170 55 -140 42 -97 144 -108 -69 84 -176 -77 82 -117 99 85 152 -285 -139 -157 -176 21 -58 30
6705 30 -152 -35 -111 -48 -180 17 20 -11 139 22 257 -101 113 18 168 -7 -187 -74 -112 30 28 158 -12
6728 -12 270 7 271 -139 266 69 8 101 -12 72 104 264 78 -12 -4 9 46 101 -335 -151 -44 47 147 -205
6752 -205 139 -32 -111 -70 116 -112 -164 118 -147 -49 -270 -112 -90 49 -299 -168 -133 223 -128 -91 -23 -145 15
6775 15 46 286 -79 -50 29 48 -189 214 242 -15 230 -84 90 170 -67 162 51 97 0 160 85 197 26
6798 26 -83 26 123 -62 84 -78 196 154 293 186 186 -115 68 260 37 189 -143 72 -26 151 -21 123
6820 123 -96 -135 -4 -123 -240 -43 -165 -24 -47 -12 -133 -98 -160 -201 27 -208 30 -155 126 -141 -268 -25
6842 -25 -108 11 -126 72 -148 -321 -84 -156 150 150 -2 -57 55 35 -208 21 69 79 65 1 125 -77 55 7
6866 7 154 25 353 198 53 142 25 93 434 56 -165 320 186 21 126 180 24 144 15 233 26 53
6888 53 241 341 -68 -99 -66 192 55 9 54 296 -85 -120 -66 23 -175 -402 -121 -151 -53 -9 294 181 6 29
6912 29 56 -168 -215 100 -446 81 249 -110 -116 163 21 -53 5 -87 -83 -239 2 -17 -85 -145 206 64 22 13 -31 200
6938 200 -12 79 -38 88 102 505 396 64 110 397 278 103 -40 312 -74 96 167 93 31 80 118 -327 295
6961 295 71 -64 4 290 -190 -42 -154 91 21 -225 79 -129 -53 -126 173 111 126 -138 20 54 -177 -265 -99
6984 -99 -121 -94 -92 -19 -34 -131 -80 -267 58 -13 -87 -64 -97 108 -95 -32 2 83 -78 -141 167 78 267 -60 -67 168 -89
7011 -89 80 -60 390 226 19 97 64 -65 25 81 -199 -28 130 -30 164 -3 132 -12 -25 24 -154 124
7033 124 -63 232 27 -24 -309 144 145 -208 452 11 -205 -99 14 -260 -13 -33 -135 -87 -60 -93 -31 40 24
7056 24 -123 40 -300 37 -234 -113 35 57 -139 -148 24 -160 -256 7 -65 -33 -13 23 87 102 -55 6 -146 56
7080 56 64 -176 27 61 102 167 77 -14 -14 33 157 -16 198 76 -34 60 238 124 97 59 248 -2 45 227 16
7105 16 260 70 -248 -133 141 83 186 91 -25 95 -66 -88 53 -127 -44 -147 -72 71 -196 -231 -239 -119 -114 -38
7129 -38 -92 -73 28 143 -103 -116 -258 250 -140 -160 -74 -159 -170 74 -193 -200 79 -61 56 216 72 -385 -27
7152 -27 180 17 83 136 39 -80 36 23 61 -183 -29 -138 145 40 195 17 219 181 119 -29 89 150 153 185
7176 185 -43 -29 -53 137 -66 26 43 14 -146 62 145 45 -55 -67 171 31 -177 54 88 -166 166 107 27
7199 27 -341 -124 211 -39 -77 -182 -116 159 -176 -123 35 -120 107 -5 -190 68 -176 -99 -126 -125 251 -255 -95
7222 -95 -21 -369 130 17 216 -19 -322 29 16 188 397 49 75 45 305 690 590 150 18 -25 -129 200
7244 200 -234 77 -46 -88 -32 -36 -78 -61 34 -30 227 96 -30 132 52 -185 352 -155 147 -123 -49 -111 276 223
7268 223 331 350 -378 171 147 232 -292 137 -10 153 -197 -7 -233 159 -39 -78 -70 8 -51 -120 -111 95 -63 -51
7292 -51 -251 -33 -130 15 -58 -68 -151 -109 -124 -12 -41 -9 237 220 -164 277 -51 14 0 -265 42 236 76 1
7316 1 -89 85 67 -21 77 223 265 -122 275 17 -8 -39 90 12 245 1 -98 -125 -46 171 -12 -80 -98 -94 87 6
7342 6 -148 259 36 -74 184 -144 -78 -126 150 -79 159 -39 -189 -136 174 -38 -175 -71 113 -19 -63 12
7364 12 -63 109 109 -190 -79 -140 -4 133 51 13 4 -27 21 -157 80 -129 123 214 31 127 89 378 -90 -64 -13
7389 -13 79 38 67 37 168 201 115 -164 -13 121 217 205 -53 60 -119 -109 -110 -186 -128 -44 163 -24 159 68 -17 53
7415 53 -120 -11 27 243 -27 175 -313 -241 -121 89 -143 345 -87 105 145 -126 -213 -212 39 -253 57 -13 -88
7438 -88 59 -43 259 -83 -78 -226 -259 -89 -161 -20 221 13 -73 -128 -70 71 -32 275 60 -130 -47 1 321
7461 321 179 108 253 118 -155 -164 183 171 -189 99 278 179 76 52 211 -9 -96 264 105 -152 -161 -66 15 131
7485 131 90 14 95 -83 -58 121 -38 -60 -33 56 -198 77 -165 -237 -13 7 -90 -191 -89 61 -398 213 -103
7508 -103 -125 87 -286 -64 -66 -50 -343 21 -179 51 1 10 -217 113 -42 -150 -54 -322 8 0 -377 -32 -51 -22
7532 -22 -80 -31 -220 -140 18 78 56 -157 208 113 -126 134 238 203 -36 201 113 140 78 369 7 255 -141 -200
7556 -200 -84 184 276 -92 -194 114 86 -122 -181 -322 -198 2 -106 -152 -310 113 -329 -194 174 -134 -198 -72
7578 -72 -79 205 -12 -33 -108 -64 249 -114 -45 220 53 -29 101 -49 48 -44 227 -193 208 -23 -214 -45 -6 -61
7602 -61 -1 134 -48 -8 44 -105 -268 -70 99 66 -147 -78 235 268 55 55 40 -22 -136 187 225 -144 25 57
7626 57 132 -297 -1 -212 64 1 94 -32 52 -177 30 -38 -222 82 -7 38 -164 -113 -63 242 145 192 -106 119
7650 119 136 -126 -318 -63 -145 -217 8 153 -148 -28 -55 -428 -158 -101 80 -95 -21 7 65 -269 -152 -72 13
7673 13 -55 122 -15 75 32 -76 66 74 -22 -150 43 30 121 80 6 71 172 96 12 -9 100 -5 139 315 -161
7698 -161 81 191 235 -48 203 -45 54 -50 222 92 78 -114 219 -47 167 -62 -179 -112 231 -42 -130 63
7720 63 82 31 19 -165 -138 -217 3 -58 32 151 -133 -238 -104 149 -363 -111 -120 -93 -83 104 -105 -269 -102 11
7744 11 -101 -70 -175 -124 91 -222 95 -476 -325 26 -236 -277 -273 -433 -5 15 -458 -264 -212 -34 58 9 -59 233
7768 233 49 -180 -223 -188 8 105 38 72 135 1 -100 -17 175 -223 102 -173 74 257 94 197 -99 -13 164
7791 164 -75 -23 -198 -205 -154 -171 -18 -43 -149 -128 -163 -92 124 -17 -137 -284 340 39 -8 -75 230 5 -276 -256
7815 -256 -124 -84 55 -37 41 -214 -115 58 -59 56 77 -37 -73 -32 236 -12 212 61 67 121 213 59 99 73
7839 73 -84 -42 98 -62 50 102 198 12 -70 102 551 101 -11 -167 42 179 69 120 -59 22 23 147 -141
7862 -141 33 -439 -88 -125 82 5 -92 -115 -10 -19 293 20 -138 42 -158 79 -5 -195 -278 -201 198 -100 73
7885 73 -50 28 -81 74 -100 42 0 -123 -86 -167 -129 -154 94 -39 105 -6 -58 -69 -35 53 -84 9 11 179 -57
7910 -57 168 230 -71 -42 67 -104 171 -90 153 -38 -41 -11 115 98 54 159 146 64 -119 66 95 -187 -14 31
7934 31 65 -36 -74 -30 -56 139 -70 -115 80 -100 -27 -13 262 -79 -189 -33 -237 1 101 -191 16 17 105 -133
7958 -133 -171 72 127 103 102 168 121 36 -394 12 -109 -46 -63 -73 202 -233 90 -44 -278 381 29 -21 145 -21
7982 -21 54 105 -140 168 25 -37 185 212 2 -16 48 -51 97 63 120 178 214 277 88 263 -9 123 -82 0 178
8007 178 133 128 140 -132 -58 60 68 -5 -51 42 325 100 -225 110 -40 -105 -90 -77 -253 62 -21 -17 -42 -159 28 -249
8033 -249 -55 74 -84 105 -116 -90 -214 -54 -183 44 -36 -84 -175 -207 19 84 -71 22 -115 -196 28 56 -108
8056 -108 -176 190 -75 54 364 -33 115 -21 -24 -73 102 86 66 -110 28 -132 -67 79 -144 176 -1 -40 114
8079 114 195 -87 -214 -127 13 39 -98 233 -11 -66 211 -36 108 10 -47 2 -82 142 -43 -17 -92 -100 -8 -59 128
8104 128 111 -136 -163 9 71 -32 82 86 -151 -188 -3 161 -291 81 4 117 90 -65 -87 -64 86 -127 -63 69
8128 69 -121 -77 -112 -24 33 -168 86 81 170 232 82 -27 -139 129 127 -88 89 57 -75 167 -45 27 -120 -13
8152 -13 -77 85 -139 113 7 -65 152 -152 -22 50 35 29 238 -137 -166 64 -40 -87 -95 -200 -97 30 14 56
8176 56 63 9 102 -55 34 -205 -316 -101 -256 -134 -202 3 -14 -269 -56
8191e6
##END NTUPLES=NMR FID
##END=
