##TITLE=1H_LR-731-CR-10
 CDCl3, 8 sc, 
 22.12.2020
##JCAMPDX= 6.0         $$ Bruker NMR JCAMP-DX V2.0
##DATA TYPE= NMR FID
##DATA CLASS= NTUPLES
##ORIGIN= UXNMR, Bruker Analytische Messtechnik GmbH
##OWNER= root
$$ XWIN-NMR		Version 3.5
$$ Wed Dec 23 09:54:31 2020 Russian Standard Time (UT+4h)  she@DPX200
##.OBSERVE FREQUENCY= 200.1315066352
##.OBSERVE NUCLEUS= ^1H
##.DELAY= (6, 6)
##.ACQUISITION MODE= SIMULTANEOUS
##.ACQUISITION SCHEME= undefined
##.AVERAGES= 8
##.DIGITISER RES= 18
##SPECTROMETER/DATA SYSTEM= spect
##.PULSE SEQUENCE= zg30
##.SOLVENT NAME= CDCl3
##.SHIFT REFERENCE= (INTERNAL, CDCl3, 0, 15.7039)
##AUDIT TRAIL= $$ (NUMBER, WHEN, WHO, WHERE, WHAT)
$$ ##TITLE= Audit trail, XWIN-NMR		Version 3.5
$$ ##JCAMPDX= 5.01
$$ ##ORIGIN= Bruker BioSpin GmbH
$$ ##OWNER= she
$$ F:/spectra/data/she/nmr/H-F/1/audita.txt
$$ ##AUDIT TRAIL=  $$ (NUMBER, WHEN, WHO, WHERE, WHAT)
(   1,<2020-12-23 09:52:11.14 +0400>,<she>,<DPX200>,
      <created by zg, POWCHK disabled, PULCHK disabled
       configuration hash MD5:
       00 E9 B6 7A A2 85 ED C7 34 08 36 98 17 FE 4E 26
       data hash MD5: 16K
       88 32 9C C2 EB 59 B5 6D 3D 1A EC 32 59 42 2B C4>)
$$ ##END=
$$ 
$$ hash MD5
$$ 86 4F A0 43 45 37 64 4A 63 2F 5A B1 EE 3D B7 E2
##$RELAX= 
##$RELAX= 
##$RELAX= 
##$RELAX= 
##$RELAX= 
##$RELAX= 
$$ Bruker specific parameters
$$ --------------------------
##$DU= <F:/spectra>
##$EXPNO= 1
##$NAME= <H-F>
##$PROCNO= 1
##$TYPE= <nmr>
##$USER= <she>
##$AMP= (0..31)
100 100 100 100 100 100 100 100 100 100 100 100 100 100 100 100 100 100 
100 100 100 100 100 100 100 100 100 100 100 100 100 100 
##$AQSEQ= 0
##$AQ_mod= 1
##$AUNM= <au_zg>
##$AUTOPOS= <>
##$BF1= 200.13
##$BF2= 200.13
##$BF3= 200.13
##$BF4= 200.13
##$BF5= 200.13
##$BF6= 200.13
##$BF7= 200.13
##$BF8= 200.13
##$BYTORDA= 1
##$CFDGTYP= 0
##$CFRGTYP= 5
##$CHEMSTR= <none>
##$CNST= (0..31)
1 1 145 1 1 1 1 1 1 1 1 1 1 1 1 1 1 1 1 1 1 1 1 1 1 1 1 1 1 1 1 1 
##$CPDPRG= <>
##$CPDPRG1= <>
##$CPDPRG2= <>
##$CPDPRG3= <>
##$CPDPRG4= <mlev>
##$CPDPRG5= <mlev>
##$CPDPRG6= <mlev>
##$CPDPRG7= <mlev>
##$CPDPRG8= <mlev>
##$CPDPRGB= <>
##$CPDPRGT= <>
##$D= (0..31)
0 1.2 0 0 0 0 0 0 0 0.06 0 0.03 0 0 0 0 0.0002 0 0 0 0 0 0 0 0 0 0 0 0 
0 0 0 
##$DATE= 1608702730
##$DBL= (0..7)
120 120 120 120 120 120 120 120 
##$DBP= (0..7)
150 150 150 150 150 150 150 150 
##$DBP07= 0
##$DBPNAM0= <>
##$DBPNAM1= <>
##$DBPNAM2= <>
##$DBPNAM3= <>
##$DBPNAM4= <>
##$DBPNAM5= <>
##$DBPNAM6= <>
##$DBPNAM7= <>
##$DBPOAL= (0..7)
0.5 0.5 0.5 0.5 0.5 0.5 0.5 0.5 
##$DBPOFFS= (0..7)
0 0 0 0 0 0 0 0 
##$DE= 6
##$DECBNUC= <off>
##$DECIM= 32
##$DECNUC= <off>
##$DECSTAT= 4
##$DIGMOD= 1
##$DIGTYP= 9
##$DL= (0..7)
0 120 120 120 120 120 120 120 
##$DP= (0..7)
150 150 150 150 150 150 150 150 
##$DP07= 0
##$DPNAME0= <>
##$DPNAME1= <>
##$DPNAME2= <>
##$DPNAME3= <>
##$DPNAME4= <>
##$DPNAME5= <>
##$DPNAME6= <>
##$DPNAME7= <>
##$DPOAL= (0..7)
0.5 0.5 0.5 0.5 0.5 0.5 0.5 0.5 
##$DPOFFS= (0..7)
0 0 0 0 0 0 0 0 
##$DQDMODE= 0
##$DR= 18
##$DS= 0
$$ [...]
##$SUBNAM2= <"">
##$SUBNAM3= <"">
##$SUBNAM4= <"">
##$SUBNAM5= <"">
##$SUBNAM6= <"">
##$SUBNAM7= <"">
##$SUBNAM8= <"">
##$SUBNAM9= <"">
##$SW= 16.9725356469052
##$SWIBOX= (0..15)
0 0 2 0 0 0 0 0 0 0 0 0 0 0 0 0 
##$SW_h= 3396.73913043478
##$TD= 16384
##$TD0= 1
##$TE= 0
##$TE2= 300
##$TE3= 300
##$TEG= 300
##$TL= (0..7)
0 120 120 120 120 120 120 120 
##$TP= (0..7)
150 150 150 150 150 150 150 150 
##$TP07= 0
##$TPNAME0= <>
##$TPNAME1= <>
##$TPNAME2= <>
##$TPNAME3= <>
##$TPNAME4= <>
##$TPNAME5= <>
##$TPNAME6= <>
##$TPNAME7= <>
##$TPOAL= (0..7)
0.5 0.5 0.5 0.5 0.5 0.5 0.5 0.5 
##$TPOFFS= (0..7)
0 0 0 0 0 0 0 0 
##$TUNHIN= 0
##$TUNHOUT= 0
##$TUNXOUT= 0
##$USERA1= <user>
##$USERA2= <user>
##$USERA3= <user>
##$USERA4= <user>
##$USERA5= <user>
##$V9= 5
##$VALIST= <valist>
##$VCLIST= <CCCCCCCCCCCCCCC>
##$VD= 0
##$VDLIST= <DDDDDDDDDDDDDDD>
##$VPLIST= <PPPPPPPPPPPPPPP>
##$VTLIST= <TTTTTTTTTTTTTTT>
##$WBST= 1024
##$WBSW= 4
##$XGAIN= (0..3)
0 0 0 0 
##$XL= 0
##$YL= 0
##$YMAX_a= 296005
##$YMIN_a= -255792
##$ZGOPTNS= <>
##$ZL1= 120
##$ZL2= 120
##$ZL3= 120
##$ZL4= 120
##$ABSF1= 10
##$ABSF2= 0
##$ABSG= 5
##$ABSL= 3
##$ALPHA= 0
##$AQORDER= 0
##$ASSFAC= 0
##$ASSFACI= 0
##$ASSFACX= 0
##$ASSWID= 0
##$AUNMP= <proc_1d>
##$AZFE= 0.1
##$AZFW= 0.1
##$BCFW= 1
##$BC_mod= 2
##$BYTORDP= 1
##$COROFFS= 0
##$CY= 11.3945322036743
##$DATMOD= 1
##$DC= 2
##$DFILT= <>
##$DTYPP= 0
##$F1P= 15.9154993809931
##$F2P= -4.1035820241983
##$FCOR= 0.5
##$FTSIZE= 0
##$FT_mod= 4
##$GAMMA= 1
##$GB= 0.15
##$INTBC= 1
##$INTSCL= 1
##$ISEN= 128
##$LB= 0.24
##$LEV0= 0
##$LPBIN= 0
##$MAXI= 10000
##$MC2= 0
##$MEAN= 0
##$ME_mod= 0
##$MI= 1.114404
##$NCOEF= 0
##$NC_proc= 0
##$NLEV= 6
##$NOISF1= 3.799351
##$NOISF2= 2.8
##$NSP= 1
##$NTH_PI= 0
##$NZP= 0
##$OFFSET= 15.70392
##$PC= 1
##$PHC0= -10760.25
##$PHC1= 9.600951
##$PH_mod= 1
##$PKNL= yes
##$PPARMOD= 0
##$PSCAL= 0
##$PSIGN= 0
##$REVERSE= no
##$SF= 200.130013532006
##$SI= 16384
##$SIGF1= 3
##$SIGF2= 2
##$SINO= 400
##$SIOLD= 16384
##$SREGLST= <1H.CDCl3>
##$SSB= 0
##$STSI= 0
##$STSR= 0
##$SW_p= 3612.71676300578
##$SYMM= 0
##$S_DEV= 0
##$TDeff= 0
##$TDoff= 0
##$TI= <>
##$TILT= no
##$TM1= 0
##$TM2= 0
##$TOPLEV= 0
##$USERP1= <user>
##$USERP2= <user>
##$USERP3= <user>
##$USERP4= <user>
##$USERP5= <user>
##$WDW= 1
##$XDIM= 8192
##$YMAX_p= 0
##$YMIN_p= 0
$$ End of Bruker specific parameters
$$ ---------------------------------
##NTUPLES= NMR FID
##VAR_NAME=  TIME,          FID/REAL,        FID/IMAG
##SYMBOL=    X,             R,               I
##VAR_TYPE=  INDEPENDENT,   DEPENDENT,       DEPENDENT
##VAR_FORM=  AFFN,          ASDF,            ASDF
##VAR_DIM=   8192,          8192,            8192
##UNITS=     SECONDS,       ARBITRARY UNITS, ARBITRARY UNITS
##FACTOR=    0.0002944,     1,               1
##FIRST=     0,             0,               0
##LAST=      2.4114304,     0,               0
##MIN=       0,             -255792,         0
##MAX=       2.4114304,     296005,          0
$$ Real data points
##PAGE= N=1
##DATA TABLE= (X++(R..R)), XYDATA
0@%%%%%%%%%%qJ6j6J6k4L2m0M8n6P2q8J04j20J37j61J92k24K56k93L38l86M38
32B33m98N66o40P20q05R01j007J122j249J388j539J702j884K081k295K530k787
49a461L071l383L727m108M533n007N544o158O861p676Q640r800J1221j3008J5337
64H333j8509K3086l0274M3182p3057K56070P8105n42728M27134K112l31678L26503
76A68279J6942k94285K78251J0145k50649J32182Q2324j25184O5435M5173q2214
87D6399k4727N7724k0256m3658Q0239K3520j48048N3760R8356j61196L2033J56014
99A50160j78203J233J66152k06299q890K23414j90447k5568K00393k07106k1304
110i6465K08240j79574j6645J70332j43318j0278R7764j08560K6233O5905o1144
$$ y = [0, 0, 0, 0, 0, 0, 0, 0, 0, 0, 0, -8, 8, -8, 8, -16, 16, -24, 24, -32, 40, -48, 56, -64, 73, -88, 104, -120, 136, -157, 181, -205, 233, -265, 301, -339, 381, -424, 477, -530, 592, -657, 731, -808, 894, -990, 1091, -1204, 1326, -1461, 1610, -1773, 1954, -2154, 2379, -2628, 2916, -3242, 3619, -4057, 4583, -5217, 6004, -7004, 8333, -10176, 12910, -17364, 25818, -47239, 208831, 286936, -255792, 171342, 173454, -158224, 168279, 185221, -109064, 169187, 179332, -71317, 60865, 143189, 18005, 83440, 128613, 46399, 21672, 79396, 59140, 15482, 95721, 119241, -28807, 24953, 123309, -37887, -5854, 150160, -28043, -26810, 139342, -66957, -75847, 147567, -42880, -68448, 131945, -75161, -96465, 111775, -67799, -84444, 85888, -57430, -67708, 30056, -78504, -52271, 13634, -47510]
121d7510J5127m969j4876L0093m2897K9691M1784q0686L5789L8471q7472O0545
133b6910L9074j01221P1756M6124j17403N2441N4511q5181N8834L1907r7820O0185
145a3703L9113q3000N2102K3129o1047N7602n111n4059O2666j3968k6068N6038
157C3694m2766o825N1043n4260J7869M2270o1421L1863K3165o1742M5327J2693
169C0910n4017M7500K323m2260L7696j0779k3340M0557j5442j9712K6339j5492
181D283k719J8554k4056P832K0718k8572O386J4260k7328K0779J2597l8656K4771
194H849J3581m0556K7359J0089l6695L3897J406l8032L6263j544l0188L2964p577
207I816j6769K5753j6668p711K2893j4047J106P896j4851J3363P05j6480J6224
$$ y = [-47510, -32383, -37352, -52228, -22135, -65032, -35341, 6443, -74243, -38454, 17, -87455, -26910, 12164, -89057, -17301, 28823, -88580, -36139, 18372, -66809, -7975, 23932, -73888, -13703, 25410, -57590, -5488, 17641, -43406, 14196, 9085, -44974, 17692, 3724, -22344, 33694, -9072, -15897, 35146, -19114, -1245, 41025, -20396, 11467, 34632, -27110, 18217, 30910, -23107, 24393, 26716, -15544, 22152, 11373, -11967, 28590, 13148, -6564, 19775, 4283, 1564, 20118, -3938, 3894, 24612, -3960, 2426, 16686, -10642, 10137, 22734, -15922, 8849, 22430, -18126, 9233, 19322, -17373, 16524, 17930, -20102, 16161, 14617, -15571, 17393, 9816, -6953, 18800, 2132, -5579, 17314, 3267, 4373, 12269, -2582, 10781, 11486, -4994, 11230]
220A1230q06j1408J5264r391r433J9776p942j0849J5553o233q451J3099p839p615
234e045J5536o757r922J2187n415n975R811q505j621J0115j0856q28O133q434
248i576N676J252j0910R581j029r888R716m071m628J0638p757m889R164m396j403
263a2520L841l342K066R24k959J722J43J445K139l693J723L771k987K15L550j099
279e061O22L023k077j831O617n5n693O476K786o578N675K072o976P319L127q303
295A143M365N139o210P96N584m460n96O728m986m583R221k116p560Q276j038p423
311B280P885j860p426P831K27p853L632K083m557m2K965l478k806N868l380p434
327f065R276m45j0771Q942Q09j1078Q949J758j2014Q085M671j1888M858N741r643
$$ y = [11230, 10424, -984, 14280, 4889, -4544, 15232, 7290, -3559, 11994, 5761, -2690, 10409, 2570, -5045, 10491, 3734, -6188, 5999, 584, -5391, 4420, -4085, -5706, 4409, -6447, -7275, -1142, -9576, -3900, -2648, -13558, -3977, -5006, -14894, -5178, -9249, -13877, -3239, -10996, -15885, -6721, -11117, -12520, -8679, -12021, -9955, -9031, -11990, -10268, -10125, -8680, -6541, -10234, -8511, -4740, -7727, -7512, -3962, -5061, -4439, -1416, -3493, -5324, 1293, 1238, -4455, 2021, 4807, -1771, 3904, 5976, -1000, 6319, 9446, 1143, 5508, 10647, 4437, 5233, 10817, 6357, 5761, 12489, 7503, 2920, 12141, 10025, 2465, 10741, 9703, 2280, 10165, 8305, 879, 8710, 8937, 1084, 4716, 6799, 2242, 2200, 5165, 1687, -1119, 4749, 1369, -6065, 3211, 2766, -8005, 937, 1746, -9332, -383, 1375, -10639, -2554, 2117, -9771, -4913, 828, -8815]
342h815L101P138r482P69R381r036j184J0164o467k286Q459n713j654P537l765
357a853l445N925J09k121R22K320j212r75M249k378l746J0116m811n239R290k075
373E076o182R719n381m249J0364m500o276Q638k675n777O742j491m868N569L62
388E071p405M418K121o148K352K516n092J526K540o139K147J741k697N00q87L50
404c086o97r85K160k563o30M416n892J72O043o407R63N062o755K923M260p245
420h261K887M482m928J416K732l141K009J940j600o32L522n77k242L578k72j902
436i89M388j162j954M069j421j034K762o22K74M09k69J910k125J513J892m413
452C228L142K019o121M363J169n123M690r27m381M261p85k875K219j336p02Q61
$$ y = [-8815, -5714, 1424, -8058, -7289, 2092, -6944, -8128, 2036, -4431, -6717, 1742, -3971, -5625, 1912, -1853, -5298, 627, 736, -1385, -463, 1857, 645, -330, 3919, 1541, -2205, 7911, 3100, -2139, 7151, 5076, -1106, 8613, 3232, -1017, 9347, 4847, -1429, 7209, 4534, -1243, 5499, 4008, -860, 4709, 5071, -2334, 2084, 4205, -1943, 409, 2925, -2167, -641, 1899, -4240, -2093, -352, -3049, -2549, -3436, -3086, -3783, -4768, -2608, -5171, -5801, -1385, -7277, -7105, -1062, -7469, -6506, -1444, -8199, -5276, -1016, -8261, -5374, -892, -5820, -4404, -1672, -4813, -2804, -864, -2464, -3096, 426, -151, -2393, 1185, 913, -989, 3399, 2237, 283, 4352, 2931, 1897, 4659, 4037, 4311, 4720, 4451, 6361, 4236, 5749, 7641, 3228, 6370, 8389, 2268, 6631, 7800, 2677, 7367, 6440, 2059, 6320, 5535, 2660, 4879, 3543, 2841, 3702]
468C702j732k15m51K12o0k146Q98k51k213J585j117j094J510j930l2L02j036Q07
486c261j616J65J792k851O72J722l415L099j35l503L665l22k133L438k085j31
502d899L083k495Q95J191j577K648l08j369K741j155L53J918j821J335J076j596
518B0J731N40m89M94l59J368n90m39J692j590M71K001k758Q14J545k415J309l31
536C014j091J785r53p41N39j390J525p71j823K016j629j103K729l228k40K553
552A192l500J138Q58k282P04M31j362L05J21J58r88J32J358j731k29J918j891
569c668R32J471k594J492J115j515J209m5m17J218m21N79j5m57K370j194o0K272
587B272k133P13K299k413J189J771k277J554N32r66J143p91N37M00q62J158q73
$$ y = [3702, 1970, 1755, 1304, 1516, 1456, -690, 208, -43, -2256, -671, -1788, -2882, -1372, -3302, -3334, -3032, -4068, -3261, -4877, -4712, -2920, -5771, -5099, -3377, -6792, -3693, -3828, -7331, -3666, -3988, -6121, -2683, -4768, -4899, -1816, -4311, -3416, -2225, -3802, -1154, -1462, -2831, -90, -1245, -892, 1026, -795, 540, 1616, 20, 1751, 2291, 1802, 2296, 1937, 3305, 2715, 2276, 3968, 2378, 2849, 4850, 2092, 2906, 4451, 2036, 3345, 3014, 1923, 3708, 2755, 2014, 2553, 1163, 2688, 1917, 94, 2110, 481, -622, 2107, -1121, -1361, 1192, -2308, -1170, -312, -2594, -1890, -1459, -2821, -2516, -2395, -2237, -3225, -3093, -1735, -3466, -3695, -1777, -3668, -2736, -1265, -3859, -2367, -1252, -2767, -1558, -1603, -2020, -802, -1223, -644, -659, -1116, 1254, 60, 0, 2272, 139, 852, 3151, 738, 1927, 3698, 1421, 2975, 3507, 2541, 3684, 2893, 3430, 3830, 2968, 4126, 3253]
604C253l70J625j768p5J756j835R3P59j589P39J20j372O75r52Nk38j222P47n50
623a99j290J054j379K30P65k177Q37N39k095O51l67l95J174j139m30P88j048P78
641c703k77o47J095m97k68J265j190L60J148q39N88K66k81J156r8J51J074p90
659a487R83J89p21J704n5n33J508n58K84O16j18P30N33o96P18n60L10J032j183
678B696P82N72q47O56k90n43O32l67k13K62n44l1P5q04O25q71m5K73j369M13J32
699A194q36J29l15n87L26p08o4J32m75k6n67m33N79j097L31M58j204N77N15j219
719c290O13L64l95J35J52P4j9K39J99k3O0R97p97L42J024r22O89N89p16P38M37
740D90k08K85K94L16k5L31L76q3p1O39m88L03P01j066M25Q55r63K06J07o57L27
$$ y = [3253, 2883, 4508, 2740, 2665, 4421, 2586, 2679, 3438, 1849, 2588, 2708, 1336, 2011, 1059, 1064, 826, -396, 351, -199, -1489, -435, -1814, -1584, -819, -2996, -2159, -1620, -3715, -3064, -3431, -3826, -2652, -3791, -4221, -3433, -4481, -3703, -3980, -4627, -3532, -4029, -4297, -3032, -4222, -3862, -2714, -3553, -2965, -2699, -2980, -1824, -1922, -1771, -697, -1487, -504, -315, -1036, 668, 613, 80, 1588, 1030, 1314, 1930, 1812, 2542, 3075, 2379, 3097, 2537, 2847, 3879, 2696, 3478, 4050, 3203, 3859, 3569, 3026, 3658, 3291, 3078, 3340, 2796, 2765, 2840, 2036, 2661, 1790, 1745, 2018, 649, 1062, 1194, 358, 487, 172, -415, -89, -797, -861, -729, -1204, -1230, -1797, -2230, -1651, -2748, -2417, -1959, -3163, -2586, -2071, -3290, -2677, -2313, -2708, -2573, -2421, -2347, -2366, -2127, -1928, -1951, -1891, -894, -1691, -1349, -325, -1247, -558, 31, -685, 53, 490, 282, 567, 861, 1177, 1152, 1483, 1859, 1776, 1705, 2344, 1856, 2159, 2860, 1794, 2219, 3074, 2111, 2317, 2424, 1767, 2094]
761B094R1o5m02J37J58q95k44P57j012J2K27r59J51J20r45L66K4q34J09l23k24
782a657P5l71R5k27m28N08m06m19R06p77k22P40p45J17O76m98L22n0K94K94j40
803a913K85K51j65Q82k15k4O69J48r3N59j64P69j97j05N69r7M84K32l34Q23l89
824A975k08J724q11m56Q02l21o68R40m57k94M77q0n7p1l82L32q66L89P2p66R7
845A371J27r94K32k60m44J3M9p53l2K56q02k72M77m24o52P04n37o62J072q72m05
866b808Q23n00l83O94m33J81J36j36J67j99L25P62n94P2Q11j006P21O57r45J138
886e17L1k63R95j71l2N64N1j72M33L98j24J84M12k14rM87q3j30M26j09l75N49
908B331k72M5j65p1L61m57l27N54q58J88K88r91N80j95q75P75n22q08Q99r66l12
$$ y = [2094, 2185, 2120, 1718, 1855, 2013, 1118, 874, 1631, 619, 631, 858, -101, 50, 170, -775, -409, -385, -1219, -1110, -1433, -1657, -1582, -1953, -1858, -2085, -2513, -2005, -2411, -2830, -1924, -2701, -2923, -2183, -2928, -2811, -2135, -2633, -2311, -2361, -2067, -1773, -1913, -1628, -1377, -1542, -660, -875, -899, -230, -82, -175, 384, 220, 989, 792, 687, 1256, 1159, 1643, 1875, 1541, 2364, 1975, 1767, 3491, 2680, 2224, 3026, 2705, 2037, 2977, 2520, 2226, 2703, 2623, 2566, 2495, 2113, 2445, 1579, 1968, 2040, 1274, 1371, 1498, 504, 736, 476, 32, 45, 94, -659, -691, -435, -1237, -1509, -1032, -1456, -2108, -1404, -1941, -2603, -1531, -2403, -2808, -1985, -2485, -2868, -2174, -2607, -2426, -2290, -2426, -2259, -2458, -2133, -1371, -1965, -1893, -1082, -2088, -1367, -710, -1655, -517, -486, -749, 246, 75, 43, 607, 658, 486, 919, 1317, 1193, 1377, 1789, 1575, 1566, 2053, 1970, 1840, 2266, 2157, 1782, 2331, 2059, 2104, 1939, 1868, 2229, 1772, 1445, 1999, 1141, 1329, 1617, 626, 1206, 1011, 136, 911, 389, -419, 480, -486, -798]
929g98P30q99K21J86j106N86l8p40O46k87o95R64o73k02N72j00j92K37k67q7J88
950a754L68n73N81P27n95k73Q26l45Q15k73j83J030l48L3N01j11N2L26m61J270
970A613r1q70J190k13o41J599r05k81J281p57l93J310p76k31M08l10m18J85R2
989A792l50j50K42k89n27L72j57o86K16l20k59j03j18J1n79L80o70k53Q58r18
1009a508o94J259r32p51J492j070m28J259j117k7R40j037P29n1k43O11n67K55
1027a880M85m80J1R76n79N97L03o14Q64K06k91L55K56o6L53M27j72P5L98J86l60
1048A050P09j37l38P08l44L60K3k41K97n8m58Q72o63j08N96r98L52N52j474R01
1068A601K91j445P88j26q76N24l12m75N83m99j34j26k10j14r3r3j14l67p9J40
$$ y = [-798, -68, -967, -746, -560, -1666, -1080, -1118, -1858, -1212, -1499, -2194, -1230, -1903, -2105, -1533, -1633, -1825, -1588, -1855, -1942, -1754, -1386, -1959, -1378, -651, -1246, -1519, -693, -1038, -223, -496, -679, 351, 3, 36, 537, 426, 478, 804, 343, 1613, 1522, 652, 1842, 1629, 988, 2587, 1682, 1401, 2682, 1925, 1532, 2842, 2066, 1835, 2243, 1933, 1515, 1700, 1792, 1442, 1292, 1534, 1245, 718, 1090, 933, 247, 463, 143, -116, -219, -337, -326, -905, -525, -1195, -1448, -590, -1508, -2202, -943, -1875, -2626, -1134, -2204, -2632, -1373, -2490, -2517, -1577, -2614, -1885, -1936, -2179, -1568, -2135, -1880, -1395, -1875, -1864, -888, -1467, -870, -567, -1181, -317, -111, -402, -47, 209, 143, 496, 923, 751, 826, 1224, 1410, 1050, 1759, 1622, 1284, 1992, 1648, 2008, 2031, 1790, 2087, 2029, 1571, 2443, 1780, 1672, 2268, 1270, 1622, 2174, 700, 1601, 1892, 447, 1235, 1109, 233, 757, 445, -30, 553, 54, -80, -206, -416, -530, -623, -716, -830, -1197, -1276, -1136]
1088a136k88j19L81p10J94K4n6j55M8L58n83R04N6q08N44K98q82R52N16j072Q80
1109f54J06k70O73J20l35O56n05N57Q8k61Q32k39k60R23o04K30M80m82L7O58p50
1130A000K48Q28q04o7M36k09l85O52m38m39N27N3m08P0m74l1j95N6j24r3l59J48
1152hn20l08O38m44k14K46m77j24L18o24mM09o62J78L01n44N61j24k32k6M31m03
1174a632J27R7J22J6J0L80N0j21M55l3n4n6P10k98K38L29k70K30N02m23M8P66
1196A193l87K80N62l52J36L94m91N83m8r6J71l47K60O8m44k7J67m11N04J51p75
1217A091K41k34o98N60k91k03j67J95l17j61R3n42m8K36n29m33N96l38r1N7j61
1238a144l31l7P1J73l87K05j5n08O17j73m98P01j04m13O10K22p08O01J90k85M47
$$ y = [-1136, -1424, -1543, -1162, -1872, -1678, -1654, -1710, -1865, -1817, -1459, -2042, -1138, -1082, -1890, -1346, -1048, -1930, -978, -462, -1534, -654, -548, -818, -145, -25, -360, 296, -209, 348, 436, 175, 1007, 768, 508, 1431, 827, 1057, 1537, 1055, 1092, 1750, 1000, 1248, 2076, 1272, 1205, 1641, 1432, 1047, 1699, 1261, 822, 1349, 1402, 994, 1064, 590, 559, 364, 420, 296, 203, -156, -8, -528, -836, -198, -642, -856, -610, -1087, -1211, -893, -1517, -1521, -1112, -1774, -1596, -1295, -1839, -1278, -1402, -1634, -1660, -1229, -1632, -1505, -1408, -1286, -1270, -1260, -880, -830, -951, -496, -529, -583, -639, 71, -227, 11, 340, 70, 300, 802, 379, 427, 1193, 806, 1086, 1648, 1296, 1432, 1826, 1335, 1918, 1870, 1774, 1945, 1598, 1858, 1926, 1482, 1455, 1622, 1211, 1715, 1866, 1091, 1332, 1098, 400, 960, 669, 466, 299, 494, 177, 16, 109, -433, -481, -245, -774, -1207, -611, -949, -1040, -983, -1144, -1475, -1512, -1441, -1268, -1655, -1450, -1465, -1973, -1356, -1529, -2027, -1326, -1430, -1843, -1233, -1011, -1719, -1118, -928, -1213, -766]
1259g66L9q8M52J51J39j61J44N17k59K0M51q3KL82P6J96m5j13O1M48n55R8M94
1282A600l44P8K65l5m87M71k66j47K57n68J56J44l92Lp5j86K11l36j47K16p72
1303c54K14J33n18K72r4m45J94N8l88L3K66o61J50M2l18r6M68q7k25P3J17k80
1325a446L74l4K39l2L60k12Q8k7J32j82L03K84k54K68M14k46K42M39o30K63N56
1346H99m97K28O17m56K29L52k22N2K5m0J4j05L21j52j68J74j11l96N48j83l44
1367G85L46m45mK67m38l46J25K8m79lR9k66k7n4l75Q9j0n1k09J96l49J06k44J01
1391a158J01j78J55j37k55O88m89q2K67j18l01O14j47J7K47r7N2L52l7m3L11M6
1413a92K11J04K25j56J9L23J34p7K36O3k19K89L3j3Q0J12l2j57K52q9O1Q8k20
$$ y = [-766, -727, -815, -363, -212, -73, -234, -90, 427, 168, 188, 639, 556, 558, 940, 1016, 1212, 1167, 1054, 1115, 1563, 1008, 1106, 1600, 1256, 1334, 1599, 1564, 1077, 1548, 1282, 1135, 1392, 824, 980, 1124, 732, 735, 660, 474, 685, 349, 202, 418, -354, -140, -7, -525, -253, -347, -792, -598, -540, -928, -895, -629, -1290, -1140, -1098, -1416, -1512, -1044, -1131, -1356, -1283, -1166, -1446, -1072, -1106, -867, -899, -539, -751, -663, -690, -558, -740, -437, -153, -407, -139, 275, 29, 271, 710, 80, 343, 899, 402, 630, 1247, 791, 1020, 1372, 1150, 1202, 1227, 1187, 1201, 1096, 1417, 1265, 1097, 1271, 1160, 764, 1312, 1129, 785, 1131, 686, 682, 949, 511, 165, 290, 318, -161, -164, -65, -331, -358, -412, -787, -698, -708, -759, -968, -772, -1121, -1015, -1259, -1158, -1057, -1235, -1080, -1217, -1472, -784, -1273, -1355, -1088, -1206, -1507, -893, -1040, -1023, -776, -873, -821, -469, -506, -549, -238, -192, 19, 123, 348, 192, 211, 534, 668, 591, 827, 890, 671, 960, 993, 980, 1060, 1172, 1140, 983, 1235, 1146, 1207, 1295, 1075]
1436A075l90N64Jn54K71l5k25J91ok12j50j77J63m57J24Nk23l77J08k76J03p5
1458e52r2N8k08No3M9j70k24K4N0j84J56j59j1L49L22n24J90K50j66q9K71J1k08
1482i15K45J34J65R1J59p5l9J99N0K45J53k17M07O6m9J22J54m80O80L08m64j08
1504H31J51J37k36J40J73n18L65J56n26K12n2j55J73q0k4k33q4K42m17j58N96
1525F93m23m29L55m97l7K92J4l84n2k29j34L32k26j32R4k7m21K64J21O4l12M35
1547f39k79k31K86k95M94O8J2n9J06J31l21K92L5m1N6O9p9L47M72l37j48L75j96
1570A18L50J55r8J04J01Kj11k2L98k06J49J11j84kN8k66oJ36K36j77k50Q1m1p
1594F29J92l39l2k18J13n25N00j38j94J05j69L6j52O8m60J82j16m93K80o4K93
$$ y = [1075, 685, 1249, 1250, 696, 967, 932, 707, 898, 892, 680, 530, 353, 516, 59, 183, 188, -35, -412, -304, -580, -477, -552, -644, -586, -794, -789, -852, -803, -973, -1197, -1173, -1123, -1307, -1151, -1310, -1321, -972, -650, -1174, -984, -734, -900, -989, -718, -707, -915, -670, -536, -371, -280, -121, -196, -235, -36, 14, 259, 412, 195, 602, 668, 619, 741, 895, 415, 1095, 1403, 939, 831, 982, 1119, 883, 1023, 1196, 678, 1043, 1199, 673, 885, 833, 678, 851, 771, 747, 514, 430, 672, 255, 97, 693, 270, -159, 196, -301, -338, -46, -32, -416, -468, -697, -831, -499, -725, -857, -763, -790, -1211, -947, -826, -762, -1074, -639, -918, -1149, -863, -1158, -664, -596, -584, -643, -537, -406, -727, -435, -400, -441, -385, -316, -395, -48, 424, 87, -61, 314, 118, 468, 623, 525, 629, 730, 732, 621, 599, 997, 791, 940, 1051, 867, 865, 923, 657, 651, 787, 1023, 846, 596, 677, 636, 629, 821, 482, 450, 232, 345, -180, 320, 182, -12, 93, -76, -40, -192, -124, -584, -402, -518, -1011, -731, -795, -502]
1615e02ML0k93n44Q78k34M6J50j6l67J99p9J79K6Q3j5j72k06M52M48J96n72N9
1638b50M28K53j74L1O01n36k40K82l1N37p41N73m6L45K2r28J384l37k4p6m18K43
1660H98k20O9j24L89n41J11J03J5p23P40l53M32p34K55q8o55K88N5j53n1jl1M27
1683A08r55O47l34j44L9N7M7Pk00J97o7l44P4o8J79N22p23K03L78M67q37O05m53
1706e95K0M83j52k36K56l60J08J65J87M69k93M6M67m63O1Q08p73j94K80n3J17
1727C48P38k76l98N67J47j73j99j4j99k5N68l29l07N45p96O1Q7K46n03R01n5q88
1749D6j53K02J55m01J98k38%K47m68J74m05K50k23P1M7j0R1q7j29j36N62o68K78
1772e97j16J52n30M26J30k10M35P2k98K67k19k5l13P79j19j36K92M9m97O9R16
$$ y = [-502, -498, -468, -761, -1305, -427, -661, -615, -465, -481, -848, -649, -728, -549, -523, -440, -455, -627, -833, -381, 67, 263, -309, -250, 178, 431, 257, 288, 889, 353, 113, 395, 364, 901, 160, 733, 687, 1032, 1054, 126, 1510, 1173, 1149, 1073, 655, 898, 678, 747, 623, 1012, 471, 582, 685, 700, -23, 717, 364, 796, 62, 317, 229, -426, -138, -83, -236, -287, -288, -319, 108, -847, -200, -534, -678, -639, -582, -535, -528, -728, -531, -598, -942, -868, -936, -757, -235, -958, -755, -377, 90, -747, -142, -595, -575, -92, -244, -480, -224, -584, -476, -311, -124, 345, 52, 98, 565, 102, 163, 971, 198, 4, 284, 231, 348, 1086, 810, 412, 979, 1126, 953, 754, 740, 541, 516, 1084, 755, 448, 993, 197, 258, 345, 591, 88, 989, 934, 46, -107, 95, 250, -151, 47, -191, -191, 56, -412, -238, -643, -393, -616, -545, -498, -508, -417, -504, -633, -769, -207, -875, -597, -713, -561, -1091, -665, -535, -745, -310, -238, -536, -269, -488, -513, -826, -47, -166, -302, -10, 39, -458, -389, 527]
1793E27l23J73j93L67q36L33J006j11n34j4R35q85M8j61L53N4j44K35l03J80O2
1814G69r3M5j27K8n4k91m3J66lj05M8j24MPm3k14k85K04oK0n75K91Nk62N7J79
1840d02p1j39J54k81j56N82l86n8L8N8QJ81k4k20L55k24J00k27M33j83K23p4K62
1863e1n11N38n0J78L2j7k13N38k15j43K55j5K31j7J07J53j84K3p9o9L51mk44J21
1887G15J46m73J7J49mN2J28j30j43nq5R8k20K31n31K29j80k33K20k87j23K10j65
1910c84J48j88j19K46k31K38k21q7Q6jo6j98J27k6n6o4K15n1n1K60j92L24Lj84
1934d72O7p4L35j13J06O5k53L42mj45M08k53J79K19l61J68K60p9J01m4M3j39J70
1957E26J75j39o8J75J6j12j9Q3l7j68K89j07k78J03l93J29J95N5k52K43k00k09
$$ y = [527, 204, 377, 184, 551, -285, 48, 1054, 943, 409, 395, 1330, 445, 493, 332, 685, 739, 595, 830, 527, 707, 769, 676, 721, 594, 622, 568, 277, 234, 400, 397, 292, 340, 216, 220, 227, 184, -30, -315, -111, -117, -97, -672, -381, -376, -638, -581, -402, -473, -612, -458, -739, -895, -313, -699, -757, -719, -661, -653, -472, -496, -716, -361, -585, -485, -712, -279, -462, -239, -313, -51, -562, -24, -74, 104, 136, 119, -94, 444, 229, 86, 341, 326, 557, 540, 647, 800, 616, 639, 560, 491, 842, 838, 594, 715, 861, 388, 405, 554, 550, 602, 730, 600, 457, 452, 367, 465, 245, 476, -55, 174, -6, -239, -19, -306, -429, -219, -384, -236, -424, -543, -297, -528, -290, -511, -598, -512, -513, -579, -777, -650, -676, -732, -796, -581, -632, -683, -423, -615, -291, -288, -472, -405, -479, -144, -257, -151, -86, -339, 3, -1, -146, 262, 9, 188, 407, 46, 214, 474, 395, 496, 452, 495, 356, 526, 701, 562, 494, 669, 685, 573, 554, 637, 600, 432, 721, 614, 336, 439, 46, 175, 370, 425, 173, 416, 216, 7]
1979GL7k50n6K69k05j01K69j62k7k64k1K35k21p8o1J73k9K96l85r6J16j13j45
2002h12L37q2K14L2j15Q7J90k6k05K18J19P7k11j01L06K49j89L84l52j3onM20
2025E16j38j07K60J03m02J40M8N0J58J7m87P0L56R4q0o2j2J64k21J61m38K88j27
2048C51r3j59P9j22j58J78O1k15Qk38p5J98M7k79k2j3jJ13J10k26m6K27j05k61
2072f41J76j01k40L59o6p3J2J26k7l4L15j62O2N3j5j82K92J72k14K45o8L1J56
2095A76k13K37K7Q5k46L55j0MNJ76j32j89M56j21m1J7J49j95J93N3k07lK88o05
2119B59k7K83Ql49L28K9m48L58j67j39j59N3j85k22K39l37L08j24pK8p9j2J30
2142b32j20k95J17K02l25K38j73J48j80J33J88k80J64m4j66L71j40J10k2q3q1
$$ y = [7, 44, -206, -262, 7, -198, -299, -30, -192, -219, -483, -504, -269, -490, -568, -629, -456, -485, -189, -574, -670, -554, -667, -812, -475, -557, -343, -311, -426, -339, -149, -175, -380, -162, -43, 34, -177, -278, 28, 277, 88, 472, 120, 107, 101, 96, 516, 378, 271, 531, 634, 232, 372, 420, 470, 628, 645, 158, 228, 584, 678, 598, 536, 524, 688, 467, 628, 190, 478, 351, 258, 99, 178, 56, -102, 76, 137, -78, -70, -308, -383, -185, -138, -417, -439, -452, -453, -340, -230, -456, -502, -275, -380, -641, -465, -566, -806, -447, -513, -586, -574, -448, -475, -509, -194, -356, -294, -241, -256, -438, -146, 26, -188, 57, -11, 20, 176, -37, 200, 227, 312, 66, 421, 411, 415, 420, 596, 464, 275, 731, 610, 569, 586, 735, 540, 733, 786, 579, 576, 864, 259, 232, 515, 523, 174, 502, 531, 83, 441, 274, 135, -24, 29, -156, -378, -139, -476, -168, -292, -299, -271, -350, -362, -232, -352, -647, -530, -328, -653, -415, -588, -440, -620, -487, -299, -579, -415, -459, -625, -254, -394, -284, -306, -389, -470]
2163d70Q3L8O12j55k48J91k57J44J88j49L03r9Q3K2J86K0R3j31l4K55j13M9n1
2186E60k00K56J26l16L33k64o1j64K58j43J85r0m99K12Q4k55K08J60m03j10j08
2207b31O8m6O0k43m7K07r2j6j29k5P5J17q0K5J64k60j75L7K40k06J80n5M2K9m6
2232d07K06m5k74J82J04J00lj9J40J86l25J52K24j67O9J4k91M27J10l7N6j76M01
2255F27k87L5L03l49M9K52q2J95j72k16M18l18o2j0J11N6l97m6m4L88k17pp7j5
2279A35j98J19J76j47j42p85L80N76m71M5o7j40R0K99o26L89j28k3J10K2k05J47
2301d44k61O3J70O6J90p3j58j2K72l69K42L47j21j46J30j01L03j90K01J8J79k70
2323C6L89l24L8K46j4k92K81K0K9l3J34p0NL3K5k62K40Qo6m2R1k76L64j5k39l04
$$ y = [-470, -387, -349, 263, 108, -140, 51, -206, -62, 126, -23, 280, 181, 264, 286, 472, 492, 585, 454, 420, 675, 562, 611, 560, 360, 616, 742, 426, 759, 495, 434, 270, 528, 385, 570, 480, -19, 193, 277, 22, 230, 390, -13, -123, -231, -163, -209, -149, -392, -439, -232, -324, -340, -469, -494, -419, -302, -382, -357, -193, -453, -628, -591, -351, -557, -377, -432, -390, -361, -407, -201, -246, -520, -338, -234, -134, -137, -156, -16, 170, -155, -3, 221, 54, 123, 137, -154, 273, 383, 346, 402, 226, 627, 340, 375, 678, 329, 378, 630, 548, 743, 571, 355, 773, 455, 393, 383, 494, 550, 153, 107, 63, 451, 234, 227, 150, 135, -63, 56, 232, 85, -57, -842, -462, 114, -357, -312, -379, -519, -429, -130, -756, -367, -495, -518, -408, -386, -591, -444, -705, -642, -472, -406, -216, -289, -447, -459, -187, -556, -314, 33, -88, -234, -104, -205, 98, -92, 109, 127, 306, 36, 425, 101, 139, 385, 371, 79, 360, 380, 409, 376, 510, 440, 445, 478, 503, 241, 481, 489, 423, 381, 472, 196, 560, 545, 306, 2]
2349BJ55L0J0O8j33p4J47j33P2l09J82N5m70O38m81K86m45K5M56n17J09q1j28
2372e36q4J81K42j30pj06Q8o83M58N6M33m02o5o22Q03P98q30K2P2L62L17j74n06
2395c13N70l21L7K45M38o52K4L70J67m1k47K52n96O57k35j70L56l06J3Q5J92J8
2417E43l67J28K55n9k90J35K0l03J93O3Jn80K57j91j8J8L11k21J09m49L68m3q6
2440b06j16J89l76j39J03J91k2j12J18k10K57j78K44k38L8K73n7q1O4j19K43k24
2462c58K78j92M7K98p3L03j63p6J22k20R0K45Q4m6L7p5r6Q6m4j1J28P8j90L34
2486E86k97M77n31Q3Q5j81J16k19J26R7l59K02N7Q3k27J93M2k56J46k77J01m47
2508d00L58j69N8N7J7k76N8K52k56R7R3l06m0Q1k0j83K91j59k7K10j87L9K44k21
$$ y = [2, 157, 187, 197, 265, 132, 58, 205, 72, 144, -165, 17, 72, -398, 240, -241, 45, -400, -375, 81, -436, -327, -408, -536, -620, -439, -197, -327, -334, -440, -352, -1035, -577, -521, -88, -490, -555, -1177, -374, 424, -406, -384, -312, 50, 367, 193, -313, 257, -64, -27, 218, 656, 4, 28, 398, 565, 524, 277, 529, -67, 590, 355, 185, 541, 235, 248, 333, 525, 543, 176, 304, 559, 500, 210, 345, 365, 62, 255, 318, 319, -261, -4, -195, -213, -195, 116, -105, 4, -445, -77, -120, -206, -322, -133, -509, -648, -545, -354, -376, -488, -370, -580, -323, -501, -257, -495, -457, -184, -241, -322, -258, -377, -134, -358, -80, -272, -225, 73, 0, 303, 140, 64, 186, -34, 56, 301, 385, 339, 376, 301, 205, 291, 247, 236, 364, 442, 252, 586, 289, 766, 235, 318, 403, 222, 338, 119, 245, 342, -17, 185, 242, 325, 98, 291, 333, 77, 223, -54, 47, -400, -42, -211, -153, -96, -79, -355, -297, -45, -301, -204, -111, -417, -457, -376, -396, -579, -288, -447, -474, -264, -451, -412, -168, -389]
2532c89J71j65J12K93m05R1J34M5N7n8J64J6Kj2L2j2PJ2J48J31k26J27q6J15N1
2557C55J08j53N0j58L03k13K97j68j64M97l69L3j43J03qj38J16j45N4q6m8l8m8
2580C7O3l2j80r5J16n8P3j25J51j15j13o9Ll1K76j78J0j40q1J29K7L06m07J07
2604c26r1R8r5n5L16N1l10M25o0Nk74L19q5L44k12n4k9K12Q5j09O5l15K92Q5O0
2629C42j38n9NJ52J7j88J22O3r3L05j72m0L45k80j35j17O7J78j45k29R5J3n0l8
2653B0M1K23l94K23j00k08P7k53O2L42k58K10Lp7j53o9N3k96L42L1k48K05M4p9
2677b59J09L7k21l7M95k56k39K50k56Q6L71k71k00N36j96j06j21K69N3M5o6K74
2699B97k99m4K23L0N8J16q9n8J44N4J78k35j64l9J7n8J61j23N0J9J13q9l28Q2
$$ y = [-389, -218, -383, -271, 22, -383, -292, -158, -113, -56, -114, 50, 66, 68, 56, 88, 76, 83, 95, 243, 374, 148, 275, 189, 304, 355, 463, 310, 360, 202, 505, 292, 589, 421, 257, 754, 385, 418, 275, 378, 370, 232, 348, 203, 257, 171, 123, 85, 37, 100, 68, -112, -207, -91, -149, -76, -201, -50, -165, -278, -347, -344, -375, -99, -277, -267, -407, -488, -359, -332, -26, -433, -326, -417, -319, -414, -469, -153, -102, -412, 13, -47, -42, -316, 3, -82, 262, 50, -4, -33, 179, 264, 155, 220, -95, 197, 282, 342, 204, 145, 150, 302, 319, 131, 253, 316, 223, 528, 356, 316, 661, 381, 246, 129, 196, 374, 229, 0, 95, 108, 58, 20, 61, 284, -110, 113, 13, -195, -118, -371, -309, 33, -225, -15, -12, -89, -242, -311, -258, -554, -212, -181, -429, -224, -180, -259, -150, -113, -334, -371, 124, -132, -371, -121, -377, -291, 80, -191, -391, 145, -51, -157, -278, -9, 44, 89, 23, 297, -2, -46, 177, 207, 265, 381, 292, 234, 378, 432, 610, 375, 211, 172, 189, 131, 292, 169, 219, 238, 351, 262, -66, 16]
2723A6J01M0j67J18k9M3J49k00nL2k81K7P7K13k44r7J17l93L05j61j6j38J79r
2747c23Lq1N5J24r5R6o1J88p4p9J45N8j83n8J33q2K28j97J54m2K24l95O0L78k35
2772e9J67J57J24m76J90k69N49M29o55k96k4P15l73OK33l73J48K07k21j43L92
2793D28p0q5m3j41J60j17m8N7r2j30k8J3R5R5k57J45K2k91J41K54k28J56k92K
2817b54J80k88J91K2l70K19J8o1K51j14P4j93j10K20P7J35n4l05K70Q4k85L18
2839B5j07O7o6o1J18K70k51J23p7kK7J81j83L2P7K5P6J56j22N2k67K01o8J33k5
2864C34j87K25k18j6k56M20o4k34l71N95j09K15l80J78O1j92L1J1Q7m98q5M75
2886B2j41K56k00k50N4J70n0O8l26L13l20K83j80J16k23K16j27KJ21q6K01M1j7
$$ y = [16, 117, 157, -10, 108, 79, 122, 271, 71, 66, 98, -183, -156, -79, 134, -110, -207, -90, -483, -178, -339, -355, -493, -314, -323, -320, -401, -346, -222, -317, -221, -282, -94, -168, -247, -102, -44, -227, -285, -152, -234, -6, -203, -49, -91, 133, -262, -202, 176, -59, 108, 265, 389, -87, 103, -166, 383, 812, 157, -139, -163, 552, 179, 185, 418, 45, 193, 400, 179, 36, 428, 358, 273, 230, 89, 249, 132, 84, 141, 49, -81, -109, -96, -1, 94, -163, -18, 4, -287, -146, 108, -120, 36, -256, -254, -74, -362, -171, -149, -519, -300, -282, -343, -92, -206, -132, -325, -435, -215, -138, -3, -57, -362, -92, -8, -293, 25, -82, -15, -81, -142, -24, 246, -5, 118, 41, 39, 66, 247, 64, 96, 173, 198, 274, 430, 308, 360, 93, 294, 226, 359, 334, 147, 372, 154, 138, -118, 302, 238, 4, -367, 228, 119, 334, -46, 132, 193, 1, 32, 43, 130, -368, -453, 22, -119, 137, -63, -313, -259, -89, -139, -71, -397, -84, -404, -121, -301, -185, -408, -192, -319, -317, -196, -282, -81, -40, -57]
2909e7j81j35O7K39j01J25L9L6P6o0n4K19q9j34J90L4J1q6K0N0K2p9q6J90j49
2934A07J98r5j03L3R5j34L2Q4QK22j95q6Q5j71J09J96k27K18l94l9j2J92j40j30
2958a47J14L2l26j4K86j23nq5j36K37q3p2j49J63J57nk1j84m6J97L65k80j94L60
2982D1l85J94Q7k10J23J58k20J02J18j91r7O3J02k31N42O15m27l77j60K48R9K6
3004B20k23L18j36O7O3m2j08N5J19j71J9P5J48m60K99k54K75R2p3l00M1J91n9
3027A56k1j93J96j78J46o0m1k8j23J92o6kJ43l34m3j6M3J43q8j42j7r1J80l3J54
3052a23j21p3P7mK51k32k04O17m18j76P9N16l09j48lM16k87K00k2k67J49P2k55
3075b65K98k68K87M78m19K82j06n13N92k93M02p95O73P0j91J31j44N8j88J03N32
$$ y = [-57, -238, -373, -306, -67, -168, -43, -4, 32, 108, 48, -6, 213, 124, -10, 180, 214, 225, 139, 159, 209, 231, 152, 66, 256, 107, 305, 210, 107, 140, 235, 101, 133, 217, 225, 447, 252, 166, 251, 80, 189, 385, 158, 376, -18, -57, -69, 123, -17, -147, -33, -1, -327, -341, -55, -178, -183, -268, -404, -167, -250, -322, -471, -308, -151, -156, -177, -361, -407, -210, 155, -125, -319, 41, -344, -150, -63, -273, -150, 8, -212, -110, 8, -183, -280, -217, -115, -346, 196, 811, 384, 7, -153, 95, 194, 220, -3, 315, 179, 246, 309, 267, 159, 214, 333, 162, 181, 256, 404, -56, 243, -11, 264, 356, 283, -17, 24, 215, 156, 135, -58, 138, -40, 106, 46, 5, -23, -146, 46, -20, -22, 121, -213, -256, -272, -229, -86, -174, -316, -333, -424, -244, -277, -123, -244, -317, -240, -244, 7, -225, -429, 188, -230, -406, -327, 189, -120, -268, -271, 145, -142, 58, 36, -231, -82, -10, -265, 33, -235, 52, 530, 111, 393, 287, -226, 366, 73, 475, -320, 353, 423, 232, 363, 219, 277, 89, 192, 724]
3096G24o32L86p05J61K02k48L84n10Q84p42L68o23P0M08j39J20ol90L47m53K63
3117a31n34m0m05P96J2P27n29oj05L49l77j07L35M64P0K89q50O3O64p03k33j86
3139d37J19K44K09n1j1j45R7N7P8P1O2k22J46M5q2K3k0L51k06J0k92J20J85j03
3163B48j06J88j1J16k59jj57j06K17J27K1l21q7R3K44j56QL9j81n9j6l5K59l26
3187b61K81K2k66L0O4k16O5J19K9P4m2j73J5K5Lo1K69p2o4j17P3P0r3NL24m1k46
3214a84K56j30O8K06k09j34L32j02O9L1l5o8q6K01o8J97k12k1J03K34k98j41J70
3237A79j09K9K33k55j04J22k10L08l8j97K13k2j32p5J47r9j88M8K10p7j52K90
3259A21k21J24n9m2N4j40o1mJ16l26K08k10R4Q0K75k42k40K90L00m60J03r5LJ88
$$ y = [724, 92, 478, -227, -66, 136, -112, 272, -238, 646, -96, 272, -351, -281, 127, -12, 108, 102, -288, 59, -394, -131, -665, -705, -1110, -314, -302, 425, -104, -110, -215, 134, -243, -350, -15, 449, 519, 808, -42, 21, 685, -18, -251, -437, -318, -74, 135, 84, 73, -72, 25, 82, 160, 231, 293, 71, 217, 262, 180, 203, 183, 534, 328, 338, 46, 166, 351, 248, 142, 330, 319, 435, 176, 175, 18, -88, 129, 256, 277, -44, -131, -38, 206, 50, 58, 97, -84, -143, -159, -194, 65, -261, 20, 42, -224, -194, -130, -346, -281, -162, -133, -59, -101, -274, -259, -234, -231, -292, -23, -95, -159, -276, -203, -133, -226, -221, 103, 62, -184, 72, -58, 10, 216, 7, -127, 205, 103, 172, 203, 168, 100, 14, 215, 147, 344, 132, 111, 214, 448, 150, 9, 179, 70, 99, 332, 77, -27, 95, -115, 193, 155, -42, 171, 149, 17, -58, 89, -10, -198, -150, 60, -17, -169, 121, -100, 24, -35, -77, -23, -163, -224, -228, -112, -438, -230, -440, -346, -266, 9, -233, -473, -183, 117, -343, -240, -335, -332, -144]
3283a44Pj30P5M26j95k51K28j38O1j34L25j12p7N2J14Q8m8j7J02J09k51J7p2K07
3307B42j31qJ89K99m33J44r6l0K34l05j20J47r2k7J21J38j43j84j08K66l43N32
3329B92k38j78J11j16J38l9L1Jj00rj48N0J40j70o6K77k05j23K54k37R5r8K34
3352a04k50L26R6k15Lr0J06qJ30j87n2L07K4j8o3m9o6K00K05k55J04J9J03j23
3376A43q5J66k34K56q5k19K85L6k41K19k33N34m57L1o4R8L52l81J35r0l0j05R4
3399A25k04k7j88N29m92L51j2n30K84l0J18j88k3J07j49K74k73K15J14j89r9J03
3421a84J68k99K66o1k09OJ51j56j03J56J28K4O2R9l02K86K06m71J06J65J22k30
3443g0K72o7q6K57k30J1K48k14p5n2J53J11J88q5j30l31L40N2o7J52k94J49k9
$$ y = [-144, -137, -267, -192, 234, 39, -212, 16, -122, -61, -195, 130, 18, -59, -7, 107, 195, 147, 130, 232, 341, 90, 107, 35, 242, 111, 103, 292, 591, 158, 302, 206, 176, 410, 105, -15, 132, 40, 13, 134, 272, 129, -55, -163, 103, -240, 292, 54, -124, -13, -129, 9, -30, 1, 2, -98, -107, -255, -205, -65, -235, -301, -24, -229, -352, -98, -335, -240, -338, -104, -354, -28, 68, -147, -144, -234, -128, -136, -6, -193, -245, 62, 86, 68, 5, -44, -110, 90, 295, 40, 144, 163, 266, 143, 58, 224, -10, 246, 161, -58, 227, 263, 22, 241, 8, 542, 85, 116, 52, 150, 502, 121, 256, 166, 136, 31, 125, -79, -106, -294, 235, -257, 94, 82, -448, -164, -194, -76, -264, -287, -180, -329, -55, -328, -113, 1, -188, -287, -184, -16, -315, -49, -110, -319, -313, -162, -318, -421, -265, -137, -113, -51, 48, -254, 32, 238, -233, -127, 38, 160, -70, 202, 135, 49, 306, 76, 87, 335, 121, 46, -6, 147, 258, 446, 361, 231, -100, 240, 292, 225, 377, 83, 232, 203]
3466B03K02k01k00P0R4Nj83l9j5k0o8K25L8j43k48L56k41L46k85j64QJ20n4Q0
3490a14p2P8j60R2l3k3Qj0L9j60J51J82j66J27k83J43P3P3K01j13Qj88J25N5k9
3515Dn6p1K53n9j13K09k49L74j16R6P4k61K05m95L95j46K04q0P2j68J27j13j69
3538h3M94l88J49n6j22M4Q2j68K34p0m2k55K26J05o4j96J54j80p0K46j53K6l6
3561a23q8k14K99p2J15k02O8p4J1J98k66L6J29K76l71J05j8K5p3J56p0j3L10l67
3585b23L54k31J23j82J58J06L59l64N3k2K12k15K85j93j86J86K3O5j72K7L5J40
3607C38j75n4j72j08J96L1J61lL1m66L09p9J08nM6j75L2J52j32M1k76J17K28m20
3631b75K52J33j68k70P2j6r4K88j76LJ58J39j57k16J59k81K68K2j07K20J00j70
$$ y = [203, 405, 204, 4, 74, 168, 173, -10, -49, -64, -84, -152, 73, 111, -32, -280, 76, -165, 181, -104, -268, -260, -140, -194, -114, -186, -108, -268, -176, -209, -232, -224, -234, -195, -355, -204, -22, -188, -61, -344, -201, -128, -55, 146, 33, 41, -147, -22, 33, 4, -52, -123, 130, 71, -42, 167, -82, 292, 176, 272, 346, 85, 290, -205, 190, 44, 248, 168, 240, 72, 199, 86, -83, 411, 23, 172, 116, -6, 38, 120, -48, 186, 116, 74, -181, 45, 150, 86, -110, 44, -136, -206, 40, -113, -87, -123, -211, -425, -126, -198, -83, -285, -217, -291, -280, -82, -348, -312, -183, 93, -278, -173, -191, -166, -239, -83, -153, -166, 144, -223, 131, -100, 23, -159, -1, 105, 464, 100, 153, 131, 343, 128, 413, 220, 34, 220, 243, 308, 136, 163, 198, 338, 163, 109, -63, -171, 25, 56, 217, 214, 245, -221, 88, 9, 117, 112, 158, -17, 15, 167, 35, 76, -200, -83, 145, -275, -23, 110, -58, -328, -256, -272, -366, -78, -254, -251, -93, 46, -111, -327, -168, -449, -181, -159, -266, -46, 54, -116]
3653a16j8j06P1j0p0K12R9j63K80j89m6p8J21pJ12O5m22L64j41J99j16J51p5R
3677A26j64M9K78j66k7j68J13j33L96k2j05j12J16k18j63L94K44m15K22n0K20
3698D15n93M3J19j19k90L45n1j9K09l07J19Q0j4k30J63m6L1j15p1K05K2j36J18
3721a22k3j64K51k52n2J95K24k30K64k19J48r9J72l17K52J07j44K96k78l4l2L66
3743C09k53J0q6J95q3L1l7r5Pj13K88q6J25Q2j41P6j03J05j54R8J48o90Q12n77
3767a32k66M27J93q1j10J4p16J072j021N24p15J524q64l36M6J65M80O8j031K99
3787d60O67o94L24qK10m76M28k02L06m98J63O4P5J55j35k34j11L03P7r0L50l47
3809a33K40j32nq1N5J30K7m2k9j79K50j5P4J26p8k14J53j30M31j27k64O7N7k92
$$ y = [-116, -134, -240, -169, -179, -249, -37, 62, -101, 179, -10, -56, -134, -13, -20, 92, 157, -265, 99, -42, 157, 41, 192, 117, 126, -38, 11, 289, 123, 96, -72, 41, -92, 304, 282, 177, 65, 181, -37, -200, 194, 438, 23, 245, 195, 415, -178, -135, -16, -135, -425, -80, -131, -150, 59, -248, -129, -49, -63, -293, -130, -176, -145, -260, -331, -126, -104, -240, -122, -145, -309, -58, -310, -362, -167, 57, -173, 91, -128, 20, -79, 93, -224, 28, 135, -9, 287, 9, -25, -57, 309, 56, 66, -20, 175, 92, 123, 86, -9, -2, -115, 173, 87, 212, 294, 153, 229, 126, 231, 77, 175, 323, -367, 445, -132, -398, 29, 222, 141, 31, 45, -671, 401, -620, -96, -811, 713, -151, -487, -441, -276, 204, 272, -759, -460, 207, -487, -163, -171, 39, -437, -9, -211, 95, -403, -240, -176, -101, 54, -81, -315, -426, -123, -46, -136, 214, -133, 107, -25, -30, -111, -56, 74, 101, 59, 30, -149, 101, 86, 160, 286, 208, -6, 147, 17, 448, 321, 57, 124, 181, -111]
3833a11J59K25l76K74l20L51j52O1Q7m0k09j01%J45J56p8o5lk07m4N98l67j80
3856a97JJ82k59K20k99K43j69j8j67J86K30p7J14k23J14oj23l7J66J48l03L42
3878F8J68l15M2k32J09J56k40J70J21j86K79q8l6J42j74K5K87j83m9K92m77R3
3900b8M41o2k94K95j54j65K79k65K51k60n7J04j1K40k25kk7J1p1p8R7P5L4j91
3924f3RJ37l67K03j87K42M7j06O9k25j22K67n9L5q0L8rP2o7R7n6J1k37M16k97
3949b32J54O6J87k25m7j48J66k15L15j27l1K25J63p4K06r7j72j55J80p5J88k16
3971C6j38r3r4O06l1K21J42n64p4K06K4n4j5o0M6j97N2K8j03K4J7l4J10m1k9m4
3997e9J35N2k12N0j6O9j1k90J97N3k48J37N7o2J63j93J25k21O7m5n8L24n8j48
$$ y = [-111, 48, 273, -103, 171, -149, 202, 50, 111, 198, 158, -51, -152, -152, -7, 149, 71, 6, 3, -204, -248, 350, -17, -197, -196, -14, -273, -53, -352, -109, -278, -296, -463, -277, -47, -124, -10, -233, -119, -125, -248, -285, -119, 29, -274, 68, 236, -79, -37, -269, -160, -4, -244, -74, 47, -139, 140, 52, 16, 158, -16, 9, 296, 113, 64, 356, -121, -28, 413, 351, 57, 352, 198, 33, 312, 47, 298, 38, -19, 85, 74, 314, 89, 87, 60, 71, 0, -78, 19, 94, 128, -63, -54, 83, -284, -81, -268, -26, 21, -85, -16, -241, -363, -96, -155, -120, -200, -162, -171, -99, -166, -69, -125, -114, -351, 65, -232, -78, -12, 175, -50, -97, -245, -79, -294, 21, -106, -137, 88, 251, 177, 383, 286, 114, -41, 139, 64, 252, 36, -102, -195, -289, 317, 286, 507, 649, 85, 11, 217, 241, 187, 172, 112, 158, -39, 13, 41, -62, -38, -21, -55, 55, 14, -15, -59, 76, 128, -84, -34, -50, 19, 8, -282, -85, -32, -280, -143, -86, -148, 15, -178, -53, -274, -207, -252, -310, 14, -44, -192]
4021a92J19K04k03j50J70r9J8L2j12M31k30K01Q1l68j3M0N0Q0j4PQ5j11N7l1J06
4046A58n4j0K57j09n1m1j97J18L8J81ok58J05n2R4J07k56j2j03J71mk39J94K86
4070C17l26j89j58K37j22J42O30n13o2r2L25n04J63k2o4M7K69r8j2J7k16J20n3
4093a64J39p4R7r8j93J58J7J66j88Lp0M1K48Km1j53O7K37k10K26j36K2j64L22
4117B54k77L90l27j34J61p8LL44p2l41K62J33k65o3N9Q4l2j2P1l1P6l37K99r3
4141G4Qj21K32J20m18P5O6r1k25R4J51j26m7K61k20R1k19L59Pj04j09j09l8J7
4165b72K83j02j89K96p5k48Q8m8P9J42j86J97K1j48j44K89j42J01j5j7j59K27
4187b2K1L0r6P5j72L99j73j3K91j81J38k50J68m25J81K74j2j4k7K7J10k07k06
$$ y = [-192, -73, 131, -72, -222, -52, -151, -133, -101, -213, 218, -12, 189, 270, -98, -111, -71, -21, 59, 45, 52, 137, 26, 83, 52, 158, 104, 94, 351, 242, 191, 150, -47, 71, 109, 290, 284, 26, 131, 79, 173, 280, 24, 12, -91, 80, 76, -163, 31, 317, -9, -198, -356, -119, -241, -99, 531, 18, -44, -136, 189, -315, -152, -174, -238, -191, 78, -20, -32, -15, -231, -111, -164, -25, -99, -2, -100, -293, -135, -118, 48, -140, -137, -207, -166, 82, 84, 43, -110, -43, 194, -16, 210, 74, 96, -68, 254, -23, 367, 40, -94, 67, -11, -8, 336, 264, -77, 185, 318, 53, -10, 49, 133, 101, 89, 160, 129, 205, -132, 167, 74, 82, -39, 193, 313, -105, -30, 36, -55, -280, -186, -35, -161, -208, 53, -167, -76, -295, 64, 71, -33, -142, -251, -289, -272, 11, -91, -280, 16, -59, -307, -219, -267, -188, -46, -232, -35, -14, -162, -306, -17, -159, -58, -73, -90, -249, -22, -1, 29, -67, 8, -164, 235, 62, 49, 340, 159, 297, 47, 215, -210, -29, 245, 233, 219, 192, 219, 329, 122, -84]
4210h4qK44l01J27K49k14mK9m6J54l62K29p8kn2L35k09J26k64j30J55j35J74j78
4234b45K41l09J7l6L92j44r9K7l1Q7n9P7q9L0P7K3J17k31r3L44k13K03p7Q8k75
4259a78M16j71o5J01o3n4J35p6L3Q4M1R5Qk18j47J78J12q5j74K45l57L43Kk16
4283a1J13J15J86k02Q7l11K5M9j38n6j34K39K08k75P9j43J82j27l0K61r8L8n7
4306@mj07j75M23l76J05K10k34k10J79q6K57j26J4lK9mK60m24kM29j40J18j49
4330a6k38P6J90rN7J36q0k03j22M50L9l40L27j40J36J6k63L8N2KNj5J74j26J72
4355C18k77j04J13J42o7rj33K56j00l57L11j42p8j80M52m3k15m9J92O1Q2k26o3
4378a16J03KM7o5L8Jk56q4L22j85J17n7KJ63j63n8J10R1k88L74j53r6K4l2L6K10
$$ y = [-84, -92, 152, -149, -22, 227, 13, 9, 38, -8, 146, -216, 13, -65, -67, -119, 216, 7, 133, -131, -261, -106, -241, -67, -245, -4, -313, -296, -332, 60, -84, -183, -156, -187, -100, -159, -82, -171, -141, -64, -41, 76, -155, -248, 96, -117, 86, 9, 97, -178, 238, 67, 2, 103, 40, -14, 121, 45, 78, 162, 203, 298, 306, 88, -59, 119, 231, 146, -28, 217, -140, 203, 205, -11, 102, 217, 403, 201, 288, -23, 2, 51, -87, -143, -277, -38, 170, -105, -26, -169, 13, -114, -144, 117, 19, 57, 0, -4, -111, -286, 137, -239, -134, 76, -158, -368, -189, -275, -18, -144, -130, -133, -104, -108, 152, -272, -274, 155, 15, 133, -16, -254, -178, 12, 3, 60, 196, 116, -87, -209, 241, 280, -60, 267, 127, 263, 279, 16, 54, 106, 108, 113, 98, 272, 146, 318, 41, -63, 50, 192, 125, 116, -17, 239, 139, -218, 93, -49, -127, -307, 145, 102, -113, -162, 30, 91, 173, -53, -116, -13, -11, 36, -29, 9, 10, -246, -330, -8, -193, -76, -133, -131, 32, -131, -189, -79, 12, -276, 98, -55, -151, -127, -159, -123, 87]
4404H7j77K01M3k73L19j85J13m6J10j26J81J5J19k93J1p3QJ55J84j66l28M71j49
4427B01j01K2o0j02J45j0j3J26n2K4j28P1n0J92k87r1K9P1K0l59J97R3ol9J01
4452fr4o1O6j28K94m26P1J87oR1o8j24Q4j2N7p4pk10J32L50r2N9J5k18K16k08
4478a12J69R6j04j90L88qj95Q4R4n05K94R6j31J36J73j69j00J22j58J24J65j44
4500A25J42j5l90L60J9k09O0O3j16Q2k05j18L78k8n1r4pJ37m9l75L00q3l3Q3K34
4525B10m09K39j51J44l58K39j32k7K50k2j90R2J18j9m12J43L55J51j70k96J15
4546a30K27k47J56j03K06o8Jn7J18K89l57k56K07jJ07r4J55l65N9K66j29l0N6
4569A0K47n8j16J7j81J10J0K55j84%K99k66j24J50o7n0o5l5K61k05p1J34k58K63
$$ y = [87, -90, 111, 154, -119, 200, 15, 128, 82, 192, 66, 247, 262, 381, 88, 99, 26, 34, 189, 373, 207, -121, 350, 201, 100, 122, 62, -40, 105, 95, 82, 208, 156, 180, 52, 123, 73, 265, -22, -113, -84, -13, 7, -352, -155, -62, -68, -107, -6, -100, -161, -95, -223, 71, -355, -284, -97, -103, -12, -80, -204, -120, -132, -75, -149, -156, -366, -234, 116, 24, 83, 98, -120, 96, -112, 57, 153, 49, -141, 247, 239, 44, 128, 222, -283, 11, 107, -24, 112, 285, 116, 16, 138, -20, 104, 269, 125, 267, 252, -138, 222, 241, 32, 92, 155, 39, 121, -84, -202, 176, 148, 97, 3, -4, 133, 84, -291, 9, -74, -107, -24, 210, -199, 40, -111, 33, -325, -86, -218, -245, 5, -17, -207, -115, 3, -16, -428, -285, 70, 221, 51, -245, -130, 97, -150, 6, -97, 109, 41, 42, -15, 103, 392, 35, -221, -14, -15, 92, -2, 153, -212, -153, 113, -16, -46, 10, 257, 199, 83, 100, -81, 29, 39, 294, 110, 110, 409, 143, 19, 169, 102, 52, -13, -48, 213, 8, -63, 71, -187, 76]
4593G6k8n5J75l72L69r5J76k21n6j41L3Q1q5J61k64K21j46J15l77L75Ko9K44n06
4617c87L52OR3j17j74K28q5p7J60k37Po6K51L81k31j11l9K1rL30l92J32J32k12
4641d4K39k85M8K52k45J06J14J0j0J16O5l75K3J46j60J12R0p0m3j7p8O2r1J29
4665I4k30K77j02n5J62k57J17J4%m11K41J21R5j41K7J40l42mM6J14p0J16p7P6
4689d9J75j25j7P4k43M6K8k04J12L49j44L3k55L26j20J22m6K2p1j25M12l66J35
4712F9N7k17K68L8j52QK51j96j63J64J3j7O4L0n0P9o9Rr7J5J7j8o1J9N1N1k36
4739g3J86k17R5j32J29R5k08J52j70j2m0K28k51K25r4j04n3o6L32j49J85k64N1
4762a55J23r5k9J0Q3J25k93J83J37r7Lr8J5J66k2k3j51j35L34k10J59j11j33L99
$$ y = [76, 48, -7, 168, -204, 165, 70, 246, 25, -31, -172, -139, -58, -143, 18, -246, -25, -171, -56, -433, -58, -56, -125, 119, -387, -35, -29, 64, -53, -227, 1, -84, -161, -1, -238, -231, -297, -46, 335, 104, -7, -46, -25, -34, 296, -96, 36, 168, -44, 195, -90, -42, 210, -35, 71, 185, 195, 185, 301, 366, -9, 14, 160, 0, 112, 202, 132, 89, 72, -6, 56, -35, 94, -136, 141, 39, -16, 146, -111, 6, 20, 20, -391, -150, -29, 66, -75, -48, 92, -250, -254, -208, -94, -164, -48, -125, -49, 126, 1, -16, 58, -185, -139, -111, -315, -203, 146, 2, 35, -220, 106, -14, 108, 62, 84, 13, -112, 300, -66, 69, 126, -91, 177, 215, 63, 71, 322, 126, -37, 127, 140, 123, 187, 217, 167, 246, 177, 186, 89, 104, 121, 103, 42, 61, 112, 163, -73, 113, -104, -9, -141, -12, 83, -125, 27, -143, -155, -195, 33, -218, 7, -87, -191, -244, -310, 22, -127, 58, -206, -155, -32, -127, -156, -146, -63, 62, -231, -48, 89, -8, -5, -103, -88, 78, 56, 33, -118, -253, 81, -129, 30, -81, -214, 185]
4786A85j31j17M6p8J78P8r7J14j26J48k79K37N3r3K9r6J22L8j90L10l03m3k7l2
4810g4J4J09J63kp7l0k49J74j16M8J5M5O9r6k75K48j08K55n04J59J44J04p8j10
4834a72J75m4j73J45R3j04j38j3J46J13k05M05k70q8O1J04j29J15q0K88j22m2
4856F5K6j96J83k7M32n05J15J10R5l46L04l61J38n0K03Q2j39M0r5q7K10j2r6J58
4880B47J7k63j1j22L16o3j79N5%J18J67k26j26j18J14O2J30j80k15J82K20j87
4902f2R4J32m27P8m7J35k4K5J41or7J10j0P1M9k13j92K19O0q3J67j06J27j57J54
4927A38k40J59j73K38m8Q3l00J28J09j63L51p6j31L6J85k33K16j71J30j52j62
4948g6K12j57K55j84Pk1M7q8n7J89O0j38J55j46p4J67k26J27J13j28l4K04l31
$$ y = [185, 54, -63, -17, -95, 83, 161, 64, 178, 52, 200, -79, 158, 211, 118, 147, 51, 173, 211, 21, 331, 28, -15, -42, -74, -60, 49, 212, 210, 133, 103, -146, 28, -88, -40, -25, 20, 89, -7, -282, -34, -142, 113, -391, -232, -88, 16, -62, -172, 3, -41, -214, -69, 24, -80, -218, -231, -85, 28, -177, 228, -42, -130, -69, 35, -94, 21, -59, 229, 107, 65, 91, -105, 78, 51, 483, -22, 93, 203, 298, -48, 256, -105, 33, -17, 186, 268, 129, 169, 74, -13, 197, 185, 89, 247, 264, 1, -10, -132, 184, 121, -58, -3, -3, 115, 282, 56, -70, -188, -74, -12, 118, -62, -277, -95, 125, -62, 32, 164, -263, -185, -232, -97, -121, -96, 45, 39, -58, 52, 42, 113, 162, -51, -243, -24, 36, -47, 120, 14, 141, -16, 138, -102, 57, -116, 122, 74, 157, -143, -15, 94, -69, 282, 206, 75, 111, 296, 63, 279, 108, 238, 86, -76, 136, -21, 234, 50, 57, 36, 83, -5, -62, 127, 187, 49, 204, 58, -16, 151, -75, 52, 165, 37, 3, 207, -124]
4971a24M7k02M08M9m23K76j28J19j57Q7Q0q8k23K3K64J03l48Rj27L93q6p1j48
4994b67L4Q6M0L15l10RJ75k22M5J24o0j10J85m9J59k9M0J56j28j30J41k34n8R7
5018IQ4M8k20M09j58k52l7K98j42o8Q9P0k52J10J61j03K5j19K84j86qkj29K02
5042A13j37q3K14K6j03j49j26J99j6k45K65k74J97o6j72j5J82oJ93l21J35QK66
5065H5o4j16k39K6J38J63j44P8J19lJ4Kj48J90j76L8K3J61k91L15m2K2k29J35
5089E7oJ55k04m1J67N3p6j17K99M5k97q9J56l31L68j29K37m9P0j75L8K5o7j89
5113a00N3K60k57j11n7L89r0j38oq2J9K0r5J84k51j05L62j05P2j96J67J8q4J66
5137C3K5j08Q8j90O8k04K78r6p0K46p8L88l41p3P9J44n1j01K6J57n3k25j30J6
$$ y = [-124, -77, -279, 129, 178, -245, 31, -97, 22, -135, -48, 32, -56, -279, -256, 8, 111, -237, -228, -355, 38, -48, -119, -267, -233, -147, -107, 208, -102, -93, 82, -140, -95, 29, -31, -141, 44, -5, 154, 125, 165, 321, 193, 63, 204, -30, -88, 9, 93, 141, -79, 330, 172, -80, -117, 181, 39, -29, 60, 130, -122, -12, 149, 46, 71, -48, 236, 50, 42, 40, -89, 113, -24, -107, 107, 133, 30, -119, -245, -46, -62, -307, -42, -316, -119, -185, -357, -372, -190, -196, -3, -324, -189, -181, 85, 21, -95, -334, -308, -170, -7, -151, -73, 46, 43, 57, 59, -89, 101, -75, -37, -14, 147, -144, 171, 129, 151, -78, 57, 51, 206, 2, -39, 128, 181, 105, -12, 287, 332, 35, -54, 102, -229, 139, 10, 247, 198, 268, 93, 131, 156, 89, -100, -47, 213, -44, -155, -212, 177, 87, -51, -57, -139, -120, -100, -195, -11, -262, -367, -5, -110, -38, -234, -67, -49, -133, 33, 58, -50, 38, -152, -84, -288, -10, -106, -176, 70, -8, 380, 39, -34, 45, 189, 138, 37, 63, 220, 167, -58, -188, -172]
5161a72R0K42o6kJ67k14K78m13K34J40m30K52K39j51J33m37M73m94K96j21J17
5182A61l36K24K4J6J5j89N9J30q7K57j64j73kL7Q1l10J36L20k71N9j65L24k43
5205i7l85M64O4l55K42n8j1J76j04k5o5lM7K51j54q1j3K0K21l78L08J7l61Q7k7
5230b20J51L32m27J64N0j96J22O4J18k03J80j41P9Q6j43m9K26R8j16Nq2q7K53
5253B64j26m2j57J70P7j93J91k29J31j96K0J93L9k06L3q7PK25k54L60m52K00j66
5276a98Q1M9j14p6K60j11O8J26O7j59J7k07N6n2J32j11K15k84j01K46j58O8J3
5299a73M11n37M30j86n1J65o1RKJ53j60J48j77J70J03r6j42M7J90l3j13J59k5
5322B33j60q6J55j18K22q1j11K10j08l2O8J07l99R7J46k7r5r7m9J18j81J90m5
$$ y = [-172, -82, 160, 94, 92, 259, 45, 323, -90, 144, 284, -146, 106, 345, 194, 327, -110, 363, -131, 165, 44, 161, -175, 49, 73, 89, 104, -85, -26, 104, 17, 274, 110, -63, -65, -28, 53, -257, -121, 199, -72, -13, -178, 146, -97, -482, -18, 46, -309, -67, -125, -136, 40, -64, -89, -154, -157, -110, 141, -13, -94, -107, -87, 134, -244, 64, 81, -280, -193, -220, -69, 263, -164, 0, 50, -146, -24, 40, 158, -45, 135, -6, 73, 159, 16, -33, 193, 291, 175, 180, 98, 11, 264, 138, 96, -61, 109, 186, -7, 184, -45, 86, -110, -90, 103, 142, -64, -31, -118, -111, 114, -140, 220, -232, -32, -198, -117, -68, -182, -258, 2, -109, -41, 85, 152, -7, 10, -197, -141, -193, -61, -172, 43, -241, -342, -96, -254, -186, -173, 238, -299, 131, -55, -106, 59, -2, 7, 9, 162, 2, 150, -27, 143, 246, 150, 8, 55, 245, 212, 99, 258, 233, 73, -13, 142, 24, 246, 165, 54, 264, 156, 124, 192, 299, -100, -3, 143, 116, 21, -76, -125, -7, -188, 2, -43]
5345d3q5J93k67L65j24L9j68N3Ro6p0O5K85j98q8P8q6k46K01J26n7j30L8K18l69
5370c27O32m24K14p3j1Jj56J83nm1J5j27l8L01J52k64r7J37J32l15K64m6j80K10
5394A37J32J7j0j75M1l10J14R0J91j48q3K13j98J19j13k02M69j25k02j05l3K55
5416G4Qn3m8K03k65r7K73j36J51r5k48K02j28j17J18o8J94p8q6K73J9k34J06N1
5440A9m6O4K2k34Q8K11m3J42j56n3q1j24J33J02o2K48l05R1L7j57J45J53l41J80
5464C3J47j36J27j38l37M03J15J61l37J77j61o5Q0q4J59J0o9j96Q1K52k0pn0j87
5488d2J8J16N2k62L21k31j3k2k0l3N0LJ31Qk08J14o6j86L51l29q9K95l29K62k07
5513c16K11j76Q3J05m7O9q4M9R8Q9o7o0J53m4j54J76j34J13k71J76K6j16J30O
$$ y = [-43, -128, 65, -202, 163, 39, 78, -90, -37, -28, -94, -164, -99, 186, -12, -100, -22, -108, -354, -153, -27, -84, -214, -176, 42, -327, 305, -119, 95, 22, 11, 12, -144, 39, 34, -7, 8, -119, -157, 144, 296, 32, -65, 72, 204, -111, 153, 107, -73, 137, 269, 286, 276, 101, 142, -168, -54, 36, 227, 79, -4, 209, 11, 130, 17, -185, 284, 159, -43, -148, -181, 74, 82, 29, -19, 184, -81, -178, 95, -41, 110, 15, -233, -31, -159, -276, -158, -226, -32, -110, -196, 77, 96, -138, -32, 19, -27, 37, 59, -175, -87, 124, 81, 223, 67, 14, -67, -191, -58, 44, -18, 230, -75, 16, 53, -104, 41, 194, -147, 33, 180, 44, 171, 33, -304, 99, 214, 375, 38, 215, 54, -11, 69, -15, 144, 154, 85, -111, -30, 222, 202, 195, 145, -42, -24, 92, 144, -118, 203, -28, -41, -63, -83, -116, -66, -63, 68, 76, -132, -18, -84, -270, 81, -248, -337, -42, -371, -109, -316, -105, -281, -198, -93, -140, -71, -155, -106, -8, 81, 14, -46, 107, 63, -91, 85, -49, 64, -207, -31, -5, -121, 9, 15]
5537A5L06m37K58k32m2M21k33q1M2K80k79q8J99j57O9ok79L46j93K7M28l53K7
5560C8K70k61J4o8K73l02L23m05K07k98K27P9j53j39J76k32K53j63J32K11l17
5581a35MK44j57j80L28j45o0O6Q0p2%k1k14J09J02j95K12m0L5Q9rk12J07MP6j7
5607aK01j25J41m03M52j97M0N0K57l25J40k22j5O2Q6j86J24L0K10j02J4J6O1j83
5631A25j9k00M0QKl5j40J42K0J04k27N3K54j71K85l46J57k02JJ06j88K37j55J59
5655A0J87j81j78j8l6J58K03m07J48L4rj99N00k62j05L6m9K46k64J90P1o1J97
5678B11j77r9Q4L08k1m69K66p5L1K36k89m1J46k18R5J12k92K56pm6J33q3J67j12
5702A16j8k1j43J34Q2k82k00K75j37J79j6K09l47J30R6N9p1m0j58L2L6k30J46
$$ y = [15, 321, -116, 142, -90, -132, 289, 56, -25, 17, 297, 18, -70, 129, -28, 41, 35, -244, 102, -91, -64, 364, 11, 38, 308, 47, 61, -7, 266, -36, 287, -118, 89, -209, 18, 97, -56, -195, -19, -251, 2, -161, -29, 182, -135, -131, 113, -44, -224, 104, -41, -101, -35, 45, -27, -27, -48, -262, -153, -51, -246, -34, -74, -39, 50, 41, -171, -64, -60, 16, -1, 200, 75, 216, -187, 265, 68, 108, 158, 415, 90, 230, 8, -7, 55, 141, -45, 79, 109, 319, 217, 231, 247, 308, 125, 106, -94, -54, -46, -44, -79, -219, -77, -57, 47, -180, -127, 127, -44, 241, -105, 52, -150, -149, -43, -231, 6, -149, 10, 197, 16, -162, -180, -216, -58, 145, -262, -114, -80, -89, -288, 212, -50, -155, -119, -168, 78, -186, 4, 75, 14, 211, 34, -65, 19, 327, 306, -163, 103, 28, 59, 295, 6, -35, 111, -107, -12, 100, -192, 64, 57, 11, 144, 61, 228, 116, 98, 77, -66, 68, 150, -132, -332, -57, -194, -15, -31, 178, -169, -39, 57, 116, 45, 5, -153, -121, -85, -315, -169]
5725a69N2P7J25j67m7k15L56n7j24k4J61j18K6J9K81j53J46r2L4n7k84j05L14
5748b1P2p8m6N3J34M2j45o2j24J05K15M0k59O7Q2R3K3k55J4P7J45j59Q6J6j73
5773e8O6K25k38K04j97M5N0O3Q8m05J08J77n7J79o5o4p7jP1k96K54k86M9J05l7
5798i7N2o4j48K17J44l26o5J86J62j34P2k46J19J24j46K05k90K8J59m7o1k2j8
5821a96K00j74p9K47j38K5m8J90j64J66K21l02J19J96k62rR9j52K04O0j99M0K2
5844F6J76k71R4j01R0R6k19J14j4K52j52j29j2L3K7j05J45j27O4j2R7n0o3L7k18
5869a82K4J58q1n7J68k94J86J7k5n6J03j31J56j04K27n51M36M4k81Qj65M12j69
5892a57L74k75J31p6O8n3j94K12L5J51n0j97qL7J05k29n3J82j21L28J10k31M6
$$ y = [-169, -117, -40, 85, -82, -129, -344, 12, -45, -169, -193, -32, -150, -124, -105, 176, 23, 169, 77, 111, 54, -230, -335, -21, 51, -27, -73, -20, 114, 156, 11, -51, -175, -70, 145, 185, -74, -7, 75, 168, 191, -64, -50, 27, 172, 13, 99, 115, -58, 8, 233, -5, 199, 2, 47, 97, 160, 248, -157, -49, 128, 71, 250, 185, 121, 44, 43, 114, -182, 72, -214, -165, -60, -97, -45, -109, -257, -40, 104, -222, -287, -101, 61, -73, -1, -247, -128, -4, -150, 55, -235, -207, -48, -95, -156, -178, -196, 4, -170, -249, -2, -140, -115, -163, 27, -137, 29, 250, -52, 67, 263, 1, -8, 91, -61, 143, 203, 4, 44, 66, 242, -29, 65, -36, 54, 150, -69, 45, 31, 283, 131, 2, -10, 23, 50, -55, 90, -37, 27, 15, 112, 62, -1, 36, -182, -158, 0, -81, -138, 30, -264, -78, -61, -86, -142, -39, -170, -14, -118, 109, -442, -6, 38, -243, -235, -400, 12, -157, 217, -58, 73, -3, 65, 12, -182, 30, 65, 216, 166, -31, -39, -2, 103, -126, -179, 3, -118, 210, 320, 89, 135]
5915A35j84j8J85K67n59J2M42j39j33j75J25K36j08J07l77J58J39o3J30j01M0
5936A19j64L8j2J51j25p9J97q9l27K20J23k11K48q5m2l9L7L12r7j0j97M86m76
5959b2J53k17n3K74j12q3k5k50K62m5J9M2n0J89l29J89p7J63p6J40q8r9PL70k35
5984D7j21j48K24J18%nJ22J15l14Q9q3j06K55j22mJ66l32J76r1J21q1j52L43N
6008B22p6j67J2j4l0M7J32j77J43j64J7j9R5J21K4p2Qk74mM6L54j44j47j24K68
6033G7j79O8L1r4q3L23p6m0k31J99k32L59j92O8J88k90r9K01N9O0m1j15j04J87
6057D4J99j00k01J04Q6L39k70n0j05K2j34J54J2n0L76n49P1j04L05o4K27n13J55
6080d6JM5Q4j36K46k13J76k08J02J03k34M4J60j96K06pj61j09K72k93l6J41j83
$$ y = [135, -49, -67, 118, 385, -174, -162, 280, 141, 8, -167, -42, 194, 86, 193, -184, -26, 113, 50, 180, 79, 119, -45, -7, -19, 132, 7, -72, 125, 36, -291, -71, 52, -159, 89, 4, -38, -77, -40, 272, 175, 165, -32, 454, -22, 131, -86, -139, 135, 23, -60, -85, -335, -73, -118, -99, -57, -107, 82, -247, -58, -135, 28, -48, 92, 4, -95, -88, 282, 47, -74, -222, 2, 120, 120, 115, 237, 352, 38, 127, 44, -62, 193, 71, 67, 233, -99, 77, -14, 107, 26, -126, 217, 222, 146, -21, -9, -23, -53, -6, 126, -51, 92, -72, -55, -74, 21, 142, 166, 94, 102, -172, -176, -130, 224, 80, -67, -191, 77, -102, -34, -3, -97, -180, 143, 67, 27, -204, -5, -237, 122, -70, -2, 186, -104, -203, -2, 57, 117, 76, -39, -143, 44, 243, 143, -58, 46, 132, 471, 201, 151, 46, 68, -66, 88, 100, 50, 426, -123, -52, -156, 149, 85, 312, -201, -46, -45, 0, 84, -52, 194, -19, 157, -51, 51, 154, -80, -36, 124, -72, 134, 127, -34, -143, 129, -164, -200, -59, -242]
6103b42J32K74m02J88j4k37L14k56J97o0N7n6K56m81J85m9J97j27qJ37l0J75k08
6126e8J74k50J49R9j57n0P1J33n8J46p4j03o8j89L35N7l6j95L33J06j33k25J67
6149A74O7j53l4K32j79J01l6k42J86K29l84L5j42K37Rl6k3j45J01n5P6L6o5j94
6173b05J78l53N11j64j05p8L82k91p7K03l5k34K49O6j18J16l8k58N0J42J97l3
6195A05j27K6N0k88J84PLl6J18j36K1P6p8r7L78j65L7J5J28j4k75J43M9J77q0
6220B21j53r1k4J99j01q9P4N0l7r3K04k99L48k56J17OJ02k07m4O3j81K01J9M0
6244F9j56J53O8j34N7n7r9K03j2m2j54K54n93M04j45J10R1K8j00J29j25N7k55
6267b49K18j82O3o7K17Q7j02L6o8R3L9Q9m18L25p0J6J63k30J39j7L6j31r1J22
$$ y = [-242, -110, 164, -238, -50, -64, -301, 13, -243, -46, -106, -49, -105, 151, -330, -145, -194, 3, -124, -132, 5, -25, 150, -58, 116, -134, 15, 114, -43, -93, -22, 111, 53, 199, 125, 22, -46, -235, 100, 157, 121, -74, 259, 365, 232, 7, 174, 241, 88, 54, 286, 107, 208, 172, -70, 116, 345, -39, -4, -146, 91, 100, 64, 41, -104, -3, -58, 18, 54, -11, -205, -27, -380, 131, -33, -138, -216, 166, -125, -202, 1, -34, -268, -19, 47, -71, 45, 7, -251, -201, -59, 138, 105, -22, 4, 54, -234, -50, -43, -40, -76, 42, -94, -73, 3, -75, -172, 206, 41, 78, 93, 221, 207, -68, 75, 124, 301, 221, 68, -23, -47, 152, 51, -38, 36, 86, 49, -44, 160, -139, 209, -47, 70, 76, 178, -29, -73, -10, -191, 10, 29, 69, -87, 66, 134, 0, 57, 0, -99, 104, 92, 50, -104, 150, -443, -39, -184, -74, 17, 45, -55, 74, -51, 6, -249, -31, -213, -150, -217, 0, 87, -15, 21, -47, 46, 85, 174, -244, 81, 11, 27, 190, -40, 99, 82, 118, -13, -104, 18]
6291A8K40n01K39J31o1k2J34P8l15O8o6J40k45K93m2R5q3J29j91O4j87L8N3K63
6315B70k30M3J20j29k10J25M8j78Q7K29j33R3k69Jk9J0q5j25K53Nj0j24J71k11
6339b78L92k66p3M31m57K32J93l3j48R0k10N4L3N6M0q2o6J0R3m5J33q9Q3l04M88
6364B77k97O0l4n7J40pj47j1J43j12J27j42Q8M5J19k04m1nJ80M6n3l7j47KL7J24
6390I4n9L3P9j34k77L69j90r9K26k1j38lk7o7J18J88k35j7J08m0J10j16o0J06
6414e2j55q1J85q2J05J7Q3Mj83k9L81j63r3k7J08r2j64K37j50P4J98m46L10J15
6438A00L8r4J11K7j82Q0rR8m6O6j17k53N1M55k41l6n2J13q8M0J15k0m9J61k17
6463E1J4k66K79k4Om8K64j33j76M6j49P3K60r0j51r0N1J9Q4J83l48O7r7M12k25
$$ y = [18, 258, -243, -4, 127, 66, 44, 178, 256, -59, 9, -57, 83, -162, 131, 89, 184, 101, 230, 39, 103, -84, -46, 7, 270, 40, 83, 203, 74, -136, -11, 37, -141, -54, 175, 42, 135, -134, -133, -162, -152, -237, -362, -109, -104, -114, -238, -67, -278, 114, -152, -225, 206, -251, -19, 174, 141, -7, 83, -127, -73, -40, 16, 56, -26, -92, -82, 11, -34, 99, 10, 93, -211, 277, -20, 40, 6, -51, 89, 82, -65, -76, 67, -45, 82, -60, 28, 73, 192, -12, -53, -58, 122, 168, 115, 78, -69, -67, -30, 94, 35, 68, 147, 13, -264, 105, -85, -184, 42, 21, -117, -120, -147, -214, -96, 92, -143, -160, -52, -92, 18, -98, -158, -52, -207, -288, -103, -185, -80, -63, 20, 24, -159, -188, 193, 30, -63, -90, 18, -74, -238, -1, -151, -77, 121, -325, -15, 100, 138, 44, 155, 182, 0, 80, 71, 169, 123, 189, 72, -181, -130, 325, 84, 48, -4, 109, 21, 61, 176, 156, 107, 268, 51, 65, -201, 78, 54, 60, 12, 276, 143, -33, 13, -136, -63, 197, 107, -44, -134, -83, -64, 20, 203, -145, -78, -175, 237, 12]
6488A2j09N6O1L5R4m02j7K53j65J20j5j78J13n8L78r1P3J35n27K61j82K32l12
6511b33K48J83m05L19J28j09L5j48p2m4J01J20k49J71r3J62J88k92J01r7L5O5
6533A14k56PM13l01Q7j49J07q5O4J21k0k00K67m58N2L16k48n0L19q4J7L6p4j87
6557a92Q2J56k21J80k87Q6J15n3n8J71K7j70K1o9M2NJ36O2j41O1l2j2R6L70n28
6582a53J53l2l6P8k80L31K22l71L14l26J65J5j13K14M6O5n37M14J51k38q3K69
6604B68l65R1O9k52QJ92J40j95J17j0j59J67K7j63j42J71J31j86OJ87l10K83k17
6627a42j51L93k99L3L56l36K65j50j97K67r0j03K02O8j32o4j30L95k06o5QP4l59
6650c63L33p9K03j70J33r3o6K05j26l9j24L8M3K43p9p7J00J2o1o0r7J68K67k15
$$ y = [12, -97, -41, 20, 55, 149, -253, -270, -17, -182, -62, -77, -255, -142, -200, 178, 87, 160, 295, -232, 29, -153, 79, -233, 15, 198, -207, 112, 240, 131, 166, 18, -54, -98, 3, 123, -126, 45, -48, 114, 302, 10, 111, 14, 49, 114, -142, -135, 278, -23, 64, -85, 22, -63, 1, 122, 102, -98, 169, -289, -237, 79, -169, -219, 100, 16, 33, 69, -5, -192, -110, 46, -175, 5, -282, -196, -81, -134, -192, -21, 6, -164, -143, -212, -170, -165, -29, 33, -108, -47, -79, -91, 5, 375, -153, 0, -32, -68, 10, -270, 61, 283, -88, 226, -100, 65, 80, -33, 181, 227, 292, -245, 169, 320, 82, -1, 268, -97, -6, 63, -189, -181, 11, 151, -44, 73, 63, -96, 71, 98, -65, -207, -36, 95, -91, -85, 102, -208, 75, -142, -293, 100, -199, -166, 190, -146, 119, -31, -228, 39, -51, -154, 48, 116, -16, -80, -210, 185, -21, -86, -78, -4, -363, -30, -109, 94, -76, 57, -36, -102, 103, -23, -62, -186, -148, -105, 138, 59, -18, 82, 94, 33, -27, -124, 44, 311, 96]
6674I6J88J2l92J48p6P8J82j41p0J56Jq4L3j15Q0k57J10j89M57j18Oo9j35K12
6698A13L8l44K44l09K24Q5K2l48Q5J64J8j98J83N7k82L07o6q0J23j84L90l01j0
6721f9lJ63l0k08j68L89J44j04j00J23q4p0n4M9j3J15j6L6K0J90j75j71K2L3K08
6746B27J43o44M40L20K73p74k1R7j06j41K76R5m9J62l21J55k24N6r7J74j07P3
6768Gp6j40K48j45r1K9M25l47J96j38k7q3k89L86j66K11k7Po4O8j57J76k30L18
6792I1j77J61l24J52p2N8L78l58k22J87J27r1R4qMj06J36j61J43M1P0j11j98j9
6816b05L26Jn8R2j66j6Q2n3J18j16k12N50n35J20K24k63J94R4j79%K41k15RJ28
6840A61M3k96L83k59L2K4N5Oj95p6L6jJ48N7p2k06J4O5j07J04J93k25o7P7l4q
$$ y = [96, 284, 296, -96, 52, -24, 54, 236, 95, 25, 181, 182, 98, 131, 16, 96, -161, -51, -240, 217, 99, 105, 36, -99, 113, 151, -193, 51, -258, -34, 51, 73, -275, -190, -26, -8, -206, -23, 34, -248, 59, -7, -87, 36, -148, 242, -59, -69, -72, 91, 61, -147, -315, 74, 218, 114, 14, 137, 53, -17, -71, -22, -35, 80, 64, 100, 120, 310, 135, -36, -14, 19, 227, 370, -274, 166, 486, 759, -15, -36, 61, -45, -186, 90, 185, 136, 298, -23, 132, -92, -36, -133, 41, -66, 7, -69, -209, 39, -106, -197, -168, 257, -90, 106, -32, -59, -142, -431, -45, -211, 0, -27, -20, -84, -16, -173, 3, -227, 91, -86, 75, -249, -97, -169, -111, 267, -91, -313, -126, 1, -90, 4, -4, 0, -106, 30, -131, 12, 53, 123, 12, -186, -205, 121, 122, 64, 156, -10, -26, 56, 3, 121, 5, -207, 343, -192, -72, 152, -111, 83, 177, -2, -2, 239, 24, 33, 161, 204, -92, 291, 32, 64, 88, 143, 149, -46, -122, -86, -87, 61, 118, 46, -160, -146, -81, -188, -84, 109, -116, -183, -106, -140, -148]
6866a48R3o6j36J74j50K26k1j5M2m0L08l91j3L00j97M0k0Q5j60J97P9l56J87N1
6890F9J28l07N1K86K8j47m4J23j74L27l06k08J45K31O4n34J85M7J70Qj17P6j04
6913cj88P2J77j09Q7J7P4j71J68k66K05J30l77L7J82o8j1j84m9J42j1K53r2j78
6937a63J5o8l1m0L24J96k24n0L8ok1k07J75l0K48J9r0k02j9j55J23J02R7J38j99
6962c0L59l01k19L90M2k54J21j38O7J5N5J3j4q3K09l39R5K08k25J15j68K15l43
6985b10L5QL27j34J12r4J20l42k7L5K63l24L75j31j55O3K00j53j36Q8O7j01J61
7008D7L9J16k63j9k7P0M9k54J6l0P3K90l81J14MJ22J06m52L18M9k05L59j49n2
7032f0K11j86J33%L8j65L2N2J06N8q0P7m19L79J73l59N4MK3j07M56n06K8L9J02
$$ y = [-148, -55, -121, -257, -83, -233, -7, -28, -43, -1, -41, 267, -124, -137, 163, -34, 6, -14, 71, -89, 108, 187, -169, 18, 69, 197, -110, -59, 227, 255, 108, 64, 187, 13, 340, 34, -174, -29, 202, 266, -268, -83, -36, 134, 142, 25, 101, -3, -191, -119, 58, -51, 36, 53, 127, -44, 124, -142, 63, 193, -184, -147, 35, -33, -44, -228, -277, -135, -146, 107, 15, -163, -148, -216, -247, -287, 37, 233, 9, -41, -3, -9, -30, -237, -62, -92, 156, 175, 85, -117, -136, -291, -168, -66, 31, 169, -30, 329, 28, -191, 199, 241, -13, 108, -30, 37, 52, 107, 120, 106, 23, 232, -107, -12, 196, -29, 86, -82, 133, -210, -175, -167, 160, 26, 138, 44, 164, -178, -205, -170, 93, -231, 144, 13, -142, -79, 121, -32, -168, -80, -13, -114, 47, 86, 202, -61, -80, -107, -37, 12, -242, -226, -256, -183, 107, -274, -160, -156, -34, 72, -380, -62, -13, -218, 141, -8, -60, 151, -35, 98, 98, 136, -29, 3, 55, 161, 219, 139, 216, -203, 176, 349, -10, 44, 48, 71, -36, 420, -86, -58, -19, 83]
7057H3J07m08K33l6l0J03RQ0j97j16N16k50j04K01l00K29m7j14P5k60J66N1j90
7080a99J59R3m47N47j99J84k25R7j46P8j51L8P1r4K10Q4k36J62kj18J06l89L18
7103e9j99J24r4j3J13L29k11L0J2l5N85m48n8p7R4m1j31np3L74j99K71K55j14
7127D30m64J66l14O3J19j7N36l35Q8p74N29N0J43j39j90O3n3J46m3r5P9Ol80L14
7151g2r0MM55q31L04M46q5RN9P1j81j83J08l41K36j4R2k34J05p3K71j82K67q0
7175F1Mj57l8K2R9J4o5J60j50j72L15JO4k80J92m1J70nJ06Q4k07r8k48K31N7M12
7201E31k87j09p1K7j24j31P4J73j14k7R7J7r7O06j8l56l5j73L9O70o44P5N3m7
7225A29k57N04j31j2J67o22m4m03O03m71Q52m96K06L02l96o73R37P2j22j08l62
$$ y = [83, 190, -218, 15, -21, -51, 52, 61, 141, -56, -172, 344, 94, -10, 191, -109, 120, 73, -41, 34, -226, -60, -9, -199, -40, 53, -394, 153, -46, 138, -87, 10, -136, -58, -209, -171, -100, -194, 16, 100, -136, 26, 24, -94, 12, -377, -59, -258, -134, -228, -241, -128, 201, -10, 20, 32, -3, 582, 134, 76, -1, 93, 52, -79, -84, -157, 217, 18, 289, 544, 430, -34, 132, -182, -119, 0, -17, 519, 184, 272, -502, 27, 77, 220, 81, -109, -46, -99, 47, 4, -91, -12, -6, -386, -72, -162, -158, 297, -534, -230, 216, 131, 140, 199, 270, 89, -94, 14, -327, -91, -105, -13, -247, -142, -215, 56, -126, 141, 61, 65, -92, -130, -108, -9, 5, -60, 100, -50, -222, 93, 94, 158, -122, 70, 29, 199, 194, 300, 384, 177, 79, -169, 62, 119, 531, 244, 135, 64, 91, -33, -164, -90, 83, -31, -58, 39, 56, -41, 565, 547, 191, 156, -17, 22, 692, 48, 123, 176, 129, -128, 376, 245, 233, 400, -222, -266, -669, -66, -537, 315, -181, 25, 327, -69, -742, 195, 267, 145, 37, -325]
7246c25K85R2J18j9k57j82K13k46L56j36k42L26J50l30J3P4Q02m70r07J352j155
7267d88K32k14Q44m24M9j38J24Q3j36J06J29j08j37J35J12q2j79P8j07N2K07L2
7289A70l26J03o2J31p0J71o4j84R1j43J10k1P3j07j1K61o1l67L10p1l41J11J24
7312a73p8J99P6l19J36J15L1n6K11j60O3K7j21J59j89P7j21l5R8j33M03J25m39
7335a04J10Q1M5n4J25k0j83N2j9K5K5l79K49K11j07o9J03N1k63J13K00l34K03
7358F1P3J0P2k03rk60L56K5k00L0j98K66j92O3K61k12m1p2l8L41k53J96j93o7
7382a84j25K39kM5J56J7k26j64K31p8J3n8J32J50j77j58J71K05l5k19r0K69M4
7405A56j3j9L9j35J04k7q9J24k53K29m54M06k71K47j4M9o7J80k86K29n9j28L17
$$ y = [-325, -40, 52, 170, 151, -106, -288, -75, -321, 35, -101, -343, -17, 133, -197, -184, -110, 692, 222, -685, 667, -488, -256, -470, 374, -50, -1, -139, -15, 68, -68, 38, 167, 59, -78, 57, 169, 87, -92, -14, -121, -69, 138, 170, -156, -53, -115, 16, -54, 117, 53, -131, -40, -183, -73, -94, -21, -128, -139, 122, 61, -306, 4, -67, -408, -297, -173, -251, -52, 24, -295, -159, -44, -13, -69, 142, -18, 45, 72, -49, 110, -79, -2, -123, -158, -60, -193, 210, 335, -104, 6, 87, 132, 78, 203, 183, 0, 52, 33, 58, 83, -296, -47, 164, 57, -12, 91, 142, -121, -8, 192, -142, 61, 134, 144, 216, 13, 4, -256, 100, 125, -75, -45, -243, 23, -169, -106, 155, -57, -98, -170, -208, 133, -120, 76, -117, -184, -309, -70, -72, -27, 129, 146, -80, -244, -13, -91, -78, -136, -4, 146, -31, -189, -18, 187, 152, -67, -157, 112, 156, 143, 124, 163, 28, 132, 105, 16, 140, -113, 116, -338, 68, -203, 44, 30, 79, 12, 192, -94, 135, 76, -52, 265]
7428B65k30j37J71j4J02k06P1o4M58n31M15k82p7J62j34K51J3r3l70P44o16K97
7450A95k62L32k3k16L8N42o15P6l5k29K4n9k9J21J7J89r7J14k86M82m19j02L6
7473b06j50R3K49j50R7L00m95L99k42J08K3p8k5pq9K56j98N9M3k5K93q1k93K92
7497A73k35J28O4K53j1o86P85m04m31j02L24O81p57l85M93L23k25%j61L94j99
7518B2p1k34L36o8J13L08n48J52j31qk4k8J17l4Q7M1j11p6k6Q2N1k43J49j2Q6
7543g0K19j71q7K7o5j09J78R6J53j97R8k78M37j38M8j7m81M33p3mJ34m3K8k22
7567a04K81q5j74K72k59K34j54J01q4R3k6n6qm5J80L9n5k3k84N6K36Q6J1R8k00
7592A30p29J443j053N14o7n92N73p2k46O5m1J35Q8k84M77j64j70l6J82j28j2j20
$$ y = [265, 35, -102, 69, 55, 157, -49, 22, -42, 416, -115, 300, 18, -59, 103, -31, 220, 233, 140, -230, 514, -102, 195, -67, 265, 242, 26, 64, 606, -9, 67, 32, -197, -173, -232, -261, -140, -123, 66, -31, 83, -203, 279, -140, -242, -206, -356, -263, -14, -164, -67, 233, -262, 137, -105, 3, 26, -52, -77, -84, -173, 83, -115, -56, -13, -38, 255, 174, -119, 173, -62, 66, 130, 383, 372, -314, 471, 67, -364, -466, -142, 539, -218, -603, -110, 213, -12, -12, -173, 221, 22, -49, -283, 53, -15, 98, 406, -142, 10, -121, -129, -153, -181, -64, -98, -11, 30, -81, -157, -183, -101, -50, -293, -144, -156, -70, 149, -22, -109, -82, -147, -256, -78, 18, 171, -26, 72, -206, 231, 93, 141, 124, -357, 76, 3, -1, 133, 90, 118, -104, 177, 92, -82, 190, -69, 165, 11, 112, 28, 121, 95, 39, 31, -14, 166, 205, 150, 127, -157, -101, 135, 221, 232, 330, 130, -599, 844, -209, 305, 238, -354, 219, 147, -99, -34, -75, 60, 148, -136, 341, 177, 7, -29, 153, 25, 13, -107]
7614a07N5J74M0nk20j39J51J28l78K17J17j17k4J0l8K53k81K05j04J9R9J31l05
7637a19J62L9q0P7k97P5n4J14K17r8k5j40j00J76K32k02k67K38j8M02q8k07P2
7660A09o2l6n2K70l19J61j07J69o2m7r3n2NJ04n8M7k7L5k9l3N4m1o2O9kk8R3n
7688Ak14jO0J9J51j02J75j40J94j85K02j87j33J84K8J61q7j93K85j33o2j56K70
7711A37OO9j37j78L7K29j03j98K81k44L3J31p7K99k47j33J78J02j67j0M1J21O3
7734B33k67J8L5j29L2O5J58k85L20l57R9O9K5O7L5l10K4k7J21R3j77K13k93k8
7758b66l2L88j23J72j72O8k8j12l7L8J49j59K35l10K30Q7j58o6J42j7P5j99J37
7781D2r1J32m1kl51L66J81j34j39K2m6J13P1j04j66J32J76k29K7j6J15J66r2J3
$$ y = [-107, -52, 122, 162, 157, -63, -202, -51, 77, -301, -84, 33, -84, -108, -98, -136, 117, -164, 41, -63, -44, 55, 186, -119, 43, 82, 2, 79, -218, -143, -197, -83, 134, 36, 11, -129, -229, -53, 179, -23, -290, -52, -70, 332, 244, 37, 109, 47, 11, -41, 229, -90, 71, -36, 133, 71, 24, -69, -121, -116, -12, -70, -23, -50, -15, -44, -77, -23, -64, -126, -57, -59, -87, 6, 1, -213, -214, -154, -135, 16, -86, 89, -51, 143, -42, 160, -27, -160, 24, 52, 213, 126, -67, 218, 85, 23, -133, 137, 143, 212, 75, -103, -66, 163, 60, -138, 143, -101, -68, 63, -14, 285, 38, -95, 83, 185, 18, 8, 49, 170, 233, -34, -16, 19, -110, -78, -13, 145, -140, 180, -177, -78, -9, 16, 83, 118, -192, -168, -195, -74, 19, -158, 55, -238, -266, -298, 90, -33, 139, -33, 35, 7, -105, -142, -104, 45, -114, 121, -189, 41, 128, -30, -96, 46, 29, 104, -95, 42, -49, 83, 42, 40, -311, 55, 236, 102, -37, -15, -61, 52, 123, 19, -147, -15, 161, -68, -41, -57, 58, 224, 132, 145]
7805A45k2j81J98l80L74M1p4K08k22j66J23j09j35J68j13K51J55m71K47k40k1
7826b24J18n0M4K50k86p6J82k68L16J61k25k78J11J15r1K58j79K29k71j18K72
7847a0L6r2O9k46J51K5K7j95K34Q1J17k48K1P2P2P7k66k4O7L0j6J9Q9j99J37m5
7873a7j4P8m2Q9j67K46j87K73k65J44P6j3l63N6L07j36P3l9%q1Kl4J79k82k28
7898c45L37n5J33j21O2O1j13J31k57J87J60k77k67M98j76P3Nj52J03N9o4j52P6
7921i4J39M7k45K6J74K3j4l9L4J98k48n1J56j93J70j06J74j59J17j9j83J27k16
7944a82K47J34q5j14k18J78K39N1j02o0p2p6L00k54K9L6K87m10j23J69NJ24j91
7967h8K19n8j44J33j36K77k34K4j6j7J27K1K07n17K08n3PR3j64K54l03M6K05j95
$$ y = [145, 123, -58, 140, -240, 134, 175, 101, 309, 87, -79, 44, -65, -200, -32, -145, 106, 261, -210, 37, -203, -224, -106, -156, -112, 138, -148, -224, -42, -310, 6, 167, -58, -336, -225, -110, -201, 57, -122, 107, -164, -282, -10, 26, -66, 3, -243, -92, -67, -40, -235, -1, 80, 197, -51, -30, 42, 114, 191, -75, -99, -32, -2, -18, 1, 90, -109, 28, -17, -31, 47, 5, 94, -73, 173, -14, 259, -6, 138, 214, 201, -162, -106, 201, 65, 138, 99, 99, 18, 20, -14, 165, -117, -345, -8, -63, 70, -51, 11, 72, -41, 90, -167, 20, 180, -97, -364, 134, -42, 31, 36, -116, -13, 46, -18, -170, -94, 45, 92, -153, -127, 47, 70, 56, 17, 51, 249, 1, -50, 106, -87, 83, -23, 151, -8, 109, 90, -93, 34, -182, 65, 199, 114, 0, -218, -40, 199, 250, 148, 88, 16, -60, 240, -14, 15, 51, 338, -72, -195, -26, -21, 103, -88, 131, 73, -71, 62, -74, 203, -31, -7, -23, -40, 87, 108, 315, -202, 6, -47, -40, 53, -111, 143, -160, -114, 91, -104]
7991a04M44n30R7OJ48N8j82M0Nn8K8mL55m48J27n0N1J57j23R9l10L31k84K80j6
8016A17k14J57N0q5Or7j5L5J58K8l79K76K1j15K78m55J53R2o1J71Q0m5k24J9O6
8041A7P1J64j44J04j31m2j84K67j32J8O2k45J07J7O2o3r6jJ69kj63k1K21j0j26
8066h1l3k00K88J67j97J5m6L5k01J59R3j40J84k95K67j67J02NK18p7j70L51l10
8089c3l8J7R2j20L94l30J18m0j41J70P6j21K30k58J17k72J04j4K61J71m30K00
8111A53k55M7R9J65k87L1J01l77L34L2j02k6L08k40j40K8K01l11J63q4m3k9J85
8134d7R0l59K47o0J1L13k41oO5j2k63K05j30L24l04J09J34j90K60q5j53P6k0N7
8158B1O6q9K8m9J6q2r5M20k53J23j03J0M5Q8q7j74L11K6j33j97L5J75R8m1O4m48
$$ y = [-104, 340, -190, -93, -87, 61, 119, -63, -23, -18, -76, -48, -52, 303, -145, -18, -68, -17, 140, 17, 116, -194, 137, -147, 133, 117, -97, 60, 110, 25, 31, -66, -81, -46, 112, 140, -239, 37, 58, -57, 221, -234, -81, 11, -50, 121, 201, 156, -68, -49, 17, 88, 252, 108, 212, 81, 39, -145, 122, -10, 8, 70, -175, -68, -51, 11, -52, -148, -149, 20, 18, -145, -166, 55, 45, -81, -114, -314, -26, 141, -56, -41, -87, -52, -253, -94, -1, -141, 43, -252, 15, -152, -50, -45, 173, 96, -74, 277, -33, -71, -54, 38, -82, 312, -18, 100, 60, -81, 89, 165, 44, 274, 16, 133, -139, -35, -49, 212, 383, -47, 153, -102, -55, 44, 209, -78, -47, 54, -323, 11, 43, -59, -85, 223, -17, -157, -129, 72, -239, -76, -160, -203, -232, -47, 43, -316, -69, -129, -118, 195, -46, -52, 13, 1, -262, -57, -187, 137, -167, -58, 76, -114, 146, 61, -92, -16, -36, 21, 87, -2, 26, -23, -7, -89, -184, 236, -17, 106, 3, 13, 58, 146, 59, -115, 196, 222, 89, -108, -73, 102, 200, 159, 223, -225]
8184b25K41mJ44m38J59K24k35
$$ y = [-225, 16, 12, 156, -282, -123, 101, -134]
8191a34
$$ Imaginary data points
##PAGE= N=2
##DATA TABLE= (X++(I..I)), XYDATA
0@%%%%%%%%%%qJ6j6J6k4L2l5M3n6P2q8J04j20J39j63J92k24K60l02L49m01M58
32B44n21N92o71P59q55R58j075J202j338J490j657J837k034K252k488K744l026
49a587L335l675M048m458M914n422N990o630P359q196R167j0310J1679j3356J5465
64H323j8213K1960k7406L6164n3285J46654l17000J71414L27394m68690K27302
75E4617J65647l46944J42825J62952l14313R0681J60130j42161m195Q4456r6274
86d2579k9659O1781O062n4869M6969L2734j21392J100J37847j15691m1189J75747
98E6861j15077r6418J95155j15027j01897K45191j00617j44836K26114j06084
108e6635j26461K42614r2458j23377K06059q2703r5533J45976o5461l0699J06170
$$ y = [0, 0, 0, 0, 0, 0, 0, 0, 0, 0, 0, -8, 8, -8, 8, -16, 16, -19, 24, -32, 40, -48, 56, -64, 75, -88, 104, -120, 140, -162, 187, -214, 244, -277, 315, -356, 403, -452, 506, -569, 633, -705, 785, -872, 965, -1069, 1183, -1305, 1439, -1587, 1748, -1927, 2121, -2337, 2577, -2845, 3145, -3485, 3874, -4322, 4845, -5465, 6214, -7142, 8323, -9890, 12070, -15336, 20828, -32457, 114197, -202803, -31389, 296005, -172685, 54617, 220264, -126680, 16145, 179097, -135216, -44535, 115595, -26566, -30761, 53695, -42579, -72238, -10457, -4395, -59264, -12295, 20439, -100953, -99853, 37994, -77697, -118886, 56861, -58216, -154634, 40521, -74506, -176403, 68788, -31829, -176665, 49449, -56635, -183096, 59518, -32940, -156317, 49742, -32961, -128494, 17482, -47979, -78678, 27492]
119B7492n8665j7597L5184k5695L1908j1614m949N6940o1746n059P4603p0388
131b9586J3714P8510r1365J8479Q6132j06634O503R9457p9259N464O9402r1467
143b0650J7295P9579q3548J1486O1905o9552K2145L3402o7990M2100K3241n5255
155e842M4485j1451m0933N8630k9790k1889N9449m9862p519N1194n8323J3168
167A317M4217o0831K1712L0780n5163K3130J6821l7395L1301K679l5870K5584
179H282k9j7709K1679j3309p299K6679k2222q518K5757k0550L107K4560l4318
192a3890N604L0573l7729P864L0611l8978J4279K2947m2886K0853K1211l9461
204a9002K1602J2139l0339K1261q97k0293K4681o135j2524J4970j2131K986J0019
$$ y = [27492, -31173, -48770, -13586, -39281, -7373, -18987, -23936, 33004, -28742, -33801, 40802, -29586, -15872, 62638, -28727, -10248, 75884, -30750, -24247, 75210, -4049, 1415, 70817, -20650, -3355, 76224, -7324, 4162, 66067, -3485, 18660, 52062, -15928, 26172, 49413, -5842, 38643, 27192, -13741, 44889, 15099, -6790, 52659, 2797, -4722, 46472, -11851, 1317, 45534, -15297, 6415, 37195, -17968, 5162, 21983, -15412, 15889, 18568, -17302, 8282, 8253, -9456, 12223, -1086, -8385, 18294, -3928, -12446, 13311, -7239, -4132, 20428, -13890, -8286, 22287, -15442, -7578, 23033, -15945, -1666, 21281, -21605, -752, 20459, -19002, 2600, 14739, -15600, 5661, 4764, -15529, 9152, 3017, -9507, 5463, -6668, -3682, 6337]
217F337j8453R014Q812j7219J0286N10j5409J6915L18j7450J3372J691j4397J0993
231d680L35j2213J3137O7j4766J0740K167j0704R546j553p400J1249n305o246
245a5626J0816n089k73P057j0072N163O336j1045P189L802q038R350j263q395
259a0088J0499M29n128O227j396j05L345l045J946K226n54K656k608J42M898k294
275G150j672M135k56j431K208j068k246M394J635o917L351M633p608J683M744
290A2735p543K876N425r417L06P155o755k250N763l519l645N057k583o790O824
305C639J197r996N463L205j0005M763L059r296N157L559q944J706M923m780j185
320g535L900j848l529M745M25p738O767M620j1096M921P044j1233M678P913j1628
$$ y = [6337, -12116, -3102, 5710, -11509, -1223, -713, -16122, 793, 1111, -16339, -2967, -1276, -15673, -4680, -4345, -16558, -3421, -3354, -18120, -7380, -5213, -15917, -6371, -7924, -15324, -4075, -9380, -15626, -4810, -9899, -10172, -3115, -13187, -8024, -1688, -12733, -5544, -1742, -9780, -430, -1693, -10088, 411, 840, -4288, 1939, 543, 438, 3783, 738, 2684, 4910, 4356, 7012, 4404, 4546, 9444, 7150, 5478, 9613, 9357, 7926, 10134, 9066, 6820, 11214, 12849, 5932, 9283, 13916, 6308, 7991, 12735, 5192, 8068, 13493, 4076, 4382, 11537, 4782, 2532, 8295, 4776, 1131, 6188, 3605, -3185, 3639, 4836, -5160, 303, 3508, -6497, -1734, 1325, -7971, -2814, 745, -8199, -6493, -1570, -6350, -7535, -3635, -5483, -9012, -4267, -3842, -11580, -4813, -193, -11289, -6368, 676, -10557, -5879, 2034, -9594]
335i594M006R296j1016R43J0133p721j279R688o633k835J0926n199n677J1004
349F042k410o697R023k357n828Q819k183m967N794N73m461J596K243r05k393L845
365E734j232n528O384Q7r262Q081J272r958Q198Q0q998Q232N3r549O999J543q733
382f597N637J535o169L147K438o887J658N770n988j446O454o154P83M376n089
397f532Q95L634k047n70Q15j70Q62q54J962k68j517M486k510k545P442l706k165
414b788P049m387q07O754n459j15O743m382r23M697k738o5L243j997r74K978j77
431F652l135K361J286l144K533M71m158L125Q8l115K308k23j580O53j300Q32r82
448B672j425K530l922Q5L840n914P02L919o083J719K280n904L050J367m528J966
$$ y = [-9594, -5588, 3708, -7308, -6365, 3768, -3953, -5232, 4456, -2177, -5012, 5914, 715, -4962, 6042, 3632, -3065, 5958, 3601, -2227, 6592, 4409, -558, 5236, 5809, 1348, 2944, 5187, 4282, 1889, 5734, 4502, -1026, 5358, 5445, -3817, 4264, 5536, -4422, 3776, 3856, -5142, 3090, 3143, -6406, 593, 2136, -6597, -960, 575, -5594, -2447, -9, -6896, -5238, 532, -5456, -6902, -448, -6602, -5819, -1443, -6532, -5637, -2003, -4050, -4620, -3805, -3975, -3113, -3967, -2005, -2273, -3790, 696, -1814, -4359, 3083, -623, -2788, 4261, -126, -933, 5821, 362, 247, 6990, 2608, 1685, 6382, 3644, 3579, 6822, 4825, 3851, 6829, 6652, 3517, 5878, 7164, 4020, 6553, 7024, 2866, 5991, 6079, 2964, 5272, 5049, 3469, 4122, 2822, 3654, 2672, 1247, 3777, -145, -60, 3780, -2134, -1432, 2487, -3596, -1877, 403, -5501, -2451, -1084, -5612, -3646]
464c646j15j709J665j337n66Q00m74P11j568N78J381k061J203P55j852K106m99
481d628p65J824o20M23N74n73K276j260k58L085k270J257K674l876K589K265l347
498f30K893J46j928L434j314r40K599j666R72J166k322K253k47j497K303j421
514C801l86J657k014K42J213j582J86m18m8K01j479J246r19j017J865k410q80
531g42K579k360m39J059j911J007j70j562J154r61jQ92k529J704J56k303K997
548a430j418j715L360j889q68K817j731j14J723j361R28N20M4J89j27J504q39
565d07r99K652r41p07K484j468K14K184j763M45J219q80J065l11r7P26j250J594
583C760k62j431K066j023j290K749k201n64K492k550P6J331k044N60j25q32N48
$$ y = [-3646, -3761, -5470, -3805, -5142, -5708, -4908, -5382, -4671, -6239, -5661, -4280, -6341, -5138, -4383, -6235, -4129, -4628, -5393, -3569, -4189, -3766, -3192, -3765, -1489, -2749, -3007, 78, -2192, -935, 1739, -2137, 452, 2717, -630, 2263, 2409, 481, 3915, 2601, 1661, 4260, 2594, 3566, 4732, 2410, 4663, 4416, 2919, 5222, 3801, 3415, 5072, 3058, 3300, 4513, 2931, 3117, 2699, 2651, 2852, 1373, 2619, 1700, 683, 2548, 138, -742, 1837, -523, -962, 97, -1814, -807, -977, -2539, -1385, -2346, -2347, -1455, -3984, -2280, -2124, -4427, -1430, -2848, -4563, -1203, -3092, -3960, -1143, -2874, -2988, -1265, -2626, -1698, -1178, -1134, -945, -1072, 432, -407, -1406, 1246, 305, -402, 2082, 614, 828, 3012, 1249, 1694, 2913, 2033, 3098, 2787, 2690, 3416, 2166, 3760, 3498, 2067, 4133, 3110, 1820, 4569, 2368, 1804, 4296, 1746, 1822, 3153, 1109, 1669, 1544, 712, 1260]
600A260j160k1L24j636J408j261j371K224j796r73J749j794j27Q82j697N03qn62
618d056O70p58N13K04j269J563n36j099K390j213m07J891j583L69J410L07l64
635a968K63j72P84k18P35O38q07J106K23m31J438m10q3J599q93L01P38k64P89
654C368J20m50Q35k63P3L92q37Q51L18j311J122l98o15P35q48j38M60j104M47
673B757m93m46O53j039l03O84j509j77L54j049M23l00o06K13p41J05k06r42M65
692b157K1r27P20m50m15J044q98j32L62m26L91J05r9K33j06L21k23j18J062j0
712a702m99J225n38L35J079o64k9J163n13J76N14N6M12n5N60p4P0N81m54P8J033
733B754n98k01Q41n87j67P96q99O7N97l64K9l32N1k22o55O77q95j54O03r37l91
$$ y = [1260, 100, 79, 403, -1233, 175, -1086, -2457, -233, -2029, -3002, -1253, -3047, -3174, -2292, -3989, -3486, -3494, -4056, -3386, -4144, -3631, -3427, -4696, -3133, -3669, -4768, -2378, -3591, -3998, -2107, -3690, -3321, -1911, -1604, -1968, -1705, -1877, -1093, -1311, -576, 62, -745, 361, 584, 153, 1591, 1181, 1098, 2697, 1804, 2105, 2843, 2579, 3368, 3488, 3038, 3873, 3610, 3683, 4075, 3238, 4089, 4407, 3096, 4218, 3820, 3205, 3940, 3092, 2954, 3414, 2310, 2757, 2264, 1818, 2471, 1432, 1129, 1813, 304, 127, 481, -568, -145, -445, -1051, -838, -1579, -1474, -1680, -2622, -2157, -2136, -3063, -2343, -2793, -3208, -2164, -3062, -3194, -2832, -3258, -2867, -2762, -2861, -2628, -2734, -2413, -2636, -2754, -1692, -1702, -2201, -976, -1514, -1179, -100, -764, -793, 370, -143, 33, 547, 603, 1015, 960, 1520, 1446, 1516, 2097, 1643, 1721, 2754, 2156, 1955, 2796, 2209, 2042, 2838, 1939, 2006, 2603, 2239, 2268, 1936, 1987, 1765, 1110, 1787, 892, 738, 1341, 404, 13]
754A3P82o92m47K99o02j97K37m28n16k0K31p35j23P84o82l24M23n26p8P68r56
775b789L28Q42q56L53J39j79L93k82K15N08m61P02K54l97J122n23k58J451r6l55
795A11R26j97J25M85k93M82K92k82N12o3K95J33m15M80J44O4L1p1Oqm88L81k98
818B352p7K52j049M78k75p97N63K31j302O26L5j506R58l34r34N69m51m71K27l54
838a259k56m92J0K85q55Q5M10n49O5N37j003M66L03o87m1N89M7m00Q93j79n86
859b617R92j32o02R01K22n41J081J96n78R33R0K3O27j65K10J65L42N74n11R4Q76
880B180p05M21O98j038N80O43r58N46K96q07M15J82o09M38K96o26m23K90j23l63
900A333Q3K5n27Q2n1p72L07m21k03O6l87j64k30m79N04l49n56O63o75qL97q19
$$ y = [13, 795, 103, -344, -45, -647, -844, -607, -1035, -1551, -1571, -1340, -2075, -2198, -1414, -2096, -2420, -1997, -2523, -2601, -1833, -2789, -2461, -1619, -2475, -2122, -1983, -2162, -1769, -2051, -1836, -1328, -1789, -1087, -833, -1230, -108, -631, -889, 562, 466, 111, 1037, 840, 965, 1450, 1157, 1639, 1931, 1649, 2161, 2098, 2393, 2526, 2111, 2591, 2735, 2799, 2830, 2759, 2765, 2757, 2269, 2650, 2352, 2275, 2527, 1478, 1956, 1681, 884, 1447, 1678, 376, 1002, 1037, -469, 489, 155, -779, -210, -661, -1132, -905, -1259, -1515, -2007, -1997, -1712, -2567, -2482, -2072, -2621, -2556, -2019, -3022, -2556, -2253, -2940, -2981, -2392, -2345, -2745, -1852, -2031, -2617, -1625, -1757, -2359, -1458, -1236, -1777, -696, -500, -1078, -145, -55, -32, 595, 430, 640, 805, 1147, 1721, 1210, 1304, 2180, 1475, 1896, 2594, 1556, 2136, 2779, 1821, 2367, 2663, 1856, 2271, 2453, 1844, 2282, 2578, 1952, 1529, 1819, 1696, 1333, 1416, 1441, 914, 996, 945, 173, 480, 59, -144, -78, -465, -629, -859, -1338, -834, -1183, -1739, -1076, -1751, -1759, -1362, -2181]
922b181M30M24j279J001j77q72J088k56j68O16n58L56N19p38N01N17p38J084j9
941d50m35Q61J13k10K05L34P0J93K46K3Q2M89l14j0O95k24nO15r01N39L50q33
963A433P37m44J95J20p52N11K44j296N96K74j207J017J27j609J163n48j270J108
981C99k68r40P27k70n17Q2n86K15j20k96J55n00J67J6n68N03o3n52L95j95J53
1002b063k70N93q5m48O45O7n97J024J84j166J606j80n53J125j59l96J244n95J2
1021a2Q72n63L13M40j40N02k34J80O94o81K29N72m12J78Q61j006N2P17o30p2N55
1042B415m23k87N01l22m06K44j07l71K83k58m91K52l86j6j04o29K25k48m43M47
1062a24p67k54Q61p61l74R10j261J90K91p76M52J23p42N81j57j23J78m5j09J06
$$ y = [-2181, -1751, -1327, -2606, -1605, -1782, -2654, -1566, -1822, -1990, -1374, -1932, -1576, -1057, -1795, -1294, -777, -1515, -431, -450, -885, -24, 89, -121, 84, 418, 488, 681, 927, 950, 1032, 1521, 1207, 1197, 1892, 1668, 1663, 2278, 1377, 1916, 2266, 1433, 2170, 1726, 1921, 2041, 1289, 1800, 2044, 748, 1344, 1618, 411, 1428, 1555, -54, 1109, 561, -709, 399, 131, -809, -82, -352, -869, -787, -1373, -1158, -1278, -1574, -1419, -1919, -1752, -1736, -2304, -1801, -1864, -2416, -2021, -2216, -2063, -2333, -1740, -1825, -2273, -1628, -1561, -2158, -1134, -950, -2116, -510, -690, -1243, -118, -277, -673, 571, -24, -12, 860, 297, 610, 1050, 910, 1412, 1178, 1358, 2052, 1371, 1600, 2172, 1760, 1938, 2799, 1793, 1845, 2562, 1932, 1860, 2415, 1992, 1705, 2206, 1884, 1478, 1722, 1615, 1244, 1527, 1269, 778, 1030, 644, 628, 524, -105, 120, -128, -571, -124, -891, -1145, -284, -1045, -1419, -509, -1770, -1580, -1289, -2065, -1613, -1490, -2232, -1651, -1808, -1931, -1753, -1798, -1907, -1801]
1082a801K28L06j99j02M28k52J42N45l5l0M06o4q7K94L24p4L31P35r79M89Q79
1103A484r05J60R53q22M44K83m27O28p6k65M43m49Q4J37m06M73j58n92L28j2n24
1124G81P29n36m62M78l97q59O50k43k78K51j70m11R1k61l76J43K16p06J75q6k83
1145a554K85j53N1N9k64J08J81l84L62N2m83N99j20n92J076l69k17J245p43J86
1165f75P49o57J55O98j79K14K22l0J16M11K2K3j32K43K56k89J88L35k34J20K45
1186A801l22m5M42k18l45K75p7m24P29o27j96O99l57m94K80m68j16J60o56K15
1206B56l2l65J44o57L17J66o75j46L80p56L37K10q06L72J02n29K7Rk40K89O6l48
1228a879K15J51j17q4K48J45k7J15M2N0K84P5J57q0J68K03j9J86O73n82M66J93
$$ y = [-1801, -1573, -1267, -1466, -1568, -1140, -1392, -1250, -705, -740, -770, -364, -428, -515, -221, 103, 29, 360, 1095, 116, 605, 1484, 579, 739, 1692, 870, 1314, 1597, 1170, 1798, 1722, 1457, 1900, 1451, 1535, 1672, 1266, 1739, 1581, 989, 1317, 1305, 781, 1510, 974, 512, 990, 593, -266, 384, 141, -137, 114, -56, -467, -376, -637, -1013, -870, -654, -1360, -1185, -1271, -1554, -1269, -1422, -1371, -1312, -1576, -1468, -1287, -1671, -1309, -1257, -1740, -1141, -1261, -1853, -777, -1146, -1363, -118, -861, -675, 74, -583, -428, 270, 91, 305, 527, 497, 613, 1024, 1046, 1069, 937, 1180, 1436, 1147, 1335, 1670, 1436, 1556, 1801, 1479, 1434, 1876, 1658, 1313, 1588, 1511, 1087, 1816, 1189, 993, 1692, 1335, 841, 1121, 653, 537, 697, 41, 256, 224, -141, 3, -654, -337, -171, -846, -992, -612, -1368, -1031, -821, -1627, -1255, -1153, -1682, -1655, -1646, -1886, -1597, -1531, -1879, -1664, -1513, -1630, -1714, -1466, -1321, -1348, -1233, -1191, -1141, -857, -782, -625, -705, -537, -334, -353, -167, 506, -76, 390, 583]
1250E83m89K91M67o54Q07K98n79N84J31j20L09J06l01J5r1J13l7R8J40k12k62
1271A197O0l55j81K50j14L1P9l22k65K55k4p47N51l43m13J64j36j92m7l5j65Q5
1293f67k00m4l3k57n6O1k70K49L7k05M72o95K18K78l95M15J52j59%L51j85J87
1315g46N18j85L8J62J01k28K64M61r0J86K29j61J16L31m2j24JM79%m48O11k51
1337A222J52K09m40j6K83m03J23L77o19qM80l98k04rl16N6j47J56k54j53n1l07
1359b67O2J21j89n98K07J68n93N1J31k32O5mk67N0N7j67M6kJ93k36J76k11K14
1382a225L03n4L8K2J49j54L6M02l9RK77p2J85K31N7O5O3nk58P91j55J70J63m1
1406I58j37K20J00l14M19k8P1k72L49J78l15%k5k30K93o9l19p2J01j28l17K39
$$ y = [583, 94, 385, 852, 198, 1005, 1303, 724, 1308, 1439, 1319, 1628, 1734, 1433, 1448, 1357, 1470, 1433, 1531, 1671, 1459, 1197, 1257, 902, 721, 971, 857, 888, 967, 645, 380, 635, 611, -136, 415, 72, -341, -177, -313, -505, -552, -587, -752, -667, -867, -911, -944, -1201, -1257, -1196, -1466, -1217, -1180, -1385, -913, -1608, -1390, -1112, -1507, -1092, -940, -1099, -1099, -748, -933, -746, -228, -413, -375, -213, -112, -340, -76, 385, 295, 481, 710, 549, 665, 996, 954, 830, 831, 1310, 1310, 862, 1473, 1222, 1374, 1583, 1143, 1127, 1410, 1007, 1130, 1507, 888, 880, 1360, 962, 758, 749, 433, 489, 342, 498, 244, 91, 40, -267, -205, -84, -273, -871, -664, -496, -1089, -1038, -907, -1139, -1074, -1078, -1345, -1295, -1238, -1405, -1359, -1361, -1168, -1404, -1228, -1439, -1225, -922, -976, -938, -916, -767, -921, -885, -483, -522, -513, -236, -308, -123, 108, 165, 230, 293, 288, 30, 821, 666, 836, 999, 958, 821, 1041, 1141, 827, 1246, 1218, 1289, 1017, 1366, 1544, 1229, 1229, 1204, 974, 1267, 1198, 879, 807, 908, 780, 463, 702]
1428G02k59j10K3q6l58pK31n35K7L18m90J88j47l15M9j10O8k03j15j3j55J18O6
1451a113o2j28N5j06K72J23j44J58L2J33N4M9n7L14J36n4J54N7K7J02J4J97K33
1474D46k14J64L16oJ79k55j15L08k53L09M7mL7Q2L68l01o9J58l15J20k09q3k62
1497D48M01k18P0J02j32l95l6J17j6k90L5k24J81k15K77n26M12m34l28K57l07
1518h21J31j13O6j15J56k2l80K3L46k80n8J45J8j97Q9K81m9K52j47q6m7J69j31
1541g70M43M72l79j36K41K62K04j32R9l14O32KK8o9J14Q2j04r2J49K60J44Q7n15
1564G08L43j52K30k62l9N1J3j85k14J88j23k96M02j87L06p12K2k6l29K98k39J18
1586h5j35o9k82n1L33J06l62o1J51k82k7p6j52M26o9N7K9m51L22K56j91m90M24
$$ y = [702, 443, 333, 356, 270, -88, -95, 136, -399, -372, -54, -544, -356, -503, -818, -769, -879, -811, -1014, -1129, -1142, -1297, -1179, -1113, -1175, -1303, -1248, -1354, -1082, -959, -1103, -945, -913, -780, -726, -677, -734, -420, -284, -338, -184, -127, -100, 2, 16, 213, 446, 232, 396, 712, 706, 885, 630, 515, 823, 570, 879, 926, 922, 959, 1041, 1409, 1108, 1039, 1197, 882, 1002, 793, 710, 448, 849, 631, 701, 803, 671, 276, 240, 357, 341, 51, 86, -138, 43, -172, 105, -421, -9, -443, -771, -514, -821, -690, -803, -737, -852, -696, -718, -1098, -1075, -729, -1009, -1067, -922, -904, -1101, -1012, -731, -780, -528, -675, -761, -808, -639, -770, -327, 145, -234, -370, -129, 133, 337, 205, 304, -10, 622, 624, 652, 583, 697, 779, 675, 583, 732, 992, 1136, 1223, 708, 1051, 899, 1129, 867, 828, 879, 892, 707, 493, 681, 558, 262, 664, 477, 783, 71, 93, 67, -262, 36, -203, -85, -220, -289, -571, -622, -289, -183, -545, -606, -455, -737, -764, -840, -992, -566, -635, -578, -549, -1000, -678, -422, -613, -1103, -679]
1609f79M25j85n55P81l01O97n72J07j30K77K62k01K48J8j63P45MN4m68J4O93r70
1631A01L11l5L68p69Q88l72M25p9r2R01m60m22j67M18k93M23k71j83Q8m55L55
1652F80J72j56l07n59P53j039O20m20k86P1k07K24M0l89K80m81N44k00J01l39
1672h98K59K6m15K06k14k04N71O5L44j45m93M31k10k12J79Q99j205O38k12P38
1692A48m79k89O40K62n14L71K70k93J37J32O8j31P10n39K98K47l28K45l96l8O26
1713A147J2k64n10L0O03q82R96m53k4n01L35K46l20L48q30O5O07j91l48n1N7n43
1735d71P11l76k97L07k91K16k81q9L9l9R6p2M17L1r10L39n0j54K6L11M3l36l86
1758a216N28j03J70J55J67m64O91j54r1J39j44L03J36l28J73P6j97L22J36J37
$$ y = [-679, -254, -439, -994, -213, -514, 183, -389, -282, -412, -135, 127, -74, 174, 192, 29, 774, 778, 832, 364, 378, 1071, 101, 412, 377, 745, -24, 864, 492, 917, 838, 746, 1647, 1187, 765, 598, 1016, 723, 1146, 875, 692, 780, 325, 680, 852, 696, 389, -170, 583, -456, 164, -256, -542, -471, -678, -454, -414, -803, -523, -1004, -460, -660, -559, -898, -639, -613, -1028, -822, -1036, -1240, -669, -604, -260, -405, -898, -467, -677, -889, -710, 189, -1016, -378, -590, 148, -331, -620, 20, 282, -232, 139, 409, 116, 253, 385, 453, 322, 1032, 493, 791, 1038, 710, 955, 559, 521, 1147, 1159, 895, 385, 415, 1018, 136, 1132, 679, 655, 154, 489, 735, 415, 763, -67, -2, 605, 414, 66, 15, 72, -471, 240, -136, -433, -126, -417, -201, -482, -571, -532, -571, -475, -547, -130, -99, -1009, -670, -720, -874, -848, -537, -494, -830, -1216, -688, -791, -621, -466, -299, -763, -72, -226, -317, -178, -322, -19, 117, -211, -38, 38, -159, 163, 299, 436]
1778D36k36Q2K00M6j83J33R8K0j67K43L80k99J69p45R01m11L49n32m1q93J348
1799H98n20k1K58r43M71M74n19J62r1n3j79k50L9R7J63l37k00K70k38L3o8j18
1821f72R6PJ66k18k15J64r8q3J01J93k47K76k68J51K62m9j34L34J8k06O6jM7L49
1845C9J24j00p4J14j64R0L08k47J58J35P9o3J16j16R1L1P0P6m0M6N8q7L72n51
1869D65O8K3L1R3nj42Op6J18l22J06j64J03k09K62l15j25J88pm17K40n5k06M9
1893b91j80O9k84K79o5j35n9K1j60J80P3l25L37n3p6J59L2r9o6K34l41K86O5q
1917d07N5J21l69M08p0J91j93L31n2J36J14j48J45PK75k47K19J07j34j41J44Q7
1939E79j60J98N8r4J06pN1j41K5l09L67j33l48J44K57n42K55k6o2j9J41k21n4
$$ y = [436, 200, 282, 482, 528, 345, 478, 576, 596, 429, 672, 1052, 753, 922, 177, 1078, 667, 1016, 484, 443, -450, 898, 378, 357, 615, -328, 143, 617, 98, 260, 169, 116, -63, -313, -274, -177, -14, -351, -551, -281, -519, -486, -554, -672, -576, -569, -403, -621, -836, -672, -770, -853, -752, -559, -806, -530, -798, -647, -385, -434, -568, -234, -216, -422, -356, -357, -310, 39, 163, 63, -11, 103, -61, 29, 337, 90, 248, 383, 462, 399, 515, 399, 490, 521, 591, 667, 627, 673, 731, 644, 1016, 465, 533, 556, 587, 680, 675, 533, 539, 463, 581, 259, 365, 201, 304, 95, 357, 42, -83, 105, 98, -319, -79, -134, -340, -291, -471, -402, -686, -407, -472, -607, -666, -645, -805, -625, -552, -877, -540, -593, -669, -510, -478, -577, -643, -409, -750, -464, -399, -407, -352, -231, -600, -192, -262, -71, -264, 67, 15, 151, 265, 117, 262, 269, 544, 297, 516, 623, 489, 348, 492, 579, 419, 617, 675, 581, 687, 680, 731, 590, 615, 306, 673, 540, 192, 336, 593, 51, 306, 280, 218, 199, 340, 119, 65]
1962F5j35r4J40k11N7p6M5j5r2k71P5J24j07rk9l0Nj25k56K94K26j71j04K10P8
1987d06j81L31k59Q7O5L08j82Q8m7J69K27l24J1L87k51J20J39J55N5k04M7R1K03
2010F29k05L86j92j07p6K3L51l69K31j66J0L6o4n5k1k71J98J06j48j26J35K2j97
2033A30J93m17M0J75j85j92K00j50j13J05pl27O6KK40m01j6K49j86j5J58j37J94
2056c94k16P0K14n4k73L87j11m35M43n8R0M0K27j33M6L6o9K93m8M9n2K11Qq4J24
2081C11K43j56k48N08l3M5r3k22K72j30O6J93j27L0m6k02q1L48m9k10m6o4J13
2104D22j56j1j16n8J80p6j73k5j3k00R9q3J62l25Q2J8r9o2k1N0j77J84k12k3r6
2129g29K07J90L2k55k1L9mK19j01p9K45j83R5N6J40m4j12J76k06M47k64Q0J25
$$ y = [65, -70, -164, -24, -235, -178, -254, -209, -224, -316, -587, -512, -388, -495, -504, -533, -563, -558, -683, -939, -645, -419, -590, -694, -484, -406, -587, -256, -515, -428, -363, -55, -237, -149, -196, -27, 200, -124, -113, 274, 23, 143, 282, 437, 492, 288, 335, 426, 629, 424, 810, 618, 511, 435, 458, 809, 440, 671, 505, 515, 551, 487, 432, 411, 140, 338, 444, 296, 170, 305, 327, 130, 323, -94, -54, 121, -64, -256, -56, -206, -319, -214, -221, -548, -482, -480, -240, -641, -657, -408, -594, -609, -451, -588, -394, -610, -540, -326, -380, -653, -266, -377, -812, -369, -427, -337, -297, -70, -203, -157, -121, -190, 103, 55, 104, 52, 263, 271, 187, 311, 554, 398, 150, 658, 625, 670, 577, 355, 627, 497, 563, 756, 629, 659, 613, 411, 330, 678, 629, 419, 373, 309, 422, 266, 255, 139, 81, 261, 185, 12, -13, -26, -226, -127, -210, -48, -373, -291, -273, -372, -434, -455, -405, -582, -398, -610, -633, -729, -522, -332, -300, -555, -576, -537, -541, -322, -423, -502, -257, -440, -345, -289, -149, -193, -305, -129, -335, 112, -152, -72, 53]
2152E3J3k4l1K96j35K24M8j64K79K36m71J67O0j37OJ40J9j45K50l0k96p8L26j79
2176D27j08j9N5R4k20Oj67L77l51j58K15l61Q7J55p3n2k36O7o5R3j27o1P3j89
2200e38k1j73K86j48k00K27J26P8L0N2m71J34K94Q0j09Q1n6m4M18k37K2lj80K29
2224a23J83M6j87J91J60j07J44kk82L25k02L24j5J8l7J67j72Q8k94L65Rj02M2
2247E39l7J23k3j1k11j96K79l81K42O8k81o5K9J88j14j23q9r8j79K83k24qJ88
2270a01l37L2J66J44k95M2j6j80m3K49j13oJ36k29j2N6lJ57K58k91o8L7K2J62
2294b33j68J05J2J41j6N0J64J7No3L39j94K33n0J17k62N24j62l54K34Q8m8j66
2317C13L4J36J70l2j86RJ49k12J93l33J47m59K33K2j80K66j55m2j18Nj21n1K5
$$ y = [53, 66, 42, 11, 307, 172, 396, 444, 280, 559, 795, 324, 491, 551, 414, 420, 560, 579, 434, 684, 654, 358, 280, 606, 427, 319, 300, 355, 449, 229, 235, 68, 445, 94, -64, 151, -210, -123, 32, -41, -93, -329, -262, -327, -234, -361, -422, -349, -538, -559, -732, -446, -594, -794, -567, -441, -363, -333, -281, -752, -618, -324, -244, -353, -272, -328, -372, 46, -191, -169, -172, -352, -123, 60, 106, -81, 110, 270, 163, 307, 305, 23, 348, 146, 470, 455, 473, 436, 603, 431, 519, 225, 590, 599, 497, 539, 502, 625, 602, 591, 380, 184, 463, 82, 324, 392, 111, 46, 75, 263, 149, 26, -63, -161, -340, -57, -281, -289, -101, -438, -406, -240, -96, -391, -349, -365, -545, -588, -339, -452, -458, -322, -551, -563, -507, -510, -353, -95, -386, -454, -417, -395, -233, -401, -296, -284, -143, -159, -109, 55, 72, 77, 14, 353, 159, 392, 342, 459, 197, 721, 559, 205, 439, 527, 479, 313, 347, 483, 653, 621, 435, 444, 593, 381, 574, 241, 388, -71, 162, 184, 4, 270, 115, 73, -45, -40, -161, -212, -187]
2340a87J03l10J74p4r3M1j43J41K49k33J21l01J73J68j23Q7l41J03k00J40J71
2361c34n6J28l54M95j70mK58N7M23n16k74J38q5K42K61M6p28N19j40n7K11P4M61
2384E95n3o34J17L07Q3j58Q79p55L2L27K14p48k48N13m22K38N76q77L58J32p40
2405b64N39j89J4L32k60j58J65l7j65j38N7J69o6k52j8R3j27m0J64l24m9L08j59
2428d05j4K34k05j30K35l7l2N7l9j40M0N4J33P3j76K85j78K36k22K26J51k40J42
2451D8K15r9j62J65K4j24K30J12L0n7r5j00J86L5R3Q8n8n0N6J03k34j22R3J9Q3
2476D79o0Nk87J27m4j86J48j52J18J48k52j92J94r8P9j07j38j71l4L14l01J56
2498b54m1l38M38n7j41l0q8K29k49K74k06J79m3j38p5P2J82J90r1M0l6j58J15
$$ y = [-187, -84, -394, -220, -294, -387, -346, -489, -348, -99, -332, -211, -512, -339, -171, -294, -207, -548, -445, -645, -505, -334, -390, -262, -616, -121, -291, -295, -37, 20, 443, -73, -347, -209, -294, -52, 209, 255, -473, 46, -94, -151, 60, 134, 595, 542, -92, 25, 332, 415, 257, 1136, 381, 413, 740, 954, 206, -42, 471, 49, 287, 863, -14, 344, 476, -264, 275, 86, 100, 432, 172, 14, 179, 142, -23, -161, -104, 65, -1, -253, -271, -178, -305, -345, -181, -505, -554, -246, -405, -419, -185, -390, -520, -285, -322, -354, -297, -336, -476, -436, -382, -249, -176, -352, -67, -245, -9, -231, -5, 146, -94, 48, 263, 164, 2, 167, 191, 67, 297, 409, 439, 382, 287, 187, 373, 408, 501, 589, 531, 481, 537, 640, 406, 284, 377, 396, 479, 419, 424, 137, 264, 220, 34, 182, 30, 148, 296, 44, -148, 46, -52, 27, -80, -218, -389, -423, -109, -410, -254, -295, -633, -195, -252, -393, -423, -511, -282, -531, -257, -463, -284, -327, -465, -540, -468, -286, -96, -187, -147, -183, -341, -226]
2521b26R8J8PJ19l05K46K66r7j32L37j5r7O4j73K42r1J07L4K0P9o4j93K41k78
2545B07J18J33o3P5l10P4j98L04K21m62o8k3M5J79K4j56j73M11k23n82K88R5J43
2568E9l54L01k40j51J06J28k05P2q8LJ05j53K1J43q6J28j42r7qk8J96k25L54J1
2592a50Q6l9Q8J4j12K60R4m21K53P2j78j2R4J88j5J27k81K47r5N5K43l07J23o5
2616B69K10p1k62K25n8k74K80L28l48o3m9O3R8pm6k78K90k47q1n5O7J42j35q5
2640h7J29k00J0j17M1J19j17Po0j63O5P7N0N4j56J5N0J15l6j75R5N9n7R8J61k32
2666b55R0J22j53L0J36k1r2O9J3J30k46J96J72n2M9j68K51o3Q0r3J84q6r9J57
2690C51M3j80N6K30J0Pk53O0R5k93K32j5%k19M0p5J03k24K03L8j37q5J8J6p5r
$$ y = [-226, -128, -110, -103, 16, -289, -43, 223, 126, -6, 331, 316, 219, 283, 110, 352, 261, 368, 402, 422, 501, 437, 244, 485, 207, 325, 458, 395, 470, 160, 234, 36, 340, 561, 99, 31, 8, 53, 232, 256, 100, -73, 338, 115, -467, -179, -84, 59, -295, 6, -234, -385, -279, -151, -356, -284, -372, -369, -264, -417, -396, -253, -339, -211, -353, -450, -458, -486, -290, -515, -161, -150, -64, -103, -15, -1, -113, 147, 241, -180, 73, 145, -33, -45, 49, 237, 222, 349, 68, 315, 220, 275, 518, 211, 334, 269, 479, 408, 146, 371, 313, 39, 319, 647, 299, 236, 187, 250, 348, 341, 295, 17, 307, 60, -21, -76, -9, 133, -2, -87, 42, -158, -148, -265, -224, -105, -222, -215, -275, -438, -373, -296, -246, -192, -348, -333, -283, -168, -204, -379, -284, -225, -282, -184, -23, -255, -165, -43, -196, -166, -30, -51, -143, -74, -61, 69, -177, 19, 191, 139, 188, 20, 271, 208, 288, 195, 379, 293, 194, 351, 394, 214, 270, 500, 510, 517, 264, 324, 419, 126, 358, 343, 343, 124, 164, 89, 192, -32, 171, 209, 72, -13, 5, 21, -54, -63]
2716f3k04m4O0l5J19Lr5J4m8K14l28r7J87k84K15J01r6R2k12K9K50r3o7J72k88
2741d98M03j57j5J8J23L7J55k44K64R1l36J51P1j22K51J17k72RJ3J38l69M09l54
2764a17L75j66J28N3Mk72O19n30l25L25j69O54n30L59m96r3k49P30L50n25j96
2785g1q9K04ro6M1k1j5K6j99l1K96l82R1j19K81j48j56P7K78j75l03J99j76K56
2809b11j6k14K32J50Q0k82k06L14j45pR4jOJ06J65o3J15j09o5P9k6J7O6m3J82
2834B18J26kr3j7K48j28j13J69j27q4r3J31J51k43K95l65N0Q8R7k10M6L5R5j97
2858G7J1j40J47j63J6L8L6k84K30j11P0Q0l72J84k13N5N0K50m13K32k02K88j58
2881b92J73J11j29j02L08j91k04L58j17k25J43qq5J84k87K01J01N1k63M36k25
$$ y = [-63, -267, -311, -251, -286, -167, -164, -259, -245, -293, -79, -407, -504, -317, -601, -386, -285, -381, -289, -501, -472, -222, -315, -382, -210, -498, -95, -252, -267, -249, -126, -89, 66, -178, 86, 177, -159, -8, 63, -59, 192, 309, 37, 46, 59, 197, -172, 237, -117, 258, 92, 220, 273, 277, 5, 624, 94, -231, 94, -75, 579, 49, 408, -88, -181, -430, 300, 650, 125, -71, -160, 44, 35, -31, 10, -11, -26, 0, -199, -230, 66, -316, -225, -344, -63, -211, -367, -290, -12, -187, -490, -291, -467, -211, -227, -441, -209, -59, 21, -261, -467, -153, -298, -305, -211, -212, -206, -100, 65, 2, 117, 8, -57, 22, -4, 13, 79, 36, 218, 344, 342, 249, 232, 480, 352, 239, 408, 281, 197, 104, 235, 386, 143, 438, 73, 123, 211, 308, 98, 144, 179, 274, 77, 88, -52, 95, -68, -52, -14, 22, -262, -32, -143, -73, 7, -365, -181, -394, -339, -289, -39, -452, -220, -422, -134, -292, -119, -8, -137, -239, 69, -122, -326, 32, -85, -310, -167, -175, -260, -76, -363, -162, -61, -10, -273, 163, -62]
2902f2Q8P6J09k8J11k1k26q0J49K23l34J52NK35k88L60j77L1K9j57L0J12k73K6
2926I0J84j33L2Kj36k37L62Q2j84K8J68j87Pj85J4p7J42p0k7j69J61r2k00K82
2950a43q4Q2J2J12l65O9r6r2L81n0K9q1j03J40P9k64L63j10P3No3J28K6j49N8
2975d3n3K49p8q8R9P7l3O5L9j6j87N3N4l7j49K27M62m25nj06l41M63J09n93J03
3000a54N8M66l58K48j55j5j70P9kP9j01kJ41j28k6j64q9N6J99o8k78K17K92j94
3024f9o9O8l67K87M08o88L18M6k37K50l90K73j61P8K09j29J78j74OJ76j73J15
3046d5j81J40J25Q5j42o5J8J77J26j74p2J66J2J8L76m37m2k32M42lJ65j59l59
3069f1N57J44n54K72q9K47l79n98L64L36l23L36n9k16O0J19j87m4k49L93j08J74
$$ y = [-62, 26, 102, 211, 183, 294, 273, 47, -33, 116, 339, 5, 157, 162, 397, 109, 469, 292, 323, 352, 195, 225, 337, 64, 90, 274, 141, 173, 175, 39, -198, 164, 246, 62, 90, 258, 71, 78, -107, -93, -170, -28, -98, -125, -294, -133, -225, -425, -143, -227, -145, -133, -21, -386, -317, -413, -505, -124, -174, -145, -226, -329, -189, -110, -374, -11, -121, -48, -43, -106, 22, 48, -101, -43, -96, 153, 75, -13, 86, 163, 130, 195, 234, 218, 31, 84, 138, 101, -48, 179, 641, 216, 211, 105, -236, 227, 336, -257, -154, -96, 370, 12, 260, 105, 90, -80, -1, -3, 76, -25, -27, 114, -14, -40, -204, -293, -237, -38, -106, -384, -167, 125, -69, -138, -70, -437, -150, 258, -430, -112, -66, -303, -53, -443, -170, -331, -253, -44, -173, 5, -169, -163, 13, -160, -45, -226, -86, 39, 124, -18, -83, -65, 112, 238, 64, -8, 158, 170, 188, 564, 127, 85, -147, 295, 292, 457, 298, -61, 496, 640, 86, 358, 269, 516, 137, -461, -97, 239, -84, 252, 193, -23, 37, 156, -31, -75, -324, 69, -39, 135]
3091A35k88q2L76o52O13l14o7M5L49p23N22n6k09M41m77J81J43j82j7K1M68n65
3113c38M63k34l02J10P7M78J08n93R1J51L85l91K48K12j41k12o2J73L80k24r7
3134B82M29m85L09p79J04K21J28J56K7k01l29M87r9J02n3k31Q4j88K92j85J58
3155B29n3O5m10M3K84j0j73J28j39j14O1M4l6J28p9m10K97l3J40j91J51k80K51
3178a07J45l50L3J32j9r4m5M8j02J14J45k6J19m5j64K28J04k45J33j87K21j52
3200a14J30R7j78O0L1J60j06J40k7M0j09J47n1J09l4r0j4oJ87j51k63J09J63J01
3224C31k51MK67l55K29j22J4l7Q3o3l5n2j45M4K28k86K19k07R1j4q1L2p6M2p3
3249b13j44K51N5r0r3lK53k47J5m5O9M2J8j62K14o8ll6K12k82J79j16K48K66j81
$$ y = [135, -153, -235, 141, -511, 102, -212, -279, -234, 115, -608, -86, -142, -351, 90, -387, -206, -63, -245, -262, -241, 227, -338, 125, -109, -411, -301, -224, 254, 362, -231, -140, 11, 396, 5, 253, 465, 324, 112, 50, 223, 603, 379, 282, 711, 226, 535, -244, -140, 81, 209, 365, 392, 191, -138, 349, 250, 352, 299, 68, 152, -36, 256, 71, 229, 176, 241, -169, -126, 158, 148, -25, 103, -36, -150, -89, -45, -81, 47, -32, -442, -145, -178, -38, -229, -78, -358, -107, 38, -312, -279, -147, -166, -260, -305, -257, -359, -245, -100, -126, -7, -52, -216, 12, 116, -129, 4, -183, 38, -114, 16, 113, -65, -5, 26, 186, 80, 220, 193, 233, 124, 271, 220, 329, 295, 205, 191, 185, 372, 221, -42, 67, 230, 331, 80, 84, 351, -4, 225, 103, 117, 80, 163, 100, 65, 13, -132, -88, 140, -146, 73, -134, -43, -57, -138, -106, -182, -140, -213, -357, -106, -51, -141, -234, -237, 16, -231, -216, -261, -192, -150, -132, -294, -80, -148, -151, -187, 25, -257, -78, -194, 54, 320, 139]
3274A39N2k41J36K8P8K01k36J13j21m9L6j1N5k92L38J79n1k02J12k6j08R4l8P1
3298B57L4l10J00J18p1o2J86k38J63k37K16l72J1J39k7J07j98K10k64J41q2J84
3320Ej75j04R5l15K38Q3j19m4K46k70J07K86m39L4K18N8n8J13q0J11m22J50L65
3343H3k56Q4J90p5r3k5K44L4l28K56o4L22j39j07nl6K54J07o6k46K19l59K46j14
3367A26J25R3j54Q8m9r8o9J23L11m65J27j14l7%j72P7J01j0k20J09o6K91k50K8
3391a05j51K0K04M8m68K00j02P2K58j53J3j1j51K12l05J56PJ65j72K18R1k26N6
3414a24Q8J81m37K09K5m7n5R3M2kK37j96P5j51L14N1j75q2J03K10J6r7M3j69K72
3439D24j44n1PPl4k06j13L37J09l59J26j01m4J35j3M4J10m53L01j37j8Q7j32J86
$$ y = [139, 191, -50, 86, 114, 192, 393, 157, 270, 149, 100, 136, 125, 180, -112, 226, 405, 354, 152, 264, 238, 130, 224, 186, 257, 291, -19, 81, 199, 128, 66, 252, 14, 177, -60, 156, -216, -205, -66, -93, 14, -184, 26, -238, -97, -179, 5, -170, -274, -179, -494, -256, -173, -292, -336, -90, -360, -253, 33, -406, -372, -154, -96, -154, -41, -121, -10, -432, -282, 83, -173, -89, 101, 26, -67, -92, 152, 186, -142, 114, 50, 372, 233, 126, 121, 85, 339, 446, 380, 134, 353, -6, 240, 126, 251, 344, 190, 278, 229, 131, 62, 185, 496, 31, 158, 44, 7, 7, -165, -88, 13, 3, -217, -108, -174, 117, -133, -105, -256, -236, -32, 16, -452, -252, -354, -282, -24, -177, -164, -175, -326, -114, -419, -263, -256, -91, -263, -45, 46, -180, -124, -36, 145, -292, -83, -58, -105, -160, -67, -25, -27, 210, 14, 89, -62, 252, 303, 128, 46, 149, 359, 375, 278, 321, 152, 424, 280, 229, 236, 243, 209, 3, -110, 227, 336, -23, 103, 2, -42, 93, 80, 124, 234, -219, 82, -55, -73, 14, -118, 68]
3463F8k03P4J19j05j36J08M9j57j41L86j99J05J5m32jJ71J18o3jM4L0K23j55j04
3487a87N1J20j02K57j73j95J50j67L34j67K68j63J70p0J51Q9mj24j29r6j00K05
3509A18J28j0k39J45K23k51L3O2N8j80m2L1J4R9k03K48k66O2O3r3J06k41J45K3
3533C3J63j74j28j38ljK33r5K6O1M0j68J54l23J96L1l3Q7k02J24O9O7K07l60J16
3558a8l08J32J33QK8q6J50j38MK32m15K0J44J71J23k46m3K88Q7q6J18R9m19K00
3582A78j14J55o5J8J54k32J42P4k18M6K06l28J70n8j23J27j11K41j72J25l29J57
3604D3K45k12k10J07N0j55J06k40M15k24j42K8J73j45m0n8L28j11k14O2J09P2
$$ y = [68, -135, -61, 58, -47, -183, -75, -26, -183, -324, 62, -137, -32, -17, -449, -450, -279, -161, -224, -225, -181, -151, 72, -83, -187, -136, -16, -118, 139, -34, -229, -79, -246, 88, -79, 189, 26, 196, 126, 277, 366, 362, 238, 109, 13, -87, 118, 246, 236, -3, 142, 365, 114, 147, 209, 267, 87, 45, 76, 90, 189, -14, 234, -32, 30, 93, 0, 106, -135, 10, 33, 196, 22, -106, -244, -247, -248, -15, -110, -84, -23, 17, -151, 3, -320, -124, -93, -126, -39, -241, -117, -48, 19, 226, -134, -18, -326, -194, -61, -53, -25, -111, 39, -99, -95, 137, -278, -258, -114, 57, 180, -66, -109, 179, 266, 180, 298, 397, -22, 178, 64, 219, 154, 172, 326, 94, 236, 310, 92, 138, 344, 16, 186, 128, 5, 132, 21, 262, 90, 215, -114, 43, 288, 76, -134, -27, 23, -132, -26, -266, 149, -75, -217, -189, -16, -161, -201, -259, 69, -42, -256, -194, -85, -13]
$$ [...]
8191F
##END NTUPLES=NMR FID
##END=
