##TITLE=1H_LR-731-C1B
 CDCl3, 8 sc, 
 17.12.2020
##JCAMPDX= 6.0         $$ Bruker NMR JCAMP-DX V2.0
##DATA TYPE= NMR FID
##DATA CLASS= NTUPLES
##ORIGIN= UXNMR, Bruker Analytische Messtechnik GmbH
##OWNER= root
$$ XWIN-NMR		Version 3.5
$$ Thu Dec 17 10:07:26 2020 Russian Standard Time (UT+4h)  she@DPX200
##.OBSERVE FREQUENCY= 200.1315066352
##.OBSERVE NUCLEUS= ^1H
##.DELAY= (6, 6)
##.ACQUISITION MODE= SIMULTANEOUS
##.ACQUISITION SCHEME= undefined
##.AVERAGES= 8
##.DIGITISER RES= 18
##SPECTROMETER/DATA SYSTEM= spect
##.PULSE SEQUENCE= zg30
##.SOLVENT NAME= CDCl3
##.SHIFT REFERENCE= (INTERNAL, CDCl3, 0, 15.7039)
##AUDIT TRAIL= $$ (NUMBER, WHEN, WHO, WHERE, WHAT)
$$ ##TITLE= Audit trail, XWIN-NMR		Version 3.5
$$ ##JCAMPDX= 5.01
$$ ##ORIGIN= Bruker BioSpin GmbH
$$ ##OWNER= she
$$ F:/spectra/data/she/nmr/H-F/1/audita.txt
$$ ##AUDIT TRAIL=  $$ (NUMBER, WHEN, WHO, WHERE, WHAT)
(   1,<2020-12-17 10:06:08.21 +0400>,<she>,<DPX200>,
      <created by zg, POWCHK disabled, PULCHK disabled
       configuration hash MD5:
       00 E9 B6 7A A2 85 ED C7 34 08 36 98 17 FE 4E 26
       data hash MD5: 16K
       94 BE 99 D8 5A 86 34 BF EB 21 EE DD 27 F7 51 E4>)
$$ ##END=
$$ 
$$ hash MD5
$$ 88 A1 0A C5 C8 2D 9A B8 50 75 71 9E 00 99 88 2E
##$RELAX= 
##$RELAX= 
##$RELAX= 
##$RELAX= 
##$RELAX= 
##$RELAX= 
$$ Bruker specific parameters
$$ --------------------------
##$DU= <F:/spectra>
##$EXPNO= 1
##$NAME= <H-F>
##$PROCNO= 1
##$TYPE= <nmr>
##$USER= <she>
##$AMP= (0..31)
100 100 100 100 100 100 100 100 100 100 100 100 100 100 100 100 100 100 
100 100 100 100 100 100 100 100 100 100 100 100 100 100 
##$AQSEQ= 0
##$AQ_mod= 1
##$AUNM= <au_zg>
##$AUTOPOS= <>
##$BF1= 200.13
##$BF2= 200.13
##$BF3= 200.13
##$BF4= 200.13
##$BF5= 200.13
##$BF6= 200.13
##$BF7= 200.13
##$BF8= 200.13
##$BYTORDA= 1
##$CFDGTYP= 0
##$CFRGTYP= 5
##$CHEMSTR= <none>
##$CNST= (0..31)
1 1 145 1 1 1 1 1 1 1 1 1 1 1 1 1 1 1 1 1 1 1 1 1 1 1 1 1 1 1 1 1 
##$CPDPRG= <>
##$CPDPRG1= <>
##$CPDPRG2= <>
##$CPDPRG3= <>
##$CPDPRG4= <mlev>
##$CPDPRG5= <mlev>
##$CPDPRG6= <mlev>
##$CPDPRG7= <mlev>
##$CPDPRG8= <mlev>
##$CPDPRGB= <>
##$CPDPRGT= <>
##$D= (0..31)
0 1.2 0 0 0 0 0 0 0 0.06 0 0.03 0 0 0 0 0.0002 0 0 0 0 0 0 0 0 0 0 0 0 
0 0 0 
##$DATE= 1608185167
##$DBL= (0..7)
120 120 120 120 120 120 120 120 
##$DBP= (0..7)
150 150 150 150 150 150 150 150 
##$DBP07= 0
##$DBPNAM0= <>
##$DBPNAM1= <>
##$DBPNAM2= <>
##$DBPNAM3= <>
##$DBPNAM4= <>
##$DBPNAM5= <>
##$DBPNAM6= <>
##$DBPNAM7= <>
##$DBPOAL= (0..7)
0.5 0.5 0.5 0.5 0.5 0.5 0.5 0.5 
##$DBPOFFS= (0..7)
0 0 0 0 0 0 0 0 
##$DE= 6
##$DECBNUC= <off>
##$DECIM= 32
##$DECNUC= <off>
##$DECSTAT= 4
##$DIGMOD= 1
##$DIGTYP= 9
##$DL= (0..7)
0 120 120 120 120 120 120 120 
##$DP= (0..7)
150 150 150 150 150 150 150 150 
##$DP07= 0
##$DPNAME0= <>
##$DPNAME1= <>
##$DPNAME2= <>
##$DPNAME3= <>
##$DPNAME4= <>
##$DPNAME5= <>
##$DPNAME6= <>
##$DPNAME7= <>
##$DPOAL= (0..7)
0.5 0.5 0.5 0.5 0.5 0.5 0.5 0.5 
##$DPOFFS= (0..7)
0 0 0 0 0 0 0 0 
##$DQDMODE= 0
##$DR= 18
##$DS= 0
##$DSLIST= <SSSSSSSSSSSSSSS>
$$ [...]
##$SUBNAM2= <"">
##$SUBNAM3= <"">
##$SUBNAM4= <"">
##$SUBNAM5= <"">
##$SUBNAM6= <"">
##$SUBNAM7= <"">
##$SUBNAM8= <"">
##$SUBNAM9= <"">
##$SW= 16.9725356469052
##$SWIBOX= (0..15)
0 0 2 0 0 0 0 0 0 0 0 0 0 0 0 0 
##$SW_h= 3396.73913043478
##$TD= 16384
##$TD0= 1
##$TE= 0
##$TE2= 300
##$TE3= 300
##$TEG= 300
##$TL= (0..7)
0 120 120 120 120 120 120 120 
##$TP= (0..7)
150 150 150 150 150 150 150 150 
##$TP07= 0
##$TPNAME0= <>
##$TPNAME1= <>
##$TPNAME2= <>
##$TPNAME3= <>
##$TPNAME4= <>
##$TPNAME5= <>
##$TPNAME6= <>
##$TPNAME7= <>
##$TPOAL= (0..7)
0.5 0.5 0.5 0.5 0.5 0.5 0.5 0.5 
##$TPOFFS= (0..7)
0 0 0 0 0 0 0 0 
##$TUNHIN= 0
##$TUNHOUT= 0
##$TUNXOUT= 0
##$USERA1= <user>
##$USERA2= <user>
##$USERA3= <user>
##$USERA4= <user>
##$USERA5= <user>
##$V9= 5
##$VALIST= <valist>
##$VCLIST= <CCCCCCCCCCCCCCC>
##$VD= 0
##$VDLIST= <DDDDDDDDDDDDDDD>
##$VPLIST= <PPPPPPPPPPPPPPP>
##$VTLIST= <TTTTTTTTTTTTTTT>
##$WBST= 1024
##$WBSW= 4
##$XGAIN= (0..3)
0 0 0 0 
##$XL= 0
##$YL= 0
##$YMAX_a= 473801
##$YMIN_a= -485196
##$ZGOPTNS= <>
##$ZL1= 120
##$ZL2= 120
##$ZL3= 120
##$ZL4= 120
##$ABSF1= 10
##$ABSF2= 0
##$ABSG= 5
##$ABSL= 3
##$ALPHA= 0
##$AQORDER= 0
##$ASSFAC= 0
##$ASSFACI= 0
##$ASSFACX= 0
##$ASSWID= 0
##$AUNMP= <proc_1d>
##$AZFE= 0.1
##$AZFW= 0.1
##$BCFW= 1
##$BC_mod= 2
##$BYTORDP= 1
##$COROFFS= 0
##$CY= 11.3945322036743
##$DATMOD= 1
##$DC= 2
##$DFILT= <>
##$DTYPP= 0
##$F1P= 15.9154993809931
##$F2P= -4.1035820241983
##$FCOR= 0.5
##$FTSIZE= 0
##$FT_mod= 4
##$GAMMA= 1
##$GB= 0.15
##$INTBC= 1
##$INTSCL= 1
##$ISEN= 128
##$LB= 0.24
##$LEV0= 0
##$LPBIN= 0
##$MAXI= 10000
##$MC2= 0
##$MEAN= 0
##$ME_mod= 0
##$MI= 1.114404
##$NCOEF= 0
##$NC_proc= 0
##$NLEV= 6
##$NOISF1= 3.799351
##$NOISF2= 2.8
##$NSP= 1
##$NTH_PI= 0
##$NZP= 0
##$OFFSET= 15.70392
##$PC= 1
##$PHC0= -10764.08
##$PHC1= 16.40094
##$PH_mod= 1
##$PKNL= yes
##$PPARMOD= 0
##$PSCAL= 0
##$PSIGN= 0
##$REVERSE= no
##$SF= 200.130013532006
##$SI= 16384
##$SIGF1= 3
##$SIGF2= 2
##$SINO= 400
##$SIOLD= 16384
##$SREGLST= <1H.CDCl3>
##$SSB= 0
##$STSI= 0
##$STSR= 0
##$SW_p= 3612.71676300578
##$SYMM= 0
##$S_DEV= 0
##$TDeff= 0
##$TDoff= 0
##$TI= <>
##$TILT= no
##$TM1= 0
##$TM2= 0
##$TOPLEV= 0
##$USERP1= <user>
##$USERP2= <user>
##$USERP3= <user>
##$USERP4= <user>
##$USERP5= <user>
##$WDW= 1
##$XDIM= 8192
##$YMAX_p= 0
##$YMIN_p= 0
$$ End of Bruker specific parameters
$$ ---------------------------------
##NTUPLES= NMR FID
##VAR_NAME=  TIME,          FID/REAL,        FID/IMAG
##SYMBOL=    X,             R,               I
##VAR_TYPE=  INDEPENDENT,   DEPENDENT,       DEPENDENT
##VAR_FORM=  AFFN,          ASDF,            ASDF
##VAR_DIM=   8192,          8192,            8192
##UNITS=     SECONDS,       ARBITRARY UNITS, ARBITRARY UNITS
##FACTOR=    0.0002944,     1,               1
##FIRST=     0,             0,               0
##LAST=      2.4114304,     0,               0
##MIN=       0,             -485196,         0
##MAX=       2.4114304,     473801,          0
$$ Real data points
##PAGE= N=1
##DATA TABLE= (X++(R..R)), XYDATA
0 0 0 0 0 0 0 0 0 8 -8 8 -8 8 -16 16 -24 24 -32 40 -48 56 -72 80 -96 112 -133 154 -179 205 -237 272 -309
31 -309 351 -399 452 -511 571 -639 715 -799 890 -990 1097 -1216 1344 -1487 1640 -1808 1992
48 1992 -2194 2416 -2662 2934 -3236 3573 -3950 4378 -4871 5440 -6101 6894 -7853 9044
62 9044 -10565 12581 -15388 19553 -26348 39221 -71635 309065 375538 -485196 313976 235691
74 235691 -368030 276751 240993 -271378 257004 205831 -183935 126573 149665 -56307 131559
85 131559 108244 27244 60408 24741 77337 45423 12888 174330 -7073 -65735 208663
96 208663 -33059 -112065 262230 -21746 -140930 262005 -56528 -195857 274448 -28285
106 -28285 -190080 256625 -50495 -205789 220156 -49087 -169906 181885 -45714 -132974
116 -132974 106560 -61817 -90878 57202 -36478 -41699 -12839 -48559 -10064 -56519 -37489
127 -37489 35528 -86475 -47133 53441 -114473 -50921 79213 -118930 -49004 94491 -125709
138 -125709 -67642 89946 -104439 -52186 87662 -98846 -60227 77168 -78993 -54179 63153
149 63153 -54644 -36650 38529 -49279 -26478 20064 -20306 -3457 -6012 -7682 3195 -28801
161 -28801 13372 17028 -38250 28018 18327 -48752 32251 20287 -43553 40130 23833 -39396
173 -39396 31294 16634 -29560 31607 20247 -16941 23025 12244 -6362 16941 7361 7561 15978
186 15978 4308 13067 6220 -2226 24662 9874 -6572 29013 6379 -13027 34508 3945 -14899
199 -14899 43908 1061 -18248 44913 -5997 -14348 47738 -10310 -6832 44588 -17960 -1243
211 -1243 38635 -18747 9734 30562 -22520 16894 21504 -23991 23551 14698 -20721 28340 4219
224 4219 -21443 30603 -1029 -17467 30810 -7108 -13867 28633 -14570 -10963 29113 -18365 -7241
237 -7241 25092 -26671 -2747 24054 -33362 3452 21506 -40470 8717 14824 -45564 17014
249 17014 9640 -48221 22291 1885 -48360 25255 -5728 -44030 28078 -11775 -40305 25105
261 25105 -16606 -31749 21736 -19458 -22954 16488 -21935 -15742 10960 -21349 -6448 6405
273 6405 -22280 902 2929 -22720 7410 1676 -22035 13321 -206 -23709 19012 32 -23373
286 -23373 23900 195 -22306 27022 -1078 -20728 29646 278 -17698 28274 699 -13434
298 -13434 25674 2003 -8553 21989 4106 -4849 15519 6497 -281 10472 8507 1977 5739
311 5739 9762 4007 2200 10502 5698 -262 7719 6351 -750 5032 7918 -1157 445 9505 -1068
326 -1068 -5147 11592 571 -9959 12516 820 -15212 13120 2571 -18750 12672 4446 -21893
339 -21893 10885 5986 -23418 10252 8191 -24605 8012 9166 -24506 7118 9495 -23368 7164
352 7164 8154 -22337 7524 5697 -17924 8340 1709 -12958 8697 -3853 -7253 8694 -7504
365 -7504 370 7354 -12582 6851 6316 -16105 12349 5401 -17616 16135 2968 -19452 19426
378 19426 2835 -19510 20002 2224 -19289 18982 1528 -18471 18754 2156 -17647 16493
390 16493 1029 -15918 15134 561 -13284 12216 -2163 -10537 9257 -3936 -5510 6298
402 6298 -6779 -1740 2663 -8871 2962 -493 -9917 6808 -3668 -11373 8975 -5166 -10440
415 -10440 10160 -6436 -9771 10112 -6530 -9157 10097 -4672 -8052 8870 -3969 -8173 9019
428 9019 -1764 -7838 8958 143 -7989 8951 1389 -6248 9090 1697 -4873 8454 1493 -1917
442 -1917 7893 965 1066 6421 266 3514 5308 86 6047 4521 -461 6959 3552 -864 7400
457 7400 3360 -1139 7307 2866 -2800 7490 3685 -4913 7033 3769 -6476 6449 3047 -7924
471 -7924 6724 2515 -8958 5846 391 -8446 4912 -1703 -6737 3863 -4200 -5400 1949 -5188
485 -5188 -3083 -499 -6379 -1421 -2390 -6539 -668 -3573 -5976 162 -4203 -5895 689 -3494 -5611
500 -5611 338 -2668 -5291 683 -1309 -5630 1032 282 -4984 1583 982 -4847 2226 1758 -3866 3088
516 3088 1681 -2378 3164 1538 -878 3279 1628 1025 2351 1930 2595 1179 2571 3630 639 2979
532 2979 2989 775 3359 1958 1300 2782 1316 2883 835 403 3809 -754 -122 4666 -2412 4
548 4 4925 -4219 78 4570 -5290 336 4152 -6314 591 2774 -6159 885 1520 -5398 547 305
564 305 -4538 238 -396 -3619 230 -836 -2902 -321 -1143 -2636 350 -1583 -1771 833 -2240 -1393
580 -1393 1845 -3149 712 2010 -3944 2269 2528 -3536 3011 2844 -3769 3985 2205 -2534 3626 2015
596 2015 -1197 4184 1232 -190 3397 1105 805 2687 1262 2023 1362 1202 1982 386 1404 2135 -222
613 -222 1708 1237 -77 729 640 140 -235 550 43 -1526 -48 -336 -2197 1 -850 -2139 -615 -1862
631 -1862 -2211 -1263 -1984 -1527 -2259 -2449 -1336 -2883 -2055 -968 -3441 -1475 -1280 -4101 -696 -1148 -3755
648 -3755 325 -1587 -3571 1028 -2435 -2345 1676 -2384 -796 1328 -1867 822 1049 -957 2005 295
664 295 -95 2555 65 981 2786 557 1729 2962 795 2142 2962 1400 2418 2905 1770 2257 2718
681 2718 1754 2241 2441 1943 1784 1884 1980 1561 1731 1630 1128 1224 1028 995 382 937 814 -513 756 506
701 506 -1614 736 -592 -1978 735 -1521 -1978 403 -2479 -1298 18 -3449 -971 -793 -4122 -312
717 -312 -1592 -3800 205 -2287 -3401 562 -2862 -2890 837 -2946 -1626 1104 -3221 -772 979 -3062
733 -3062 -153 1234 -2446 616 1292 -1887 1271 1444 -1330 1390 1473 -501 1766 1601 23 2499
749 2499 1453 48 2873 969 590 3094 915 562 2995 80 922 2920 -111 1194 2506 -246
765 -246 1027 2390 -617 658 1923 -1083 382 1239 -1162 -392 767 -1189 -689 156 -1417 -1121 -38
782 -38 -1784 -1521 -410 -1865 -1135 -649 -2335 -924 -717 -2624 -798 -1128 -2504 -320 -886 -2309 7
799 7 -809 -2044 220 -630 -1631 646 -632 -1318 743 -424 -1115 1660 -62 -772 2068 -129 -462
816 -462 3166 -312 178 3661 -726 589 4128 -1083 1799 4292 -1484 2744 3753 -1939 3184 3251
832 3251 -2121 3709 2313 -1635 4128 803 -1433 4125 -71 -819 3313 -1076 -345 2532 -1572 -289
848 -289 2039 -2202 -450 1029 -2286 -784 449 -2239 -792 -106 -2499 -840 -528 -2660 -790 -419
864 -419 -3184 -891 -831 -2830 -745 -1101 -2912 -293 -879 -2605 -275 -938 -2377 -180 -868 -1664 34
881 34 -615 -848 28 -56 -315 111 610 -298 558 888 -168 981 1600 -15 1497 1458 250 1985 1132
900 1132 218 2633 1135 615 3049 442 826 2801 8 1077 3292 -466 857 2550 -745 1206
916 1206 2589 -1689 1186 2197 -1996 1221 1670 -2457 1020 1171 -3089 745 764 -3552 944 271
932 271 -3338 1081 -831 -3255 1635 -1557 -3378 1756 -2146 -2949 1383 -2907 -2035 1288 -3370 -1106
948 -1106 1207 -3212 -485 926 -3227 546 704 -2654 970 962 -2596 1459 861 -1774 1758 1034 -1530
965 -1530 1772 825 -857 2038 1166 -540 1973 1177 19 2444 1129 428 2507 434 336 2473 474
982 474 676 2356 -264 737 1983 -469 794 1328 -330 657 1161 -630 186 1203 -1172 45 1090
999 1090 -1145 -566 1002 -1610 -722 965 -2483 -459 766 -2632 -1060 603 -3188 -286 -47 -3575
1015 -3575 -1064 -448 -3210 749 -1230 -3007 1028 -1814 -2322 461 -1826 -1725 1267 -1590 -1372 1632
1031 1632 -1758 -417 2175 -1506 -13 2123 -1488 210 2659 -1480 341 3085 -1271 576 2511
1046 2511 -1181 1048 3705 -1144 2100 2660 -922 2694 2319 -743 2641 2230 -127 1822 831 449
1062 449 2557 531 142 1633 1307 621 821 495 941 1283 105 222 -256 -830 90 497 -1594 -518
1080 -518 878 -2167 -189 1159 -1819 -2225 -130 -1945 -1496 527 -2568 -2338 654 -2372 -1691 -69
1096 -69 -2401 -196 1063 -2972 -235 -570 -1378 -228 -558 -1280 47 -390 -2274 392 536 -744 1359
1113 1359 148 -1690 2199 121 -845 2657 -947 -322 2821 -1500 94 3109 -1168 1034 3097
1128 3097 476 522 3324 -1337 1962 3649 58 1833 2055 -2032 2992 1317 -2341 869 542 -1107
1144 -1107 2208 -481 -2048 1933 -53 -1153 1880 -1434 -775 2198 -614 -688 449 -1733 -634 1500
1160 1500 -1834 -85 420 -3049 -2450 -35 -2473 -388 157 -2501 987 95 -1172 328 -305 -1329
1176 -1329 161 -569 -1698 268 186 178 657 -337 -868 -120 126 365 962 193 360 1465 677 1172 1252 -11
1196 -11 1058 1327 1193 741 1632 1422 627 2225 872 218 1697 361 395 1987 1474 13 2083 243
1214 243 40 1060 969 28 1343 46 -810 951 -1016 486 496 -1665 -915 1541 -1780 400 819
1231 819 -1389 -1543 -234 -927 -1408 -642 -2190 759 -48 -1538 -93 -1385 -2083 356 -1195 -1670 274
1248 274 -853 -1057 632 -1110 -219 320 -900 -507 1312 -1150 384 762 -864 2 1192 -397 329
1265 329 1425 50 653 932 -376 1083 1122 630 1733 992 954 2079 1055 622 1698 1064 340 1019
1283 1019 784 561 1208 294 539 1603 475 431 1089 341 355 308 -187 306 -318 -371 -108 681 -370 -551
1303 -551 335 -771 -235 793 -1014 -282 50 -1014 -1101 192 -1209 -567 -447 -1664 -677 -845 -1520 -534
1321 -534 -340 -1188 -280 -380 -1427 -509 -532 -587 -220 -452 -967 434 -20 -717 547 -201 -482 905 294
1340 294 -31 1112 -118 429 1349 -48 616 1037 -83 812 1398 90 1126 921 268 1261 1053 -19
1358 -19 1374 840 286 1096 818 429 903 550 -6 500 52 276 511 133 -59 278 -290 -107 -96 -556
1378 -556 -734 -255 -858 -627 -160 -749 -589 -479 -840 -836 -768 -1392 -612 -766 -800 -851 -760 -566 -375 -927 -584 -997
1400 -997 -537 -966 -1075 -205 264 -669 -334 -1266 39 761 -460 -65 390 -186 142 560 68 251 1070
1419 1070 162 908 828 115 1235 1033 382 1417 598 554 1373 437 623 1248 521 626 1172 238 532 1008
1439 1008 60 552 805 30 375 544 -221 284 588 -561 18 24 -718 -69 -390 -993 -182 -470 -1046 -424
1459 -424 -846 -1122 -267 -961 -801 -659 -1307 -741 -585 -1291 -636 -672 -1498 -418 -572 -955 -420 -1004 -729 -386
1479 -386 -523 -553 -382 -379 -30 -225 32 126 -16 198 418 24 526 481 75 553 934 588 982 486 539 954
1501 954 846 1021 929 473 535 787 684 679 857 545 738 508 463 676 776 387 433 611 -37 130 138 -282 51
1524 51 60 -506 94 -326 -575 86 -333 -997 -333 -790 -656 -287 -1059 -686 -491 -838 -744 -761 -725 -549 -593 -1026
1546 -1026 -699 -898 -551 -619 -477 -603 -264 -571 -88 -272 -240 -119 46 -62 278 321 17 215 315 236 333
1567 333 302 229 746 624 310 773 808 731 851 473 1014 1019 579 972 647 517 883 449 496 1150 152 96 899
1590 899 -98 426 588 -401 179 426 -387 476 158 -221 156 -284 -446 -106 -413 -452 -146 -822 -488 -516 -649
1611 -649 -611 -616 -942 -716 -521 -1018 -587 -471 -861 -424 -260 -872 -544 -302 -544 -382 -414 -512 -161 -67 -372 21
1633 21 -21 -93 219 61 -68 586 315 450 254 246 471 279 257 786 645 638 889 518 548 933 739 444 735
1656 735 552 698 490 801 816 430 483 405 124 625 169 268 473 164 140 433 198 297 -230 -436 -207 -269
1678 -269 -401 -661 -74 -504 -545 -211 -548 -273 -479 -1114 -807 -580 -1211 -574 -679 -952 -604 -793 -775 -491 -515
1699 -515 -972 -49 -512 -562 44 -565 -330 113 -359 -186 74 -153 139 324 26 -209 513 89 512 340
1719 340 592 438 566 233 557 497 942 565 521 546 947 1057 419 1207 195 446 622 446 542 465 -197
1740 -197 551 196 478 -70 252 -655 -119 -246 -562 -601 -417 -274 -327 -24 -185 -48 -477 -296 -712 -358 -662
1761 -662 -751 -563 -471 -802 -534 -600 -616 -508 -823 -393 -197 -647 -329 -93 -591 -311 -194 -409 -177 -112 -414 32
1783 32 -59 -360 -74 -28 -193 446 81 272 821 168 465 610 614 433 539 362 477 960 635 403 820 247
1805 247 509 982 360 646 727 136 517 486 281 439 393 68 331 82 -192 499 89 -90 298 -74 -457
1826 -457 153 -434 -338 -86 -310 -306 -741 -532 -466 -467 -593 -725 -1030 -809 -493 -567 -743 -565 -829 -586 -521 -407 -479
1849 -479 -496 -547 -332 -446 -255 -143 -67 -151 -293 -226 51 -317 -72 193 206 235 229 228 181 641 287 582 729 466
1873 466 516 692 466 906 847 443 640 846 452 989 552 382 607 329 422 613 133 440 497 84 473
1894 473 560 41 68 539 -114 246 -16 -515 -111 -9 -578 -132 -271 -680 -351 -644 -780 -174 -623 -364 -8
1915 -8 -564 -714 -348 -674 -430 -664 -707 -532 -505 -684 -506 -264 -880 26 -32 -544 -140 -129 -608 79 266 116
1937 116 28 105 -4 219 360 214 324 316 44 546 1023 212 375 -18 758 342 221 84 837 345 308 200
1959 200 537 280 644 601 -77 558 360 545 498 341 5 123 -117 -478 -71 736 -1077 296 -46 -1441
1979 -1441 -891 -516 -292 -412 -300 -369 -463 -1235 -375 -1062 -1178 -564 -54 9 -709 35 -253 -198 -312 -755 -127
2000 -127 -418 -944 246 -29 -842 275 -785 -432 156 -636 -241 102 -693 89 254 -55 599 475 577
2019 577 186 774 386 624 354 863 909 602 597 400 511 312 1023 213 650 298 607 187 456 -390 411
2040 411 356 192 -184 158 285 127 -225 -817 329 -418 -231 -181 11 -308 -568 -647 -115 -273 -596 -256 -241
2061 -241 -216 -482 -544 -549 -748 -502 -545 -1065 -511 -89 48 64 -482 -273 -127 380 299 -1226 -522 -62 -463 -221
2083 -221 -881 231 624 -898 431 -29 508 303 380 10 221 1102 398 324 434 150 211 581 265 -377
2103 -377 -142 860 793 204 349 343 442 836 428 835 766 513 213 685 -175 499 223 299 103 386 -18 -40
2125 -40 477 249 -331 -20 -439 -566 -173 -464 -378 -527 -318 -593 -582 -419 -395 -374 -511 -259 -438 -400 -454 -517 -498
2148 -498 -415 -111 -526 -237 -139 -77 -415 -212 82 74 -55 -334 -700 98 265 -468 86 284 -22 332 520 102
2170 102 -79 392 85 804 536 149 215 925 446 550 1083 467 543 731 432 217 804 1061 394 -99 550
2191 550 722 -62 -261 804 115 128 337 -12 -197 -422 -129 1025 -739 121 -732 367 -932 -943 -1145
2210 -1145 -763 -736 -1086 -612 -204 521 -618 -644 -500 -117 -758 -2072 -201 -587 27 -162 -1138 -346 -664
2229 -664 -38 -275 -324 -593 833 -243 -212 -164 -421 370 -11 313 114 114 -218 -75 9 -167 784 1474 910
2250 910 567 839 1354 116 730 -83 998 220 488 204 926 494 -378 291 376 19 1103 -453 542
2269 542 60 -25 70 238 -269 113 -121 -375 -34 -441 -83 -6 -759 -270 -802 -651 -254 -603 -443 -568 -1155
2290 -1155 -1139 -567 -1806 -740 427 -182 4 -533 -539 -225 -626 52 -768 17 -17 -143 -236 142 -254 -476
2310 -476 -187 217 261 574 839 974 390 526 575 90 402 356 316 778 586 456 200 462 111 544 482 338
2332 338 755 414 672 658 796 573 346 236 274 3 -379 228 41 9 -87 163 185 -139 -177 -254 44 -39 -88
2355 -88 252 -303 -443 99 -526 -479 -570 -367 -285 -646 -619 -765 -405 -648 -527 -374 -227 -441 -624 -487 -524 -263
2377 -263 -265 181 -236 427 137 205 181 -214 312 -422 168 409 6 146 334 418 -48 369 408 376 135 408
2399 408 383 226 270 661 435 250 225 631 416 578 235 469 26 305 443 183 183 266 -37 212 351 104
2421 104 210 126 21 -199 -51 -308 146 59 -324 -301 -358 -263 -323 -62 -291 -331 -506 -299 -338 -440 -352 -618 -302
2444 -302 -351 -185 -624 -373 35 -189 -61 -79 -262 -179 -190 -174 -88 -65 -125 317 -226 290 441 144 468 115 329
2467 329 419 128 492 342 374 385 110 292 236 184 474 600 495 631 489 472 386 253 345 190 470 208 250
2490 250 -125 66 37 430 2 34 82 36 275 -180 -173 13 -46 -94 -136 -353 -259 -238 -546 -461 -438 -579 -548 -390 -506
2515 -506 -265 -392 -342 -424 -500 -238 -208 -153 65 -265 -150 -468 -421 -323 -224 -257 -449 -100 -204 -280 368 -207 168
2538 168 142 96 156 59 283 261 -35 719 181 270 283 169 533 291 422 470 490 299 703 95 35 80 364 281
2562 281 265 -113 -265 345 329 -433 123 -51 262 -61 -107 232 687 476 -24 -223 -75 -85 -119 -602 -61 -368
2584 -368 -642 -325 -294 -292 -112 -409 -365 -285 -451 -376 -68 -165 -613 -363 -93 -150 -350 -161 -261 -272 -242 -232 197 215
2608 215 108 -151 -67 348 628 137 -165 223 314 686 237 288 385 92 298 478 482 233 394 602 262 350
2630 350 906 260 -11 101 108 567 225 247 35 -1 -328 416 171 449 210 -330 66 -25 -293 -180 -341 -150
2652 -150 -311 -202 -158 -12 -61 101 -152 -380 -649 -510 -440 -540 164 -438 -733 -440 -467 -354 -138 -531 -252
2673 -252 -136 -316 -177 -151 -278 -178 -351 -159 -145 183 -4 -164 95 343 -70 405 188 -71 -79 61 288
2694 288 306 466 165 116 293 281 324 211 411 467 297 222 723 148 142 332 13 20 60 282 164 215 -72 199
2718 199 96 19 -14 40 -258 -260 -150 -294 -147 -211 -203 -93 -221 -69 -214 -431 -446 -237 -253 -93 -192 -540 -532 -203
2742 -203 -430 -495 -186 -294 -304 -390 -363 -193 -458 -191 -177 -33 -81 -144 203 83 -97 -108 41 159 52 221 8
2765 8 378 241 165 254 101 65 236 192 458 255 175 611 172 544 125 201 368 159 21 -32 327 279 64
2788 64 12 384 5 -67 163 -6 165 72 -20 -18 -173 -376 -152 -130 -75 -111 -266 -231 -131 -88 -89 -86 -249 -60 -348
2813 -348 -239 -390 -431 -396 -574 -177 -355 -109 -240 -364 -275 -148 18 -213 -167 -192 -329 -165 -170 -125 -151 55 126
2836 126 93 -104 102 166 245 4 316 542 380 364 278 416 247 508 195 205 129 326 -47 385 246 97
2858 97 334 276 110 255 219 79 209 198 178 0 94 191 -135 78 -58 71 -206 -69 -274 -258 61 -321 -229
2881 -229 -317 -454 -88 -45 -369 -201 -235 -178 -375 -402 -249 -161 -177 -290 -95 -52 87 -125 -246 -411 -131 -269 -94
2904 -94 51 -69 -37 67 -166 -325 16 -95 61 126 270 216 260 160 512 247 69 329 292 542 96 177
2926 177 219 336 104 32 194 469 243 97 46 -62 171 126 216 -85 121 -51 2 -51 -40 -177 8 44 -225
2949 -225 -119 -144 -31 -134 75 -259 -337 -159 -289 -53 -375 -329 -214 -5 -243 -176 -348 -114 -209 -184 -355 -114
2971 -114 -211 -318 -51 -218 -469 -331 0 104 -224 -12 -12 292 18 102 190 76 27 45 15 159 177 209 67
2994 67 248 501 275 241 398 72 495 333 106 387 138 269 -6 -21 233 415 124 460 71 -117 -54
3015 -54 558 40 -73 364 345 364 -250 197 -125 -249 -330 -108 385 337 170 -631 558 108 37 -137 -263 -206
3037 -206 302 -405 -364 315 -684 -1103 298 44 -1386 -648 341 268 -143 188 492 -98 -200 -152 660 646 226
3058 226 -523 -492 -200 -592 -60 962 814 666 -664 1460 -602 219 535 389 -51 -154 122 -365 -19
3077 -19 196 1135 241 475 745 -246 510 512 -600 188 1010 527 683 133 -424 725 45 823 -99 297
3097 297 575 -763 -539 208 961 -275 680 -895 -515 -561 -50 -326 -37 68 807 -177 301 67 178
3116 178 292 -946 861 414 -542 -571 -990 -12 -474 442 -46 296 414 284 -250 345 -450 -447 -89 150
3136 150 154 -364 -398 1803 269 -67 386 290 1126 -298 887 539 239 -210 -1164 193 593 103 -178 111
3156 111 313 131 -410 338 576 -751 338 -257 -377 -597 352 788 -577 -686 548 35 -95 -660 -706
3175 -706 -1113 201 265 -581 450 -198 864 684 -508 -696 16 -363 281 -716 947 -1506 -229 638
3193 638 -992 -867 90 672 -849 40 -421 542 328 -92 635 -696 -756 830 1529 -580 -25 -566 264
3212 264 656 269 1034 287 283 -370 986 665 794 683 628 136 -376 359 1208 -719 758 1567 542 -1120
3232 -1120 -79 1386 -363 1124 392 400 777 -338 -127 351 583 540 103 441 -41 -1158 -434 81 285
3251 285 930 -1151 1109 -347 -116 -279 542 222 409 128 301 -88 -930 -72 117 298 -429 -441 -323
3270 -323 -426 -486 -597 -98 433 -990 -75 -269 -290 27 -491 -555 -498 486 -207 -397 -63 -530 354 23 204
3291 204 552 -475 786 397 -258 3 -284 250 850 227 179 596 -110 247 914 -155 129 69 -78 199
3311 199 -116 75 -463 34 115 110 -63 771 -343 590 212 -426 -258 -50 74 214 -34 -546 -503 -257 -8
3332 -8 -338 -68 -761 -104 -256 -108 -504 -489 -136 -42 244 124 -380 -23 -103 -171 -233 -207 -58 36 -440 -12 -63
3355 -63 261 93 -265 -257 571 -175 507 -267 -46 -59 320 61 449 610 -93 281 391 -48 -138 352 290 404
3377 404 210 -23 36 -162 152 39 85 460 162 -53 568 127 -2 343 -448 1014 103 -102 -135 289 429
3398 429 2 93 -304 197 -176 258 191 62 -35 72 -450 -36 -158 -447 -244 -302 -550 -555 -230 162 -84 -99
3420 -99 -134 50 203 -91 73 -210 -36 -97 36 -12 288 273 323 -202 -109 113 208 323 323 -61 126 345 391 329
3444 329 -101 123 -453 -112 495 -61 733 309 205 290 246 918 -181 -215 180 316 45 863 -1061 -319
3464 -319 -173 519 -21 224 -498 -134 587 -651 -431 199 -162 294 92 -32 -351 -764 -226 -701 -391 -573
3484 -573 -230 -211 126 -150 -679 -148 -60 -506 -261 -293 -554 -104 -145 -245 -151 -253 449 143 -256 16 -272 -221
3506 -221 421 -138 -114 -67 -98 676 -343 282 8 -62 348 -458 313 150 368 10 251 381 386 -575 364 -47
3528 -47 -666 309 246 199 -566 263 214 -346 -96 783 307 582 11 -341 -428 -114 298 -344 363 -328 -521 -116
3550 -116 -301 12 275 24 -458 -213 -10 74 -94 -46 136 -45 -506 -283 -1 182 -6 -447 -23 -110 -776
3571 -776 -186 -130 -33 -3 -266 -84 153 159 -61 -60 -91 -254 -52 86 76 85 1 65 76 39 296 281 250 456 -67 49
3597 49 70 100 272 251 340 197 -69 339 250 162 164 285 2 168 214 -11 85 116 -24 2 286 33 -100 27
3621 27 17 -129 59 3 -346 -210 -66 -295 -180 -172 91 -174 -28 -203 -404 -396 -233 -94 -95 -272 90 -264 131
3644 131 -117 -279 146 -105 -302 -48 -108 -233 -106 -178 -196 -125 57 107 211 -25 57 -4 -152 113 104 15 234
3667 234 428 180 5 293 200 -177 261 95 470 37 304 548 -107 220 61 145 201 107 248 130 67 321
3689 321 284 477 -11 -7 354 177 228 129 397 -118 -9 -54 -59 -189 64 -35 -116 -575 -244 385 -184 -80 306
3712 306 -713 193 57 -1114 3 -409 565 -416 -273 101 -328 267 413 -456 -344 106 80 686 716 200
3732 200 -752 469 -111 -38 -258 573 353 563 207 494 442 511 1438 -385 69 -290 376 306 -933 52
3752 52 634 -237 173 308 656 -39 398 -191 7 235 -332 242 -110 2 500 187 166 338 122 -135 45
3773 45 -271 -196 -82 -143 87 -368 301 -21 -574 -405 -107 -587 261 320 -342 -261 -72 -465 -195 93 -59 44
3795 44 -37 82 -181 72 -84 -247 -84 -234 -98 639 -206 -250 381 309 96 -90 54 -56 -179 -119 224 393
3817 393 282 672 333 404 224 594 -47 -108 161 335 211 -292 276 75 -82 382 -291 75 395 -272 263
3838 263 -203 -226 139 -235 -106 57 139 -17 -44 -95 10 -146 -192 -145 -234 18 -94 71 -193 -119 -309 -67 29
3861 29 -247 -5 -106 -105 -131 -324 -12 -141 -149 -343 -138 -264 140 -118 -219 77 -26 87 75 61 167 -27 171
3884 171 -51 148 -73 202 207 -9 235 -83 0 126 205 115 167 224 106 23 283 445 30 247 56 82 155
3907 155 229 -16 160 381 242 201 -97 134 -31 9 10 204 -65 -43 113 156 129 -205 8 -84 -7 -91 -326 57
3931 57 -190 -43 -140 -96 -61 -171 -222 -39 -81 -242 -325 -98 -426 -149 -136 -6 1 141 -245 87 56 81 18 -230
3955 -230 -52 -19 -109 168 146 110 -76 52 -210 -65 344 180 137 270 113 241 -24 249 10 125 73 197
3977 197 228 -69 328 -145 209 45 377 -61 -50 174 -138 181 115 88 7 -54 -134 -206 -156 35 -53 27 -13 41
4001 41 -74 -62 -333 46 -161 -143 -398 -193 -371 -114 -85 214 -108 -252 -67 37 -245 -191 -202 -265 -72 -342
4023 -342 115 153 -204 109 274 450 -104 196 120 7 -142 -298 -416 237 -157 468 -95 733 -16 -474 375
4044 375 150 321 499 627 -85 444 627 530 152 -19 39 292 1 204 329 554 -713 -325 32 145
4064 145 -661 85 -399 119 -364 -601 336 -285 430 154 -115 30 323 -265 32 -462 63 -256 161 52
4084 52 13 -121 -44 -116 -486 -109 -175 70 -203 -471 -127 -495 -217 -17 -94 -182 -202 -213 -152 -215 -160 27 -94 -88 -200
4109 -200 -106 213 116 341 138 278 -27 97 87 229 -314 170 417 272 288 84 363 78 124 133 47 199 -118
4132 -118 21 30 -70 73 -197 -18 -67 -48 66 -142 -24 -56 -45 25 -154 7 -145 -116 -369 138 -148 -65 45
4155 45 -116 -118 -325 -132 13 -278 -204 -161 -9 -143 -245 -169 -238 51 -191 -43 -130 79 -163 -146 -163 -160 -38 -89
4179 -89 -231 -189 -197 -144 -143 134 164 156 267 113 346 248 123 76 204 169 197 33 -92 93 34 13 143 -139 336
4204 336 153 112 161 93 65 212 126 57 174 216 444 -244 -245 140 -193 44 58 328 352 -161 -389 29 144 -171
4228 -171 -133 -191 -459 -731 -390 -374 -48 253 -6 -102 67 341 -418 -83 282 -85 -620 -229 -125 -369 539
4249 539 606 -245 -550 -162 -583 96 968 -600 -952 149 -319 135 -30 912 93 -115 -332 108 411 -38
4269 -38 345 -606 -235 483 298 226 39 -133 212 -149 46 -196 197 199 197 160 -96 227 225 121 305 -304 424
4292 424 -191 -19 85 -308 -97 173 321 26 192 125 -326 39 3 43 2 -2 -89 -88 -212 -394 254 -152 -290
4315 -290 143 -394 -13 -128 -162 198 36 166 -87 -273 -69 407 -26 222 107 -157 -31 -265 10 248
4335 248 178 127 -21 -75 471 219 356 -51 -190 206 478 433 -329 141 -298 134 377 56 -83 287 195 -429
4357 -429 -374 53 594 104 327 270 -164 162 -10 72 147 -450 -339 -257 80 593 -34 -277 124 -187 -200 -75
4379 -75 -61 31 -109 -201 53 214 285 -358 -124 45 -267 -204 -179 -6 18 -281 -83 -238 164 232 -60 -49 337
4402 337 8 -50 265 -138 184 163 -211 209 -130 424 -4 236 100 -241 42 271 71 394 229 206 285
4423 285 -109 276 138 141 135 78 129 -37 23 375 -154 8 -241 252 227 -59 -117 107 66 73 173 -292 283 -58
4447 -58 -291 -45 -61 4 -30 -52 -183 -421 -28 -143 -223 -288 -222 36 -542 -94 -383 -156 -263 -154 -140 76 21
4470 21 110 59 -327 95 -315 -173 73 -126 -380 -79 135 -283 129 -38 -211 -122 255 600 -37 132 -305
4491 -305 -156 -244 -196 -240 361 -48 -120 -127 -322 -88 -243 15 -148 263 -64 24 76 -91 625 520 272 12 -264
4514 -264 -317 177 -550 -134 90 -222 -602 -204 0 -329 1 126 24 104 68 -158 -237 -106 -184 74 -136 -280
4536 -280 164 93 -242 -307 -221 -26 -105 214 -39 -295 -482 -306 19 -243 -484 -161 -2 144 -339 -104 158
4557 158 -15 129 414 -243 -412 304 132 -53 40 10 199 -21 -19 133 296 -84 -75 77 210 72 122 -9
4579 -9 226 212 93 -42 141 322 -355 -182 128 182 -121 334 302 -483 104 313 -300 -102 54 -287 -159 -340
4601 -340 -77 -17 -174 265 -116 -16 -171 -275 -268 -91 -106 -614 82 -416 243 0 92 52 -452 -4 67 -167
4623 -167 157 -218 189 170 -585 170 -213 -97 174 99 157 196 -76 -199 -137 -34 -56 403 -264 439 -288 193
4645 193 37 548 -189 478 319 637 117 350 804 920 494 142 707 -518 -403 34 242 340 -82 144
4665 144 -496 -520 -36 30 30 -377 -346 -124 -442 -369 -256 21 69 27 -332 68 -234 14 -206 815 146 -640
4687 -640 -530 -252 -289 -322 -7 -492 48 416 -360 -351 -1003 -265 45 -527 -169 -1158 -307 -547 -379 -64 -96 -123
4709 -123 -179 -130 583 -333 452 -241 214 -19 -144 -330 -485 602 307 -653 93 598 -158 -497 -209 387
4729 387 134 -3 -726 -191 -39 525 -60 -244 99 182 158 100 708 -421 -445 -212 85 -67 15 401 -29
4750 -29 -1460 834 -283 -80 171 -919 -224 734 18 -306 -76 541 39 -652 -62 -308 -287 -575 172
4769 172 -172 19 873 -369 141 -700 -430 325 438 -221 708 240 -183 -50 144 -122 -36 293 46 -194
4789 -194 150 260 245 645 52 -487 -114 58 468 -167 -21 272 84 276 45 113 518 350 -340 145 98
4810 98 -333 168 -3 79 102 78 -165 -277 -306 -87 273 -161 282 -109 -244 -51 22 116 -216 -390 68 -176
4832 -176 186 -357 89 -146 95 -214 282 49 32 8 -151 -263 -145 -580 33 138 8 71 -453 -620 67
4853 67 245 -134 -137 -528 -335 -182 277 64 -487 713 -567 320 158 -508 -179 18 231 680 -471 -357
4873 -357 643 284 -362 -117 -105 -540 432 426 -335 -394 117 503 232 33 -114 71 192 -97 -129 -344 321
4894 321 378 39 226 -28 113 -469 -390 -466 63 278 -103 -623 52 112 58 -249 124 231 148 -91 -147 149
4916 149 -370 -130 34 -913 -261 56 -186 196 -149 -235 -285 -52 24 -91 -523 -28 -9 220 -197 -438 -288
4937 -288 -52 346 -177 461 252 282 164 -278 -696 261 -715 -13 -1861 -420 563 458 546 496 -483 82
4957 82 -473 418 583 -678 449 -16 92 -38 -270 -397 -48 -324 -304 -409 14 -73 -185 -253 143 -165 -271
4978 -271 26 -367 -279 -143 -88 -383 -67 -477 -218 -268 -539 -322 -330 -195 95 -9 -541 -132 -72 250 -303 -55
5000 -55 -63 -497 -591 -52 140 -40 97 -339 168 -403 -100 61 280 4 96 196 -8 131 241 138 45 158
5022 158 -79 189 -318 -368 50 146 152 -123 -10 -67 -218 -63 414 124 -258 -137 -220 -24 18 71 -96 -104 26
5045 26 -128 -107 -54 -85 28 -71 -245 41 -125 177 -175 -367 -85 -21 -220 55 -96 -118 267 -218 -337 -59
5067 -59 -448 -77 513 -245 829 -543 -137 -335 -199 -193 148 -719 -163 53 -106 -162 -166 -525 126 -101 -1
5088 -1 -444 -183 727 38 -632 -161 -4 -818 451 756 228 301 -161 226 106 343 -263 -136 173 647 -393
5109 -393 -541 97 -2 121 -682 769 143 704 -37 -755 -662 -777 -381 62 -328 270 -496 -66 592 250
5129 250 50 -66 -138 -367 162 10 -17 -239 578 -946 30 -155 93 -537 -282 -292 -64 -276 -363 -27 292
5150 292 98 -295 617 31 627 -255 363 -347 -467 594 -161 192 -54 200 162 480 202 -218 21 -555
5170 -555 -517 -773 -114 93 -331 -60 288 96 684 125 29 706 -257 257 370 -103 221 -64 -520 111 -814
5191 -814 457 519 -32 -227 484 65 715 80 198 -479 -21 335 213 -180 -355 -376 144 -966 -357 229
5211 229 371 -416 -202 183 -720 718 -56 46 -57 -443 -167 8 145 -22 -110 -15 15 570 -129 -34 102
5232 102 39 -476 -333 1 143 -170 940 329 93 34 440 -210 -305 297 -185 90 436 -231 -14 -162 63
5253 63 22 169 159 -59 43 -193 -113 128 -194 -101 67 -88 6 56 -12 6 20 343 32 190 -144 28 226
5276 226 396 203 -541 -85 204 -42 27 210 -116 -118 -105 56 59 -124 -165 -103 -684 -242 -369 89 414 136 -297
5299 -297 -16 -91 -11 -551 259 -188 141 -150 -255 29 -597 -94 -192 -755 -38 118 611 -104 216 591 -207
5320 -207 -619 630 520 -435 -185 81 706 -72 347 117 539 -649 473 -152 158 28 -1072 94
5338 94 -665 -163 -568 -26 314 33 -130 -618 31 -379 316 -675 213 425 -1 87 -420 134 -224 -184 -419
5359 -419 -2 16 85 200 465 159 -50 -2 258 -489 -41 -41 -390 -13 58 -371 14 -293 -100 -297 120 311
5381 311 189 -56 42 67 -497 -156 148 -346 -70 -985 -470 -63 -179 256 -36 -313 -272 631 618 216 -360
5402 -360 -88 182 -317 -151 -60 83 -58 337 483 210 54 -401 -240 -532 9 -790 -364 39 -409 352
5422 352 465 -140 81 25 -2 286 -26 -429 -178 -226 80 -79 7 -429 227 -780 -311 53 330 -428 80
5443 80 -369 -246 353 -429 37 98 -35 -192 -351 -21 105 -208 274 -55 43 -208 308 -40 25 -297 -344 -72
5465 -72 -111 -160 -23 227 -186 100 112 519 227 538 325 -75 -146 169 297 -61 141 -2 23 351 292 135
5487 135 141 -13 -20 -411 -64 16 45 -158 -56 -64 18 -191 167 -178 171 -8 -31 30 56 -123 1 12 18 -241 -139
5512 -139 3 -9 295 -3 -8 -85 27 -260 56 90 -114 53 -167 -62 98 -98 -423 44 -134 33 -83 -190
5534 -190 -20 -160 25 -135 81 121 -28 79 231 73 -53 -150 181 14 -5 135 -60 -8 251 111 218
5555 218 103 -201 155 -130 60 -48 -134 -230 131 85 26 21 41 0 120 -112 -68 275 -27 313 43 -138 -130 -30
5579 -30 -158 -18 37 98 -123 -185 -198 36 200 -284 81 -100 103 -162 -182 -101 189 -170 -98 -329 -128 -268 -47
5602 -47 -4 159 49 -22 -141 142 184 -52 203 -34 72 42 86 -72 172 9 110 163 -11 97 163 311 -48
5625 -48 88 102 36 2 -40 96 151 9 65 -144 95 23 -284 139 91 -60 5 14 -47 -300 -121 -90 -173 -122 -88 87
5651 87 -169 51 -40 48 95 117 -36 92 -95 -28 32 -303 -218 20 -21 90 -54 -50 30 -268 22 214 99 -14
5675 -14 36 -48 33 3 36 51 -124 48 -41 66 -26 -186 -117 141 60 -8 63 -23 93 -41 -266 -259 115 12 62 -217
5701 -217 118 -52 22 96 60 -46 187 290 174 -256 9 -136 -3 132 -111 76 -210 -145 -112 -75 96 -255
5723 -255 -15 101 -3 -32 -169 -244 -116 43 -310 -62 -322 -38 -205 -132 224 -62 -223 60 191 118 294
5744 294 -92 -165 -236 292 -20 313 -134 -108 -244 -58 -1 -99 -214 166 -208 -342 -148 -66 321 -92 3 137
5766 137 198 -221 3 34 -329 15 -121 -225 6 -366 -51 358 125 -11 186 -11 38 416 95 -23 -150
5787 -150 282 438 104 93 -531 202 -161 18 43 216 52 375 612 85 -614 -237 -176 -282 398 -473 -387
5808 -387 353 -127 154 -125 -90 316 -332 -203 348 -340 -742 210 197 -301 -808 -569 -749 -52 99 -192 -614
5829 -614 -148 -241 -383 40 423 161 449 84 -288 -148 39 -26 -40 1179 454 -496 491 -111 217 227 542
5850 542 504 -107 -685 -93 -157 -368 209 72 73 169 -129 232 62 -266 -54 315 -480 31 -188 319 389 -34
5872 -34 -42 -99 335 243 570 -477 237 32 27 -328 -548 -55 -365 -166 141 130 580 -40 -61 -722 43 -859 -553
5895 -553 -556 305 -215 -624 -169 -234 -230 -413 810 1176 816 106 398 212 304 412 211 -580 3 -228 -548 -185
5917 -185 -710 -777 403 370 -804 226 -362 129 248 110 -512 -287 542 247 94 -176 181 -686 507
5936 507 180 814 430 -402 453 61 -37 -721 361 -216 1176 762 -662 -724 -816 41 624 389 185 66
5956 66 220 306 -528 205 -347 -152 204 702 143 -127 -69 149 -284 -258 747 -74 -577 -112 -1130 -379 836
5977 836 902 -541 -569 -483 19 -743 229 8 -614 -581 198 -95 -280 -195 741 72 749 -63 786 -93 25
5998 25 814 -151 1230 -74 -170 -49 848 -242 -372 454 1253 -56 -423 -177 225 -346 430 827 -1068
6017 -1068 20 -496 417 -57 -741 283 329 1101 270 -140 -1127 -229 696 -1162 937 938 -774 -828 462
6036 462 -637 -485 -119 395 886 -1192 112 -1026 -95 -523 -526 928 160 -313 286 -499 -176 -264 102
6055 102 11 -130 -6 277 -703 -95 -81 -265 387 211 701 -782 -354 508 175 -651 37 61 -509 256 58
6076 58 555 116 -421 768 -557 -575 72 295 612 95 -775 656 -762 799 29 -969 -949 503 -84
6095 -84 -64 -711 -400 -292 706 -53 285 163 -356 359 -271 670 -171 -1337 15 -33 -165 -526 140 -684
6115 -684 -167 -176 -195 -65 516 300 187 -803 -358 -223 -849 169 277 469 523 75 366 122 -760 163 -484
6136 -484 668 -386 960 -353 -4 -861 23 36 566 -401 -581 275 -775 355 -167 -673 -381 280
6154 280 -124 -361 -454 -139 -205 -705 -300 954 -192 -7 -538 445 345 46 92 -139 -222 39 59 39 44 4
6176 4 289 72 327 -13 -183 -147 -44 201 -151 -96 -157 -66 82 45 130 -152 -261 466 86 -186 -230 174 102
6199 102 152 6 -294 -175 -116 -40 -101 347 -23 -234 69 123 -57 -19 -4 80 15 127 -62 -89 119 -43 -75 -119
6223 -119 90 15 71 69 160 253 184 -185 172 -14 178 76 244 22 221 -95 163 -255 -143 -89 272 23 35
6246 35 30 -247 -2 22 -290 -214 252 231 -103 -257 249 -126 -290 242 -61 94 44 531 439 -11 148 64 39
6269 39 -49 -87 -514 79 126 -33 159 32 21 -232 62 -1 -126 135 -91 -94 -149 297 -103 175 25 40 -16 197
6293 197 -7 30 203 140 73 -54 -124 50 -49 -181 31 16 65 194 -129 99 -5 -210 -20 227 -46 -121 -132
6316 -132 109 28 -95 -167 106 59 -234 47 270 -63 60 -82 91 53 -33 -19 107 -240 50 2 214 7
6338 7 156 -315 -190 -48 80 -276 -32 -158 97 31 -328 337 -97 201 -360 34 549 67 -107 -73 68
6359 68 573 -17 -437 -107 69 94 -380 208 -776 164 -308 372 -210 234 960 134 -418 -268 -60 -933 691
6380 691 364 -354 665 -42 -511 183 658 62 -292 406 30 220 -137 -215 -29 -602 -442 -533 -220 182
6400 182 -612 319 -398 -376 -155 -108 -454 -133 272 -54 -243 -87 -287 -135 -138 -103 409 61 307 -106 -172 -165 294
6423 294 242 9 -477 269 -211 -53 166 753 178 -534 1005 122 55 -665 427 -322 261 -254 224 -258
6443 -258 -381 511 -323 -424 -87 -139 403 269 -114 -6 -164 -355 -414 108 -81 655 -738 455 -32 -181
6463 -181 15 -174 63 -103 -268 -803 382 117 40 65 161 -268 193 186 318 -32 -318 35 -96 120 -316
6484 -316 -111 250 -216 -268 -251 -120 -473 330 176 87 -33 -57 2 -26 -114 52 183 -404 -120 -100 -43 107 59
6507 59 -39 5 23 44 -33 -105 129 -12 54 87 135 120 -82 112 49 -101 -122 152 -56 -89 59 1 -175 99 65
6532 65 -89 -43 127 -199 152 224 3 8 -11 -380 353 -119 -398 9 -282 596 550 -181 -52 -978 895 -1132
6554 -1132 421 -585 132 513 -502 31 84 565 -12 -36 -228 -235 3 965 -531 -55 20 208 233 -102
6574 -102 -241 331 -56 -60 -180 -13 38 -33 -159 -25 -62 -72 97 26 198 223 119 125 16 153 -208 240 208 -178
6598 -178 -46 -345 179 -79 -139 29 -123 179 62 318 -167 -200 -3 313 -190 195 -134 485 -305 -84 642
6619 642 -127 14 20 -6 -1286 113 18 150 235 8 189 -359 247 -319 289 -89 -151 -590 -376 470 376 -8
6641 -8 182 97 28 -19 -128 82 -519 -433 284 -68 -287 -32 -165 186 162 72 760 -395 -233 -38 -23 -213 -168
6664 -168 1255 38 0 -389 511 -559 3 255 -188 295 73 225 108 -131 197 294 -627 92 348 -408
6684 -408 -322 -398 372 149 -331 -208 -756 374 -161 636 155 -94 102 189 48 -913 -105 676 -85 -127 30
6705 30 299 5 -24 1113 -670 -975 -450 -244 -579 -231 -63 774 -202 14 145 -825 549 12 -316 -668
6725 -668 484 557 81 314 -575 210 123 -122 -150 -344 351 -825 410 119 619 170 531 114 385 68
6745 68 416 -226 343 157 25 210 -2 -391 -63 151 -227 844 272 54 -83 -194 381 -225 -40 -54
6765 -54 -1138 473 -926 362 251 -11 -308 460 752 -91 -495 -255 534 -481 681 -1313 331 -889
6783 -889 -24 -356 914 351 764 -194 -182 633 696 423 -350 35 506 -221 362 123 -896 182 -266 -287
6803 -287 557 -497 242 436 213 327 272 28 -54 115 49 818 -38 227 53 66 -85 53 533 458 -60
6824 -60 19 472 -53 -173 -167 -563 -25 -167 14 -269 -159 -144 -185 83 -77 -307 169 263 -12 187 -269 89
6846 89 43 -27 -102 -171 -120 16 155 -8 -83 -53 -120 185 -144 303 135 -319 -62 10 247 -87 -185 -35 -162 -55
6870 -55 -345 7 -45 43 -170 -38 3 -120 101 29 -253 -207 132 92 149 5 -28 -47 -161 221 243 100 188 -86
6894 -86 97 -37 206 -106 94 -163 203 -30 -7 261 509 -316 42 -41 -8 333 142 -134 17 248 771
6915 771 -140 495 262 592 180 336 652 -725 161 496 940 -187 21 -267 272 264 953 531 -254 324
6935 324 -61 -349 -416 176 233 144 319 66 404 842 -174 -499 123 -313 104 -45 3 25 244 -89 -89 61
6957 61 -202 -94 -298 -20 280 252 -290 100 51 -62 -8 88 130 50 0 124 -94 262 58 250 -112 -71 100
6980 100 86 265 25 -83 67 -237 114 -157 174 72 -125 303 5 -134 -15 -88 158 23 -208 34 -212
7001 -212 -188 -24 85 37 277 5 -11 200 -37 -222 50 82 92 23 207 138 117 -91 -93 -100 -131 78 -86 108
7025 108 -20 -63 36 -135 3 39 101 21 -89 -226 -87 3 168 -218 256 171 -60 146 90 168 -244 144 -26
7048 -26 -11 -74 -79 13 -313 -197 139 48 86 141 93 229 32 181 -70 344 -48 86 -28 -135 -96 -57 367 -83
7072 -83 -86 -125 2 -107 6 90 117 276 -314 -22 96 -53 -538 31 -164 260 129 -199 -434 276 -205 -141
7094 -141 -12 157 -200 -43 -144 -35 -588 -162 -309 10 104 -151 -354 314 417 6 -239 377 328 -596 389
7115 389 -351 372 -238 -487 -100 -180 -348 591 -166 -179 66 425 -161 363 21 -208 115 -174 -145 117 -141
7136 -141 143 228 -669 0 466 -105 371 -269 -99 184 -511 -3 -16 -27 -105 -177 -768 42 -205 -65 -323 -176
7158 -176 -276 -472 10 -52 190 65 -440 63 311 -215 164 42 251 -72 -356 -85 -160 464 -361 -28 45
7179 45 22 247 -24 33 108 -67 24 -59 165 78 -7 -29 -9 100 257 1 169 259 50 -16 273 -186 -39 -96
7203 -96 -107 -25 -109 46 35 12 -14 -229 140 103 -201 14 -136 58 259 -244 -170 -90 -205 -124 78 -80 53 -279
7227 -279 -44 -71 -346 -28 25 76 49 -43 2 195 -237 -143 -64 85 102 100 238 226 -34 39 -224 -69 3 249 -471
7252 -471 -110 217 100 52 -249 225 -61 275 240 -294 16 495 234 -112 -54 84 -161 -209 -635 234 6
7273 6 301 -186 -122 -184 359 126 435 466 155 22 119 74 -210 -65 464 -70 -301 -849 205 242 21 557
7295 557 353 -287 232 -225 52 397 556 -71 182 808 -550 429 -52 581 206 -737 -18 -667 188 -16
7315 -16 -193 65 75 -147 573 79 -239 -1032 -565 220 367 -3 -574 142 190 -34 312 405 145 4 357
7336 357 -705 451 -370 -193 -363 -167 -367 41 -192 288 -42 422 -576 -337 637 -193 708 -153 349
7355 349 -58 252 -433 -505 91 105 224 155 -272 -671 157 89 -268 425 215 -381 392 -285 -393 268 -294
7376 -294 595 362 81 -670 12 322 -36 -173 127 174 -357 92 402 283 386 400 -81 123 284 -257 114
7397 114 229 140 -102 -80 -397 117 109 -518 369 323 387 255 66 3 -390 18 59 -139 274 412 -90 -150 287
7420 287 433 -115 -198 143 -279 -62 -256 253 56 -100 -34 -51 305 -159 -8 -578 208 437 515 150 -145
7441 -145 -337 -404 422 165 166 86 -215 -53 -366 -145 199 145 195 -106 427 102 183 71 479 25 81 -212 -353
7464 -353 -137 201 67 -412 118 -327 143 168 250 -10 -297 83 588 -143 17 -209 -218 -17 -108 202 336 76
7486 76 256 -85 -424 -23 -141 -110 -447 219 -179 615 667 51 -228 144 382 -341 -35 282 -260 -170 261
7507 261 118 180 445 258 113 321 138 -16 14 138 -378 -86 -368 -534 158 408 -263 118 378 -198 -137
7528 -137 249 -82 190 41 -40 -51 -557 701 209 -208 -65 -347 -10 -37 -161 -83 -153 -146 -150 106 46 -124 -230
7551 -230 734 506 -118 387 -36 290 147 -169 252 245 -369 -37 207 -126 -339 287 -360 43 -315 -49 -488
7572 -488 -199 133 6 -295 -273 131 -505 -458 -326 -375 605 37 -294 282 136 147 655 240 303 115 332 -36
7594 -36 304 194 -66 338 78 530 13 279 -126 -634 35 355 -86 -68 -277 184 104 447 -786 -142 -202
7615 -202 -817 432 -762 442 395 76 -280 -389 -196 -495 40 139 -182 248 31 -234 -150 -283 75 187
7635 187 104 -247 -245 -228 -62 -328 11 -650 48 -389 -307 391 478 161 437 198 164 -40 -14 -136 274 366 -241
7658 -241 -199 133 332 89 185 154 287 -335 -221 21 313 279 -176 91 470 -158 377 219 -451 -91 322
7679 322 275 -17 -392 -683 104 -524 166 -341 42 266 -162 431 -101 -87 -753 491 -205 -327 472 -249
7699 -249 353 107 33 -1075 865 203 -1342 -437 179 414 99 500 -390 -525 -933 580 687 -656 -22
7718 -22 122 807 286 102 -180 -329 -719 254 305 -219 -368 -174 512 -193 118 -228 82 195 -48 -246 -52
7739 -52 46 329 114 95 331 -148 -220 255 79 -514 -658 -190 193 84 268 203 -96 416 -42 -71 244 -514
7761 -514 -110 29 -191 39 -543 388 -273 8 851 95 -234 -446 267 -674 -32 -15 -462 -733 -945 79
7781 79 -69 607 -340 -247 132 -398 120 -158 -295 550 -196 232 -26 -871 -55 -83 -250 -55 -32 210 -353
7802 -353 609 701 -418 -635 -61 -47 -62 -154 408 -233 698 840 -493 234 -492 1192 495 -222 582 -228
7822 -228 -466 177 1254 -450 -97 -875 1452 838 -666 186 47 342 -1051 265 -266 -525 -522 492
7840 492 89 335 -284 -72 73 -844 -14 -314 87 -271 -581 -362 -486 315 -459 -328 -98 66 416 111
7860 111 103 -782 -247 -238 -259 323 240 -97 384 -202 62 564 -432 302 -313 58 172 -178 -491 -21 -289 -191
7882 -191 136 82 -188 -75 -146 -11 -59 -28 238 -12 -90 -257 42 -112 131 -11 61 78 -52 93 -190 148
7904 148 110 -13 71 -122 -119 -51 25 -58 -25 123 -105 2 292 -132 -166 -77 23 -125 -194 -11 -13 -90 107 -229 125
7929 125 40 85 132 140 65 -79 -40 179 165 12 -203 5 101 136 -157 133 -141 166 -93 -30 -177 -152 23 47
7953 47 -344 142 -14 -283 -120 125 733 -47 -33 33 263 -212 172 -336 77 120 -143 162 217 30 91 168
7975 168 23 -796 32 27 -707 -339 -535 -327 -624 99 -44 -458 578 200 -687 -40 -271 353 -20 -329
7995 -329 -26 120 -441 236 -5 -131 -155 329 -102 83 70 -34 166 -394 -3 415 263 -188 -26 -199 -42
8016 -42 -261 95 273 -211 -132 -129 -69 -4 -28 103 -181 -37 404 -75 -134 -22 250 17 -176 268 -28 67 70 9
8040 9 -65 54 -222 -7 169 -398 -1 -74 83 196 89 -261 8 -4 -139 -64 -29 -244 -20 -100 -73 -119 102
8063 102 -218 -18 -41 -75 -184 -7 21 -190 -156 -93 15 -212 -46 -49 93 -35 -12 139 186 10 106 -11 120
8086 120 520 -247 53 -127 -242 -206 -81 180 -175 37 178 245 -152 26 -329 -55 158 46 -83 522 18
8107 18 61 -9 380 132 122 -156 119 195 -208 298 9 -17 -257 -16 164 -156 -18 -47 -175 -39 58 11 -7
8130 -7 -402 132 -35 -236 230 310 306 161 -176 -242 -197 -275 -80 -55 -185 164 175 138 -97 -361 401 -399 155 -231
8154 -231 107 -304 14 83 -3 -135 -624 -44 571 -55 246 -74 249 -246 -478 -549 -57 -71 -216 -41 200
8175 200 -62 163 121 492 -881 900 -206 -145 -749 -582 -771 193 -167 -203 528 -549
8191e49
$$ Imaginary data points
##PAGE= N=2
##DATA TABLE= (X++(I..I)), XYDATA
0 0 0 0 0 0 0 0 0 0 -8 8 -8 8 -8 16 -24 24 -32 40 -48 56 -72 85 -101 120 -140 164 -191 222 -258 295 -339
31 -339 386 -439 497 -565 637 -715 803 -898 1003 -1119 1245 -1382 1531 -1694 1874 -2068
47 -2068 2282 -2516 2768 -3051 3361 -3703 4083 -4506 4980 -5518 6130 -6836 7661 -8637
61 -8637 9815 -11269 13118 -15552 18923 -23920 32191 -49146 161772 -379850 -15831 473801
73 473801 -390029 94374 363355 -282432 41074 288285 -256382 -8222 181254 -104851
83 -104851 4276 88864 -83158 -21916 -27402 -13551 3957 -63912 38335 -25531 -179421
94 -179421 82402 -9121 -222369 125421 19350 -276764 115974 7121 -307669 143280
104 143280 54113 -312538 120688 32486 -312843 116259 42591 -266837 102298 22381 -220381
115 -220381 60175 -5728 -145624 46919 -9976 -82842 -4875 -38737 -20279 -18091 -41683
126 -41683 37193 -37612 -66436 68777 -44245 -71011 106752 -39371 -77681 121811 -42765
137 -42765 -89999 128771 -16607 -72912 119856 -19133 -73125 112251 -1375 -58998 97853
148 97853 10789 -40344 71667 4081 -18514 59289 15637 6717 28027 9073 25841 6262
160 6262 18714 46826 -12366 20368 50461 -29189 22167 55422 -29269 25887 51545 -33620
172 -33620 18312 43853 -24976 21107 37977 -19501 12166 24493 -10277 11591 14683 962
184 962 13138 2427 2837 6815 -5408 13496 11807 -14943 12606 10941 -23189 16567 12577 -28244
198 -28244 22879 10648 -37414 24851 6694 -36767 30848 724 -34811 30899 -9848 -30232
210 -30232 31435 -14998 -20943 26567 -24690 -12799 21791 -30430 -3998 17881 -33316 2183
222 2183 8708 -37107 9224 5296 -36271 11720 -1720 -34585 13607 -8571 -31977 17846 -12476
235 -12476 -30443 17924 -19499 -25688 22288 -25842 -20734 25678 -33266 -15521 26753 -39021
247 -39021 -5583 27266 -44439 2063 25248 -46968 9872 21826 -44565 17839 16429 -42265
259 -42265 21680 12196 -33817 24517 6827 -25284 24402 1455 -16156 23985 -820 -6078
271 -6078 21894 -5467 1724 21138 -8215 8471 21323 -10806 13212 20485 -14734 18152 21567
284 21567 -17429 20633 21051 -19837 22500 19407 -20874 24754 18426 -21244 22365 15477 -19039
297 -19039 20357 12322 -15685 16065 10105 -11982 9863 7302 -6913 4180 5098 -3878 -827
310 -827 3587 -1104 -5116 1796 569 -7893 -827 1033 -7697 -3525 1234 -6464 -7507 1783 -4121
325 -4121 -12301 2838 -509 -16052 2174 2539 -19489 2531 6815 -21484 1947 10088 -22703
338 -22703 510 12937 -21782 -109 16088 -21836 -1971 17361 -19847 -2090 18368 -18383
350 -18383 -1686 18124 -17759 346 16518 -14898 2869 12390 -12542 5772 6425 -9036 9372
363 9372 965 -4825 10790 -6285 72 12707 -12623 3925 14228 -16783 6727 13232 -20299
376 -20299 9750 13423 -22428 10159 12351 -23241 9503 11564 -22245 9320 10763 -21984 7773
389 7773 9554 -19724 7236 8006 -17458 6174 5103 -14841 6454 2037 -9952 6134 -1995
402 -1995 -5817 5670 -5447 -346 5285 -8486 4163 4365 -10624 7872 4222 -10510 9748
415 9748 3150 -10214 11280 3309 -9473 11407 4272 -8319 9925 4547 -7170 10018 6680
428 6680 -6842 8455 7302 -6905 7848 8051 -6294 7283 7108 -5801 6642 5508 -4088 6187
442 6187 3294 -2390 5149 192 -629 4170 -1913 705 2661 -4038 1163 1780 -5368 1155 1330 -6658
458 -6658 420 420 -8080 231 1451 -9585 -1056 2113 -10608 -1615 2454 -11638 -1355 3279 -12320
473 -12320 -1391 2254 -11838 -591 998 -9905 959 -1296 -8210 1539 -2532 -5137 1417 -4136
487 -4136 -1730 1714 -4319 444 1437 -3547 2277 1237 -3129 3422 2309 -2253 3667 3188 -1886 3601
503 3601 4070 -1762 3796 5548 -973 3225 6417 -1210 3461 6491 -846 3165 5371 -620 3549
518 3549 4521 -470 2894 2793 363 2341 1540 1584 877 642 1980 -223 164 1804 -1290 127 450
535 450 -1795 29 -501 -974 -692 -2756 404 -1658 -3551 1676 -2527 -4247 2858 -3794 -4691 3843
551 3843 -4572 -4279 4103 -5081 -3081 3898 -5221 -2029 3449 -4783 -1279 2666 -3853 -211 1923
566 1923 -2589 483 1828 -1869 493 1336 -724 1355 1291 -608 2726 938 -341 3946 234 -203
582 -203 4192 -637 -112 5219 -2458 1785 5476 -2793 1998 3875 -2922 2040 3059 -2564 1985 1738
598 1738 -2418 1380 612 -1610 1014 6 -730 -626 -1383 29 -1365 -1485 49 -2086 -1504 -743 -2408
615 -2408 -1624 -1191 -2068 -2009 -1749 -1650 -2683 -1695 -1088 -2862 -1469 -1076 -2811 -895 -984 -2231 -774 -817 -1138
634 -1138 -1218 -1188 -142 -768 -559 1019 -1003 -12 1704 -990 1032 2462 -720 2236 2756 -1098 3109
651 3109 2546 -184 4539 1809 349 4439 1324 1770 4254 857 2720 3098 915 3508 2097 1123
667 1123 3339 1131 1076 2832 519 858 2192 544 373 1449 -151 -349 838 -198 -414 -18 -814
684 -814 -1233 -1047 -1126 -1326 -1262 -1385 -1685 -1890 -2050 -2072 -1796 -2143 -1690 -2571 -2552 -1466 -3006 -1755 -953 -3350
704 -3350 -902 -1452 -3255 -123 -1814 -2577 569 -2103 -1491 952 -2419 -239 725 -2188 987 949 -2244
721 -2244 1946 787 -1567 3192 573 -823 3394 42 176 3586 58 644 3697 49 1511 3517
737 3517 -1 1641 3332 192 1550 2731 -51 1563 2309 -220 1281 1954 -694 1456 1144 -1217
753 -1217 1490 505 -1682 1594 -396 -1797 1106 -1353 -1937 746 -1793 -1944 455 -2166 -1688 160
769 160 -2083 -1997 155 -2204 -1947 -339 -1924 -2175 -462 -1692 -1964 -272 -1312 -1822 -39 -1178 -1410
786 -1410 322 -862 -661 953 -1388 137 1192 -1014 556 1318 -696 1413 1622 -608 1822 1606
802 1606 -55 1669 2009 3 2155 1852 119 2759 1919 -9 2860 1807 -449 3266 1399 -999
818 -999 3349 900 -1206 3856 -123 -1357 3517 -1630 -1017 3319 -2723 -686 2943 -3538 -55 2011
834 2011 -4155 672 916 -4245 997 -558 -4010 993 -1493 -3786 872 -2294 -2907 632 -2540 -2682
850 -2682 332 -2498 -2300 328 -2182 -2064 420 -2011 -1275 448 -1850 -1016 898 -1737 -268 1232
866 1232 -1461 -12 1675 -1195 682 1880 -982 1235 1916 -604 1561 1712 191 1763 2146 766
882 766 1648 1684 1126 1360 1816 1243 1511 1743 806 1004 2269 666 882 1882 370 1085 1430 -481 1197
901 1197 1075 -987 1319 -72 -1237 1441 -693 -2021 1440 -1344 -1959 1410 -1850 -1975 1090 -2683
917 -2683 -2006 1092 -2920 -2096 1030 -3120 -1669 1040 -3568 -1428 1011 -3577 -1148 1368 -3603 -328
933 -328 902 -3253 512 748 -3324 1582 417 -2876 2174 -9 -1872 3037 -390 -938 3259 -836
949 -836 -282 3142 -654 532 3073 -835 862 3084 -842 1349 3120 -792 1341 2486 -406 1381
965 1381 2037 -779 1502 2033 -834 1240 1606 -523 1379 759 -874 1273 531 -1460 1219 37
981 37 -1491 709 -1092 -1372 347 -1420 -1452 165 -1287 -1683 -357 -1534 -1270 43 -2090 -2018 241
998 241 -1601 -2095 -136 -2042 -1647 362 -1770 -2080 1026 -1752 -997 1115 -2151 -1031 1827 -1983
1014 -1983 -81 1909 -2167 935 1213 -1223 1557 1204 -1000 2017 1040 -901 2064 937 -447 3294
1030 3294 900 -515 3310 847 -138 2450 33 110 3406 650 -816 3679 -902 -55 3135 -544
1046 -544 -638 4240 -580 -860 2577 -1459 288 2571 -2485 304 1223 -2258 693 939 -2115 -1069
1062 -1069 -313 -2043 -1223 -1654 -1943 184 -2513 -2083 -571 -1036 -530 142 -1231 -2473 189 -1338 -2618
1079 -2618 -173 -1230 -2126 263 -1488 -1098 788 -973 -1378 1471 -606 -1177 1331 -1280 -1757 1178
1095 1178 -227 152 2678 -196 -69 2357 -595 1218 2178 -37 -218 860 -175 1219 1312 261
1111 261 2674 1389 -28 1935 1957 -917 1747 438 -739 2599 -864 -1286 4304 872 -1095 3095
1127 3095 -911 -801 3738 -1454 -2234 2495 -1880 -521 906 -3259 -151 810 -1534 841 -294 -2421
1143 -2421 119 250 -1753 -1151 -72 -1586 -74 -527 -2557 918 -270 -1838 1919 -2133 -1861 1162
1159 1162 -1175 -313 1337 -1134 -593 1638 -371 95 1997 -1169 -257 2291 -1219 157 1057 -338
1175 -338 1032 2205 794 1406 707 -321 1150 1169 234 1984 1234 294 1776 485 410 1326 1866 191
1193 191 731 1408 779 -274 621 706 1506 1076 -183 572 -429 -511 588 -60 -1285 146 -533 -1553
1211 -1553 262 -455 -1676 -783 -2108 -1984 -388 -1758 -2241 -11 -621 -1486 -3 -1872 -1897 -23 -1176
1228 -1176 -1375 -801 -1745 -656 507 -1941 329 928 -1742 -312 603 -632 486 993 -1251 1154
1244 1154 207 -85 1385 507 -228 2062 869 599 1875 -222 -200 1555 1038 1058 1687 1271 992 2380
1262 2380 282 606 1380 785 718 2048 119 909 1273 295 947 1013 289 345 147 -656 392 226 -349
1281 -349 -143 -962 216 792 -83 -502 -36 -1429 -1287 -446 -573 -940 -640 -1228 -1387 1 -906 -1519 -605
1300 -605 -715 -1271 -379 -954 -1183 -201 -595 -1450 -319 -711 -1367 553 -265 -1053 790 -175 -604 936 -392
1319 -392 -466 142 -590 1209 699 -550 565 568 58 1128 991 389 1139 1372 83 1232 822 136 1181
1338 1181 860 451 1675 623 220 1260 287 235 1389 380 -171 1105 -419 183 989 -592 155
1355 155 450 -570 -87 315 -675 69 -274 -1199 -162 -516 -934 -357 -576 -924 -523 -650 -901 -534 -891
1374 -891 -765 -653 -593 -727 -535 -677 -858 -194 -477 -573 -67 -619 -418 139 -681 -601 -4 -379 290 406 17
1395 17 124 168 448 61 1041 767 484 1108 1268 -239 1273 1454 765 1000 1287 601 1051 750 441 1496
1415 1496 590 340 873 169 576 1227 248 750 916 -435 560 470 -270 681 -186 -721 471 -660 -419
1434 -419 93 -478 -545 -127 -911 -777 -123 -1118 -906 -522 -1236 -957 -454 -1182 -798 -452 -1081 -772 -665 -1100
1454 -1100 -824 -318 -1115 -521 -353 -992 -20 -16 -738 288 -259 -335 333 -401 95 459 -212 554 706 156
1474 156 563 640 445 923 618 590 784 253 877 1024 618 836 669 765 930 684 842 904 574 741 622
1495 622 421 490 536 313 648 367 147 317 172 -1 -81 152 -44 -182 -97 -351 -357 -521 -524 -534 -699 -633 -547 -468
1519 -468 -742 -456 -1021 -774 -375 -989 -626 -605 -929 -252 -691 -855 -350 -712 -682 -213 -677 -345 -55 -359 -138
1540 -138 125 -422 -71 334 -95 339 93 126 489 216 430 453 514 467 778 485 770 749 751 680 740 611 490
1563 490 1111 620 602 644 557 424 571 174 544 393 85 482 0 85 267 -313 -56 298 -392 -2 -182
1584 -182 -609 -138 -349 -591 -298 -436 -614 -628 -669 -650 -207 -1027 -786 -668 -1051 -590 -632 -910 -443 -688 -889
1605 -889 -185 -628 -575 -72 -534 -433 -344 -212 -89 -67 -208 151 181 -33 73 250 293 286 787 261 681 630 325
1628 325 663 668 483 811 519 616 872 759 394 825 599 848 575 485 890 425 413 797 739 416 773 340
1650 340 -3 329 179 -32 99 82 -13 -205 -23 -150 -420 -349 -243 -542 -423 -489 -512 -350 -714 -588 -459 -598
1672 -598 -899 -606 -681 -685 -743 -737 -605 -513 -441 -691 -103 -233 -661 -224 -587 -54 45 -434 -258 179 -20 128 246
1695 246 14 286 359 -61 632 566 21 900 543 424 820 542 362 1193 411 397 936 626 376 1136 634
1716 634 755 1095 194 617 924 -74 507 797 327 154 146 -155 -68 -165 -401 260 41 -504 -179 -475 -429 -206
1738 -206 -466 -837 -247 54 -848 -225 116 -697 -605 -698 -738 138 -924 -682 -443 -769 -431 -696 -485 -365 -494
1759 -494 -57 -494 -338 -280 -257 -64 -164 -255 254 -285 147 174 162 339 608 211 279 628 317 491 710 360
1781 360 589 531 71 803 753 415 499 644 211 776 623 145 668 258 326 344 459 83 388 173 -82 177
1803 177 23 -398 327 -350 -273 71 -356 -216 -37 -719 -395 -159 -742 -208 -208 -794 -336 -500 -905 -585 -690
1824 -690 -663 -255 -806 -1015 -286 -596 -599 -582 -632 -498 -273 -195 -253 -54 -137 -12 -97 -246 31 40 168 210 192 106 491
1849 491 366 327 537 403 535 600 487 433 851 729 462 393 643 573 634 652 704 429 879 516 464 417 380 349
1873 349 279 31 -54 310 -171 201 241 -461 143 -153 -500 -75 -239 -449 -40 -384 -581 -201 -552 -655 -341
1894 -341 -706 -844 -339 -1061 -959 -597 -1060 -654 -305 -950 -586 -242 -818 -421 -358 -685 -272 -268 -208 -4 -160
1915 -160 -171 298 264 -153 547 25 -191 356 -1 158 298 -92 637 658 40 546 602 383 348 674 279 867
1937 867 873 476 336 308 343 909 372 904 545 516 387 322 892 260 12 161 414 200 151 -423 -150 -442
1959 -442 274 -619 -313 -63 -139 401 -195 -215 -269 -10 -117 -484 -877 -490 -99 -702 -1100 -39 -759 -134 -1392
1980 -1392 -1001 853 -260 -88 441 -54 333 336 -456 14 -287 -24 65 394 -290 360 524 431 555 -239
2000 -239 38 379 901 505 678 143 361 798 952 221 928 177 565 1007 195 174 489 287 430 1065
2020 1065 694 394 350 1036 175 475 -44 -228 -27 -319 -172 -42 -487 -137 -257 -591 -564 -137 -183 -191 -217 -278
2042 -278 -450 -879 -312 87 -720 -853 -604 -546 -237 -480 -606 -355 -264 -584 -327 -417 -549 -536 -608 -55 -220 166
2064 166 -436 -78 439 134 -334 425 469 171 101 473 -314 737 69 258 294 919 573 382 438 774 861
2085 861 294 674 591 -91 341 535 403 184 -230 278 539 946 -49 682 999 19 1339 913 -144 -230
2105 -230 -14 537 -465 333 69 -175 -527 -254 104 361 -638 -217 -133 -440 -285 -748 -500 64 135 89 42
2126 42 -743 -250 -343 -803 -738 -585 -527 -262 -290 -372 -67 -58 -15 70 51 -68 -80 3 252 266 189 396 52 214 214 568
2152 568 565 496 386 501 297 936 500 337 620 514 159 339 876 256 571 148 548 12 125 408 278
2173 278 33 242 769 -156 -205 59 -419 -237 -366 -254 -251 -270 -592 -127 -395 142 -207 -471 -996 -589 -782
2194 -782 695 -1006 -1477 -350 -467 -324 -473 68 -88 -562 -91 -639 -222 -579 -1148 -903 88 435 290
2213 290 -259 179 399 672 1043 518 206 -157 926 -34 57 -33 253 210 662 221 703 349 143 -195 358
2234 358 326 352 414 323 821 168 657 760 577 954 680 -171 431 -162 469 391 -159 -63 218 104 287 120
2256 120 -864 -1101 -44 -568 263 -390 -946 -380 -711 -406 812 -861 -386 -257 373 -711 -532 -1040 -765
2275 -765 -272 -300 -513 3 -493 -75 -181 156 -83 -81 -852 -619 424 -154 -144 467 101 390 286 128 109
2296 109 573 270 667 -238 376 403 477 6 329 620 757 1193 990 243 641 130 333 660 266 337 662
2317 662 286 482 24 -338 87 -8 291 -79 332 -185 76 -548 -250 -83 -313 373 -543 -691 14 -208
2337 -208 -552 -258 -529 -768 -204 -951 -489 -431 -12 -344 -1296 -765 -543 -409 -822 -72 -81 -415 -255 -388 -162
2358 -162 -331 -198 -361 -124 -291 -203 48 -132 -306 106 170 148 133 216 322 274 396 324 548 666 966 505
2380 505 464 349 499 453 449 311 49 647 522 607 440 413 100 597 99 450 327 356 186 8 81 227 -71
2403 -71 206 144 -287 126 -142 51 -127 -521 -356 -338 -297 -341 -240 -397 -473 -351 -396 -520 -614 -164 -583 -425 -463
2426 -463 -267 -202 -403 -324 -269 -185 -455 4 -280 -216 -92 -252 -220 -161 113 0 -282 -136 -43 -139 117 -78 254
2449 254 373 65 394 292 298 -20 360 168 584 223 342 511 554 348 542 387 81 428 299 356 41
2470 41 430 79 223 75 132 -172 -24 64 -123 80 -258 114 -492 -62 -286 -439 -208 -409 -153 -412 -323
2491 -323 -513 -432 -627 -433 -461 -531 -535 -160 -445 -411 -405 -494 -349 -93 -465 -461 -159 -239 -82 -46 -293 -169 -192 -325 279
2516 279 -242 59 110 -163 321 145 217 92 216 252 297 265 320 618 388 221 236 522 193 291 401 343 247
2539 247 72 500 204 229 192 249 29 -46 -113 371 67 13 206 -202 -324 -117 199 -52 -367 -188 -301 -489
2561 -489 -88 -34 -239 -526 -434 -459 -731 -183 -79 -504 -664 -321 -275 -361 -478 -89 -519 -361 -15 -1044 -259
2582 -259 -276 -21 -332 -119 -153 -266 192 -54 -18 -206 78 -374 -62 479 -195 576 50 220 44 -85 549
2603 549 787 336 691 56 247 510 345 86 -188 129 197 498 39 284 241 229 399 400 88 206 684 409
2625 409 -204 206 54 -192 -222 180 32 -829 -414 -358 126 -161 -255 -327 -257 -510 -531 -836 -796 -661 -321 -391 -264
2648 -264 -316 -123 -369 -48 -538 -488 -270 -154 -360 -288 -522 -294 -368 278 -183 -347 -121 -84 -55 -42 198 118 -19
2671 -19 208 340 48 166 241 492 406 546 82 491 122 314 564 81 287 428 92 189 218 318 163 328
2693 328 290 457 309 279 -39 -53 -25 132 -61 -31 178 -291 58 -209 -139 -152 -195 -53 41 -211 -209 -328 -398 -285
2717 -285 -347 -305 -361 -209 -30 -245 -376 -291 -288 -270 -327 -269 -39 -64 -209 -210 -239 -103 -44 -267 -100 285 55 177 81
2742 81 -192 277 -58 216 163 136 301 429 525 251 176 300 698 297 149 263 488 484 136 254 563 305
2764 305 385 208 250 172 321 241 286 76 261 168 129 -111 -5 135 -68 -156 53 113 58 -174 -372 -137 -354
2787 -354 -175 -436 -311 -488 -207 -318 -254 -284 -275 -436 -301 -251 -651 -510 -184 -328 -406 -2 -221 -138 5 -191
2809 -191 -108 -378 -1 -188 100 147 -36 151 151 323 166 169 96 33 193 657 280 110 517 310 398 0 46
2832 46 289 197 105 447 272 282 44 304 396 383 197 100 18 4 198 414 153 -1 104 48 36 -162 -93 -84 -234
2857 -234 -120 -47 -209 -199 65 -159 -409 -148 -99 -249 -318 -356 -222 -215 -321 -261 -221 -178 -360 -232 -205 -136 -63 -272
2881 -272 -126 -8 -267 -349 -72 -364 11 -237 22 204 -105 -118 3 56 132 425 261 -39 107 73 99 120
2903 120 369 176 270 438 94 386 509 -38 212 142 56 120 492 184 433 -10 224 -21 171 65 141 55
2925 55 142 -18 25 -114 111 2 -270 -52 -21 106 -217 -219 -257 -118 -135 -309 -257 17 -543 -237 -163 -256 -350 -143
2949 -143 -292 -232 -221 -98 -209 -140 -184 -179 229 -90 1 2 48 -72 -60 -89 -125 150 62 196 234 48 2 356 90
2974 90 355 198 553 311 28 488 322 230 227 57 386 -237 286 238 208 74 159 239 299 322 49 286 -17
2997 -17 112 107 -46 -239 183 -107 -131 -32 -43 -366 -200 16 97 270 -397 -288 21 -449 -194 -525 -581 -558 -919
3020 -919 -85 -83 -226 -150 -631 -250 -499 -195 -746 -151 -101 -35 178 303 -416 76 -201 -166 474 470 383 184 322
3043 322 419 -1067 -293 402 120 104 -494 -50 -309 -67 492 -320 536 316 -26 397 613 351 229 -24
3063 -24 169 56 -450 0 573 835 -444 254 -97 -232 595 -79 -14 -141 -203 691 -445 482 703 116
3083 116 653 -450 86 -383 -209 159 -451 -271 -720 -666 599 -972 -299 -38 586 -552 -471 -292 -339 280
3103 280 239 -342 -308 101 448 -49 -246 -231 574 40 -387 -154 435 84 -61 144 556 -120 -171 -452 -77
3124 -77 629 -125 -143 -153 -134 -355 603 1484 476 449 317 879 424 17 -518 -597 7 -924 -523 -144 -978 213
3146 213 967 545 511 -131 637 -615 -1403 368 36 -810 -377 -271 506 -295 -1037 20 -33 98 305 -673
3166 -673 -389 -374 -572 343 450 18 -148 238 -579 -508 0 305 72 -98 -285 -306 138 -725 756 397 -371
3187 -371 -243 -988 -422 -996 -80 205 1035 126 -534 111 -459 -750 -172 183 -122 478 -369 -299 -274 974
3207 974 778 123 -274 -578 -289 277 319 595 278 -873 -561 472 -128 -305 -21 82 846 556 299 -343
3227 -343 776 -275 -746 944 -847 -429 795 394 194 -657 390 -211 -657 360 -336 838 126
3244 126 925 1292 -94 628 -704 642 1102 -1410 553 -820 -1363 -32 -524 -1273 -332 380 271 239
3262 239 418 -403 165 644 -376 437 -358 372 -73 -269 -259 89 -478 37 -30 -70 74 -262 260 -303 -184
3283 -184 657 141 388 -401 -275 308 532 465 -63 -739 -408 -131 -316 243 656 -180 114 -179 630 -104
3303 -104 -770 -324 -647 -29 -185 -306 430 -14 47 -581 -733 131 -563 190 58 -197 67 -192 -578 -149
3323 -149 -371 -353 -465 -17 -62 -435 -586 -213 -232 -1 -230 84 -321 -253 -150 75 148 -65 208 214 -140 485
3345 485 478 -441 251 498 390 -64 516 31 85 144 -9 118 542 -134 377 397 217 658 379 221 159 -86
3367 -86 30 486 -9 81 208 -86 332 -254 -219 303 241 -240 326 16 -166 -345 46 -81 -104 -28 -874 -688
3389 -688 -151 -232 14 -313 -774 -72 -369 -522 -191 -97 -259 -488 -98 -14 -170 -143 -123 213 -433 197 -405 -103
3411 -103 49 164 237 -124 644 757 302 475 120 -117 145 70 154 -227 -91 448 314 512 125 60 767
3432 767 99 211 221 223 101 166 -134 245 -87 -430 535 540 278 98 -103 665 -38 -206 -241 -530 185 -1000
3454 -1000 -137 -333 -167 -427 -336 -78 -894 -26 264 31 190 405 -504 -683 114 189 -279 -1241 813 -111
3474 -111 34 -636 119 413 -152 -136 -523 -562 -403 -50 -604 90 136 12 -228 249 -301 -121 115 -46 145
3495 145 30 145 135 203 -324 104 228 -79 379 171 390 234 408 534 -33 -6 519 -22 98 169 -8
3516 -8 -204 156 199 603 755 -186 170 -46 4 -70 -422 -543 -686 -54 128 -365 41 -132 -24 317 173 58
3538 58 -19 -201 -206 -286 9 -3 -8 13 -532 -593 343 -729 48 -530 69 -254 -146 -447 176 -694 -216 271 -788
3561 -788 -227 -416 76 183 92 -314 125 73 195 -17 292 62 234 573 234 89 -153 125 413 357 -107
3582 -107 475 498 188 274 396 103 -33 -83 257 206 -24 163 98 82 -60 88 -33 199 -138 -58 276 -215
3604 -215 123 -231 -302 -22 -25 -13 12 -231 -58 -219 -267 -96 -24 -283 -296 -155 -133 -54 -199 -88 15 -149 -76 -33
3628 -33 -119 -246 1 -102 -345 -189 -85 26 -190 -6 -202 -68 89 44 82 133 78 138 69 -80 193 328 298
3651 298 162 -92 85 202 56 53 283 204 321 -118 411 211 300 321 247 -15 -10 -590 596 411 -14 296
3673 296 226 66 393 248 16 230 -70 221 80 -452 -77 103 -203 -122 14 -53 -351 62 112 126 7 -266
3695 -266 -330 -143 -9 -227 -514 -394 -149 -121 66 527 -40 -266 -249 -846 -646 -575 111 -270 -360 309 -460 -289
3717 -289 346 260 396 106 -3 529 722 203 36 133 818 463 -98 159 56 541 -30 -285 157 495 337
3738 337 -206 215 481 96 546 296 286 224 599 435 90 87 -569 370 -280 -525 -219 176 222 -335 513 -205
3760 -205 95 311 -312 -251 100 -427 -73 -50 -968 -178 -669 -270 -381 -505 75 -420 2 -77 95 -773 -417
3781 -417 392 -376 -113 -64 -205 -137 -359 -73 126 -9 159 -5 162 -160 -560 -155 -619 311 241 214 -42
3802 -42 26 104 -183 141 -163 67 138 162 357 -225 -165 394 50 492 -33 568 -108 -245 -155 -236 -54 -286 -173
3825 -173 -256 -313 -37 -307 -106 -415 1 215 -211 91 230 -40 -310 -238 -475 191 -137 73 -276 -127 -131 -342
3847 -342 74 -255 -321 -430 -106 -130 -405 -142 -262 -380 -152 -144 -207 -71 -205 -72 -40 47 -152 35 186 120 192
3870 192 199 213 44 160 291 217 105 292 2 -14 39 -89 69 126 150 184 26 146 133 89 183 224 100 136 49
3895 49 190 41 40 151 21 323 308 -181 -20 287 180 -76 -234 -269 -155 169 31 -74 -499 -273 -152 -228
3917 -228 43 -87 -83 88 127 -463 -304 135 -212 -245 -223 -238 35 -197 57 -200 -162 10 17 -456 35 163 -60
3940 -60 49 -98 4 150 -42 48 180 166 -60 10 -75 -88 24 -8 130 182 -87 285 141 102 206 78 209
3963 209 8 313 98 47 303 60 148 48 30 251 78 -58 -104 110 65 -150 -201 26 -17 -160 -8 135
3985 135 140 -160 -236 -7 -144 -55 -90 -23 8 -270 -177 -199 -312 -139 48 -198 -275 -237 -44 -149 -136 179 49 75
4009 75 89 -50 -473 -280 115 95 -38 22 -190 137 322 -257 420 394 128 332 -34 -118 -67 -63 254 -159 102
4032 102 299 -566 319 -190 247 54 249 265 -215 133 349 -2 -227 290 -79 788 -132 622 278 -149
4052 -149 214 892 58 553 -138 153 -184 28 -368 126 -336 -180 -273 -156 -378 -48 482 -197 -179 -49 -322
4073 -322 -579 -248 138 218 15 -146 -284 49 -100 237 334 -140 -213 144 -347 146 278 124 -176 -95 41
4094 41 242 -276 30 285 195 69 331 245 137 248 -57 160 -90 179 142 333 -55 85 99 85 192 -72
4116 -72 171 96 -76 238 215 174 168 182 -41 -176 -128 -254 -423 -27 160 70 -308 -157 -175 -88 -78 -83 -318 42 6
4141 6 -98 108 96 -323 -355 -327 -226 -234 166 -144 -155 -194 118 -70 -135 -50 -124 -43 -211 -58 -39 -104 -70 -36 -25 -111
4167 -111 232 230 70 -191 115 -191 -121 309 126 109 10 173 140 353 -17 334 28 259 319 -46 115 -26
4189 -26 203 208 -172 59 49 226 39 32 57 70 -14 -253 -21 -186 -12 93 -20 -227 -316 77 41 -84 -148 -19
4213 -19 -78 -52 -52 -113 -241 -277 -83 153 -72 210 62 -112 136 -167 -133 -79 -109 -114 113 160 -256 -46 154 -68
4237 -68 -125 60 -289 187 322 -510 187 367 -357 -230 367 -453 345 284 -195 201 692 -67 101 224 319
4258 319 250 -606 350 -378 -672 -260 479 611 259 393 468 -755 -655 -189 415 -615 -280 -398 158 86
4278 86 130 -136 -10 -45 94 -364 -131 58 -524 -128 -88 -141 -91 157 -183 -16 -618 -172 -105 130 78 -226 -170
4301 -170 92 -257 -409 32 2 -346 -102 103 97 144 -97 -175 -46 176 415 -22 467 311 152 428 640 -143
4323 -143 115 209 -76 134 140 70 150 -35 160 55 -266 -33 360 413 320 87 251 -221 -52 181 -43 86
4345 86 244 232 -468 -362 -228 -314 -450 -10 -105 -588 -319 -187 263 1 440 428 -444 124 -517 -327 -636 -315
4367 -315 -195 -633 -59 136 -231 -192 141 31 130 -415 -425 -212 -170 -37 -194 212 -272 -133 -35 -267 -220 130
4389 130 -214 -292 -84 -89 271 306 196 -37 -45 192 299 349 -4 -135 141 155 -235 159 188 162 123 71 126 182 169
4414 169 -139 -25 -263 35 -51 81 110 -9 44 -194 71 6 80 -74 94 73 -96 -31 -215 173 -495 -1
4436 -1 -105 -112 97 -185 9 -101 -244 68 -87 69 -154 69 -143 -15 85 -270 -76 -324 -124 -112 -199 -328
4458 -328 151 -99 -83 -227 -375 139 71 168 -22 263 153 234 145 -273 171 -128 200 -56 28 271 383 165
4480 165 -62 100 -92 26 213 205 295 511 -8 53 -372 489 176 -250 -104 219 324 -627 135 -171 169
4501 169 209 80 -48 -150 446 291 229 -229 -17 -570 144 -372 276 -486 -12 -401 -528 -488 -280 -527 -364
4522 -364 -307 -417 148 -6 -211 -265 -136 -382 -226 -38 -226 11 3 27 -74 456 168 12 98 -140 276 140
4544 140 44 -71 293 -68 -205 302 -91 -185 104 -187 14 -100 -38 -142 -241 -110 -111 -132 334 67 118 157 309
4567 309 244 32 32 -112 317 -84 -33 17 48 429 96 -245 -71 247 -200 121 -378 -558 37 -171 73 -106
4589 -106 -11 -144 124 -259 -241 -314 -80 287 179 -145 -426 -262 -366 159 -105 153 101 -270 224 -97 -230
4610 -230 -244 -140 28 245 -24 266 -136 158 -326 526 52 83 -212 40 655 335 125 -108 85 233 -65
4631 -65 -52 393 -465 142 323 199 -130 -106 381 62 392 231 -307 -60 -230 -399 -222 -143 -486 -178 289
4652 289 -10 -210 107 130 -119 260 -136 557 -561 -31 -1 -77 44 117 -325 164 -660 -350 213 -140 -597
4673 -597 195 -333 -777 -112 -350 -376 -462 -92 94 -613 -150 -257 -8 147 466 40 151 -269 -123 -271 290
4694 290 -280 -257 -95 -284 329 324 232 -160 101 -196 87 -558 -790 188 952 67 -181 373 115 449 -64
4715 -64 -284 75 -3 356 231 -343 56 64 556 40 276 240 487 227 -133 -165 -166 -106 -1276 257 -98 -829
4737 -829 -875 -104 492 5 240 214 597 -539 218 579 -507 36 -868 568 -1453 -473 284 -666 341
4756 341 342 -163 178 114 -35 -480 -310 -235 -173 -200 69 88 -381 124 48 240 29 -121 131 82 -42 442 373
4779 373 -230 -66 72 403 413 10 -30 237 39 -30 233 87 -451 -80 490 161 37 185 -6 148 269
4800 269 -279 25 262 1 445 -459 -647 -275 137 -355 -464 -184 72 17 -14 227 92 21 -56 -85 79 -70
4822 -70 -165 127 -342 -149 -95 128 28 -105 -252 0 -80 56 -107 268 72 225 32 -89 173 84 -41 -44
4844 -44 -170 -300 -584 321 265 340 2 -678 -416 -609 492 -323 359 -160 338 360 466 -585 -387 -103 -280
4865 -280 -116 173 121 57 193 391 -357 45 -41 -642 117 -438 48 137 -181 25 -177 -203 300 -411 298 87
4887 87 372 -201 -392 -1 -327 247 29 -6 76 -885 370 -188 22 -353 700 -200 -318 237 -160 267
4907 267 -102 -280 239 102 -164 -11 -61 64 -166 -219 151 56 -233 -5 57 82 270 227 427 -295 340 -35
4929 -35 -73 475 -714 -219 -167 -268 -313 499 349 13 164 273 -430 -307 -233 547 110 -260 -144 -283 102
4950 102 61 36 -784 -36 213 -269 -35 147 -283 -359 80 -115 -487 -16 122 652 -302 205 -314 -690 59
4971 59 -311 10 -247 29 -369 275 -238 -329 -208 559 68 -470 171 27 88 290 1 -925 -264 223 -233
4992 -233 -160 12 -75 -13 -80 106 -300 23 -284 140 249 389 -109 50 383 -47 -108 353 176 233 -105 19
5014 19 -181 -27 22 573 170 190 313 -31 49 -49 -350 52 -193 -25 -267 56 -38 69 -67 -31 75 -65
5036 -65 -131 -90 8 -370 -86 -214 -257 -71 -85 -229 -103 -283 191 -172 -110 111 -46 -19 -134 -3 -203 168 240
5059 240 151 256 50 -24 -98 -145 -40 -56 60 25 105 812 -124 65 -268 163 528 -124 -159 146 215 -246 -260
5082 -260 454 -163 255 -50 242 -337 -190 -558 96 -10 -259 -465 -47 -44 403 164 182 -15 -370 490 -69
5103 -69 1052 15 269 -198 -29 274 -515 444 -225 -510 106 -300 -599 -431 -82 248 -825 113 128 -370
5123 -370 177 -266 -273 95 -425 -549 -212 -456 -78 -68 634 718 -518 -316 -20 -108 -344 247 -132 -287 356
5144 356 318 63 87 -373 -84 255 462 349 -19 358 -29 464 -200 -59 386 390 53 -11 344 -364 -76 169
5166 169 -60 301 618 515 340 -331 19 1024 217 -651 307 -199 290 -721 -215 191 -178 -264 78 -29
5186 -29 -352 444 -423 -51 13 7 165 178 260 -469 -454 686 -228 -3 209 -296 -801 -604 71 -73 25 272
5208 272 -231 21 593 -182 -25 362 702 142 -771 -31 731 359 -15 -647 -1020 339 -121 373 46 -108
5228 -108 -285 -195 -314 149 188 361 -538 -166 -296 -344 420 349 -23 2 -15 -299 -42 0 443 271 123 151 -217
5251 -217 132 -228 -515 95 -331 -416 449 38 -69 443 116 -227 -137 -18 67 -168 -86 187 -248 -173 -456 286
5273 286 -72 -271 -388 405 392 -174 -17 166 51 -244 -50 -272 -168 -430 -375 -85 62 282 322 361 58
5294 58 126 345 -213 511 122 -162 246 562 175 120 16 -322 300 103 -204 740 25 -106 417 101 -43
5315 -43 316 -665 221 -381 38 -718 405 994 -117 221 121 -51 -166 520 261 -559 472 192 581
5334 581 373 401 90 394 160 88 290 -52 -81 -269 -305 18 -598 109 412 394 858 252 -229 -291 478 103
5356 103 178 43 -175 -244 360 -173 69 435 -301 -206 248 197 192 72 184 -256 214 349 -404 294 3 163
5378 163 -88 239 248 98 48 199 88 71 -164 -344 -207 210 328 216 662 44 -48 14 -261 417 -377 -466
5400 -466 -71 -216 513 -435 210 -141 -196 -57 -125 -29 -219 191 -104 -68 -258 235 81 -138 -193 172 -389 382
5422 382 -218 40 95 365 -115 -83 -275 -943 -198 477 -350 -285 -73 -348 -186 440 -341 235 -256 -234 461
5443 461 -192 -389 -311 154 42 309 -116 -64 258 326 88 -7 207 10 -42 -16 841 256 39 232 192 -12
5465 -12 -206 54 43 -43 124 690 0 259 -260 -217 130 -249 -115 -184 198 -425 81 -87 38 -33 220 -106
5487 -106 -476 113 -83 105 -239 -166 -123 10 91 14 -5 -179 -184 197 111 0 159 108 165 210 -160 -71 81 -159
5511 -159 280 -4 45 94 54 167 131 22 234 -53 108 253 48 -61 0 113 -165 -28 111 -143 116 386
5533 386 31 -64 -68 -19 274 -64 240 143 -17 23 -117 129 10 4 96 -281 -270 120 -174 -85 68 -32 29 203
5557 203 -38 -59 -107 -71 167 166 -188 149 -135 -20 -68 -235 -82 81 -157 -257 -179 -131 -59 -325 -73 19 59 7
5581 7 106 98 -43 -12 -58 -80 -156 -11 -197 -180 -139 93 124 -97 81 49 87 43 -50 143 146 280 -77 79 261 -90
5607 -90 36 66 -17 168 111 -59 88 46 205 185 -113 66 138 -235 71 -120 41 29 173 -272 93 -30 18
5630 18 -46 -31 69 131 -119 -71 114 58 -50 -197 198 7 -170 -89 -115 40 -133 62 76 -85 -119 193 -93
5653 -93 117 8 -138 -169 -76 119 -129 -252 -158 5 83 153 298 103 30 183 20 294 70 113 85 304 66
5676 66 50 318 100 342 -17 66 -86 28 57 75 41 -40 61 64 -27 373 -137 51 110 -43 40 -174 -66 46
5700 46 107 -215 186 97 31 54 -54 -25 -139 100 139 -20 -239 -65 -127 10 137 -42 207 -367 -279 -190 154
5723 154 -55 -69 -171 71 213 51 43 -101 -55 -36 -54 -199 134 -2 112 -62 78 266 104 -29 141 1
5745 1 206 208 -168 -158 -73 -139 -257 196 -34 68 224 111 487 54 -25 109 119 82 -233 287 14 41 255 129
5769 129 219 -545 457 136 107 -204 -161 -395 168 317 -106 31 -18 -217 -389 -895 145 276 248 -52 -22
5790 -22 -397 -366 617 -51 -959 -478 -3 134 -335 -263 525 -707 647 461 540 -403 267 -71 523 92 126
5811 126 -42 132 115 221 -136 441 106 -341 222 347 -92 61 104 75 -339 -109 808 -393 -303 -264 -131
5832 -131 1019 -151 92 -126 574 509 -105 8 301 -453 -184 22 -412 442 -97 712 -197 -282 -104 388
5852 388 -678 580 27 38 41 -272 -400 -154 -382 -395 -170 -324 -108 -284 -68 -480 189 -648 573 -280
5872 -280 -208 -27 486 -181 257 205 -455 -99 -280 -75 -561 -816 215 437 -31 -99 -298 -13 -558 70 44
5893 44 -431 -353 -221 -536 -11 1069 289 -438 -319 694 -342 757 120 356 134 62 92 -276 -242 -748
5913 -748 -346 -444 -674 -72 958 467 -548 -400 -692 274 517 453 -1277 -207 -203 618 -887 -160 -210 178
5933 178 516 -691 -170 -190 -711 -295 -247 292 141 -753 -220 90 824 914 -603 -436 287 307 -151 -655 -81
5954 -81 30 371 191 398 -934 -127 130 549 -241 319 34 366 315 513 303 204 -801 -28 -147 212
5974 212 -709 93 899 -22 502 71 -353 18 62 -125 -1 122 325 219 -20 121 570 -187 1441 593
5994 593 834 -504 131 419 -598 791 -223 -493 343 -26 365 -372 -477 631 -247 590 413 -119
6012 -119 386 840 -513 -532 181 18 105 9 -308 648 859 168 644 -68 685 -179 -61 98 -672 917
6032 917 -83 149 -614 708 -613 -266 -84 44 -129 561 -402 -882 557 -18 454 231 73 301 -53
6051 -53 816 63 -551 134 832 1347 718 -780 372 271 505 922 -75 277 -368 64 990 -112 770
6070 770 -410 45 -129 324 -321 -81 -541 528 -975 1196 626 561 598 125 -383 319 348 -452 345 594
6090 594 -132 -162 180 161 122 -606 -918 -18 -25 -616 -410 -131 -405 3 682 10 -226 707 -549 550 621
6111 621 -454 963 -263 338 -408 689 44 144 276 -626 -866 49 321 -6 -499 809 593 316
6129 316 -284 -438 384 -161 -673 14 37 279 270 -304 -562 74 -101 -90 537 -623 -424 638 -191 -323 -178
6150 -178 411 -849 439 113 167 -381 212 121 6 95 -266 59 296 805 163 -180 -202 -145 73 -140 -1
6171 -1 26 -146 -115 36 -150 -146 84 1 20 -28 -107 -148 -233 14 -171 -131 4 141 417 248 -148 223 263 29 36
6196 36 -194 56 -197 96 563 565 94 53 40 -134 165 -425 -23 390 62 -132 -149 75 -43 -25 121 9
6218 9 -73 63 21 144 61 -168 -46 38 -84 68 -87 96 -67 117 69 112 -15 -111 206 -390 -32 -2 149
6241 149 -35 -336 -92 -300 -53 -176 106 -250 -41 -160 114 -31 -2 -110 -315 -63 -236 202 100 179 -48
6262 -48 -84 -372 -283 -43 -352 -21 -47 -163 -45 384 -18 46 -186 -93 -178 57 148 31 308 127 -39 43 -191
6285 -191 -85 -26 -9 125 221 -69 -69 31 -173 -99 56 87 295 -161 -114 13 -44 -211 132 -145 20 -309 102
6308 102 -57 92 -159 52 -198 74 192 -10 -109 -93 98 -38 -23 66 124 -223 189 -79 16 158 -69 -279
6330 -279 -37 92 -92 -75 34 -297 220 -5 -57 53 49 -149 53 -7 589 264 -24 468 -352 -255 -211 -96
6352 -96 -243 224 -173 442 247 250 83 -17 401 -238 -130 -281 -239 306 86 -565 599 -231 -115 -233 414
6373 414 -440 -576 493 -19 969 1003 -302 444 493 47 133 52 -64 599 -160 -204 23 -975 53 -523 -186
6394 -186 62 -269 -959 219 -46 51 43 38 -615 454 -21 -31 -144 -244 144 -43 244 57 -85 64 324
6415 324 617 580 67 224 508 178 301 682 -58 -71 -412 -166 727 -183 275 -74 -147 -261 -220 -65 -405
6436 -405 271 517 -306 -116 -254 188 -433 575 -87 297 -172 120 -502 313 114 -71 -60 -315 -8 -41
6456 -41 -423 -722 13 -608 -157 278 351 109 31 -599 -197 173 -142 285 -533 1 53 -130 336 15 -149
6477 -149 375 155 -281 -181 -218 436 122 -113 203 414 -39 -147 -285 101 -85 -108 -310 -29 80 15 -226
6498 -226 301 12 36 363 -74 217 -128 123 81 14 -160 -199 23 73 156 26 -72 -181 163 106 127 -7 -156
6521 -156 241 -50 110 -102 15 -88 -294 43 -139 333 149 -191 -66 4 -134 -228 -66 -174 -513 -48 -366
6542 -366 -39 124 535 551 13 -45 -75 744 298 195 255 262 -573 134 430 121 -194 -108 -289 -297 -540 317 -403
6565 -403 -124 19 214 418 -339 -213 -85 153 239 230 228 26 -161 73 51 -71 82 212 168 -150 -241 -122 -60
6588 -60 -138 134 76 -48 -145 -397 -285 154 98 173 -30 -251 114 211 104 -49 428 19 -471 55 -438 187
6610 187 -388 356 -144 -237 115 83 -180 -110 8 -272 -299 196 -42 87 38 62 238 -413 130 42 -2 -837 -127
6633 -127 -427 -734 425 341 -590 -60 966 -103 68 446 241 130 -276 59 126 -1 -18 50 -117 -57 204
6654 204 -258 -53 12 163 339 168 89 -227 -80 -459 451 174 648 -519 -948 313 -193 237 339 180
6674 180 532 383 74 -144 -361 -851 -1054 -133 429 24 600 -874 -62 -245 82 -163 703 216 380 -1202
6694 -1202 360 -254 -327 560 -173 -101 -112 256 -712 -432 361 -688 -298 -368 -614 -37 11 34 -200 -342 56
6715 56 -149 56 207 -367 -492 -13 -61 -116 238 -546 -1137 42 -43 -575 183 -221 -1156 695 -24 663 -271
6736 -271 -413 -32 -507 280 1195 -109 -58 59 98 -55 -341 -354 -285 731 -343 1007 352 201 -517 -278
6756 -278 313 526 -64 484 -130 613 -289 474 167 703 189 -254 59 -607 -686 384 -304 -572 41 -59
6776 -59 -28 -1361 606 574 -424 53 59 18 1 577 -495 426 456 214 -309 -335 598 348 939 -689 184 253
6798 253 -35 -128 517 370 38 63 -495 -171 -234 629 283 -120 -393 381 29 -118 -224 -27 -345 3 -619
6819 -619 -75 109 -317 395 262 12 486 1 -247 103 -713 422 92 -403 138 -438 -58 223 477 -60
6839 -60 -435 -200 -258 -296 -716 -10 192 -68 -134 172 100 -14 127 -129 -22 65 -4 65 197 -148 20 28 189
6862 189 -101 62 -66 -210 -13 -11 303 124 15 -119 -55 353 201 101 -3 32 17 -320 -72 -124 42 185
6884 185 -230 302 7 -59 -129 7 130 51 -247 67 -20 -288 63 5 -299 54 -197 -270 33 -101 -146 -73 155
6907 155 -229 -281 35 -453 335 46 189 -234 -28 -300 -248 -225 709 -403 -833 -598 475 -309 -597 384
6927 384 -125 -440 -383 204 900 502 -111 301 49 -110 237 -61 279 122 122 374 -349 543 -121 -88 -65 -36
6949 -36 333 -134 -122 -245 -43 -118 -63 -14 128 -114 76 -16 -73 -124 80 26 -52 -78 -208 -322 195 51 1 -38
6973 -38 0 21 80 134 -95 -94 -34 -190 -133 199 -136 -157 -16 -72 -59 -53 58 -77 -221 -68 -215 204 -38 75 -150
6998 -150 -172 174 -277 53 -66 -41 1 84 -252 49 29 -11 138 -177 53 168 -175 -292 64 104 180 155 53
7021 53 -109 -38 151 4 -84 -103 -66 -142 177 -97 -74 -101 -71 127 87 45 -52 73 66 -132 -8 273 129 -9 -21
7046 -21 -177 86 288 -47 383 -68 -188 16 49 67 -19 -214 172 52 -93 3 -107 -16 -2 10 260 -29 188
7069 188 -221 -41 236 -45 59 -190 73 -210 212 -222 -212 -212 -100 -97 -222 39 222 -124 154 -143 -238 247
7091 247 240 -103 325 -196 227 -84 188 312 462 -139 -21 114 -172 100 183 111 338 -600 776 59 -344
7112 -344 182 834 -386 -1224 25 -196 202 67 -77 290 -149 199 -142 9 172 -138 -420 -36 119
7131 119 -561 13 -559 335 235 -293 401 150 138 -59 65 204 -163 271 -212 -144 -21 -361 -56 -34 -273
7152 -273 576 -64 220 347 85 -142 287 -235 -241 -141 294 166 24 113 248 78 195 -94 219 347 -117
7173 -117 143 169 208 144 107 -19 -26 193 118 120 -136 61 -181 -196 235 -132 -275 49 -292 227 99 -230 62
7196 62 136 -239 99 120 58 83 57 -46 -135 -54 -78 -233 78 247 -117 -112 -113 185 47 -48 6 61 184 -179 -259 -67
7222 -67 -158 196 -203 -112 -196 -136 -42 -8 -96 -157 304 -143 129 -172 2 107 -123 -54 52 13 23 19 -477 104 224
7247 224 379 -118 498 82 -590 -152 -393 587 336 -346 -180 -342 -107 371 -697 -67 -319 301 419 -397
7267 -397 -272 350 202 -36 382 438 467 -707 -135 -227 -218 169 -385 -35 498 399 174 142 -47 1 262 -333
7289 -333 -151 196 203 -276 -364 108 643 -531 -656 -443 636 -231 133 -202 764 -391 -504 269 -491 -226
7309 -226 -213 353 313 148 418 65 -38 53 -457 -77 674 -124 272 608 471 -315 118 196 -882 -152 219
7330 219 185 74 291 601 153 744 97 240 -74 36 -136 371 -337 23 344 -144 73 -276 88 -133
7350 -133 -484 -508 -43 -83 259 163 384 -591 -264 -185 -105 -126 -346 -137 -401 222 178 -230 389 -331 -217 -225 215
7373 215 213 -171 -21 -88 -200 145 89 -884 -692 149 166 188 -184 234 -75 -246 214 -425 -11 111 405 -258
7395 -258 175 538 -18 355 448 -117 30 26 -112 309 -66 -579 -15 22 278 73 186 -133 300 96 18 20
7417 20 291 284 -60 275 -98 -197 -194 -189 -113 -638 49 -183 147 -231 -325 -467 29 246 -296 -641 -487 132 -53
7440 -53 435 -271 401 257 138 -171 -94 -467 44 225 33 158 -198 -131 -142 66 -6 45 366 -60 201 -281
7462 -281 182 -189 -315 -17 -115 392 -418 -101 -46 109 -212 21 -35 -282 238 212 534 145 39 -414 118
7483 118 -127 237 313 -24 -378 -298 -205 147 -331 351 -359 -83 -154 -196 52 -312 242 -140 22 -73 -203 14
7505 14 -221 326 83 -62 18 263 81 -70 -5 -232 136 -69 -471 44 -408 97 161 -92 209 -210 -188 -92
7527 -92 376 -163 -70 200 -369 436 -232 -201 -341 239 481 -699 -82 -68 -543 129 233 48 -137 -350 -49
7548 -49 285 -373 340 259 85 -240 241 -14 190 205 36 131 -96 70 346 -62 243 342 -296 -69 67 111
7570 111 -521 243 -201 -297 -139 70 135 326 81 -786 461 -250 -359 -30 25 450 -296 154 479 -568
7590 -568 299 -152 351 -104 -290 631 74 184 703 -192 -99 321 281 -135 -639 -672 -205 143 -268 182 243
7611 243 162 -63 33 -46 -303 238 180 -315 408 141 -360 1267 44 -57 -110 -586 -389 -633 -859 60 26
7632 26 778 -95 -443 -625 -137 650 108 -452 246 399 807 64 409 13 -60 -25 508 -94 -79 -226 79
7653 79 -61 -300 300 361 -197 360 -18 -134 285 -167 -58 -165 -220 -38 -223 80 1 -332 76 -168 -130 -504
7675 -504 -83 2 64 -107 303 -82 -271 158 212 264 -254 -120 -143 635 343 -316 -186 -333 -323 680 504 -152
7697 -152 161 380 -495 185 124 417 118 9 158 -639 181 -489 -320 -78 425 181 -534 -618 -307 153 -614
7718 -614 -154 67 -250 -3 -283 256 156 468 218 390 240 160 92 -49 445 1 -56 -401 82 -475 -267
7739 -267 163 108 176 432 77 142 77 -2 401 292 104 -589 316 161 114 -774 -95 -406 199 87 69 603
7761 603 286 -26 -136 -261 994 386 -219 18 -236 -397 -154 13 1050 111 84 -402 -379 697 108 -147
7781 -147 1173 273 302 -700 103 -3 -157 107 190 319 249 208 760 -2 488 447 -578 -45 -491 -236 -395
7802 -395 162 -467 281 605 25 264 410 256 63 160 -24 -635 197 -341 -193 -234 -377 -627 56 5 -614
7823 -614 98 -124 -112 209 -13 322 117 -763 -324 722 201 -10 503 50 -154 -835 -988 63 432 134
7843 134 50 215 152 -130 214 1 -565 -922 -465 172 -88 701 -243 -119 -244 97 -163 -131 184 52 -101
7864 -101 -394 7 213 330 -16 -243 81 -31 -240 -242 -114 204 21 90 129 261 -110 -307 -29 123 109 -76
7886 -76 112 69 -352 -59 39 -216 -82 -203 -9 -358 -35 61 221 -156 -9 -88 128 36 -75 -36 141 53 -375
7909 -375 -38 -63 -36 -273 28 135 -129 115 95 -120 146 300 136 16 -186 -62 92 -97 213 15 31
7930 31 198 82 53 23 -84 -91 99 -108 -8 -23 97 70 -87 -103 -22 -13 -85 185 -53 202 -245 346 291 300 188
7955 188 -202 132 -348 -557 -182 -583 -196 102 238 -101 -45 -71 -612 -45 -2 -240 -105 307 -51 689 -205
7976 -205 191 -812 -424 453 125 601 -245 -395 471 -64 521 254 -42 231 -345 -81 394 187 -159 444
7996 444 626 -137 -367 -210 199 300 452 -369 174 71 -119 104 -123 55 159 310 -154 -207 -63 -95 -177
8017 -177 148 -252 -73 57 37 55 134 84 -70 212 -176 217 54 -65 16 -218 -88 12 123 -96 -180 -151
8039 -151 -52 -25 103 160 165 131 -123 38 -228 225 -347 -87 -192 14 -95 -13 -355 235 262 0 141 -244 118
8062 118 139 167 125 -62 23 69 -133 277 50 38 -28 -309 46 -36 -203 59 81 211 -3 64 113 -215 100 -85
8086 -85 70 460 166 14 -192 -288 -409 28 -278 7 188 -13 -33 51 66 -48 15 -287 15 -328 18 85
8108 85 -213 189 -124 -334 -115 -103 18 99 -302 -145 -224 43 -219 -67 -29 -29 -109 -51 -265 165 -29 -135 81
8131 81 235 -448 76 37 212 296 170 13 -103 -326 -35 -340 -79 451 -258 -48 -110 -159 15 7 -253 -75
8153 -75 -485 428 -117 -86 -230 -362 -1073 -325 42 137 -871 -274 1045 94 -251 -30 -39 89 401 156 -246
8174 -246 -639 -347 -277 -199 35 -56 -371 85 805 390 -326 -359 319 -284 -494 555 31
8191C1
##END NTUPLES=NMR FID
##END=
