##TITLE=1H_LR-731-C1A
 CDCl3, 8 sc, 
 17.12.2020
##JCAMPDX= 6.0         $$ Bruker NMR JCAMP-DX V2.0
##DATA TYPE= NMR FID
##DATA CLASS= NTUPLES
##ORIGIN= UXNMR, Bruker Analytische Messtechnik GmbH
##OWNER= root
$$ XWIN-NMR		Version 3.5
$$ Thu Dec 17 10:31:40 2020 Russian Standard Time (UT+4h)  she@DPX200
##.OBSERVE FREQUENCY= 200.1315066352
##.OBSERVE NUCLEUS= ^1H
##.DELAY= (6, 6)
##.ACQUISITION MODE= SIMULTANEOUS
##.ACQUISITION SCHEME= undefined
##.AVERAGES= 8
##.DIGITISER RES= 18
##SPECTROMETER/DATA SYSTEM= spect
##.PULSE SEQUENCE= zg30
##.SOLVENT NAME= CDCl3
##.SHIFT REFERENCE= (INTERNAL, CDCl3, 0, 15.7039)
##AUDIT TRAIL= $$ (NUMBER, WHEN, WHO, WHERE, WHAT)
$$ ##TITLE= Audit trail, XWIN-NMR		Version 3.5
$$ ##JCAMPDX= 5.01
$$ ##ORIGIN= Bruker BioSpin GmbH
$$ ##OWNER= she
$$ F:/spectra/data/she/nmr/H-F/1/audita.txt
$$ ##AUDIT TRAIL=  $$ (NUMBER, WHEN, WHO, WHERE, WHAT)
(   1,<2020-12-17 10:30:43.28 +0400>,<she>,<DPX200>,
      <created by zg, POWCHK disabled, PULCHK disabled
       configuration hash MD5:
       00 E9 B6 7A A2 85 ED C7 34 08 36 98 17 FE 4E 26
       data hash MD5: 16K
       6B 84 C1 F7 82 F6 66 ED CA FD DC 58 8D 5A 1D CE>)
$$ ##END=
$$ 
$$ hash MD5
$$ 66 3B 42 8E A3 F5 DE A0 B0 A5 33 06 88 6E 5B 62
##$RELAX= 
##$RELAX= 
##$RELAX= 
##$RELAX= 
##$RELAX= 
##$RELAX= 
$$ Bruker specific parameters
$$ --------------------------
##$DU= <F:/spectra>
##$EXPNO= 1
##$NAME= <H-F>
##$PROCNO= 1
##$TYPE= <nmr>
##$USER= <she>
##$AMP= (0..31)
100 100 100 100 100 100 100 100 100 100 100 100 100 100 100 100 100 100 
100 100 100 100 100 100 100 100 100 100 100 100 100 100 
##$AQSEQ= 0
##$AQ_mod= 1
##$AUNM= <au_zg>
##$AUTOPOS= <>
##$BF1= 200.13
##$BF2= 200.13
##$BF3= 200.13
##$BF4= 200.13
##$BF5= 200.13
##$BF6= 200.13
##$BF7= 200.13
##$BF8= 200.13
##$BYTORDA= 1
##$CFDGTYP= 0
##$CFRGTYP= 5
##$CHEMSTR= <none>
##$CNST= (0..31)
1 1 145 1 1 1 1 1 1 1 1 1 1 1 1 1 1 1 1 1 1 1 1 1 1 1 1 1 1 1 1 1 
##$CPDPRG= <>
##$CPDPRG1= <>
##$CPDPRG2= <>
##$CPDPRG3= <>
##$CPDPRG4= <mlev>
##$CPDPRG5= <mlev>
##$CPDPRG6= <mlev>
##$CPDPRG7= <mlev>
##$CPDPRG8= <mlev>
##$CPDPRGB= <>
##$CPDPRGT= <>
##$D= (0..31)
0 1.2 0 0 0 0 0 0 0 0.06 0 0.03 0 0 0 0 0.0002 0 0 0 0 0 0 0 0 0 0 0 0 
0 0 0 
##$DATE= 1608186642
##$DBL= (0..7)
120 120 120 120 120 120 120 120 
##$DBP= (0..7)
150 150 150 150 150 150 150 150 
##$DBP07= 0
##$DBPNAM0= <>
##$DBPNAM1= <>
##$DBPNAM2= <>
##$DBPNAM3= <>
##$DBPNAM4= <>
##$DBPNAM5= <>
##$DBPNAM6= <>
##$DBPNAM7= <>
##$DBPOAL= (0..7)
0.5 0.5 0.5 0.5 0.5 0.5 0.5 0.5 
##$DBPOFFS= (0..7)
0 0 0 0 0 0 0 0 
##$DE= 6
##$DECBNUC= <off>
##$DECIM= 32
##$DECNUC= <off>
##$DECSTAT= 4
##$DIGMOD= 1
##$DIGTYP= 9
##$DL= (0..7)
0 120 120 120 120 120 120 120 
##$DP= (0..7)
150 150 150 150 150 150 150 150 
##$DP07= 0
##$DPNAME0= <>
##$DPNAME1= <>
##$DPNAME2= <>
##$DPNAME3= <>
##$DPNAME4= <>
##$DPNAME5= <>
##$DPNAME6= <>
##$DPNAME7= <>
##$DPOAL= (0..7)
0.5 0.5 0.5 0.5 0.5 0.5 0.5 0.5 
##$DPOFFS= (0..7)
0 0 0 0 0 0 0 0 
##$DQDMODE= 0
##$DR= 18
##$DS= 0
##$DSLIST= <SSSSSSSSSSSSSSS>
$$ [...]
##$SUBNAM2= <"">
##$SUBNAM3= <"">
##$SUBNAM4= <"">
##$SUBNAM5= <"">
##$SUBNAM6= <"">
##$SUBNAM7= <"">
##$SUBNAM8= <"">
##$SUBNAM9= <"">
##$SW= 16.9725356469052
##$SWIBOX= (0..15)
0 0 2 0 0 0 0 0 0 0 0 0 0 0 0 0 
##$SW_h= 3396.73913043478
##$TD= 16384
##$TD0= 1
##$TE= 0
##$TE2= 300
##$TE3= 300
##$TEG= 300
##$TL= (0..7)
0 120 120 120 120 120 120 120 
##$TP= (0..7)
150 150 150 150 150 150 150 150 
##$TP07= 0
##$TPNAME0= <>
##$TPNAME1= <>
##$TPNAME2= <>
##$TPNAME3= <>
##$TPNAME4= <>
##$TPNAME5= <>
##$TPNAME6= <>
##$TPNAME7= <>
##$TPOAL= (0..7)
0.5 0.5 0.5 0.5 0.5 0.5 0.5 0.5 
##$TPOFFS= (0..7)
0 0 0 0 0 0 0 0 
##$TUNHIN= 0
##$TUNHOUT= 0
##$TUNXOUT= 0
##$USERA1= <user>
##$USERA2= <user>
##$USERA3= <user>
##$USERA4= <user>
##$USERA5= <user>
##$V9= 5
##$VALIST= <valist>
##$VCLIST= <CCCCCCCCCCCCCCC>
##$VD= 0
##$VDLIST= <DDDDDDDDDDDDDDD>
##$VPLIST= <PPPPPPPPPPPPPPP>
##$VTLIST= <TTTTTTTTTTTTTTT>
##$WBST= 1024
##$WBSW= 4
##$XGAIN= (0..3)
0 0 0 0 
##$XL= 0
##$YL= 0
##$YMAX_a= 392279
##$YMIN_a= -396470
##$ZGOPTNS= <>
##$ZL1= 120
##$ZL2= 120
##$ZL3= 120
##$ZL4= 120
##$ABSF1= 10
##$ABSF2= 0
##$ABSG= 5
##$ABSL= 3
##$ALPHA= 0
##$AQORDER= 0
##$ASSFAC= 0
##$ASSFACI= 0
##$ASSFACX= 0
##$ASSWID= 0
##$AUNMP= <proc_1d>
##$AZFE= 0.1
##$AZFW= 0.1
##$BCFW= 1
##$BC_mod= 2
##$BYTORDP= 1
##$COROFFS= 0
##$CY= 11.3945322036743
##$DATMOD= 1
##$DC= 2
##$DFILT= <>
##$DTYPP= 0
##$F1P= 15.9154993809931
##$F2P= -4.1035820241983
##$FCOR= 0.5
##$FTSIZE= 0
##$FT_mod= 4
##$GAMMA= 1
##$GB= 0.15
##$INTBC= 1
##$INTSCL= 1
##$ISEN= 128
##$LB= 0.24
##$LEV0= 0
##$LPBIN= 0
##$MAXI= 10000
##$MC2= 0
##$MEAN= 0
##$ME_mod= 0
##$MI= 1.114404
##$NCOEF= 0
##$NC_proc= 0
##$NLEV= 6
##$NOISF1= 3.799351
##$NOISF2= 2.8
##$NSP= 1
##$NTH_PI= 0
##$NZP= 0
##$OFFSET= 15.70392
##$PC= 1
##$PHC0= -10762.67
##$PHC1= 15.00094
##$PH_mod= 1
##$PKNL= yes
##$PPARMOD= 0
##$PSCAL= 0
##$PSIGN= 0
##$REVERSE= no
##$SF= 200.130013532006
##$SI= 16384
##$SIGF1= 3
##$SIGF2= 2
##$SINO= 400
##$SIOLD= 16384
##$SREGLST= <1H.CDCl3>
##$SSB= 0
##$STSI= 0
##$STSR= 0
##$SW_p= 3612.71676300578
##$SYMM= 0
##$S_DEV= 0
##$TDeff= 0
##$TDoff= 0
##$TI= <>
##$TILT= no
##$TM1= 0
##$TM2= 0
##$TOPLEV= 0
##$USERP1= <user>
##$USERP2= <user>
##$USERP3= <user>
##$USERP4= <user>
##$USERP5= <user>
##$WDW= 1
##$XDIM= 8192
##$YMAX_p= 0
##$YMIN_p= 0
$$ End of Bruker specific parameters
$$ ---------------------------------
##NTUPLES= NMR FID
##VAR_NAME=  TIME,          FID/REAL,        FID/IMAG
##SYMBOL=    X,             R,               I
##VAR_TYPE=  INDEPENDENT,   DEPENDENT,       DEPENDENT
##VAR_FORM=  AFFN,          ASDF,            ASDF
##VAR_DIM=   8192,          8192,            8192
##UNITS=     SECONDS,       ARBITRARY UNITS, ARBITRARY UNITS
##FACTOR=    0.0002944,     1,               1
##FIRST=     0,             0,               0
##LAST=      2.4114304,     0,               0
##MIN=       0,             -396470,         0
##MAX=       2.4114304,     392279,          0
$$ Real data points
##PAGE= N=1
##DATA TABLE= (X++(R..R)), XYDATA
0 0 0 0 0 0 0 0 0 0 0 0 -8 8 -8 16 -16 16 -24 32 -40 45 -55 64 -72 88 -103 119 -136 159 -181 207 -237 269
32 269 -306 346 -389 437 -489 547 -611 682 -756 841 -930 1028 -1135 1255 -1384 1524 -1678
49 -1678 1848 -2036 2243 -2474 2730 -3021 3350 -3724 4159 -4668 5275 -6009 6921 -8088 9637
64 9637 -11793 14993 -20229 30160 -55214 239033 289472 -396470 242959 208952 -316095 210017
76 210017 219651 -251764 195689 191031 -182741 101287 143203 -77033 100726 98487 30
87 30 47477 25777 49351 36154 6662 130632 -3052 -61553 167957 -18201 -108770 210275
99 210275 -5294 -131122 211311 -32020 -170335 221096 -10552 -167521 202361 -18717
109 -18717 -176305 167819 -13126 -148813 135215 -7348 -120253 80958 -19864 -87583
119 -87583 41782 -6776 -39629 -9396 -25559 -5925 -42460 -27183 37198 -65225 -41083 59243
131 59243 -85004 -52431 81221 -85957 -54042 95642 -89697 -71356 91330 -74370 -60092
142 -60092 88076 -69458 -62621 76035 -55369 -56980 59657 -35674 -39828 37371 -31280 -31643
154 -31643 18280 -11811 -10192 -1757 -5814 -412 -22499 3208 16427 -31963 9206 25823 -42022
167 -42022 6818 29279 -41506 11748 35364 -39024 4851 29531 -32722 4859 28719 -21252
179 -21252 1821 20245 -12234 -2153 11667 584 1302 5341 8151 -3203 -5455 18484 2035
192 2035 -10807 24365 2788 -17617 26792 3596 -19389 31970 7152 -20641 29327 4899
204 4899 -18067 29152 6332 -11358 25594 2867 -6808 19928 1925 3504 15715 -765 10412
217 10412 8981 -4168 16963 6027 -3898 23333 38 -7988 25752 -1931 -7776 28162 -4193
230 -4193 -7665 26752 -8024 -7623 25972 -8130 -5258 21530 -11935 -4209 17676 -13573 -214
243 -214 14280 -15823 2039 7632 -18585 5957 4301 -19918 8274 -654 -21793 9171 -4630
256 -4630 -21312 11828 -6917 -21435 10109 -9678 -19804 9591 -9892 -17187 7179 -11099
268 -11099 -15678 4770 -9857 -11225 2909 -9728 -8652 476 -9665 -4769 -180 -8631 -1084 -1556
282 -1556 -9157 1989 -1148 -8551 4954 -484 -8543 6517 -293 -8030 8427 2127 -7364 8249
296 8249 3250 -6259 8335 5332 -5125 7290 7426 -4362 4801 8905 -3051 3476 10563 -1996
310 -1996 1295 10942 -1041 -472 11147 777 -1728 9197 1619 -2280 7432 3306 -2589 4204
324 4204 4741 -2471 297 5953 -1167 -3512 6579 464 -7258 6676 2586 -10179 6613 4548
338 4548 -13206 5509 6705 -14951 4654 8974 -15990 2866 10502 -15848 1903 11574 -15070
351 -15070 516 11718 -13827 -168 10995 -10677 -776 9317 -7714 -672 6199 -4979 92
364 92 3995 -1067 405 -98 2151 1871 -3746 4642 3640 -6242 6487 4691 -9390 7722 6737 -11804
380 -11804 8078 8467 -13048 6884 9261 -13742 6055 10222 -13808 4327 10311 -13412 2491
393 2491 9893 -11464 700 7930 -9446 -708 5639 -6767 -1704 2603 -4757 -2524 -650 -2080
407 -2080 -2883 -3074 687 -2905 -5941 1471 -2476 -7926 3644 -1324 -9678 3672 -31 -10907 3802
422 3802 1997 -10626 3201 2846 -10584 2833 4583 -9624 2133 5380 -8676 1194 5859 -6462
436 -6462 939 5919 -4371 715 5213 -2154 624 4266 660 921 2865 2555 902 1487 4398 2137
452 2137 9 5266 2956 -1366 5359 4268 -1897 5341 4982 -3133 4285 5952 -3371 2990 6477
467 6477 -3697 1529 6852 -4039 325 6760 -3424 -956 5745 -3266 -2260 4545 -2394 -2736 3166
482 3166 -1515 -3435 1258 -523 -3202 -538 163 -2870 -1866 507 -2469 -3270 455 -1516 -4347 -158
498 -158 -45 -4761 -572 1226 -4715 -1402 2120 -4739 -2029 3139 -4124 -2291 3633 -3397 -2692 3935
514 3935 -2644 -2289 3764 -1478 -2086 3250 -36 -1579 2706 1113 -1098 1500 1793 -689 717 2224
530 2224 530 48 1962 1277 -776 1852 2236 -1089 1095 2822 -1653 263 3725 -1812 -484 4069
546 4069 -2042 -1538 3957 -2007 -2138 3855 -1748 -2406 2966 -1484 -2776 2242 -1082 -2831 1343 -961
562 -961 -2750 635 -162 -2432 -388 275 -2045 -844 25 -1606 -1479 487 -313 -1542 -33 192 -1731
579 -1731 -190 1150 -1633 -469 1840 -1293 -573 2558 -1039 -550 2855 -602 -672 2837 216 -601
595 -601 2783 1014 -288 2396 1315 -151 1673 1758 173 1609 2369 579 624 2190 879 345 2012
612 2012 1083 -236 1585 1234 -328 820 1383 -631 -25 1568 -986 -486 1366 -945 -1045 1225 -1048
629 -1048 -1581 778 -1063 -2197 299 -822 -2173 -345 -479 -1953 -1243 -305 -2001 -1703 -254 -1529
645 -1529 -2003 -172 -1525 -2123 -204 -943 -1913 -473 -736 -1777 -711 -199 -1588 -303 296 -1192 -737
662 -737 774 -636 -318 989 -235 -342 1078 470 -325 964 935 -9 841 1492 716 870 1798 764
680 764 460 2016 663 425 2200 1138 179 2035 1279 -328 1583 1222 54 1419 984 -214 417
697 417 861 -44 315 907 -70 -250 575 -21 -613 274 -131 -543 -306 -286 -665 -624 -131 -868 -976 -196 -745
718 -745 -1366 -99 -651 -1755 -210 -489 -1665 1 -152 -1665 -7 -260 -1340 -248 247 -1289 7
735 7 478 -891 -178 688 -432 -14 561 -213 171 797 -121 334 669 533 371 377 717 767 286 943 738
756 738 -54 1129 971 -356 1118 1129 -423 839 955 -557 663 1176 -485 371 942 -891 298
773 298 1093 -678 -79 834 -664 -272 574 -878 -476 196 -716 -557 -338 -885 -557 -653 -774 -308 -1085 -706
793 -706 -392 -1245 -589 -230 -1478 -354 -18 -1305 -431 -96 -1129 -423 193 -1233 -174 454 -1020 -182
811 -182 551 -770 -16 519 -475 256 631 -60 525 421 -31 738 665 319 969 584 612 1462 281 592
831 592 1542 232 795 1567 -81 611 1465 173 490 1457 -274 353 1603 -325 248 1019 -398 -98
849 -98 717 -149 -320 761 -626 -587 317 -398 -458 64 -492 -447 -161 -768 -586 -433 -559 -427 -707 -651 -193
870 -193 -839 -940 -277 -751 -823 -98 -808 -722 51 -556 -947 111 -307 -511 61 -178 -798 381 -10 -523
890 -523 558 39 -550 689 341 -239 602 683 -103 347 782 169 633 675 358 725 629 652 503 368 918
911 918 414 270 889 304 -135 1173 547 -278 870 454 -542 1153 380 -869 756 200 -1206 765
929 765 475 -1229 589 92 -1263 596 165 -1094 219 -610 -1172 185 -499 -860 -109 -703 -662 -305
947 -305 -708 -592 -316 -725 -195 -418 -827 -72 -325 -1116 388 -214 -1169 187 108 -1028 465 325 -1135
966 -1135 567 458 -661 778 589 -627 898 559 -499 1091 721 -140 1021 507 -103 835 531
983 531 238 731 416 534 574 182 624 812 42 530 452 -193 619 528 -445 506 513 -682 948 378 -930
1004 -930 637 66 -1129 150 100 -1039 -66 -97 -932 39 -195 -1034 23 -185 -1182 -206 -494 -646 -54
1023 -54 -547 -479 -415 -599 -551 -285 -568 -305 3 -766 -123 147 -794 -224 207 -782 69 483 -817 202 690
1044 690 -617 465 819 -554 337 757 -418 524 945 -244 481 652 -170 729 987 -96 666 920
1062 920 -289 486 950 122 286 531 186 483 322 -168 447 84 244 386 13 76 460 -600 -19 136
1082 136 -601 -131 293 -905 -217 417 -938 -237 296 -1021 -135 207 -1068 -254 90 -1050 -351 84
1100 84 -572 -289 -150 -580 144 -446 -563 368 -148 -375 225 -332 -433 347 -329 -254 683 -193 21 749 -287
1121 -287 388 716 -423 424 978 -456 455 1077 -208 266 827 -190 325 881 -139 389 543 -119
1139 -119 802 617 -58 310 562 -118 456 189 -129 240 -58 -300 395 -70 -129 349 -430 -307 95 -613
1159 -613 -288 217 -395 -88 66 -532 -459 90 -619 -238 -242 -488 -475 -233 -291 -216 -333 -393 -291 -277 -522 -178 -514
1182 -514 -168 -52 -454 2 67 -136 -20 -70 -58 163 18 158 63 199 13 274 397 74 219 556 131
1203 131 11 581 442 386 411 445 83 416 209 36 852 375 233 342 308 54 502 177 392 455 77 155
1225 155 384 -53 168 31 -105 38 247 -4 191 -31 -318 -37 50 -481 -153 -85 -563 -216 -220 -631 -230
1246 -230 -88 -732 -305 -110 -866 -64 -29 -575 47 -108 -358 -256 -181 -579 -164 -270 -338 44 4 -227 39
1267 39 -118 -55 251 -260 44 257 -28 249 553 152 478 286 -69 183 275 180 493 126 22 22 475 -79
1289 -79 149 404 -6 555 362 -40 206 -13 -248 193 98 167 100 34 -149 92 -51 141 328 -227 68 -118
1311 -118 -397 -344 19 -513 -101 -107 -291 -462 -50 -343 -137 -240 -372 -412 48 -203 -39 -223 -375 -261 -304 -158
1333 -158 -106 -117 -237 -99 -114 -134 -150 -66 -157 249 -42 67 301 111 217 259 -129 121 64 184 215 261 151 99
1357 99 529 161 375 535 177 295 413 123 415 433 -275 296 191 41 212 229 115 170 -177 -50 127
1378 127 116 14 -79 269 -293 -76 -196 -235 -18 -132 -169 245 -223 -60 -62 -327 -207 -108 -412 -201 -354 -576
1400 -576 -101 -55 -349 -152 76 -600 -178 -360 -204 -275 126 -292 57 16 -249 -51 38 119 -489 -4 -135 150
1422 150 116 16 45 29 168 302 117 227 248 121 221 365 89 201 199 426 272 380 523 300 80 -83
1444 -83 246 453 115 56 234 83 135 43 -457 -269 38 87 42 82 320 258 -37 -252 58 15 -251 -281 -175
1467 -175 -81 225 477 -534 34 -296 -484 -138 -264 -454 -577 -618 -83 -74 321 -32 122 -78 71 -134 -123
1488 -123 476 -509 55 221 452 99 851 -253 175 438 1022 396 -212 75 -474 -139 351 -128 569 299
1508 299 401 347 95 246 54 94 -74 241 524 667 897 -33 -52 337 581 -87 30 22 -107 340 10 1324
1530 1324 463 -124 -314 288 -156 -311 243 217 -309 -41 -153 -180 -429 -211 -357 -471 -352 -414 -581 -316 -157
1551 -157 240 -55 -56 7 -132 -229 -31 -133 -326 45 -504 -82 296 -31 -2 -42 -126 -163 214 316 -259 249 35
1574 35 -84 150 276 12 -25 154 -7 76 317 54 468 483 -68 179 132 384 -112 156 180 3 92 -224
1596 -224 85 118 324 1 82 64 -5 -68 116 15 44 -141 29 -56 96 265 -61 -113 -124 -262 -501 -191 -243
1619 -243 216 -168 -272 -378 58 -310 -209 -180 -246 -47 247 -233 -575 -106 165 -171 -56 -125 132 151 164 189
1641 189 -139 128 -83 -147 -210 168 28 -265 65 46 57 331 112 489 59 -119 123 41 206 177 -166 13
1663 13 389 286 58 -9 287 157 253 -32 -438 342 141 93 -394 228 -48 85 -183 19 43 -2 109 -425
1685 -425 -280 -99 -212 -95 149 -56 -379 -232 82 -149 73 160 -310 21 19 -348 -360 -203 -396 -288 181
1706 181 23 -302 -74 -55 124 -314 -80 -219 -286 -238 191 93 146 294 177 16 293 11 497 125 -171 -360
1728 -360 -308 153 1 137 242 387 288 308 290 315 215 -372 -86 -23 -57 387 -6 96 73 904 67 165 677
1751 677 -321 464 463 174 390 -208 355 392 80 -10 207 485 -208 -42 21 -257 61 -427 78 -384 -525 -162
1773 -162 78 -21 -91 76 -19 201 -161 54 -295 14 41 377 -255 -197 397 -200 -219 -219 -392 14 464 321 -303
1796 -303 -133 -32 492 -37 225 -272 118 162 -203 -100 -277 38 413 183 -367 -132 514 217 276 -28 -147
1817 -147 222 887 202 -575 -425 -93 586 505 774 -238 -71 348 158 549 5 270 447 -51 -18 -171
1837 -171 -305 -694 -7 -434 -297 -130 528 592 -538 -268 -285 104 557 254 -685 -631 -29 -329 -102 503 139
1858 139 130 -61 14 -336 -513 235 36 265 405 -141 153 230 -44 -265 234 -144 -528 270 276 74 215 592
1880 592 368 404 -4 156 366 91 255 86 -182 13 -215 249 154 9 146 -14 52 -75 237 143 1
1901 1 29 259 -55 -380 -144 104 318 -159 -276 275 373 -176 -169 112 -100 -61 267 283 -91 -156 272 258 57
1924 57 134 -260 -394 187 -160 -610 92 756 107 241 227 396 227 372 -884 -677 370 83 -1092 371
1944 371 95 961 -196 156 164 -225 -151 337 -533 64 -64 125 151 -303 416 275 503 45 -11 171 167 151
1966 151 390 -13 -255 -64 486 -151 -148 607 112 -163 515 134 424 356 402 174 -254 -113 -2 -315 283
1987 283 -34 567 280 444 740 -315 164 -19 404 -289 -328 252 -613 -568 -233 108 -267 -158 49 -386
2007 -386 -14 297 -209 -477 -259 -493 -356 191 -44 323 153 -73 -335 -310 60 -324 193 -34 410 214
2027 214 154 -213 -25 -130 53 -50 -33 133 -50 323 161 43 160 648 272 218 -285 6 220 -153 -201
2048 -201 342 -168 277 67 35 114 384 32 -50 190 -91 -112 -413 33 -258 -62 -51 149 139 201 45 -13 -138
2071 -138 -60 122 145 -230 -12 -76 -89 -143 -131 99 9 -19 -47 -74 11 -189 -89 -30 -118 -64 -280 -66 101 -16 154
2096 154 -228 -49 -2 -271 29 145 -147 -30 5 -29 110 87 385 52 96 151 -164 259 172 -30 107 -22
2118 -22 22 214 182 49 133 -14 114 -28 63 13 -6 66 70 484 149 -84 -84 -28 -18 -85 -22 -273 -280 -32 -200 -184
2144 -184 239 45 6 16 -139 35 -21 -103 -411 33 -251 -170 47 105 -185 5 -197 -473 -110 -91 -41 -23 -201
2167 -201 -229 -216 136 179 -148 -256 67 -177 -141 -461 129 66 -66 -119 187 48 162 228 -196 -15 -108 197 -39
2190 -39 163 -56 190 302 221 24 96 64 360 135 173 105 83 349 -55 72 176 260 -110 167 -7 -115 -170
2213 -170 -3 330 -56 -88 15 534 -133 -167 -126 62 -89 19 -221 66 -207 64 4 -212 45 -84 135
2234 135 351 -363 180 -49 -169 -150 273 228 -143 14 -116 125 -42 -16 -318 -91 215 -98 -219 -334 -75
2255 -75 19 -133 -102 483 1 -4 -301 485 382 -19 74 111 -367 419 -8 54 199 8 -364 308 -96 -281 35
2278 35 -148 463 240 -41 -15 -78 277 146 174 -29 103 -15 -78 145 438 -54 253 -456 93 288 -420 -113
2300 -113 49 268 -36 -168 14 -203 -76 158 -113 5 -87 -238 -129 -156 -62 13 -221 23 -191 106 -128
2321 -128 5 12 104 -218 140 79 4 -38 -111 53 -9 121 -205 140 102 183 -91 78 -125 132 83 231 -9 55
2345 55 245 391 45 180 287 61 -103 104 78 144 -16 261 -88 35 143 63 160 -170 151 154 -105 261
2367 261 86 113 30 -139 147 -260 36 -194 -48 -83 20 173 151 28 -139 -39 160 -62 -96 -146 -19 -192
2389 -192 -108 -95 -156 -163 -40 -10 -253 89 -29 154 -97 110 161 -241 18 -35 -176 24 130 21 -177 -148 304
2412 304 199 -34 39 -63 -143 -173 7 12 -62 0 87 6 -272 7 42 -131 166 153 6 -77 -256 122 54 224
2436 224 146 -72 -66 154 62 137 3 9 -301 56 97 -234 -47 264 -151 -27 -183 -32 -24 228 14 -181 -99 -135
2460 -135 227 -241 -212 36 -67 -76 30 -17 76 14 -147 -10 106 -165 -15 -86 -23 -123 -131 -144 360 -59 255 171
2484 171 78 -16 -27 -37 -33 65 172 -163 104 -146 -161 -121 25 200 41 43 248 40 -99 -211 122 -26 -122 206
2508 206 -83 47 -43 -131 2 160 -246 -157 20 161 -20 3 8 154 -59 -246 -15 -28 36 -105 -103 139 151 -89
2532 -89 -5 -149 -48 76 -375 17 -85 18 -174 -23 166 -145 -59 7 -203 72 -123 -40 -188 -251 -44 -83
2554 -83 -154 -105 123 -45 -1 86 -79 -96 7 107 -166 -10 29 81 -163 -209 180 141 -263 -144 -39 261 182 -23
2578 -23 226 397 235 29 201 -177 106 188 59 87 -186 179 -71 -240 256 43 -183 -95 -89 -57 6 -11 -27
2601 -27 100 176 121 32 -22 52 -201 196 -143 48 -249 38 -9 -76 2 -169 -81 -27 -32 -136 -158 33 91 -96 123
2626 123 -41 -8 7 -241 -105 150 -6 60 -237 39 160 -46 106 139 -72 182 -75 215 -63 -109 60 73
2648 73 -122 143 147 -40 282 -223 -74 108 -14 30 74 260 -343 -39 120 152 -143 -73 -245 66 164 -44 -290
2671 -290 -295 105 18 -22 -79 286 -135 104 -172 110 6 189 103 -43 1 -87 -28 -272 14 -211 -205 -207 -83 -52 -143
2696 -143 -42 -150 -43 236 52 74 -90 -75 -229 26 75 -104 -94 153 -31 117 -90 83 121 -193 43 3
2718 3 61 6 101 164 -11 160 260 -26 59 121 0 -196 132 167 -243 311 299 -4 -60 130 9 -198 126 255
2742 255 164 141 217 223 14 -31 302 -83 40 304 -111 52 -75 58 -233 99 27 -66 -148 -4 -1 -72 -72 49 33
2767 33 -257 129 -9 119 -70 -174 88 104 134 -273 -14 28 -228 111 101 -107 6 -31 -116 66 149 17 161
2790 161 3 -93 -148 4 -132 -244 229 78 -184 -78 -71 -200 -135 -98 -19 103 -17 184 14 55 -56 -15 -253
2813 -253 54 154 -189 -169 -364 199 -53 80 -35 56 146 201 -19 -71 -85 -153 -51 -58 131 -89 -14 -100 -35 -5
2837 -5 -75 -76 -179 -57 -180 -279 267 36 -34 -14 -37 -36 -48 -157 -132 -44 -48 -9 -106 337 -277 37 223 -51 -155 116
2863 116 1 152 -39 -145 -15 -152 -169 -156 249 -25 34 267 243 170 124 48 81 62 13 189 -28 -5 -13 66 60
2888 60 56 189 -54 -55 38 73 2 29 130 -294 4 81 -3 -69 89 -213 73 10 -92 -6 -223 -53 59 152 -7
2913 -7 -81 78 -275 81 -265 -274 -27 -222 77 216 149 -228 -106 54 -174 54 -62 95 152 -202 -106 -151 -26
2936 -26 116 -32 166 13 57 166 -37 58 -93 63 7 262 5 -274 182 -16 88 -137 -105 97 -86 138
2958 138 -56 194 70 143 54 75 -32 -88 72 56 243 17 -14 -51 65 -30 -245 -9 112 171 -266 74 -34
2981 -34 10 113 2 172 -105 -9 109 -5 49 -6 71 54 -65 -95 2 -71 -76 44 -22 -81 -72 -90 -3 145 -216 -95
3007 -95 32 -119 116 -125 -91 -61 -83 -89 -241 77 -110 23 -245 -99 194 -207 -25 -127 13 -113 80 171
3029 171 40 -101 -20 205 105 67 73 148 5 64 313 -69 -222 -51 251 202 239 -36 133 135 125 118 101 35 56
3054 56 2 84 10 -123 -155 -36 136 168 -133 118 123 -261 -49 177 -260 29 -37 -163 -121 -197 -215 68 -80 59
3078 59 -47 89 17 98 32 -297 248 330 98 -19 63 41 -182 -23 241 165 71 -10 -125 29 81 -147 253 147
3102 147 67 323 92 -159 -73 -69 0 63 178 -142 129 185 -222 155 203 12 19 142 414 -196 220 -87 5 -106
3126 -106 -220 -102 -94 33 165 152 96 142 68 -213 -221 -136 39 -223 -149 -6 34 30 37 234 -81 45 70 281 88
3151 88 -84 -28 -31 -48 -144 -3 29 -117 -135 -151 187 25 9 152 -290 102 -237 -278 -121 99 -65 36 -106 -221
3175 -221 -27 -124 -212 -91 31 24 262 -25 -173 207 1 -60 49 81 -214 -171 74 -58 -80 52 132 156 -1
3198 -1 42 72 -72 27 -133 27 0 1 -24 -93 -95 -16 -250 -173 172 42 119 -36 59 -101 -152 179 24 -163 43 53
3224 53 241 -162 -134 95 -69 -210 -9 -89 181 17 4 -263 -15 144 198 -83 162 -335 -177 -45 30 -140
3246 -140 -27 -20 -84 28 149 117 82 -66 71 48 204 -171 110 63 129 -24 -180 110 -155 180 -28 40 13
3269 13 85 -45 -44 122 286 187 21 -72 81 113 167 -191 192 143 -88 -278 -39 88 35 7 11 -3 -227 -43 36
3294 36 -74 -59 -127 -218 -151 -115 207 -87 -244 -75 -133 -53 233 -138 0 126 14 -77 -65 203 -56 -96 -104 195
3318 195 106 -196 -37 154 77 81 -133 -103 1 98 114 74 -66 476 -24 448 111 -181 169 177 -61 375 33
3341 33 270 107 -3 -84 -40 186 -17 10 143 -26 -215 88 74 -49 -11 16 -70 115 181 19 -98 239 318
3364 318 73 -84 -141 -222 -203 73 -80 120 19 -55 -121 213 -17 -65 -148 47 48 -23 -144 -2 -99 54 150 119
3388 119 -74 -137 -11 -326 87 -215 47 -15 43 -180 -189 55 131 36 66 48 -112 -126 110 238 31 35 -153 40
3412 40 -205 184 47 92 37 86 104 -72 164 -161 121 -12 202 -13 -152 -146 -45 171 11 252 71 -130
3434 -130 -86 -73 201 -241 -22 153 -9 95 42 -56 3 6 -74 -59 -92 -78 121 -244 -114 -86 -53 111 126 -174 -46
3459 -46 -200 -224 -137 9 -42 75 88 73 -122 150 10 -63 -3 -314 32 54 -89 -281 68 202 50 -93 -53
3482 -53 54 -196 102 137 -329 111 -15 -305 58 34 -81 87 24 13 88 -181 -17 298 440 -106 253 -200
3504 -200 -12 -250 -52 160 180 -61 215 27 193 56 -97 -59 -42 -374 -197 -28 218 8 -4 -232 -102
3525 -102 595 -318 210 94 140 -82 -173 -195 -540 420 130 26 -302 618 786 -416 -64 25 -680 1044 474
3546 474 -64 -734 502 -904 -388 273 -431 116 -874 470 333 234 -137 280 451 302 10 364 136
3565 136 324 -275 -192 56 -168 150 99 -295 67 -40 114 104 -96 -162 -121 94 -98 468 29 -105 -317 223
3587 223 -238 216 22 0 -467 2 -118 -61 282 451 -306 102 1356 246 -102 -391 195 241 88 161 -36
3608 -36 -349 757 -770 379 16 96 -875 -112 -293 -175 340 171 -252 282 -103 600 -1073 156 -385
3627 -385 55 284 -190 -26 -236 182 -447 564 -157 489 472 768 302 504 307 -194 140 219 2 264
3647 264 -11 425 -292 133 -230 -161 375 371 -64 99 80 -393 -246 134 -365 296 -399 238 136 414 393 126
3669 126 81 119 -118 -180 88 384 -394 -649 -739 -291 487 -336 -16 -303 1291 147 606 -29 187 270 495
3690 495 133 1014 -243 -226 -25 217 173 741 1394 268 -425 368 98 -177 377 -204 216 -191 -367 -252
3710 -252 398 420 93 -77 -59 -410 -137 -118 356 -265 -57 -120 58 -225 -90 -124 -44 532 600 170 503 90
3732 90 -397 111 790 -37 -229 -442 -198 -34 159 -90 360 497 -47 107 -288 -114 180 184 14 47 -90
3753 -90 -601 -204 54 -27 -162 73 210 -9 466 -157 -134 -162 137 -54 143 33 51 -217 190 -250 -148 -226
3775 -226 -27 35 -68 65 -176 -156 -35 -103 -180 -29 -75 171 -14 117 166 83 221 67 -124 -65 121 157 -77
3798 -77 26 54 -51 251 -175 -45 -88 150 -211 -1 67 55 -136 61 134 -271 -33 -17 169 87 -25 278 -138
3821 -138 -186 11 -202 23 -153 -45 -76 -286 -24 1 -48 287 -14 81 50 204 63 695 -158 94 -287 -791
3843 -791 -548 170 -270 17 -103 -348 -343 -229 526 215 365 -378 122 -65 230 7 -101 21 138 -54 110
3864 110 104 -39 131 212 -133 128 36 37 -33 -199 236 3 38 13 -54 90 60 -79 161 -177 295 -186 67 -99
3888 -99 147 205 -15 77 -44 19 -70 77 -68 -117 -1 30 -311 161 82 -1 -67 123 21 228 -336 140 267
3911 267 -106 -139 -306 -178 -131 -76 -127 201 5 8 -73 -47 -165 75 -13 -150 183 -88 -115 87 -50 161 148 -266
3935 -266 -4 68 -68 -192 -29 81 185 93 150 29 397 101 -39 49 66 71 181 239 41 65 4 236 -45
3958 -45 184 77 -132 -92 169 36 123 43 -208 -143 162 111 -93 148 -122 1 -250 87 -56 -25 -94 -109 70
3981 70 -300 -35 41 97 -70 -203 142 54 -72 -15 87 -59 -111 -66 19 231 48 -224 -115 84 -56 -174 -25
4004 -25 -247 147 62 155 190 121 -80 54 -73 141 49 107 -192 27 81 53 -67 -86 -60 96 145 145 -60 144 -158
4029 -158 -110 -102 -120 133 85 143 -34 38 1 -37 -13 -128 242 37 -166 -70 -204 126 38 -88 -12 86 -9 -174 -17
4054 -17 -139 69 -95 189 233 -54 -98 103 -154 155 298 -238 -46 -98 166 -164 -6 -74 73 -211 -47 185
4076 185 -60 -10 -95 122 184 -138 -74 -33 64 -4 265 78 96 233 46 -91 148 230 -130 -95 175 -55 86
4099 86 99 87 59 53 28 -26 -56 260 258 26 74 26 160 -111 -101 12 0 222 47 -87 -39 111 -93 -141 -150 -43
4125 -43 23 14 -84 -238 -125 -164 -112 -84 -16 178 -15 -155 28 -68 -308 -242 214 -92 -11 54 -37 186 134 63 86 -31
4151 -31 -32 -91 91 -66 307 -61 -131 -60 64 -30 5 60 -70 91 -74 68 -202 -118 112 -44 2 -249 -28 247
4175 247 -429 120 386 -85 118 -34 27 248 28 138 -27 -123 -100 140 -82 39 -66 -129 86 -45 -53 -17
4197 -17 132 55 62 36 41 -51 28 67 108 -65 272 28 -86 -58 -250 1 -24 -190 -67 42 -58 108 32 -244 -6
4222 -6 42 84 -119 -271 -26 130 -223 -203 28 -5 339 -31 -5 -69 -81 130 -10 -10 113 -12 -46 33 -98 72
4246 72 -17 -158 121 104 20 122 -131 -197 199 194 -287 -85 -76 59 -40 45 31 -134 211 116 -27 -130 -90 -125 -194
4271 -194 -18 -155 107 52 143 24 -62 81 -55 5 -99 -12 -109 -148 66 176 -88 214 163 -133 -103 -133 -156 50
4295 50 -112 -11 120 -93 163 -119 -145 -229 -118 -102 -53 -159 87 86 130 -238 -37 -67 -95 185 29 -13 -28 85
4319 85 123 121 -47 240 83 -27 -11 59 -88 27 11 -92 145 190 214 -78 164 -12 183 186 -61 -87 -160 49
4343 49 223 -25 179 20 -130 56 114 9 -209 30 -212 -195 37 -115 130 53 142 -198 -99 -26 -184 -299
4365 -299 74 50 0 -140 305 -33 -89 -63 9 141 -163 -96 140 65 -89 146 79 280 -190 47 -112 76 55
4388 55 -169 -101 -157 258 53 64 -103 -13 172 -99 30 230 -21 -22 29 -225 51 4 -4 -150 271 -65 41 -51
4412 -51 -2 -38 -93 27 -53 -270 44 -178 -17 98 -104 -66 24 79 21 -20 -154 278 31 -82 164 -21 26 54
4436 54 136 -120 51 2 36 307 253 233 124 -169 -347 -113 77 -16 -39 -76 -118 80 163 -50 -142 -54 74 -53
4460 -53 -221 -231 135 -60 219 -16 -151 88 268 233 -1 372 152 58 -87 -15 80 -14 23 135 259 178 217
4483 217 40 -84 170 64 -70 -102 330 144 -88 -213 -80 -170 -115 -112 -177 -4 47 46 -70 201 178 -41 149
4506 149 -89 5 41 18 89 -67 -103 4 12 101 -10 -82 -112 -408 49 -15 -136 -132 21 -257 -45 -134 77 180 -53
4531 -53 90 -173 83 238 122 283 -146 17 29 -42 136 29 -12 163 -1 91 203 9 93 135 -382 172
4553 172 85 119 -113 -16 194 -85 -145 128 -33 83 90 72 -92 78 164 196 -3 -159 -165 -304 -66 137 7 -300
4577 -300 89 -15 173 118 -57 382 -70 163 -171 158 -72 -84 58 -295 -203 -47 -67 -120 119 121 -127 -138 -114
4600 -114 89 -25 52 101 102 44 99 43 29 -13 -54 78 -150 24 -50 -10 189 0 -104 112 24 -377 33 -25 0
4625 0 164 -31 45 57 -30 -20 23 234 -307 13 -97 -18 171 -164 65 149 237 -185 -26 38 23 43 -107 -243
4649 -243 102 144 81 56 -16 19 2 212 20 -56 88 12 48 144 119 -178 160 -43 -9 -24 34 -115 45 -37 -67
4674 -67 74 -82 0 212 4 183 255 133 193 25 97 -43 16 -112 -286 -140 23 -48 -185 12 22 58 22
4697 22 -16 146 20 -83 206 -122 74 -131 -195 152 90 41 5 12 -222 -208 5 10 8 -145 -6 10 10 -146 17
4722 17 -122 -30 47 56 132 241 -107 -32 -45 -143 -27 -320 5 0 11 -167 -181 -190 -22 206 -114 27 216 232 118
4747 118 -138 114 31 -117 -34 -94 190 83 -34 116 142 -56 -167 -115 53 -85 -160 36 114 6 -1 102 45
4770 45 -1 4 309 134 104 5 55 -240 143 -52 10 -12 -97 115 237 -9 -321 125 -85 -11 58 -122 -123 15 -119
4795 -119 218 183 260 -8 83 -25 170 101 92 72 111 31 58 -109 -200 -8 -55 -256 46 -116 -227 25 -16 -56 -19
4820 -19 -40 -246 -73 -35 -88 168 -7 -10 -77 -59 81 -93 -58 140 -188 21 132 -299 -118 -11 33 -22 119 -142
4844 -142 11 -82 240 -87 248 134 -187 46 141 -5 -90 83 -85 187 153 -88 192 -325 -20 -45 -172 63
4866 63 8 71 4 47 -95 -53 -39 -97 -354 8 89 165 -60 63 67 -203 77 91 21 -159 66 60 16 104 52 57 -197
4893 -197 -132 -118 116 174 -279 65 -113 149 32 -157 75 -29 -83 -223 30 -49 40 44 -219 -82 214 -150 -73
4916 -73 10 134 -83 3 185 93 -67 -100 40 -46 -37 21 47 82 -24 -84 158 -217 -41 183 198 116 -47 -144 26
4941 26 -106 -148 -172 -106 53 -61 52 -22 -47 27 -50 -183 462 358 320 202 -268 -350 98 -367 -235 -196 -166 282
4965 282 68 -255 -37 510 -157 781 156 -324 71 600 -650 39 306 495 -239 202 686 189 214 208 826
4986 826 367 -537 74 16 -203 436 119 -321 -26 -314 309 -234 -534 -350 -210 70 -258 215 151 324 67
5007 67 1247 -785 8 832 -382 23 238 977 -826 735 34 -220 537 -51 428 262 -185 445 -187
5026 -187 504 1298 -120 -479 269 674 -531 -54 28 469 147 -483 198 -311 -79 322 -262 370 197 805
5046 805 30 -814 -163 359 -421 -332 -252 -569 700 -126 -263 42 264 688 -215 481 -888 -383 184 -140
5066 -140 403 511 678 -148 397 -899 720 -240 -151 -401 -278 93 108 585 -298 -292 -90 -225 155 305 -177
5087 -177 -142 126 -652 -560 352 205 -415 174 219 -167 45 307 330 -137 -234 665 191 115 -287 -123 -183 -30
5109 -30 -71 -569 -450 86 277 175 -141 -251 428 125 -369 412 128 7 -118 189 -165 398 -625 421
5129 421 655 -246 -570 185 -354 -870 -202 480 859 -114 -164 16 -470 -329 -288 -219 90 -144 381 341 288 -757
5151 -757 218 -348 769 358 -224 -525 425 666 400 127 259 27 310 -105 -102 111 298 -247 486 -82
5171 -82 154 -784 149 -43 590 -222 253 121 -34 -333 3 -84 -99 593 -466 -106 -172 -418 543 -464 290
5192 290 305 245 -220 548 456 -60 531 131 -553 -11 287 101 272 622 186 -242 300 649 555 145 558
5213 558 388 464 59 197 175 201 15 710 -496 242 -567 -331 -30 197 -85 -38 -389 151 36 393 88
5234 88 72 44 -106 292 -202 151 -41 238 533 -317 -265 115 -453 156 76 795 298 108 -112 -125 699 213
5256 213 234 -84 310 -77 61 567 -33 85 374 -806 -266 -2 539 -56 -57 608 -472 -203 721 33
5276 33 285 307 -14 558 -332 143 -176 -387 -548 76 -309 -237 266 167 122 280 177 55 520 -29 439 130
5298 130 -137 -12 -407 -329 209 494 -350 100 34 -123 142 -48 403 -236 -271 -42 173 -57 151 363 74
5319 74 201 -60 -193 -580 14 544 -71 -107 349 668 -58 -276 -434 643 -180 170 -145 353 545 162
5339 162 -175 181 408 -210 -121 12 -101 35 -102 77 364 510 85 46 13 181 -47 121 5 316 313 -7
5361 -7 -101 -330 46 122 33 4 48 -473 -209 -277 623 40 181 298 29 179 309 -78 -201 -81 -17 213 -141
5384 -141 365 89 -358 -234 -253 -587 119 248 -442 329 -232 -99 141 -225 187 -19 166 -125 304 -234
5404 -234 174 503 22 71 -88 260 644 534 -298 -29 733 -128 54 355 372 -495 250 584 -228 -437 312
5425 312 -6 64 358 335 55 380 -419 319 369 -365 -242 149 311 -388 -196 -278 -354 394 471 -89 135 -180
5447 -180 -97 236 229 452 -92 238 8 7 74 651 -616 -149 141 116 106 163 17 34 -229 -8 129 156 -807
5470 -807 -464 164 242 317 505 582 -123 -150 162 65 207 580 -144 273 375 337 99 89 310 289 100 -6 -138
5493 -138 268 23 341 11 -230 112 -90 21 91 -53 -170 -17 -6 -40 -104 -145 75 184 -122 -69 46 -155
5515 -155 13 34 -61 61 -289 95 45 160 189 270 -21 -73 -7 -156 26 -26 160 -86 -38 175 -130 151 386
5538 386 -24 25 -13 230 126 -8 35 92 186 -78 -28 -18 -17 169 142 -162 -7 23 119 -160 7 84 -90 65
5562 65 -328 192 -5 18 41 -43 44 98 320 -86 -71 -75 -136 -56 28 162 -32 91 142 140 54 -220 115 -7 172
5587 172 121 290 14 -120 130 -341 -35 37 -84 76 -30 63 204 75 -21 219 93 -127 223 223 -140 -19
5609 -19 263 -19 50 -87 44 5 136 66 102 -14 112 155 53 -268 -92 85 14 56 -34 -51 -158 -61 373 178
5633 178 -221 107 -70 -150 1 204 -216 -63 -128 -193 48 -29 -58 -49 84 -107 16 72 158 287 -48 93 201
5656 201 18 -272 61 303 -151 -16 129 -2 -149 -136 -232 133 -163 -242 92 57 -79 55 -89 -80 -40 112
5678 112 248 252 141 -77 -169 -10 183 -224 75 -36 119 -220 -12 -135 114 94 -228 -30 143 -256 -18
5699 -18 -14 203 164 -34 140 67 34 52 21 -13 -73 24 65 -6 83 151 72 -64 -114 4 -56 -163 64 50 49 127 151 11
5727 11 133 -86 106 -35 -218 79 76 -31 84 130 -14 -101 41 -192 -62 292 -107 -10 -41 71 -62 326
5749 326 98 167 -36 159 352 355 363 -247 78 -102 -185 -74 2 -189 -179 226 62 118 96 -207 -271 -192 -41 -137
5773 -137 219 174 80 -75 -226 -53 -54 167 106 78 3 98 -83 -122 75 -118 100 -50 26 147 27 9 52 177
5797 177 -105 -112 -87 135 -164 45 46 142 142 349 82 16 190 117 -57 -42 -80 4 21 48 8 70 -25 18 -2 -125 0
5824 0 98 91 102 370 -73 58 -67 -40 104 -68 16 -63 66 35 4 -168 -16 -112 -24 100 -98 54 -130 25
5848 25 -117 30 115 -50 102 -51 -220 -160 -31 -17 97 121 -54 65 -59 89 191 -304 87 -200 -50 33
5870 33 58 152 83 -218 -35 65 -161 -129 -141 60 -39 123 -58 -51 -134 34 -19 26 -31 21 -8 -153 -64 -194 -112 193
5896 193 122 160 -207 327 152 105 -24 -63 -80 104 102 39 63 -11 -103 -92 -23 -192 42 23 47 -146 -108 42 23 114
5922 114 49 -91 -146 194 67 -176 53 -51 74 136 -177 -16 67 -137 251 -78 194 126 49 206 -19 38
5944 38 67 42 -164 -319 -40 -208 -140 117 -131 240 38 -44 -13 -84 57 -11 -58 -85 257 212 286 -201 147 136
5968 136 203 8 -18 23 159 93 178 252 27 86 68 -25 125 13 -38 126 109 -31 -69 133 -138 -49 -13 205 -85
5993 -85 35 -131 -19 -88 -86 40 89 -48 -193 65 379 179 -32 -216 -174 17 1 -83 -59 36 126 -54 48 103
6017 103 -43 88 -258 149 -46 -19 130 -23 58 49 164 -157 7 202 249 -151 37 191 248 -192 -28 84
6039 84 -182 211 11 -66 27 -365 102 23 65 -11 4 61 -111 -51 -250 213 -51 -286 -56 -55 -26 -16 129 -154
6063 -154 -35 3 45 64 -2 123 209 -179 74 -231 10 210 293 106 -57 19 -42 -200 65 -8 111 80 -75
6086 -75 -166 202 114 -15 203 -117 -46 78 37 -60 158 137 -309 184 -20 -196 186 -36 56 -130 -203 249 26
6109 26 -163 109 102 53 -139 43 56 -29 44 117 -96 -130 86 31 130 -284 262 92 466 -77 -52 174 198 71
6133 71 41 73 97 -74 114 -128 -260 15 237 -67 -147 6 110 163 13 66 42 -138 -11 -4 -28 218 -154 -11
6157 -11 245 -67 -163 -174 206 237 20 -76 120 77 -73 98 -184 -85 -15 -20 191 161 51 117 113 163 79 -89 69
6182 69 -133 -154 79 58 -207 -13 -141 42 164 -148 -55 143 19 45 -112 -61 56 99 -140 -52 -23 369 21
6205 21 77 180 -262 -58 -137 -109 -89 166 26 -111 27 -13 73 -40 104 151 19 175 59 -40 -22 -290 42
6228 42 -18 47 -63 -14 100 9 -76 -118 113 63 9 -20 58 -85 213 -70 -166 -29 -38 -29 -5 176 279 -102 -58 171
6254 171 -83 -100 -69 208 -148 -162 122 -101 -104 148 74 104 -172 36 -89 87 15 103 -215 110 107 83 -63 -30
6278 -30 -50 163 99 -15 -66 92 160 -155 -24 54 49 -290 4 -226 -124 121 73 -104 167 78 85 92 74 54 216
6303 216 163 4 294 181 113 112 197 -7 67 160 -97 -24 -57 20 9 -71 -26 19 36 -90 215 69 88 -59 -196
6328 -196 -134 287 -179 -307 -6 51 116 77 4 -24 -225 159 93 70 171 -89 -322 230 243 -210 116 93 162 341
6352 341 222 82 0 26 -52 -11 79 -54 -287 -38 -89 4 -186 -76 343 -91 -204 33 1 -151 237 39 173
6375 173 191 -162 -301 280 -202 -99 -231 -237 37 100 247 13 -130 42 222 -146 64 264 28 242 -173
6396 -173 -101 -131 -19 -67 -295 174 76 223 -5 -61 -224 4 -80 -242 -3 95 -158 -167 -77 -108 26 -11 -65 98
6420 98 151 116 -99 -98 17 -144 -163 128 200 -262 174 -114 191 -1 48 -245 62 11 -68 -73 104 66 132 236 -36
6445 -36 -194 203 -100 -5 148 32 -28 53 -133 -196 -113 230 80 123 -124 -245 -7 55 70 -87 26 -94 -52
6468 -52 39 165 -83 69 -173 -159 77 -8 -79 52 231 113 -31 174 98 -91 -6 -34 84 28 -93 185 115
6491 115 -118 60 94 -187 -143 199 33 -54 26 -70 -104 31 84 -372 25 63 -119 -148 -28 10 -180 315 -91
6514 -91 -253 177 224 -105 24 1 75 -26 137 -21 39 -305 22 -155 -177 98 278 -68 183 451 13 -280
6536 -280 118 -11 -54 10 -51 184 -100 -101 21 -284 -9 76 125 37 -127 59 -145 137 178 -194 68 199 -86
6559 -86 -127 -51 32 -3 184 34 -136 -57 -42 -14 34 -161 49 66 -197 297 -47 -226 -153 173 284 -58 -155 -73
6583 -73 26 8 3 62 -122 -68 -168 -62 -32 76 -26 -68 107 -425 1 68 -108 89 60 134 98 199 215 -109 60
6608 60 -7 48 192 196 127 82 1 62 115 87 -93 -50 29 52 -143 29 53 175 -7 22 -175 -99 -32 -32 59 -94 -35
6635 -35 -86 -324 50 -122 161 -156 37 6 -118 -8 103 149 -20 -1 64 -227 -18 91 -39 92 -189 9
6657 9 -180 28 93 -17 -235 138 -163 25 -38 274 105 155 -27 94 133 199 -8 -394 69 148 -280 -293 136
6680 136 21 -39 -97 -33 91 -41 140 -72 185 249 108 -120 -178 -90 79 -172 -87 -22 -73 258 122 144 -18
6703 -18 42 38 26 -75 -78 -145 -39 98 269 153 -54 91 -179 201 71 2 -164 -101 -28 -326 156 -97 -86 313
6727 313 -100 -578 -197 291 152 358 -255 -307 -60 -151 140 33 -95 -369 132 146 16 -221 -204 102 -19
6748 -19 -88 137 86 47 28 -110 29 110 120 -167 -16 40 53 32 -121 49 -280 38 -328 51 74 -141 -52 -284
6772 -284 16 213 -2 45 113 -187 115 -170 -23 54 -14 90 81 -53 98 -18 99 53 -239 123 -139 -56 166
6795 166 81 22 -13 12 -182 -36 -93 64 -103 -46 -419 -40 126 -22 77 7 121 37 30 -50 -68 -5 -40 -209 -191
6820 -191 148 205 11 20 59 -110 43 125 61 -14 32 -165 -33 -130 -36 10 37 -53 103 -41 -46 67 119 -141 -122 -54
6846 -54 -49 67 -187 14 33 -105 -210 -262 224 -169 23 111 110 58 -73 -155 -96 74 65 -118 -77 -239 -161 -13 -209
6871 -209 -169 2 -48 -218 -14 127 41 36 29 -164 5 -74 -77 -31 41 120 -107 18 -79 61 169 -108 -209 -101 30
6896 30 190 -39 16 82 -162 41 -233 26 -79 62 86 -166 -16 55 -24 38 140 130 -59 -51 -12 -23 74 -85
6920 -85 65 -154 207 62 188 205 69 131 1 -63 27 38 -239 -55 -104 74 -85 39 90 222 -98 289 39
6943 39 -162 105 72 56 -203 -18 130 -167 -65 32 73 -302 24 -62 140 -73 -139 -35 -169 45 35 -183 250
6966 250 55 -29 -193 -164 201 13 86 -163 -179 271 8 33 -274 289 48 -29 5 -34 100 -18 53 -124 -88
6989 -88 268 -60 172 -71 -100 -38 -133 -153 -69 -52 -12 40 -28 114 222 265 -27 77 -16 53 84 31 -171 -213 101
7014 101 112 -222 48 86 142 -98 35 9 148 -93 70 -208 192 5 50 -147 52 -16 197 133 58 99 -19
7037 -19 -8 -98 15 -119 31 197 -257 -152 53 -20 212 -118 9 -231 -199 187 196 2 -54 -53 -184 -24 -95 -30
7061 -30 172 -236 290 -109 -191 19 53 -3 -30 38 -184 -178 51 68 -74 -74 -71 319 -123 -171 44 -20 -91 115 9
7086 9 23 -237 -299 -68 -115 87 7 171 213 23 40 -158 -31 -131 117 185 39 95 -195 113 -154 100 60 -17
7110 -17 90 -459 66 -273 -19 -104 263 42 73 -4 -122 -196 -44 -157 153 -61 -118 98 -106 91 64 -103
7132 -103 -26 171 27 -17 238 -24 1 -12 -140 320 -24 196 21 147 74 151 351 15 25 1 -234 -53 -156
7155 -156 -60 -60 -81 -8 50 160 -63 -182 131 -277 210 101 -294 201 -103 94 -40 -159 -58 -14 -280 -71
7177 -71 13 70 180 76 82 54 -346 -8 12 -71 -18 161 2 -214 -66 42 198 -27 -28 -25 -186 10 63 117 48
7202 48 -11 11 -154 28 200 59 54 -70 195 320 42 103 -113 192 -34 -118 75 114 -64 280 -152 23 95
7225 95 -71 37 -77 278 53 49 201 -15 44 -46 -10 155 127 126 51 207 165 -315 -40 -70 142 191 -140 182
7249 182 258 140 -160 -33 -15 44 -94 -143 -167 -94 -63 184 77 -147 81 199 141 126 -30 65 -15 28 -6 -23 92
7274 92 33 192 3 -327 -86 22 71 -29 39 4 -112 -88 -42 -79 350 91 106 -142 -92 25 92 -131 169 -276
7298 -276 -6 -105 -88 26 -13 64 -93 -132 44 -70 15 -2 -184 -35 -5 33 -119 -123 -195 21 3 -195 10 75 23
7323 23 177 -71 -65 -224 47 -71 159 186 -132 19 -80 -192 47 -146 81 131 195 278 -199 27 -27 -59 229
7346 229 -214 -221 3 -37 -104 -69 66 30 -63 15 54 52 -5 255 35 37 194 -197 -48 -45 27 43 127 -10 226 -55
7372 -55 101 -76 61 34 -1 -46 84 4 47 151 90 79 1 224 33 9 143 62 162 51 233 158 -64 104
7396 104 36 14 140 107 -107 -111 -58 -194 137 49 19 96 202 -244 37 141 167 -62 -94 -47 -102 25 98 50 98
7421 98 -89 147 213 52 -212 192 -89 -189 130 46 3 117 -61 -313 55 182 259 187 -95 53 -41 27 -168
7444 -168 -46 -46 86 -99 98 86 -324 -7 -172 -46 118 198 -9 -155 -105 -49 99 194 111 104 -25 148 -86
7467 -86 -204 83 288 70 -42 -62 101 -76 78 -187 41 -18 92 53 101 -40 154 62 172 268 -23 69 -220
7490 -220 -90 -84 220 -138 -76 49 292 147 310 151 -160 214 75 -115 281 -121 43 80 -26 41 231 3
7512 3 40 38 14 -47 -195 0 -142 234 85 -89 -7 -70 -196 -114 -437 -121 -193 0 -15 -224 -68 28 50 47 -33 48
7538 48 -76 -83 126 -109 59 -260 -127 147 -29 134 -17 -30 -40 -2 -241 -35 28 -70 151 34 -173 81 -176
7561 -176 -25 -106 112 169 -161 -150 -64 21 -30 -70 -190 -76 -97 -69 9 69 -133 189 79 -172 -92 -42 -185 -155 82
7586 82 51 -15 -290 -57 29 -181 -86 33 157 88 -178 143 11 59 -295 -188 -24 26 -166 -215 -60 43 1
7609 1 -13 85 44 -113 47 -60 -115 -11 -22 -133 -127 -75 176 7 -78 64 -80 21 213 316 96 -58 -262 58
7633 58 139 74 195 229 -73 126 17 113 86 -19 -11 -79 229 -227 -29 -112 -61 114 -85 140 -8 17 222 82
7657 82 73 -63 106 3 189 -3 -197 -109 -282 68 4 -95 31 215 -108 112 -126 -100 -34 -15 23 -56 114 33
7681 33 26 -21 -7 126 -43 142 -38 -57 69 -62 -11 -45 -225 -81 61 147 54 -9 70 82 -32 38 -118 -111 -47 -171
7707 -171 -40 132 11 20 48 -36 161 -72 188 49 88 160 -20 -187 121 -134 27 -108 -64 152 19 17 77
7730 77 1 26 -42 -41 -229 -181 81 100 -89 -16 -13 22 48 147 -60 -125 114 165 14 -72 -353 198 -35 -156 147 15
7756 15 -50 124 -79 -57 45 50 -3 302 288 -79 124 -146 170 -152 -155 -85 68 48 28 -181 53 -100 51 32
7780 32 176 -28 -18 -108 -206 -75 -45 21 77 -93 -32 120 -155 -77 -138 101 -59 93 119 177 -15 217 67 194
7804 194 -45 102 33 -149 -25 -99 74 30 -59 -67 -282 279 -120 320 -324 -126 161 89 -281 -176 -410 -30
7826 -30 421 646 13 152 -376 395 -352 -637 -674 -362 141 -347 22 -94 -247 135 100 20 -252 128 127 67
7848 67 -71 -114 -64 -27 -16 -185 73 -141 -57 -110 -13 34 -7 -99 -146 118 -235 -327 103 -225 94 -101 55 161
7872 161 52 -203 165 105 189 -84 -24 223 -101 11 109 109 111 191 -82 71 156 54 -124 34 -151 -62 -79 103
7896 103 2 -87 109 99 60 -152 113 26 -93 125 227 45 166 -34 -160 -144 65 90 -87 7 82 -80 -71
7919 -71 71 70 206 -121 -26 65 -74 1 -4 -128 -84 -11 148 -79 99 -204 233 166 139 96 101 -2 -138 111 126
7944 126 -92 -10 300 191 112 163 -126 -173 -143 196 -77 -113 120 50 35 -67 -174 159 40 -128 147 171 5
7967 5 -19 157 -75 14 -38 206 -40 15 -318 -172 -164 22 203 93 -143 -275 -162 -92 91 249 129 103 258
7990 258 -63 1 -38 55 204 60 74 86 -148 -111 22 -94 -99 -35 284 -6 -237 -388 -87 57 51 53 54 -130 -91
8015 -91 -84 -172 -54 276 -63 -11 -59 59 247 93 11 125 82 25 -204 -35 -154 -27 10 -40 301 -14 72 85
8039 85 -106 180 49 153 210 135 91 -79 -156 -89 108 -126 -92 22 -46 137 125 -190 -217 61 168 65 -13 76
8063 76 -91 -168 -92 26 -128 263 -24 165 96 -162 -299 201 -251 -35 -182 150 8 -126 98 -239 -10
8084 -10 -7 -10 -96 -142 -141 -40 40 -55 170 14 -128 -7 -122 64 22 96 3 -199 -74 -28 143 113 129 2 94 18
8110 18 24 -11 32 -35 -75 130 86 28 166 -43 151 156 -134 -241 13 54 416 35 7 33 157 98 46 203 94
8135 94 73 13 73 -8 -10 -157 2 9 122 -289 220 78 59 -64 -268 84 23 -163 247 136 -12 -167 -167 -159 26
8160 26 -152 104 79 7 -157 83 143 126 130 37 -211 -102 64 44 -77 78 314 197 -133 278 122 -69 270
8183 270 140 171 -95 825 149 291 932 354
8191C54
$$ Imaginary data points
##PAGE= N=2
##DATA TABLE= (X++(I..I)), XYDATA
0 0 0 0 0 0 0 0 0 0 0 8 -8 8 -8 16 -16 22 -24 32 -40 48 -56 64 -80 94 -110 128 -149 173 -201 231 -264 302
32 302 -342 389 -441 498 -560 626 -701 784 -873 972 -1079 1195 -1323 1463 -1614 1783 -1962
49 -1962 2163 -2383 2624 -2892 3189 -3519 3888 -4309 4787 -5341 5985 -6748 7669 -8809
63 -8809 10256 -12166 14807 -18734 25236 -38585 128064 -301993 -15832 392279 -317698
74 -317698 51614 317860 -240519 8719 266669 -221593 -22352 180202 -104552 -11287
84 -11287 96398 -77510 -22377 -5119 -17997 1628 -44369 26370 -13507 -140324 66042
95 66042 6303 -185882 97997 37177 -229250 90606 27821 -251245 112377 61807 -254949
106 -254949 92696 50417 -249639 80054 59426 -210893 64069 46597 -174895 31623
116 31623 24812 -120532 21241 16827 -67567 -12835 -17549 -16227 -17827 -31614 32600 -27294 -59639
129 -59639 60980 -29391 -73721 89741 -19929 -82011 101589 -20744 -95875 105255 -719
140 -719 -83332 98139 -3048 -81193 89608 7008 -67676 75723 15838 -48004 52549
151 52549 8724 -29488 39868 16112 -5197 17301 7269 11188 1556 7812 33010 -9383 2286
164 2286 42804 -20273 -3580 49952 -19065 -1555 52382 -21720 -9132 46396 -15230 -5357
176 -5357 42449 -9096 -7178 29547 -3441 -4521 19770 5966 1754 8369 7896 1833 -2847 15997
190 15997 11006 -11745 16159 13058 -19803 17195 17261 -22721 19886 19038 -26891 16292 17567 -24811
204 -24811 17423 16268 -21660 13913 8869 -17568 12365 4539 -9496 9367 -3496 -4090 6155
217 6155 -10569 2711 5340 -15286 7414 496 -21960 11122 139 -23985 13249 -2574 -26306
230 -26306 13006 -5892 -26045 14152 -6738 -24519 11263 -10926 -21683 11051 -12818 -17232
242 -17232 9805 -16412 -13914 7937 -19101 -7531 8033 -21271 -3327 6080 -23459 837
254 837 5582 -22563 5585 4445 -23061 7103 3889 -19764 9463 4078 -16736 9572 2609
267 2609 -13348 10338 3412 -8160 9649 2019 -4664 9117 1627 -41 9501 1102 3030 8462
281 8462 -747 6173 9473 -1870 8225 9737 -3129 8686 9576 -3630 9756 10307 -4349 8154
295 8154 9959 -3874 6775 10066 -4072 4502 9734 -3676 1367 9712 -2149 -1392 8883 -1780
309 -1780 -3958 7999 -493 -6014 7073 425 -7489 4325 1134 -7153 2280 1836 -6592 -891 1940
324 1940 -4999 -4015 2430 -2441 -6904 1826 301 -9264 1628 4101 -11188 505 7021 -12516
338 -12516 -1056 10060 -12367 -2366 12753 -11979 -4474 14393 -11074 -5203 15507 -9838
350 -9838 -6056 15246 -8143 -6521 14307 -5878 -5786 12148 -3964 -4334 8863 -2530 -2348 5666
364 5666 -671 -787 1233 739 1847 -2902 1196 4742 -6099 1130 6388 -9386 946 9132 -11568
379 -11568 -201 10636 -12971 -1976 11571 -12862 -3222 12373 -12959 -5077 12105 -11588
391 -11588 -5744 11351 -9585 -6383 9068 -7884 -6034 7357 -5419 -5169 4229 -3452 -3642 1171
405 1171 -903 -2010 -1483 964 12 -4008 2127 2570 -5395 3331 4500 -6396 3141 6177 -7177
420 -7177 3396 8511 -6524 2292 9575 -5922 2143 10767 -4998 1198 10774 -3825 198 10573
434 10573 -2290 -178 9311 -923 -313 7576 169 -169 5636 1458 117 2834 2035 840 542
449 542 2776 1543 -1692 2072 1980 -3498 1536 3062 -4531 75 3231 -5486 -1200 4217 -5357 -2663
465 -2663 4405 -5147 -4388 4173 -4741 -5228 4480 -4130 -6362 3885 -3446 -6587 2475 -2110 -5758
480 -5758 1177 -1540 -5440 24 -314 -4026 -1581 498 -2605 -2455 377 -1121 -2787 550 466 -2824
496 -2824 328 2063 -2613 -422 3674 -1727 -1195 4265 -1152 -1731 5273 -188 -2110 5233 604 -2360
512 -2360 5384 1078 -2121 4576 1422 -2143 3687 2018 -1237 2669 2144 -1006 950 2182 -481
527 -481 219 2020 289 -791 1041 802 -1339 150 1442 -1678 -814 2334 -2144 -2010 2569 -1634
543 -1634 -3040 2748 -1769 -3837 2847 -903 -4107 2265 -573 -4178 2039 -395 -4070 1749 393
558 393 -3275 863 676 -2871 451 1117 -1818 91 1231 -729 -485 1360 39 -469 1355 1070 -453
575 -453 942 1603 214 785 2175 6 13 2919 490 -336 3209 703 -763 3125 1053 -828 2598
592 2598 1391 -1444 2069 994 -1414 1476 1112 -1165 505 1263 -1019 -101 1283 -634 -1087 379
608 379 -326 -1399 50 -288 -1597 -698 -330 -1825 -1229 -227 -2011 -2063 -91 -1752 -2553 -21 -1153
625 -1153 -2488 -82 -910 -2438 -233 -659 -2718 -538 -284 -2069 -669 -16 -1373 -1047 495 -1252
641 -1252 -844 613 -266 -838 1118 148 -721 1060 996 -224 878 1091 26 928 1654 301 532 1881
659 1881 598 568 2106 1088 490 1715 1219 433 1534 1292 431 1449 1412 584 540 1612 559 391
677 391 1338 660 -211 929 329 -765 730 515 -1152 236 389 -1415 -22 382 -1405 -552 52 -1418
695 -1418 -871 -38 -1218 -1104 -90 -1076 -1491 -372 -943 -1555 -311 -660 -1148 -884 -615 -924 -904 11 -614
714 -614 -797 134 -239 -1153 469 141 -1026 448 768 -876 304 1110 -853 521 1064 -224 393 1251
732 1251 -321 439 1593 77 230 1091 239 104 1497 524 226 1069 488 543 889 560 548 213 298 371
752 371 -17 363 403 -566 0 609 -875 -113 681 -1127 -353 413 -1288 -459 475 -1183 -916 490 -1230
771 -1230 -1075 434 -1405 -1449 356 -1071 -1188 257 -834 -1243 101 -871 -828 -177 -872 -541 -105 -378
789 -378 -72 -183 -444 411 -295 -190 662 -358 -70 1072 -230 329 1331 -319 74 1434 176 298
807 298 1539 210 348 1705 315 418 1748 321 320 1121 290 681 1146 155 576 917 -91 565 678
826 678 61 888 359 -183 755 -2 -474 813 -307 -570 720 -606 -945 352 -719 -1164 480 -1023
844 -1023 -1436 8 -805 -1630 59 -701 -1209 -44 -733 -1299 -222 -650 -996 -173 -610 -724 -286 -340 -674
863 -674 -212 -351 -409 -227 -590 -55 -48 -261 288 90 -316 563 300 -166 812 243 -309 823 830 -320 792
884 792 829 57 857 1079 81 674 1276 -193 601 1139 82 379 1044 -17 563 749 297 226 555 255
904 255 550 114 28 58 -45 75 -27 -475 333 -229 -851 47 -70 -1197 -31 -37 -1427 -181 27 -1328
924 -1328 -118 116 -1560 -178 464 -1493 -280 342 -1413 8 438 -1468 -261 6 -1083 81
940 81 203 -994 -94 282 -683 200 124 13 582 66 65 611 -211 472 584 -415 563 1168 164 506 1415
961 1415 -313 623 1021 -423 508 1161 -185 528 1310 -337 456 1067 -410 708 831 -695 439
978 439 645 -517 191 320 -270 177 -76 -194 38 -607 -169 28 -565 -331 121 -740 -53 -125 -1130 -177
998 -177 3 -1206 -567 129 -982 -237 -10 -1319 -284 127 -1134 -296 63 -1205 -354 116 -903 -151
1016 -151 184 -669 4 11 -545 339 35 -267 369 51 74 281 208 145 517 102 384 1015 120 553 650 118
1038 118 579 933 189 141 1185 -86 475 1133 -90 170 1279 -1 179 1031 -95 -110 1098 -134
1056 -134 -108 1010 -21 -184 290 -235 -427 385 -137 -149 11 -336 -437 -82 -245 -80 -386 -491 -114 -572
1076 -572 -363 -140 -368 -481 121 -980 -708 242 -662 -527 370 -805 -592 475 -751 -360 316 -438 -381
1095 -381 548 -394 -199 509 -290 273 700 -366 92 379 -4 280 708 -45 656 357 99 658 479 -254
1115 -254 877 11 -49 1088 160 -167 1018 175 59 1075 -230 -205 687 58 -43 737 -428 59 414
1134 414 -488 -132 499 -692 -421 19 -241 -473 -29 -405 -340 -48 -625 -180 -438 -729 -132 -311 -594 -216
1154 -216 -630 -874 -108 -558 -533 -88 -418 -507 318 -427 -319 40 -414 -176 -88 -182 -151 173 -256 194 42 17
1176 17 285 493 -10 357 255 118 394 474 190 229 494 346 531 425 473 504 456 209 316 250 282 594 469
1199 469 236 411 287 101 313 280 -151 303 382 -313 41 -64 -426 192 -10 -558 109 -6 -404 -75 -394
1220 -394 -763 -356 -191 -315 -499 -197 -489 -163 -333 -794 -297 -386 -408 -316 -483 -499 -234 -612 -670 253 -739 -370
1242 -370 -210 -246 -176 37 -449 -18 280 -417 147 177 -234 183 392 -230 195 484 97 124 382 151 404
1263 404 635 -106 267 291 401 630 233 -107 554 283 275 240 356 268 636 -157 360 252 -333 63 171 -46
1285 -46 56 91 -219 -14 37 -218 11 109 -200 -177 -308 -267 -134 60 -428 -88 38 -230 -217 -130 -475 -160 -261
1308 -261 -222 -106 -202 -332 -93 -295 -32 35 -220 -312 -118 -85 -288 177 -2 -292 168 -107 -5 486 131 -14
1330 -14 174 291 115 452 -166 231 405 141 423 245 332 341 480 53 64 171 266 313 285 240 196 224 217 335
1354 335 77 53 -20 5 -34 296 176 -106 80 -190 8 130 -337 -97 -121 -270 -316 91 -532 -245 141 -28
1376 -28 -108 -216 -439 -114 -179 -138 -220 -143 -198 -202 -339 -498 -256 -223 -122 7 -107 40 -56 262 -305 -122 -181 -153
1400 -153 34 186 -1 244 -108 84 -6 51 122 182 138 65 383 -6 265 266 271 75 498 245 361 247 315 364
1424 364 547 425 162 22 99 384 43 139 243 -356 96 155 -260 -320 228 -190 -484 141 -66 -138 125 -437
1446 -437 -417 -148 -239 70 189 -225 -371 -211 -348 -237 -632 -259 -233 133 -281 -98 -180 -400 61 -163 -255 -380
1468 -380 -589 -233 -431 -116 -217 -289 175 -122 597 -233 -87 631 104 -62 170 286 127 178 224 448 67
1489 67 288 189 414 568 281 7 -3 351 -238 9 232 364 -236 -100 478 359 -77 -151 -259 193 -208
1510 -208 -483 -201 119 178 -290 -489 339 315 293 -12 141 -1114 -482 -176 -938 -418 -169 -705 -457 -344 -274
1531 -274 71 -562 17 126 -544 -1011 53 -467 245 -110 -80 -137 143 164 -101 228 421 -296 -410 -209 103
1552 103 463 -38 511 32 30 -192 16 -99 466 63 423 -34 166 125 699 186 -50 355 165 267 479
1573 479 92 312 21 136 435 56 485 -8 122 11 62 -10 52 115 -25 48 -132 -108 30 -238 -125 30
1595 30 -27 -248 -177 -126 82 -246 -262 -152 -75 -250 -85 -224 -203 -422 -195 -226 -385 -355 -52 -375 -77 -150 -240 58
1619 58 -420 -339 -231 -6 -467 -269 269 -503 43 -72 -281 -108 -120 214 -62 48 190 172 155 601 472 9
1641 9 322 324 299 372 311 -53 -115 390 456 158 111 -54 -439 -162 143 28 -179 77 328 168 -41 201 -243
1664 -243 -104 82 -349 -187 -172 -74 252 -37 421 -58 -302 87 107 7 285 8 -291 -99 -422 -309 55
1685 55 -69 -294 -330 99 -88 -784 -494 -107 -489 -277 199 -368 1 -112 8 -269 -177 -299 366 23 136
1706 136 -404 96 -307 -59 178 361 68 126 279 218 303 -197 20 159 -203 297 341 325 482 386 8 -179
1728 -179 195 -67 206 54 -90 87 433 -232 281 -174 -276 133 -257 36 100 44 -51 -443 -269 -326 230
1749 230 -482 -283 37 -22 -200 -182 84 -167 -8 -346 51 -49 231 -276 -329 190 -132 186 78 109 286
1770 286 -55 310 -121 -101 167 164 -571 265 180 312 -51 136 -402 177 140 -330 -44 -80 -224 338 314 567
1792 567 72 384 52 -331 371 19 618 262 151 29 386 -32 270 -12 57 6 -351 -123 -31 199 196 -457
1814 -457 -24 -993 -707 -591 -541 -67 -311 127 192 654 595 154 -598 -926 -708 661 -282 -190 -121 496 -611
1835 -611 -817 950 -391 -271 -773 167 -112 -91 212 468 -590 192 105 183 -582 134 -140 268 411 -252
1855 -252 -68 329 -701 -327 312 -353 253 371 -195 129 651 231 -38 676 244 -35 619 145 -479 21
1875 21 -53 -277 -12 715 177 343 610 54 358 15 416 78 164 -200 105 133 -214 -26 -195 265 -163
1896 -163 253 111 34 -257 -153 -223 -17 -62 211 -279 119 -147 -564 -210 -417 -108 -46 -229 34 -104 -277
1917 -277 -189 -176 -72 184 -147 107 -255 -246 26 252 -407 458 144 85 84 -553 650 -82 -166 -1049 609 417
1939 417 460 27 82 99 -507 8 33 -451 117 -219 -4 -166 -250 56 678 997 176 582 181 685 -138 -286
1961 -286 -406 -378 136 160 46 108 227 -67 58 260 -230 245 -39 137 56 -387 409 -129 -369 136 216 133
1983 133 -101 -494 -127 268 -56 181 246 -223 165 66 -35 -42 7 -103 66 -254 -752 -43 -597 117 -281 222
2005 222 466 -104 -211 -147 -322 130 -417 50 323 -80 239 -17 83 -63 143 -21 115 123 -197 -330 384
2026 384 75 -104 3 88 169 -98 564 82 163 -65 344 83 47 -85 -14 7 243 -303 -351 35 -135 -20
2048 -20 -244 107 83 -172 132 430 106 3 -394 140 23 154 -98 76 -60 -79 -149 -34 182 46 -71
2069 -71 36 81 -73 -385 295 5 -158 6 -165 52 51 -170 -136 12 306 -206 109 -12 250 130 20 398
2091 398 -76 71 6 -12 110 189 161 23 -9 37 111 92 152 65 98 300 188 260 122 124 89 157 -20 100 -157
2116 -157 -34 26 -79 16 -19 -18 96 171 -95 -61 -246 -96 -100 98 -175 -88 -143 -172 43 -96 -136 -158 -25 76 -274
2141 -274 -37 -23 -50 -132 75 -167 -51 -169 -261 79 50 -5 -57 280 33 96 -188 40 16 179 104 42 -123 197
2165 197 51 50 6 133 100 -199 -25 279 69 204 112 313 56 111 -52 102 272 -11 -96 350 350 17 26 8
2189 8 105 -27 101 38 -50 39 20 -203 181 -179 34 -139 -43 -24 -131 -214 244 -80 14 384 -161 -98 -51 -305
2213 -305 -205 -14 51 -112 -8 -212 -529 -170 203 -111 257 -344 36 -378 -172 -680 -253 -208 -40 694 121
2234 121 121 332 180 -162 -10 -267 260 33 276 54 -18 -83 -5 51 349 -288 37 -130 -290 188 209 680
2256 680 173 436 277 -472 92 -316 -119 422 -92 -404 -133 -162 14 -29 -212 96 89 -29 -52 147 -100 160
2278 160 63 -69 3 89 145 18 -36 300 -79 85 35 -443 267 -38 -264 544 170 201 -149 -96 -10 58 -144
2301 -144 12 -309 97 265 -290 -3 35 -85 277 -29 -272 -101 -36 -9 37 135 136 243 4 8 -98 -12 106
2324 106 165 -184 214 67 -198 156 4 242 -73 104 263 113 58 53 -30 -12 71 -95 -34 -15 -20 176 57 184
2348 184 47 -254 -205 -190 141 128 -74 -111 -71 -98 24 -129 8 -267 -151 -134 -197 119 69 -161 -121 -84 -172 -60
2372 -60 -71 -40 -215 -85 -214 -70 -18 129 -252 -106 46 136 29 76 147 150 -38 215 51 -80 67 -74 133
2395 133 245 250 -27 218 107 63 -56 -140 -205 71 -185 372 -30 215 -8 36 75 -87 53 68 59 120 -167 140
2419 140 56 9 8 -131 109 245 33 20 -140 -216 -52 -201 -149 41 118 31 -140 203 25 172 -133 -106 -162 85
2443 85 -12 -168 180 -99 18 -346 -187 255 -239 -97 86 -141 67 -161 81 -7 14 -63 -291 -125 4 -53
2465 -53 44 50 -20 -26 -86 -8 144 -133 -10 -95 -88 -86 53 3 262 145 94 16 353 110 130 -148 -152 55 -42 233 64
2492 64 159 161 10 -192 -118 -146 -42 178 83 164 34 100 145 -4 -162 56 -1 -3 27 -347 -17 57 -76 89 -252
2517 -252 -93 52 -75 131 50 9 -274 -219 47 182 137 -224 -125 73 -81 -50 349 33 -9 121 -35 -43 149
2540 149 92 -250 -63 -4 106 9 -118 -53 97 127 269 34 -70 -43 -167 56 21 286 154 19 6 -65 14
2563 14 172 -218 113 23 119 -57 80 196 9 -7 40 -62 -17 117 2 140 -137 -142 -109 -50 63 47 49 14 -1
2588 -1 -182 -101 142 -62 -247 -86 21 75 -170 113 -7 -106 116 76 -49 -116 240 -148 -165 -87 -260 87 -15
2611 -15 141 -64 4 178 -89 -244 -19 7 -182 53 81 12 99 54 245 26 -34 99 -119 -116 66 30 -74 -53
2635 -53 -49 -93 87 68 -59 -70 -110 9 280 77 -124 132 292 -91 13 18 4 -172 55 20 2 107 -68 78
2659 78 -192 190 174 -37 -77 8 33 113 -212 -11 -109 180 -86 -22 -197 11 -14 -16 79 -119 -179 53 -14 45 -42
2684 -42 -50 -197 -22 -114 -93 -60 206 -35 174 -91 96 203 25 -63 40 92 -221 79 78 -139 -17 -94 4 262
2708 262 37 83 27 72 116 24 45 201 34 -46 -39 42 280 -115 -8 -9 -84 19 -172 -269 163 -46 -149 -17 -73
2733 -73 -16 -40 -159 142 180 230 -149 -160 -50 -271 80 -127 80 37 -106 -164 -101 64 131 -255 154 -379 92
2756 92 126 -340 21 25 74 125 -116 -42 188 -106 56 -196 33 258 -172 32 -35 166 18 -63 -12 48 -92 35
2780 35 57 -50 -148 94 66 10 -132 188 114 -3 47 -225 101 -278 -304 -65 55 -8 111 -212 -66 370 195
2803 195 25 156 -38 98 -209 237 53 -72 110 -198 -139 141 -196 -3 -314 -281 55 -182 58 -26 69
2824 69 -46 35 150 14 -142 -303 -44 224 -55 276 -272 283 -96 -161 53 -101 -142 51 38 -196 154 -197
2846 -197 -158 -114 251 -61 -149 59 -68 54 224 -217 -97 116 -235 -45 69 85 200 -32 -181 246 303 100
2868 100 59 247 -78 -177 71 157 -39 95 356 23 -251 129 76 -121 -90 -121 -129 -30 83 -39 -69 -36 -314 -94
2892 -94 155 -148 -179 -33 -15 21 -208 -114 -4 -54 102 114 8 -28 -229 -132 -175 -81 -44 -16 -56 -67 -56 101 29 33
2918 33 44 57 18 155 -106 15 -146 -30 -74 268 -112 -80 -67 203 -24 36 118 -241 -146 212 137 4 -179 102
2942 102 -245 -23 -84 121 35 63 -43 -27 145 -173 230 70 23 88 -14 -3 102 -48 -117 130 59 -26 166
2965 166 129 49 159 160 -110 -83 53 142 -288 -228 -160 37 195 23 40 54 -19 -143 57 202 -136 304 40 -60
2989 -60 -176 -183 190 41 -408 12 -36 20 -154 -11 -173 -3 -41 -28 -239 15 105 -30 128 -29 268 -53 97
3012 97 -144 -100 104 -38 -67 38 100 105 29 5 91 81 -75 -126 54 164 -49 123 55 -66 195 94 49 -55
3036 -55 172 269 4 -76 -145 275 -56 170 14 155 -71 121 -118 -110 -45 198 -115 87 188 47 9 166 -78
3059 -78 -9 74 82 -73 138 -145 170 55 168 103 53 -1 66 -28 76 169 298 56 82 285 -52 60 -35 104
3083 104 216 33 10 12 -45 -8 -67 145 -1 175 110 18 42 -107 158 -177 35 33 97 217 43 265 30 62
3107 62 164 -146 270 -34 23 -206 88 -104 36 -106 106 -88 -132 21 62 -32 96 -27 -85 67 3 -54 185
3130 185 -8 17 -26 -153 -232 83 -57 -48 -231 -43 108 -130 159 -139 60 -19 87 -18 -200 86 -304 -193
3152 -193 13 -89 166 26 131 -41 -19 -21 -225 -19 34 73 94 -18 3 318 68 44 0 97 -185 -50 -37 179
3176 179 65 12 96 67 240 149 -182 -156 128 -64 24 -14 168 433 -147 -31 -9 -43 4 70 141 -209 -67 18
3200 18 -179 -45 -72 137 -128 -259 -89 -38 -61 -127 -81 6 22 -103 219 95 129 4 -27 186 -130 140 88 23
3224 23 164 -78 31 203 -27 30 -118 -300 -33 -35 259 217 6 82 45 -32 227 -111 -155 43 210 180 -185
3247 -185 -120 -383 218 -82 -84 -20 -111 102 -221 -67 -118 115 72 -31 171 130 124 48 174 17 -1 -141 -92 -42 126
3272 126 -74 152 -357 -105 15 224 -24 -13 -14 -47 -92 103 -170 -66 -175 50 -112 14 71 -281 39 -239
3294 -239 188 -82 41 -216 -136 -57 112 -119 45 -72 36 187 -386 210 -66 -61 -217 -66 -19 -5 -126 -202
3316 -202 -393 -98 -84 134 97 -58 -95 214 -90 95 -35 197 85 18 292 -29 -113 167 23 -156 51 110
3338 110 -113 289 247 154 -229 -47 -103 227 -224 -106 -143 117 -27 -242 -175 21 -80 -181 -109 27 118 12
3360 12 -121 -198 -283 38 -94 -207 -150 50 240 -109 146 -48 -252 -215 -103 105 -101 -110 -164 54 12 -144 61
3383 61 -206 -135 -207 -94 7 142 -13 46 126 61 224 207 -223 179 102 -151 -36 75 -11 51 185 202 128 -67
3407 -67 337 37 -69 -59 174 100 -251 362 174 349 -25 -26 -152 -133 2 123 236 211 -7 -264 93 172 -119
3430 -119 96 171 121 89 -25 -42 293 -83 -96 -38 81 107 -41 -370 -171 -14 -240 -104 -82 -5 52 -89 -56 -90
3454 -90 -116 -334 362 -341 -125 92 93 -7 -113 25 1 126 -30 -32 1 -95 -160 71 31 59 137 153 28 -7 44
3479 44 149 -40 -135 -47 142 86 -278 -25 4 114 236 -183 -3 18 134 -54 180 189 -263 -94 -127 -173 -314
3502 -314 -113 -305 132 -106 -758 86 -131 -353 118 -108 -262 242 142 -349 -325 228 -581 320 -466 71
3522 71 693 182 -181 1 669 272 255 -402 80 236 252 7 673 -106 -374 -1155 -133 -539 246 -241 42
3543 42 -120 418 491 -398 -447 296 217 265 -970 294 511 351 -19 -171 548 483 206 719 -215 -370 -233
3564 -233 -33 137 -574 -72 348 38 69 -79 -26 -187 -31 404 396 167 30 -551 -273 -113 64 5 67 62 -351
3587 -351 -74 -311 -83 20 -20 134 -10 -329 -558 -114 7 -649 -1182 -220 -645 -484 380 281 -218 199 -28
3608 -28 425 -183 -188 75 -217 -134 256 -655 71 -137 -197 184 -264 -552 336 -112 23 -174 5 9 -184 -345
3630 -345 131 161 61 -328 595 -82 878 173 90 264 -74 -33 657 84 333 60 -16 -44 -102 430 238 -44
3652 -44 -125 -81 486 -182 -423 60 -714 178 1197 -281 -147 -6 -164 349 -74 -204 39 367 -862 88
3672 88 -579 -179 333 941 558 274 -641 -67 -544 77 -421 15 -445 -106 -24 -1014 -63 40 -17 186 -644
3693 -644 230 -327 -95 211 -247 456 146 262 8 -309 138 -156 655 -327 127 514 -44 -20 262 151
3713 151 103 146 -221 72 -274 -14 170 -223 501 44 524 420 -175 -245 151 512 -320 469 -7 -357 387
3734 387 -95 -372 -825 99 65 -24 -333 -256 -224 -224 -403 -515 311 -142 -213 343 -324 -717 -386 -380 -161 -313 70
3757 70 -214 48 -427 172 115 -526 -107 467 99 215 15 346 -81 -9 -68 82 51 -113 195 -63 -38 209
3779 209 81 285 110 -79 320 46 181 45 184 198 -141 4 161 11 2 171 167 152 -16 -10 -19 -3 79 91
3803 91 213 -319 194 -20 -4 -19 -118 -51 -267 -155 -215 -120 -140 20 -37 -141 84 10 -129 -250 -106 -112 -62 -106 -80
3828 -80 42 -12 88 163 -92 -267 16 189 -273 64 -209 -240 51 -39 209 183 -141 -57 126 212 191 -186 -849
3851 -849 28 -22 -410 -40 121 334 -230 -196 18 -74 -30 107 -112 197 -104 -75 64 -54 2 258 -31 107
3873 107 156 244 -21 -167 -3 -114 22 -5 -351 140 -65 183 -34 -5 -77 -75 -176 -39 63 -99 -143 -127 -178
3896 -178 139 -11 139 43 -23 -118 -35 -77 -71 228 -87 -285 86 176 -146 150 -258 -22 35 317 7 0 26 170
3920 170 98 25 19 -22 -165 27 8 -83 116 191 297 191 125 -135 215 7 -158 183 95 -30 -125 77 204 -14
3944 -14 -12 81 11 95 48 88 -77 -146 71 74 240 -214 -43 64 -19 -58 -120 22 211 117 -183 1 -223 -162 130
3969 130 -10 -102 -19 33 -65 312 -44 219 -50 -52 -44 -168 11 -150 -59 110 279 -39 -164 -172 282 198 -167 32
3993 32 305 -127 -41 56 -263 -161 65 -309 214 47 -102 179 321 40 146 208 88 -202 182 339 83
4014 83 213 117 225 -16 150 -143 79 145 69 60 107 -151 117 -146 -159 -230 5 16 -102 -141 -28 -78 -187 -36
4038 -36 21 83 3 14 -132 -4 -113 28 -119 -31 6 -46 -84 -19 124 -15 -150 -153 -79 -50 -145 -273 -83 263 -133
4063 -133 196 105 -237 41 -142 20 -109 44 207 249 -47 205 -27 -34 -45 -283 -126 4 125 214 137 16
4085 16 53 52 70 60 -63 81 -288 94 136 64 -14 161 112 61 -30 16 26 51 28 -205 -136 42 -75 -179 46 -37
4111 -37 -58 -64 -70 29 74 -60 -10 -164 -324 -34 -24 -241 124 175 -131 -46 -17 -150 -123 -20 -56 -98 -71 -58 148 -14
4137 -14 21 -58 200 -156 115 -55 -80 50 49 153 -320 103 -56 230 127 17 48 -31 26 -184 47 64 -215
4160 -215 -25 3 -133 171 22 219 -1 32 -59 133 24 -300 -49 -44 132 312 71 44 4 -200 156 -80
4182 -80 -39 -134 -6 27 105 -113 153 -40 314 44 105 19 200 -40 245 66 9 148 -62 -118 175 122 128 3
4206 3 166 -34 -347 179 -248 -20 -144 -172 -136 -18 37 -8 18 -21 -232 88 73 6 -276 61 -50 -121 -36 99
4230 99 131 -6 -136 95 37 -149 95 -59 74 273 242 69 71 -22 438 -66 -64 0 73 -155 109 105 11 76 203
4255 203 -3 113 -198 -59 45 54 182 57 -91 16 -68 -55 -95 219 208 174 -25 -150 -214 138 77 -145 92
4278 92 -134 39 -186 1 -93 -130 -94 -172 21 154 -59 7 -145 22 -165 -188 280 21 186 26 -62 -174 -135
4301 -135 99 -2 -18 -141 194 48 255 149 -142 -106 62 -46 -2 141 104 -49 196 -4 11 62 169 -1
4323 -1 -175 186 34 -243 132 -102 75 46 -19 -66 100 83 -72 -165 -23 15 -239 -196 -90 -164 94 -77 -106 10
4347 10 -141 99 272 -185 71 -31 29 102 -43 354 128 -216 -48 198 -177 7 114 -123 227 88 -35
4368 -35 86 177 119 110 -40 51 111 -170 52 -56 -83 -88 -61 -116 90 -108 262 -89 -177 -36 182 132 -41 148 -45
4393 -45 -101 -116 -16 13 -165 1 260 33 50 -44 -197 -188 -95 1 -83 -276 333 71 76 120 56 -114 125 109 9
4418 9 -348 31 -49 -21 -276 45 -23 -222 199 -117 -3 -185 -202 154 255 -40 399 -160 -181 -27 -127 -152 11
4441 11 35 -64 -153 30 -153 -68 98 93 125 142 82 -153 106 -119 -54 17 116 -190 210 87 89 -181 -60 132 169
4466 169 -40 -112 -190 -228 108 32 108 -213 -230 28 90 -143 -182 30 -118 -12 -23 -107 242 -11 -71 -86 -142 12
4490 12 51 93 68 180 -59 -29 -41 171 -61 -8 -230 93 11 30 -4 0 6 -135 190 -145 -26 335 123 52 -75
4515 -75 54 -147 -272 173 -126 185 83 -20 -109 -147 31 64 -59 -8 71 213 -7 33 161 16 -7 -68 -75 32
4539 32 -5 -10 3 98 10 -69 -48 95 122 -159 10 -99 -37 -103 -61 79 -194 0 169 43 -19 148 10 135 161
4564 161 -135 22 -72 -77 -62 -139 9 -431 184 68 11 132 -114 129 76 -82 107 320 68 -19 209 164 81
4587 81 -44 196 80 122 50 -130 -249 -14 151 74 -206 -47 140 -138 88 -16 90 -97 32 -55 -44 188
4609 188 -121 -177 30 -157 83 324 43 -166 101 121 106 155 153 31 47 -227 -108 41 10 -302 59 25 -15
4632 -15 -156 -159 -176 65 227 66 58 146 -35 -16 2 3 142 69 29 -19 48 -14 265 0 82 172 160 -34 -184 -99 -37
4659 -37 -96 68 102 -39 143 -132 29 -100 16 -30 100 -44 68 13 -50 228 161 15 100 119 -20 72 192
4682 192 169 23 44 190 90 -94 232 -240 28 60 70 107 -45 3 -27 -168 -1 -103 56 45 -162 -260 -169
4705 -169 70 -70 -78 -335 37 4 -121 -109 -203 93 36 -15 -66 -38 133 -298 55 41 -49 22 -145 79 -98 74
4729 74 25 298 172 -73 219 -101 74 -38 101 148 79 124 80 -39 -8 87 84 43 -53 -83 24 150 39 185
4753 185 132 132 50 -4 -18 -32 -145 123 -16 108 142 -95 68 -113 -80 -25 120 123 -72 -322 112 -149 -25 63
4777 63 -9 148 209 -54 -20 83 144 200 -24 -112 120 99 -19 138 -136 5 16 -111 178 100 -59 -31 35 153
4801 153 -105 181 -214 -68 -189 46 -218 -32 22 -188 -26 -122 -36 238 -80 -114 173 224 -109 -62 -175 124
4823 124 -70 213 -69 -120 -71 -17 51 -100 161 -33 -59 -31 3 -216 239 79 -160 264 81 167 126 -13 32
4846 32 -33 -166 -132 -93 -74 61 49 4 -200 -496 14 -167 -65 -65 -182 251 -186 62 -53 51 88 -218 -13
4869 -13 80 -303 -121 57 -91 68 -217 -25 32 71 -44 9 -172 11 -194 139 14 -9 48 -145 12 295
4891 295 36 -52 53 26 -20 26 48 -152 125 113 119 -141 50 -24 -37 192 59 -74 -52 47 384 -21 132 101
4915 101 198 -23 -7 101 -68 -121 -4 -75 -22 162 248 129 -59 -38 18 151 -64 176 -85 9 -184 -4 92
4938 92 100 -66 -221 -119 4 151 117 138 44 -139 -2 -94 -22 -61 -94 594 -53 54 -361 -87 7 131 -286 21
4962 21 -451 261 -90 -38 20 865 -360 48 -586 -57 229 89 203 458 -460 -253 -140 -196 440 17 290
4983 290 -603 -717 307 -330 -246 380 -27 -793 -148 -291 677 879 -703 -281 -320 -768 545 264 -223 187
5003 187 558 163 -947 -47 16 -567 960 -1331 550 -766 -265 -115 -325 -810 709 737 -370 1152
5021 1152 -482 351 280 478 -788 534 -269 328 96 1114 -609 260 -521 369 462 439 -639 441
5039 441 70 -376 152 -244 20 -77 257 -142 413 -186 142 92 98 68 -91 490 162 174 -864 103 291 290
5061 290 -487 -315 410 294 -415 194 432 -408 238 -701 160 -203 -579 -629 30 691 125 737 93 -613
5081 -613 -293 -903 -821 306 -79 -626 566 -53 732 714 -753 208 -299 108 -174 -166 -592 -135 62 160 -21
5102 -21 230 -857 -321 -54 317 -37 -313 424 -67 387 -271 -128 -65 428 317 -651 -61 -414 422 -273
5122 -273 401 -381 76 704 603 387 34 383 352 198 -401 -607 371 -659 -357 167 -160 -212 377 -622
5142 -622 -291 -420 292 -220 897 -505 -185 -761 -477 -326 -10 189 154 -54 510 -108 -137 307 -293 114
5162 114 -235 -111 -315 250 410 54 -231 -19 -605 -316 -654 -327 -343 580 -129 567 -195 -12 -25 -72 -551
5183 -551 -138 -147 -284 -117 -203 -145 189 59 -74 -368 118 -93 193 -140 -107 105 -284 -667 -437 -346 250 -321
5205 -321 146 -148 -23 25 -307 108 389 -375 -281 321 158 -250 -202 432 103 39 76 426 -471 702 197
5226 197 -196 258 403 393 -82 207 132 246 -181 -221 -395 64 121 213 -34 -87 -23 358 -43 171 121 165 -111
5249 -111 -342 -363 -607 -563 -324 -53 -190 84 -232 -202 -459 -286 161 -226 -467 -437 61 -231 -71 -148 311 -555
5271 -555 -22 -12 97 314 502 -37 -399 -132 -341 -931 -317 -365 10 61 -34 583 438 449 298 -440 -794 423
5293 423 -50 300 -112 45 -157 33 164 31 128 -40 -287 -689 282 227 -410 114 -216 -343 -141 160 227
5314 227 484 197 231 5 157 -319 -324 -241 -286 -64 -100 109 -436 -280 -110 726 -307 -323 -44 102 -262 -509
5336 -509 29 -275 -122 -146 91 -139 68 114 27 185 444 -111 44 417 -136 257 -13 204 38 -133 -45
5357 -45 -13 220 -270 297 -148 378 -46 434 -245 -196 71 -230 -153 93 -243 -267 -299 23 -83 -12 196 59
5379 59 149 99 388 -162 -276 434 -57 -33 340 254 -545 -10 -46 205 158 -146 54 -242 -4 277 -78 285
5401 285 126 -44 -572 64 -118 -162 -297 350 353 -563 -59 -181 -146 -461 -211 221 -351 -155 -132 13 -461 -493
5423 -493 -217 -30 -12 243 -272 292 -172 47 -431 253 -557 434 822 -141 -83 259 -201 125 -165 94 113
5444 113 -109 -527 -170 180 -339 50 -302 235 -236 -415 -477 408 128 -401 110 463 7 509 562 -32 -1161
5465 -1161 54 -168 205 70 -173 -799 -397 -578 -911 278 107 263 -277 19 455 -436 -772 -83 719
5484 719 -123 -40 -533 -77 384 313 121 -17 -74 213 243 -211 -326 33 80 -46 110 -105 82 40 44 237 -1
5507 -1 48 202 1 -51 -124 -46 -71 125 -295 -136 -14 -11 167 146 -112 270 -1 -95 41 57 -45 144 -82 -15
5531 -15 -6 30 44 -25 115 30 -203 61 125 97 147 -61 -170 99 -15 -39 196 -65 16 44 -185 -18 -30 -134 156
5556 156 136 -86 7 -52 181 65 -134 -163 151 62 80 111 71 65 180 142 -113 271 76 306 -193 33 100 9
5580 9 -178 47 -243 81 252 -25 45 -76 -61 -170 64 -189 -53 -191 46 -145 254 -85 -38 -201 -9 332
5602 332 -48 -35 -25 335 -44 -16 152 54 45 -32 -188 36 -33 -27 192 -111 -261 -289 -45 30 192 5 115 65
5626 65 -11 -157 16 -32 -102 52 -34 -239 -319 -134 -14 131 6 30 101 27 -19 8 84 15 -241 -39 -181 7
5650 7 43 67 15 123 -93 91 59 -148 60 90 62 -204 -310 59 -59 -18 38 -63 -11 43 -213 8 -22 20 -70
5675 -70 162 -48 156 -64 77 -18 -187 -115 -39 -80 83 149 88 71 -162 125 109 106 -96 -58 -23 -148 4 -86 -49
5700 -49 -101 6 -137 12 -50 21 16 -254 240 108 -150 2 77 -259 -371 -8 -75 -26 -128 -236 89 106 55 -56
5724 -56 -56 118 53 -123 -169 29 119 -294 -57 12 -2 23 95 42 117 60 -3 111 -65 -90 -195 -76 53 -152 1
5749 1 -132 280 97 59 104 625 282 190 237 -93 -94 -15 42 -109 -143 20 38 132 4 -172 78 39 -17 -113 71
5774 71 113 236 -78 -115 -51 113 -101 100 -144 -200 82 -179 -45 55 206 149 -135 -46 -146 -27 77 87 204
5797 204 112 -27 164 117 -66 -40 -83 -58 31 120 214 -54 183 -202 -17 204 -143 218 -128 -74 -121 -175 199 -172
5821 -172 -258 182 60 -103 72 70 17 -62 -121 46 20 6 -41 295 27 242 24 -248 -162 -32 -122 134 61 191
5845 191 34 -18 125 90 -35 67 -25 -173 -74 -245 98 158 -100 -230 96 69 31 -53 -28 -108 -136 212 -119 177
5869 177 -91 -88 28 -13 207 -26 -183 -127 -66 55 142 -1 144 -7 -92 225 -207 91 -1 -99 118 -62 162
5892 162 119 116 317 -30 82 16 258 150 71 131 29 121 -24 96 -90 -77 -39 -242 60 -22 134 58 -57 -15
5916 -15 59 74 -133 -27 -18 -87 51 132 238 8 25 -14 10 -99 200 8 51 300 98 52 187 -17 86 3
5940 3 -142 -95 46 -8 96 258 -49 -257 179 -168 8 -338 76 95 191 -47 -129 190 -44 -234 144 -123
5962 -123 76 71 102 -13 56 44 -102 73 52 -99 49 -282 58 -120 -136 96 16 -7 -198 -186 207 171 -20 -26
5986 -26 54 -42 -34 70 185 7 221 -110 110 -87 -134 86 76 45 -28 134 34 1 -73 130 -122 -25 58 55 16
6011 16 -3 170 -58 95 38 72 137 77 -16 -49 -121 -167 227 14 -55 59 37 35 -105 215 -179 -7 2 -19 -23 128
6037 128 -143 -207 -33 94 225 169 98 166 124 45 124 184 -147 90 -71 -51 39 261 -93 11 94 -300 169 -91
6061 -91 109 -35 -88 -91 67 -5 -29 27 -22 174 -79 -49 7 84 -78 -442 177 277 27 273 -71 -20 -49 233
6085 233 -21 -49 85 -67 -3 -94 -92 28 -45 -16 -78 -91 149 -140 -21 -190 60 164 289 149 -18 -177 59
6108 59 90 28 61 32 -204 97 -159 -17 70 -61 153 242 168 148 109 74 39 16 58 -182 -26 -36 76 -91 -178
6133 -178 37 112 -430 92 97 -202 -148 94 248 31 -94 -180 184 201 7 22 61 -48 -84 -198 169 48 -184
6156 -184 193 86 46 -84 -109 118 -67 18 3 -165 -149 73 258 -52 -46 222 126 172 98 -46 -20 181 -75 -67
6180 -67 28 -135 178 286 69 -1 -35 -68 237 125 -84 214 75 -47 -99 -59 -149 105 197 32 103 -13 -1 -273
6204 -273 -218 211 54 -112 -41 64 174 -96 85 25 196 -170 -44 25 -31 -173 320 -251 33 303 34 134
6226 134 102 39 -290 76 -22 291 65 -46 141 79 -273 -136 1 -21 -134 -146 -222 193 87 146 40 27 -77
6249 -77 -135 -143 -119 156 18 51 -59 186 -74 7 148 1 37 56 37 143 -113 -28 -146 110 -111 -8 301 -107
6273 -107 263 115 -82 -164 -57 35 78 -44 115 -9 49 -59 -127 41 14 -112 58 -129 44 44 59 66 -133 -70
6297 -70 -74 -32 -94 239 -81 218 -129 -177 -66 -131 34 -21 -171 42 41 -195 43 -91 -123 191 90 -93 -104 -112 18
6322 18 -9 35 238 -190 -228 112 -147 -32 131 17 -56 30 70 181 67 232 -28 34 -150 12 149 -182 70
6345 70 -148 67 -77 285 -82 -24 100 125 53 62 140 -136 -184 153 -68 52 7 101 6 38 -54 -198 -65 57
6369 57 197 62 -91 -18 155 -33 207 138 6 -70 -156 -93 -48 -21 -175 -183 45 129 -10 -3 21 53 -15 30 350 -238
6395 -238 -231 -210 -125 -56 84 48 38 -45 29 -60 127 132 116 229 156 79 -26 -250 123 167 -31 285 129 -145 -101 -135
6421 -135 -118 60 86 63 82 -63 -94 -31 -188 -119 -38 -80 -8 -67 7 -75 -178 -28 142 39 -169 -56 136 41 -7
6446 -7 -133 54 -63 42 111 -74 171 104 -32 -219 5 135 58 32 -11 -79 -365 -38 -188 -57 85 14 -20
6469 -20 38 -21 115 132 15 -83 -160 126 -24 99 -91 67 -177 71 85 19 16 35 -46 -88 -108 41 -112 65 66
6494 66 201 -95 168 76 -157 104 -117 14 156 -38 -97 -10 -64 93 174 -65 -164 -218 -118 189 -36 33 99
6517 99 33 -166 -76 -79 -23 -107 -411 -144 21 284 -116 133 -69 165 401 294 -26 -43 192 39 -67 32 124
6540 124 -116 -129 181 -249 57 -80 128 13 29 -34 70 264 103 199 10 57 -265 101 106 264 -101 -21 60
6563 60 -23 114 -143 30 76 -8 85 -53 -79 -259 255 2 57 167 -30 21 256 -57 -134 -248 9 195 -267
6586 -267 14 -151 10 22 -62 -82 -16 -12 240 -83 103 -36 127 -101 362 217 5 -228 -124 49 -85 15
6608 15 -330 64 27 -317 -124 333 85 32 193 78 -66 38 -178 -77 -149 -74 -184 221 -18 -25 -37 -136 -54
6631 -54 37 54 -201 171 -110 115 -72 -63 -40 64 -198 -147 -132 -116 148 -249 56 129 -160 69 -65 -56 27 -47 42
6656 42 74 178 -151 31 -189 -190 253 180 -302 -33 -215 185 -126 114 282 -188 106 3 58 -147 80 -24
6678 -24 -51 -129 33 -10 146 196 44 44 -78 215 -30 37 -159 61 -141 -102 198 -39 -120 -186 218 -150 -69 -65 22
6703 22 -76 -70 -32 -21 -51 -21 -198 -167 79 -7 76 243 92 285 -158 71 57 -399 -66 49 -118 33 588 -225
6727 -225 -271 -479 -431 120 -446 -69 80 278 -314 -25 7 146 174 -156 75 203 -81 -132 17 -34 -27 141 -43
6750 -43 88 142 21 259 76 39 237 -182 -37 -239 40 -93 -38 153 -161 -41 -26 10 -69 -46 152 -234 -16
6773 -16 137 180 -3 -101 -48 58 -202 -45 141 -38 -111 -48 -87 -209 0 -136 -192 -26 -10 97 14 -107 -57 138
6797 138 -30 70 230 58 171 -253 -107 75 -12 189 -126 259 361 55 -188 -59 71 -160 156 50
6817 50 197 10 -8 -71 -155 -128 42 -89 -146 -79 1 -210 -308 -25 -25 49 6 81 -265 49 -12 -18 258 24 67 -151
6843 -151 -29 -106 186 11 -66 21 -194 75 106 188 41 128 30 136 -247 -134 -125 -86 -60 -9 122 -27 -160 -192
6867 -192 -33 -38 -18 108 125 -30 60 -77 155 -75 12 -55 -38 -263 207 151 -148 -5 15 219 -42 19 -207 -124
6891 -124 45 -235 24 -158 -32 57 76 -8 -249 125 217 25 181 133 -182 -289 206 73 -33 -27 -148 43
6913 43 -49 49 -263 62 93 14 121 -262 -125 -95 101 -103 -95 62 50 129 -79 89 139 -81 -233 106 52 -206
6937 -206 99 121 -44 18 69 20 167 38 165 324 93 -68 4 -36 161 126 50 51 -148 -11 -70 -218 66 7
6961 7 -71 -58 -92 12 -189 40 33 19 -60 2 -80 -17 -69 2 13 -2 -17 143 -59 120 220 -77 -156 -255 80 -16 -124
6988 -124 34 -16 -42 123 -10 -128 198 -128 -6 169 7 -125 104 5 64 -2 -48 -148 -9 -63 -39 138 236
7011 236 -106 -174 56 -116 -126 43 235 80 -130 24 72 -19 -64 212 -84 77 128 -260 179 6 40 -120
7033 -120 -85 195 -43 108 118 -73 61 -5 143 129 -9 -100 -2 -35 -108 36 68 52 99 -21 147 -98 -217 -22
7057 -22 -112 -163 -9 -7 -46 285 -71 -285 -31 -77 404 90 18 107 7 -12 -38 82 -46 114 -93 -217 -52 -63
7081 -63 84 42 -92 -34 -84 217 -96 53 88 -144 64 80 101 3 -125 78 -177 -88 -153 142 -18 31 -26 225
7105 225 69 100 -89 -181 109 86 80 -356 -55 394 -139 -125 -62 176 -40 -112 -147 -39 179 -33 -258 -101 65
7128 65 46 -89 -157 -162 -1 -153 23 171 -9 121 -13 95 45 64 75 0 7 160 298 -67 9 164 -79 -313
7152 -313 3 -7 -116 -222 91 -111 -32 170 1 49 -156 -15 212 187 68 -73 17 69 100 -282 -25 5 141
7175 141 -9 -53 63 -65 149 -211 56 -88 112 81 -83 -82 -169 113 102 -118 -34 -181 -57 -96 -183 -41 -197
7198 -197 216 258 -15 -35 -96 -46 170 -30 6 109 -73 32 -172 77 -199 -134 -225 51 10 -209 -11 -121 43
7221 43 86 -124 38 29 -209 -30 147 -83 16 -205 -103 -169 28 18 -6 31 -306 -10 -69 -101 -89 -92 -50 -92 193
7246 193 -43 -133 173 45 18 109 119 -54 1 224 38 -45 33 190 138 -125 48 -12 -40 -128 51 138 96 83 -147
7271 -147 -60 -188 -19 332 23 60 226 116 137 196 328 360 40 -52 -13 -95 -34 -59 26 52 22 206 17 43 -67
7296 -67 -202 91 161 50 13 108 -141 258 -11 -23 -69 45 -112 29 -44 -84 0 114 -178 -74 220 167 67
7319 67 240 -193 -28 54 153 159 179 -27 0 85 16 -112 -101 -119 -50 -53 -65 346 -158 -11 105 22 92 50 -180 -40
7345 -40 48 -105 17 -82 98 -51 -11 -15 14 -221 -421 22 176 96 213 -137 39 -92 -110 120 20 -49 -61 -46
7369 -46 -93 111 165 46 -40 225 -101 11 -70 136 125 -105 115 -43 53 232 0 -174 -235 270 -158 -25 -135
7392 -135 32 -57 -120 -22 211 -35 -189 80 83 162 37 -73 50 -81 13 144 115 26 -333 65 -19 8 71 -162
7416 -162 -104 35 31 -84 126 8 -181 -277 -82 35 92 -145 223 -103 -12 -203 -236 11 -104 -84 -234 12 -97
7439 -97 66 45 -168 178 66 -16 122 95 105 57 -71 60 -311 194 -221 26 -237 -75 142 194 108 271 127
7462 127 -290 203 -48 -84 -90 -275 22 141 -66 179 -255 -175 43 -220 144 93 -41 -17 43 378 -25 219
7484 219 137 41 62 -1 12 -55 -170 -305 125 -52 -237 -170 -11 -56 22 61 -91 -51 -51 17 207 -245 -218 -89 -33
7509 -33 214 -41 -40 -241 14 -113 47 -17 -145 -128 5 180 207 -110 -25 -335 180 -166 19 -120 -17 171
7531 171 -7 -11 74 105 -59 273 37 -71 188 -66 -201 -129 -63 -96 -88 -144 -84 -28 185 161 57 -133 55 107 5
7556 5 -185 -5 -256 70 36 -107 -297 38 -64 -139 31 -101 -98 -170 71 -53 202 182 177 -17 -64 88 11 -98
7580 -98 3 -58 -10 209 31 -83 -108 25 167 -34 260 212 -80 248 42 -111 -68 212 156 -205 -104 280
7602 280 -13 211 -98 32 68 -59 -147 -27 -54 -67 124 41 80 -42 -131 81 -78 71 -108 111 14 75 -14
7625 -14 114 -60 -59 -79 -204 -25 135 51 -54 -74 -247 -111 -17 -105 43 146 20 24 206 405 -1 -47 89 159
7649 159 -156 27 -125 -134 76 -142 -80 53 33 -82 -196 -61 -32 26 77 97 127 143 -81 -3 205 21 76 65
7673 65 -146 17 58 108 45 -116 -165 -109 314 -123 -86 118 -179 110 -69 -161 -108 102 -89 -57 62 -25 -70 -160
7697 -160 -3 -49 -121 100 37 -77 35 89 -140 -77 95 68 -289 -134 33 180 25 -21 57 -79 -117 -63 76
7720 76 -170 164 38 -83 12 94 -35 173 7 197 -100 51 -89 -159 3 -80 -41 -108 126 -225 -86 116
7742 116 -69 26 -99 -63 166 -303 48 -105 -46 155 -122 -110 229 27 -23 222 72 -26 -174 72 240 -5
7764 -5 155 -114 51 -9 49 17 -240 189 86 25 -63 109 112 -72 12 70 209 152 64 -9 -213 -133 -63 -188 155
7789 155 26 30 -302 86 -8 -28 17 -166 -68 -230 37 -182 -34 105 -234 -237 -59 131 -10 125 102 29 -8 100
7813 100 -76 -76 66 -297 199 245 107 11 -32 -174 -250 111 164 286 -680 180 -522 -144 247 55 251 -565
7835 -565 315 -396 158 -301 -42 163 56 70 18 230 89 20 148 50 31 45 -22 167 128 91 -274 1 247
7858 247 -106 -49 -92 -85 26 10 205 -13 60 34 -191 44 140 54 184 32 105 -54 -61 -143 -14 -97 121 162 69
7883 69 89 144 235 367 163 106 119 6 -70 157 -11 -70 120 21 203 -124 14 -103 -161 69 -181 23 -71 -249
7907 -249 97 103 57 105 -10 107 -4 -79 119 281 -127 -57 -134 20 -22 -157 -21 -39 -70 -73 117 108 -105 -148 -179
7932 -179 70 -53 -165 51 167 -69 283 154 194 110 196 -98 220 209 118 118 -52 108 252 -52 -45 90 61
7955 61 -49 -43 -74 -48 -165 217 44 -62 -7 102 120 -202 -125 168 23 -252 -110 -162 91 157 -89 13 36 -32
7979 -32 -126 34 -97 -84 -16 28 14 -98 210 106 -287 -184 -31 224 -191 139 -82 -274 -75 85 161 143 50
8002 50 29 -150 17 -38 -6 52 147 -150 -229 138 -14 136 26 179 29 -83 -38 69 111 98 -54 89 -120
8025 -120 42 -152 128 377 -80 115 95 -103 70 -92 15 53 -17 116 211 145 -147 94 -15 313 135 135
8047 135 -55 -391 60 13 199 141 50 -23 81 -208 -138 69 170 35 94 30 -151 25 -145 98 -288 -22
8069 -22 -186 96 209 -56 -120 9 40 -172 31 -155 5 -84 66 -1 176 39 -243 184 -8 230 -4 156
8091 156 -25 -98 12 -7 -58 -236 -111 -27 -137 296 -241 -8 270 -41 141 -219 -285 52 -116 -209 411 63
8113 63 -95 -127 -134 -267 42 -60 -61 -170 178 113 -111 235 205 -159 167 59 146 64 54 -54 -239 -103 9 -13
8137 -13 30 49 65 0 -159 -319 -64 11 88 16 -210 -86 142 60 -102 0 0 -54 -2 5 12 157 -134 -135 43 12 -112
8164 -112 205 91 278 -250 205 66 86 185 -323 -32 12 10 -76 -50 -29 -148 -470 348 -278 -99 32 -373 -217
8187 -217 -493 -559 -200 -287
8191b87
##END NTUPLES=NMR FID
##END=
