##TITLE=1H_LR-730-C1
 CDCl3, 8 sc, 
 14.12.2020
##JCAMPDX= 6.0         $$ Bruker NMR JCAMP-DX V2.0
##DATA TYPE= NMR FID
##DATA CLASS= NTUPLES
##ORIGIN= UXNMR, Bruker Analytische Messtechnik GmbH
##OWNER= root
$$ XWIN-NMR		Version 3.5
$$ Mon Dec 14 13:52:14 2020 Russian Standard Time (UT+4h)  she@DPX200
##.OBSERVE FREQUENCY= 200.1315066352
##.OBSERVE NUCLEUS= ^1H
##.DELAY= (6, 6)
##.ACQUISITION MODE= SIMULTANEOUS
##.ACQUISITION SCHEME= undefined
##.AVERAGES= 8
##.DIGITISER RES= 18
##SPECTROMETER/DATA SYSTEM= spect
##.PULSE SEQUENCE= zg30
##.SOLVENT NAME= CDCl3
##.SHIFT REFERENCE= (INTERNAL, CDCl3, 0, 15.7039)
##AUDIT TRAIL= $$ (NUMBER, WHEN, WHO, WHERE, WHAT)
$$ ##TITLE= Audit trail, XWIN-NMR		Version 3.5
$$ ##JCAMPDX= 5.01
$$ ##ORIGIN= Bruker BioSpin GmbH
$$ ##OWNER= she
$$ F:/spectra/data/she/nmr/H-F/1/audita.txt
$$ ##AUDIT TRAIL=  $$ (NUMBER, WHEN, WHO, WHERE, WHAT)
(   1,<2020-12-14 13:51:02.51 +0400>,<she>,<DPX200>,
      <created by zg, POWCHK disabled, PULCHK disabled
       configuration hash MD5:
       00 E9 B6 7A A2 85 ED C7 34 08 36 98 17 FE 4E 26
       data hash MD5: 16K
       7F 7D 7F F1 F9 56 1F DE D5 4A 44 17 2D 37 21 00>)
$$ ##END=
$$ 
$$ hash MD5
$$ F9 A8 61 DD B3 BF B8 E4 5A CD 8D 49 5B 3F 42 33
##$RELAX= 
##$RELAX= 
##$RELAX= 
##$RELAX= 
##$RELAX= 
##$RELAX= 
$$ Bruker specific parameters
$$ --------------------------
##$DU= <F:/spectra>
##$EXPNO= 1
##$NAME= <H-F>
##$PROCNO= 1
##$TYPE= <nmr>
##$USER= <she>
##$AMP= (0..31)
100 100 100 100 100 100 100 100 100 100 100 100 100 100 100 100 100 100 
100 100 100 100 100 100 100 100 100 100 100 100 100 100 
##$AQSEQ= 0
##$AQ_mod= 1
##$AUNM= <au_zg>
##$AUTOPOS= <>
##$BF1= 200.13
##$BF2= 200.13
##$BF3= 200.13
##$BF4= 200.13
##$BF5= 200.13
##$BF6= 200.13
##$BF7= 200.13
##$BF8= 200.13
##$BYTORDA= 1
##$CFDGTYP= 0
##$CFRGTYP= 5
##$CHEMSTR= <none>
##$CNST= (0..31)
1 1 145 1 1 1 1 1 1 1 1 1 1 1 1 1 1 1 1 1 1 1 1 1 1 1 1 1 1 1 1 1 
##$CPDPRG= <>
##$CPDPRG1= <>
##$CPDPRG2= <>
##$CPDPRG3= <>
##$CPDPRG4= <mlev>
##$CPDPRG5= <mlev>
##$CPDPRG6= <mlev>
##$CPDPRG7= <mlev>
##$CPDPRG8= <mlev>
##$CPDPRGB= <>
##$CPDPRGT= <>
##$D= (0..31)
0 1.2 0 0 0 0 0 0 0 0.06 0 0.03 0 0 0 0 0.0002 0 0 0 0 0 0 0 0 0 0 0 0 
0 0 0 
##$DATE= 1607939461
##$DBL= (0..7)
120 120 120 120 120 120 120 120 
##$DBP= (0..7)
150 150 150 150 150 150 150 150 
##$DBP07= 0
##$DBPNAM0= <>
##$DBPNAM1= <>
##$DBPNAM2= <>
##$DBPNAM3= <>
##$DBPNAM4= <>
##$DBPNAM5= <>
##$DBPNAM6= <>
##$DBPNAM7= <>
##$DBPOAL= (0..7)
0.5 0.5 0.5 0.5 0.5 0.5 0.5 0.5 
##$DBPOFFS= (0..7)
0 0 0 0 0 0 0 0 
##$DE= 6
##$DECBNUC= <off>
##$DECIM= 32
##$DECNUC= <off>
##$DECSTAT= 4
##$DIGMOD= 1
##$DIGTYP= 9
##$DL= (0..7)
0 120 120 120 120 120 120 120 
##$DP= (0..7)
150 150 150 150 150 150 150 150 
##$DP07= 0
##$DPNAME0= <>
##$DPNAME1= <>
##$DPNAME2= <>
##$DPNAME3= <>
##$DPNAME4= <>
##$DPNAME5= <>
##$DPNAME6= <>
##$DPNAME7= <>
##$DPOAL= (0..7)
0.5 0.5 0.5 0.5 0.5 0.5 0.5 0.5 
##$DPOFFS= (0..7)
0 0 0 0 0 0 0 0 
##$DQDMODE= 0
##$DR= 18
##$DS= 0
##$DSLIST= <SSSSSSSSSSSSSSS>
$$ [...]
##$SUBNAM2= <"">
##$SUBNAM3= <"">
##$SUBNAM4= <"">
##$SUBNAM5= <"">
##$SUBNAM6= <"">
##$SUBNAM7= <"">
##$SUBNAM8= <"">
##$SUBNAM9= <"">
##$SW= 16.9725356469052
##$SWIBOX= (0..15)
0 0 2 0 0 0 0 0 0 0 0 0 0 0 0 0 
##$SW_h= 3396.73913043478
##$TD= 16384
##$TD0= 1
##$TE= 0
##$TE2= 300
##$TE3= 300
##$TEG= 300
##$TL= (0..7)
0 120 120 120 120 120 120 120 
##$TP= (0..7)
150 150 150 150 150 150 150 150 
##$TP07= 0
##$TPNAME0= <>
##$TPNAME1= <>
##$TPNAME2= <>
##$TPNAME3= <>
##$TPNAME4= <>
##$TPNAME5= <>
##$TPNAME6= <>
##$TPNAME7= <>
##$TPOAL= (0..7)
0.5 0.5 0.5 0.5 0.5 0.5 0.5 0.5 
##$TPOFFS= (0..7)
0 0 0 0 0 0 0 0 
##$TUNHIN= 0
##$TUNHOUT= 0
##$TUNXOUT= 0
##$USERA1= <user>
##$USERA2= <user>
##$USERA3= <user>
##$USERA4= <user>
##$USERA5= <user>
##$V9= 5
##$VALIST= <valist>
##$VCLIST= <CCCCCCCCCCCCCCC>
##$VD= 0
##$VDLIST= <DDDDDDDDDDDDDDD>
##$VPLIST= <PPPPPPPPPPPPPPP>
##$VTLIST= <TTTTTTTTTTTTTTT>
##$WBST= 1024
##$WBSW= 4
##$XGAIN= (0..3)
0 0 0 0 
##$XL= 0
##$YL= 0
##$YMAX_a= 740754
##$YMIN_a= -357955
##$ZGOPTNS= <>
##$ZL1= 120
##$ZL2= 120
##$ZL3= 120
##$ZL4= 120
##$ABSF1= 10
##$ABSF2= 0
##$ABSG= 5
##$ABSL= 3
##$ALPHA= 0
##$AQORDER= 0
##$ASSFAC= 0
##$ASSFACI= 0
##$ASSFACX= 0
##$ASSWID= 0
##$AUNMP= <proc_1d>
##$AZFE= 0.1
##$AZFW= 0.1
##$BCFW= 1
##$BC_mod= 2
##$BYTORDP= 1
##$COROFFS= 0
##$CY= 11.3945322036743
##$DATMOD= 1
##$DC= 2
##$DFILT= <>
##$DTYPP= 0
##$F1P= 15.9154993809931
##$F2P= -4.1035820241983
##$FCOR= 0.5
##$FTSIZE= 0
##$FT_mod= 4
##$GAMMA= 1
##$GB= 0.15
##$INTBC= 1
##$INTSCL= 1
##$ISEN= 128
##$LB= 0.24
##$LEV0= 0
##$LPBIN= 0
##$MAXI= 10000
##$MC2= 0
##$MEAN= 0
##$ME_mod= 0
##$MI= 1.114404
##$NCOEF= 0
##$NC_proc= 0
##$NLEV= 6
##$NOISF1= 3.799351
##$NOISF2= 2.8
##$NSP= 1
##$NTH_PI= 0
##$NZP= 0
##$OFFSET= 15.70392
##$PC= 1
##$PHC0= -10757.22
##$PHC1= 11.60089
##$PH_mod= 1
##$PKNL= yes
##$PPARMOD= 0
##$PSCAL= 0
##$PSIGN= 0
##$REVERSE= no
##$SF= 200.130013532006
##$SI= 16384
##$SIGF1= 3
##$SIGF2= 2
##$SINO= 400
##$SIOLD= 16384
##$SREGLST= <1H.CDCl3>
##$SSB= 0
##$STSI= 0
##$STSR= 0
##$SW_p= 3612.71676300578
##$SYMM= 0
##$S_DEV= 0
##$TDeff= 0
##$TDoff= 0
##$TI= <>
##$TILT= no
##$TM1= 0
##$TM2= 0
##$TOPLEV= 0
##$USERP1= <user>
##$USERP2= <user>
##$USERP3= <user>
##$USERP4= <user>
##$USERP5= <user>
##$WDW= 1
##$XDIM= 8192
##$YMAX_p= 0
##$YMIN_p= 0
$$ End of Bruker specific parameters
$$ ---------------------------------
##NTUPLES= NMR FID
##VAR_NAME=  TIME,          FID/REAL,        FID/IMAG
##SYMBOL=    X,             R,               I
##VAR_TYPE=  INDEPENDENT,   DEPENDENT,       DEPENDENT
##VAR_FORM=  AFFN,          ASDF,            ASDF
##VAR_DIM=   8192,          8192,            8192
##UNITS=     SECONDS,       ARBITRARY UNITS, ARBITRARY UNITS
##FACTOR=    0.0002944,     1,               1
##FIRST=     0,             0,               0
##LAST=      2.4114304,     0,               0
##MIN=       0,             -357955,         0
##MAX=       2.4114304,     740754,          0
$$ Real data points
##PAGE= N=1
##DATA TABLE= (X++(R..R)), XYDATA
$$ [...]
$$ plain form
2715 169 31 147 76 45 -9 144 151 140 45 -59 22 118 152 132 156 52 34 -117 310 213 -25 -34 -94 42 169 -27
2741 -27 166 122 103 584 -127 4 -281 54 267 -97 235 326 -179 5 -111 52 128 -215 266 -5 151 181
2763 181 67 391 209 -31 104 -27 -82 598 114 -5 89 -344 102 3 -283 314 137 -204 -55 -350 -46
2784 -46 325 -842 -29 -114 -321 179 -832 -696 510 -672 -99 -521 -1155 492 -550 -838 374 -727
2802 -727 -6 -300 -1523 540 -199 -926 465 -1087 -129 853 -1552 410 163 -810 1507 -1384 -283
2819 -283 1507 -1118 700 336 -1171 2167 -589 -825 1646 -293 1497 1078 -1984 2178 819 -581
2835 -581 1720 -1473 1152 1735 -1622 811 2209 285 2640 -1566 -180 3435 -2493 1526 440
2850 440 -1048 3291 -1022 -1313 2686 -876 921 167 -3019 2981 538 -2357 1381 -2475 1113 1526
$$ packed form
2715A69j38J16p1l1n4J53Pj1r5j04Q1R6L4k0K4j04j8j51M27r7k38ro0J36J27j96
2741b7J93m4j9M81p11J31k85L35K13l64L32R1n05J84j16J63P6l43M81k71J56L0
2763A81j14L24j82k40J35j31n5O80m84j19R4m33M46r9k86N97j77l41J49k95L04
2784d6L71j167Q13q5k07N00j011J36J206j182N73m22o34J647j042k88J212j101
2802g27P21k94j223K063p39p27J391j552R58R82k405J962k47r73K317k891J101
2819b83J790k625J818l64j507L338k756k36K471j939J790m19l062M162j359j400
2835e81K301l193K625N83l357K433J398j924K355m206J386L615n928M019j086
2850D40j488M339m313k91L999l562J797p54l186O000k443k895L738l856L588M13
$$ plain form
2866 1526 -4282 1076 683 -1666 1637 -3428 -15 3367 -4337 837 -1195 -2221 2915 -3868 -2242
2881 -2242 3207 -2693 625 -1105 -4197 4384 -1562 -3255 1756 -2714 2222 453 -5993 2852 306
2896 306 -2086 1792 -4515 1853 4073 -5120 713 729 -778 4729 -4678 -690 5609 -2708 1403 -774
2912 -774 -2171 6963 -2219 -2928 4048 -1502 3587 113 -4972 6440 1390 -2107 2265 -3021 4299
2927 4299 3738 -5930 2915 1859 93 3331 -5142 1476 6133 -3751 714 -694 -784 6551 -4430
2942 -4430 -2703 5100 -1804 1911 -1478 -4274 6741 -1011 -3832 1482 -2633 4021 485 -6956 3397
2957 3397 1126 -2106 1247 -5636 2137 4412 -6146 -155 -19 -614 3851 -6195 -1953 5180 -2759
2972 -2759 367 -2308 -2503 6260 -3027 -3657 2842 -1597 3045 -1270 -5717 4930 792 -2587 861
$$ packed form
2866A526n808N358l93k349L303n065L413L382p704N174k032j026N136o783J626
2881b242N449n900L318j730l092Q581n946j693N011m470M936j769o446Q845k546
2896C06k392L878o307O368K220r193N833J6j507N507r407L988O299q317M111k177
2912g74j397R134r182p09O976n550N089l474n085J1412n050l497M372n286P320
2927D299n61r668Q845j056j766L238q473O618M657r884M465j408r0P335j0981
2942d430J727P803o904L715l389k796J1015p752k821N314m115O654l536p441J0353
2957C397k271l232L353o883P773K275j0558N991J36n95M465j0046M242P133p939
2972b759L126k675j95Q763r287o30O499m439M642m315m447J0647m138l379L448
$$ plain form
2987 861 -3338 3684 2491 -6037 1687 1490 -85 2464 -4785 975 5378 -2827 242 -499 -358 5340
3003 5340 -3086 -2702 4079 -577 1509 -555 -3330 5124 233 -3171 1768 -1339 2625 1402 -5005
3018 -5005 2335 2183 -1507 1439 -3308 1194 4036 -3485 -85 765 -836 3212 -3060 -1912 3721
3033 3721 -1150 389 -424 -2459 4105 -911 -2797 1976 -814 1202 645 -3848 2569 1159 -1502
3048 -1502 1264 -1978 1125 2790 -3500 554 1019 -807 2175 -2178 -907 3336 -1202 219 445
3063 445 -1706 2970 -495 -2193 2352 -551 647 605 -2762 2285 1281 -1792 1350 -1086 688 2210
3079 2210 -3037 516 1250 -1089 1436 -1528 -719 2741 -1761 -504 481 -1494 1879 -1190 -2016 1916
3095 1916 -993 -180 351 -2086 1377 5 -1942 996 -917 77 1035 -2279 619 497 -1172 929
$$ packed form
2987H61m199P022j193q528P724j97j575K549p249N760M403q205L069p41J41N698
3003E340q426L84O781m656K086k064k775Q454m891l404M939l107L964j223o407
3018e005P340j52l690K946m747M502K842p521L400Q50j601M048o272J148N633
3033C721m871J539q13k035O564n016j886M773k790K016n57m493O417j410k661
3048a502K766l242L103J665o290M054M65j826K982m353J271M243m538J421K26
3063D45k151M676l465j698M545k903J198m2l367N047j004l073L142k436J774J522
3079B210n247L553P34k339K525k964Q09L460m502J257R85j975L373l069q26L932
3095A916k909Q13N31k437L463j372j947K938j913R94R58l314K898j22j669K101
$$ plain form
3111 929 -1035 -448 1414 -1594 -371 530 -886 1059 -865 -951 1723 -476 -180 395 -1036 1605 415
3128 415 -1178 1090 -39 178 1149 -1049 961 1080 -527 1187 240 390 1295 -808 564 825 -230
3145 -230 1251 87 -98 1385 -278 -145 617 -154 1086 404 -280 831 -14 -89 456 -211 643 55
3163 55 -623 494 -23 -343 173 -713 174 28 -588 -67 -423 -407 206 -412 -437 -55 -796 -154 -496 -643 -45
3184 -45 -452 -318 -203 -658 -367 -505 -413 -194 -563 93 295 -720 138 208 -567 -163 -322 -607 -59 213 4
3205 4 334 -43 151 419 -220 381 -5 196 383 -22 77 58 236 565 257 580 478 69 625 605 -69 279
3227 279 304 89 617 148 28 106 21 342 -234 -13 241 -65 163 -223 -222 12 -264 -258 37 -417 -105 -194 -483
3250 -483 66 -202 -334 355 -392 -137 -63 -490 -168 -80 -639 241 -255 -390 154 -772 215 30 -702 437
$$ packed form
3111I29j964N87J862l008J223R01j416J945j924q6K674k199K96N75j431K641j190
3128D15j593K268j129K17R71k198K010J19j607J714r47J50R05k103J372K61j055
3145b30J481j164j85J483j663J33P62p71J240o82o84J111q45p5N45o67Q54n88
3163E5o78J117n17l20N16q86Q87j46o16N21l56J6O13o18k5L82p41O42l42j47N98
3184d5m07J34J15m55K91j38R2K19l69O56K02j015Q58P0p75M04j59k85N48K72k09
3205DL30l77J94K68o39O01l86K01J87m05R9j9J78L29l08L23j02m09N56k0o74L48
3227B79K5k15N28m69j20P8q5L21n76K21K54l06K28l86JK34k76OK95m54L12q9k89
3250d83N49k68j32O89p47K55P4m27L22Q8n59Q80m96j35N44r26R87j85p32J139
$$ plain form
3270 437 -420 -280 375 -887 238 169 -715 601 -7 -83 517 -567 14 773 -555 360 -60 -299 1176
3289 1176 -326 -260 711 -338 895 277 -850 899 66 -49 900 -705 641 539 -759 616 24
3306 24 51 825 -888 -31 1017 -364 365 -422 -814 1637 -971 -894 743 -777 711 -140 -1475 1101
3324 1101 -69 -1083 203 -1219 671 436 -2236 403 273 -429 671 -2059 -205 1826 -1471 15
3340 15 -342 -748 2079 -1520 -1086 1485 -779 454 -125 -1903 2270 73 -1854 898 -807 1308
3356 1308 793 -2909 1486 1429 -558 1080 -1744 906 2830 -2291 33 757 -115 2371 -1986 -1068
3372 -1068 3017 -899 162 56 -1598 3742 -309 -2417 2022 -335 1147 414 -3355 2512 1587 -2043
3388 -2043 880 -1945 1373 2461 -3861 251 1515 -1008 1626 -3037 -783 3942 -2551 -764 192
$$ packed form
3270D37q57J40O55j262J125o9q84J316o08p6O00j084N81P59j328R15m20k39J475
3289A176j502O6R71j049J233o18j127J749q33j15R49j605J346j02j298J375n92
3306B4K7P74j713Q57J048j381P29p87l92K451k608P7J637j520J488q51j335K576
3324A101j170j014J286j422J890k35k672K639j30p02J100k730J854K031l297J486
3340A5l57m06K827l599M34K571k264J233n79j778M173k197j927K752j705K115
3356A308n15l702M395n7j987J638k824K650J924n121K324P24q72K486m357R18
3372a068M085l916J061j06j654N340m051k108M439k357J482p33l769N867r25l630
3388b043K923k825L318J088o322M112J264k523K634m663K254M725o493J787R56
$$ plain form
3403 192 -1498 3478 -1901 -3101 3136 -813 130 -130 -3867 3572 659 -3354 1611 -1683 1496 1919
3419 1919 -4893 1445 2089 -1806 1615 -2761 406 4463 -3453 -230 1280 -1187 3486 -2708 -2164
3434 -2164 4612 -1669 216 -57 -2665 4601 -87 -3383 2670 -1193 1267 1313 -4457 2996 1684 -2417
3450 -2417 1997 -2756 1263 3592 -4528 813 1649 -1424 3111 -3117 -1328 4609 -2341 -47 -31 -2294
3466 -2294 4297 -1532 -3408 3088 -1383 710 201 -4433 3162 614 -3045 1611 -2179 1116 2219
3481 2219 -4726 1019 1273 -1846 2116 -3335 -577 3750 -2924 117 85 -1623 3820 -1980 -2726 3034
3497 3034 -1514 490 161 -2985 3853 298 -2561 1827 -1337 1509 1919 -3900 2089 1624 -1297 1871
3513 1871 -2180 841 3504 -2566 541 801 -716 3159 -1829 -937 3365 -829 368 393 -1580 3440
$$ packed form
3403A92j690M976n379j200O237l949R43k60l737P439k913m013M965l294L179M23
3419A919o812O338O44l895L421m376L167M057p916L223J510k467M673o194N44
3434b164O776o281J885k73k608P266m688l296O053l863K460M6n770P453j312m101
3450b417M414m753M019K329q120N341Q36l073M535o228J789N937o950K294J6k263
3466b294O591n829j876O496m471K093n09m634P595k548l659M656l790L295J103
3481B219o945N745K54l119L962n451K758M327o674L041l2j708N443n800p46N760
3497C034m548K004l29l146O838l555k859M388l164K846M10n819N989m65k921L168
3513A871m051L021K663o070L107K60j517L875m988Q92M302m194J197K5j973N020
$$ plain form
3529 3440 -351 -2150 1716 -759 1195 540 -2909 2058 1098 -1598 913 -2039 823 1890 -3097
3544 -3097 147 744 -716 1328 -2276 -1139 2178 -2057 -667 -230 -1345 2062 -1362 -2204 1396 -727
3560 -727 -89 -107 -2114 1478 330 -1974 415 -1063 385 973 -2672 606 672 -824 792 -1403 50
3577 50 1854 -1558 -221 249 -408 1422 -670 -783 1725 -255 108 288 -776 1422 290 -742 821
3594 821 159 563 723 -971 1046 668 -391 665 -9 317 1100 -889 534 838 -360 616 -426
3611 -426 -118 1345 -461 51 604 -491 600 -5 -583 833 -153 -102 373 -685 578 132 -912 191
3629 191 -218 -435 308 -794 -48 250 -788 198 -199 -366 215 -595 -357 -39 -282 155 -181 -255 268 -261
3649 -261 -181 103 -92 256 308 -154 19 -105 -63 360 -53 -79 553 -98 202 145 -79 404 175 -103 186 280
$$ packed form
3529C440l791j799L866k475J954o55l449M967r60k696K511k952K862J067m987
3544c097L244N97j460K044l604J137L317m235J390M37j115L407l424q42L600k123
3560g27O38j8k007L592j148k304K389j478J448N88l645L278O6j496J616k195J453
3577E0J804l412J337M70o57J830k092j13K508j980L63J80j064K198j132j032J563
3594H21o62M04J60j694K017l78j059J056o74L26P83j989J423L04j198R76j042
3611d26L08J463j806N12N53j095J091o05n78J416r86N1M75j058J263m46j044J103
3629A91m09k17P43j102P46K98j038R86l97j67N81q10K38L18k43M37l36p4N23n29
3649b61Q0K84j95L48N2m62J73j24M2M23m13k6O32o51L00n7k24M83k29k78K89R4
$$ plain form
3671 280 4 140 73 383 120 70 346 -118 -16 131 -205 -67 -107 -188 70 -156 177 236 -260 -105 -91 -257
3693 -257 97 -55 -195 -452 -170 -357 -103 -364 13 -217 -268 -13 -430 -151 -67 -365 68 48 -197 241 -328
3714 -328 -210 -168 -62 109 -19 -68 374 34 -270 255 -71 214 318 -168 253 174 -24 354 -185 316 383
3735 383 48 434 -134 75 526 -199 345 335 23 495 62 253 831 -244 55 105 -245 523 -57 -338
3755 -338 342 -286 -16 175 -449 359 -172 -302 333 -657 26 265 -778 154 -148 -625 495 -790 -372
3774 -372 723 -1013 -17 -216 -765 957 -838 -836 407 -938 112 -76 -1492 446 -42 -676 647
3791 647 -922 583 760 -1446 665 -92 -414 847 -1319 78 1229 -937 264 26 -292 1727
3807 1727 -853 -390 1439 -369 1131 163 -1225 1995 6 -790 1315 -321 1358 913 -2001 1111
$$ packed form
3671B80k76J36o7L10k63n0K76m64J02J47l36J38m0q1K58k26L33N9m96J55J4j66
3693b57L54j52j40k57K82j87K54k61L77k30n1K55m17K79Q4k98M33k0k45M38n69
3714c28J18M2J06J71j28m9M42l40l04N25l26K85J04m86M21p9j98L78n39N01O7
3735C83l35L86n68K09M51p25N44j0l12M72m33J91N78j075K99N0l50P68n80k81
3755c38O80o28K70J91o24Q08n31j30O35r90O83K39j043R32l02m77J120j285M18
3774c72J095j736R96j99n49J722j795KJ243j345J050j88j416J938m88o34J323
3791F47j569J505J77k206K111p57l22J261k166J397J151k166J201k38l18K019
3807A727k580M63J829j808J500r68j388L220j989p96K105j636J679m45k914L112
$$ plain form
3823 1111 443 -231 952 -1210 830 1791 -1572 366 144 -318 1719 -1267 -620 2037 -962 411
3839 411 -449 -986 2072 -758 -1409 866 -904 948 214 -2154 1620 223 -1028 243 -1595 740
3855 740 1300 -2421 265 375 -492 1174 -2217 -426 2383 -1364 -25 -283 -874 2315 -1108 -1660 1418
3872 1418 -656 870 34 -2167 2305 445 -1306 752 -1024 1069 1439 -2713 1129 1016 -482 1025
3888 1025 -1996 328 2672 -1411 32 596 -539 2148 -1269 -1324 2488 -93 569 -129 -2026 2539
3904 2539 114 -1870 1103 -578 1162 998 -2668 1468 1327 -1154 812 -1754 425 2425 -2371
3919 -2371 -477 710 -609 1872 -2094 -1726 2533 -1001 -621 -302 -1735 2722 -533 -2729 1319 -408
3935 -408 344 251 -3172 1824 1387 -1869 884 -1444 746 2557 -2909 87 1309 -771 1555 -1915
$$ packed form
3823A111o68o74J183k162K040R61l363J938k22m62K037k986O47K657k999J373
3839D11q60n37L058k830o51K275j770J852p34k368L774j397j251J271j838K335
3855G40N60l721K686J10q67J666l391J791K809l747J339k58n91L189l423n52L078
3872A418k074J526q36k201M472j860j751K058j776K093L70m152L842j13j498J507
3888A025l021K324K344m083J443N64j135K687l417n5L812k581O62o98j897M565
3904B539k425j984K973j681J740j64l666M136j41k481J966k566K179K000m796
3919b371J894J187j319K481l966L68M259l534L80L19j433M457l255k196M048j727
3935d08P52r3l423M996m37l256K753k328K190J811n466K996J222k080K326l470
$$ plain form
3951 -1915 -960 3280 -1411 -548 377 -966 2775 -740 -2338 2352 -24 270 476 -2331 2579 1077
3967 1077 -1855 1166 -433 1009 1992 -2991 736 1977 -967 1139 -1794 -380 3204 -1965 -432
3982 -432 1048 -1163 2032 -1244 -2092 2798 -662 -220 295 -2371 2509 338 -2696 1210 -705 571
3998 571 855 -3281 1313 1561 -2151 682 -1352 61 2331 -2601 -272 1150 -1242 1546 -1401 -1236
4014 -1236 2607 -1191 -585 351 -1378 2368 -540 -2216 1943 -424 144 985 -2033 1605 760 -1778
4030 -1778 1030 -746 468 1496 -2148 818 1352 -757 1199 -976 -79 2404 -1283 111 955 -836
4046 -836 1744 -458 -1034 1868 -336 -125 670 -1231 1606 165 -1147 1225 -412 175 785 -1333
4062 -1333 606 687 -1080 684 -780 -171 923 -1215 14 493 -786 653 -775 -704 950 -834
$$ packed form
3951a915R55M240m691Q63R25j343L741l515j598M690k376K94K06k807M910j502
3967A077k932L021j599J442R83m983L727J241k944K106k933J414L584n169J533
3982d32J480k211L195l276q48M890l460M42N15k666M880k171l034L906j915J276
3998E71K84m136M594K48l712K833k034J413K270m932K329J422k392K788k947J65
4014a236L843l798O06R36j729L746k908j676M159k367N68Q41l018L638q45k538
4030a778K808j776J214J028l644K966N34k109J956k175Q97K483l687J394Q44j791
4046h36K580k202n76K902k204K11P95j901K837j441j312K372j637N87O10k118
4062a333J939Q1j767J764j464O09J094k138J229M79j279J439j428P1J654j784
$$ plain form
4078 -834 -459 151 -814 535 -313 -1140 603 -673 -196 328 -1070 457 -132 -779 334 -495 -31 547
4096 547 -1064 162 469 -675 523 -273 -545 901 -486 2 168 -282 706 -190 -397 921 -56 -196
4114 -196 346 -282 422 72 142 370 -197 244 304 -344 457 345 -333 102 135 -20 434 -240 111 45 24 430
4136 430 -14 -295 260 -70 73 285 -295 -170 -160 -625 -122 -205 -238 -311 -197 12 -225 151 -42 -405 -143
4157 -143 -56 88 181 44 -373 -39 -429 -257 -598 -164 -203 -299 196 -18 -29 -245 42 -94 -44 146 -199 155
4179 155 553 -53 80 187 275 193 82 261 11 -481 -480 601 353 280 253 116 -124 59 454 109 165 156 210
4202 210 -268 363 2 -35 18 -192 60 -5 -301 329 -233 63 -192 -323 153 -80 -310 60 -195 19 76
4223 76 -143 141 144 98 410 -132 -232 -1 -430 -226 14 -65 177 -124 -240 269 -205 -120 65 -231 422 97
$$ packed form
4078h34L75O10r65J349q48q27J743j276M77N24j398J527n89o47J113q29M64N78
4096E47j611J226L07j144J198p96k72J446j387M88J66m50R88q96k07J318r77j40
4114a96N42o28P04l50P0K28n67M41O0o48Q01j12o78M35L3j55M54o74L51o6k1M06
4136D30m44k81N55l30J43K12n80J25J0m65N03q3l3p3J14K09k37L76j93l63K62
4157a43Q7J44R3j37m17L34l90J72l41M34l9r6M95k14j1k16K87j36N0J90l45L54
4179A55L98o06J33J07Q8q2j11J79k50m92JJ081k48p3k7j37k40J83L95l45N6rN4
4202B10m78O31l61l7N3k10K52o5k96O30n62K96k55j31M76k33k30L70k55K14N7
4223G6k19K84Lm6L12n42j00K31m29K04K40p9K42l01j16N09m74Q5J85k96O53l25
$$ plain form
4245 97 -413 431 -56 117 489 -177 511 443 -241 419 73 300 821 -424 167 460 -188 685 -177 -101 1019
4266 1019 -318 -22 561 -286 689 172 -384 637 71 30 504 -632 522 518 -797 493 -423 279 489
4285 489 -1277 317 397 -864 711 -1064 -352 1023 -1160 2 -47 -747 899 -806 -914 910 -630
4302 -630 -14 -127 -1342 1105 -577 -1280 813 -623 293 625 -1730 743 562 -887 710 -828 24
4319 24 1323 -1577 199 311 -819 1329 -987 -506 1917 -841 296 195 -1036 2083 -369 -1138
4335 -1138 1436 -414 620 707 -1744 1685 676 -1059 1168 -860 791 1571 -2009 522 643 -592
4351 -592 1373 -1579 -252 2284 -1394 -73 66 -1037 1901 -824 -1366 1684 -785 466 -195 -2004
4367 -2004 1814 119 -1810 830 -1188 864 1042 -2646 800 480 -1130 575 -1931 -19 2307
$$ packed form
4245I7n10Q44m87J73L72o66O88o8o84O60l46K27N21j245N91K93o48Q73q62P6J120
4266A019j337K96N83q47R75n17n56J021n66m1M74j136J154mj315J290r16P02K10
4285D89j766J594Q0j261J575j775P12J375k183J162m9p00J646j705j08J824j540
4302f30O16j13j215K447j682p03K093j436R16L32k355K473j81j449J597j538Q52
4319B4J299k900J776J12j130K148k316M81K423k758J137j01j231L119k452p69
4335a138K574j850J034Q7k451L429j009j735K227k028J651P80l580K531J21j235
4351e92J965k952J327K536l678J321J39j103K938k725n42L050k469J251o61j809
4367b004L818j695j929K640k018K052J78l688L446l20j610J705k506J912K326
$$ plain form
4382 2307 -2265 -195 -65 -515 2040 -1578 -1297 1874 -766 -42 -195 -1528 2268 -98 -1888 1143
4398 1143 -770 877 734 -2392 1618 1153 -909 1017 -1291 790 2054 -2212 -4 922 -57 1673
4414 1673 -1507 -418 2714 -761 17 142 -785 2387 -387 -1783 1821 -247 634 94 -1995 1902
4430 1902 1068 -1428 670 -665 762 1606 -2362 323 992 -590 1151 -1421 -261 2605 -1475 -606
4446 -606 65 -515 1750 -1002 -1770 1541 -377 -138 -225 -1680 1637 315 -2012 676 -615 247 831
4463 831 -2145 795 1056 -1255 396 -961 104 1737 -1792 33 591 -399 1060 -910 -927 2005
4479 2005 -563 -416 425 -1186 1429 -42 -1691 1185 -250 196 873 -1556 1222 1072 -1247 744
4495 744 -378 237 1282 -1522 247 1107 -727 863 -673 -440 1858 -523 -419 514 -670 1255
$$ packed form
4382B307m572K070J30m50K555l618K81L171k640P24j53j333L796k366j790L031
4398A143j913J647j43l126M010m65k062J926k308K081J264m266K208R26r79J730
4414A673l180J089L132l475P78J25r27L172k774j396L604k068Q81n40k089L897
4430A902q34k496K098j335J427Q44l968K685O69j582J741k572J160K866m080Q69
4446f06O71n80K265k752p68L311j918K39q7j455L317j322k327K688j291Q62N84
4463H31k976K940K61k311J651j357J065J633l529J825N58r90J459j970j7K932
4479B005k568J47Q41j611K615j471j649K876j435M46O77k429K778j50k319J991
4495G44j122O15J045k804J769Q60j834J590j536K33K298k381J04R33j184J925
$$ plain form
4511 1255 -524 -1341 1233 -236 -189 236 -1488 844 230 -1217 482 -455 55 796 -1289 328 912
4528 912 -752 501 -624 -428 1134 -952 -372 335 -552 639 -115 -1102 909 -256 -389 491 -877
4545 -877 980 79 -759 776 -134 -54 683 -791 690 388 -242 269 -79 41 929 -848 174 653
4563 653 -162 462 -414 -511 973 -310 49 528 -467 510 -43 -528 678 -65 -204 230 -627 503 53
4582 53 -576 49 -114 -88 297 -481 -130 255 -686 40 -269 -423 326 -457 -446 349 -459 340 -94 -564 100
4603 100 -70 -257 128 -442 103 228 -483 54 183 125 171 -382 54 400 -159 75 56 -25 238 -202 -78
4624 -78 368 -364 350 388 -43 260 13 411 447 117 192 146 141 366 200 133 327 120 488 214 13 335 297
4647 297 199 180 130 252 163 54 -159 -40 -32 -85 224 -124 220 -182 -49 59 -266 -205 95 35 -115 -12 -91
$$ packed form
4511A255j779q17K574j469M7M25j724K332o14j447J699r37N10P41k085J617N84
4528I12j664J253j125J96J562k086N80P07q87J191p54r87K011j165j33Q80j368
4545h77J857r01q38J535r10Q0P37j474J481l02o30N11l48J20Q88j777J022M79
4563F53q15O24q76r7J484j283L59M79r95R77n53m85J206p43j39M34q57J130m50
4582E3o29O25j63K6L85p78L51L85r41P26l09j54P49p83J1P95q08P99m34m70O64
4603A00j70j87L85n70N45J25p11N37J29n8M6n53M36L46n59K34j9q1K63m40J24
4624g8M46p32P14L8m31L03k47L98L6l30P5m6nK25j66o7J94k07L68k74k01L22l8
4647B97r8j9n0J22q9j09k13J19Qn3L09l48L44m02J33J08l25O1L00o0j50J03p9
$$ plain form
4670 -91 -190 -103 -51 -524 -176 -416 -69 -339 -298 -177 170 14 -149 7 -231 -250 -120 -57 -178 147 58 95 -86
4693 -86 48 147 -24 -20 -43 -231 251 -274 232 74 -145 -33 166 226 140 166 -32 286 81 418 266 -222 303
4716 303 191 -136 41 -92 158 375 -335 359 -4 -176 175 -142 55 471 2 109 125 -256 517 -27
4736 -27 -165 291 -260 -114 -46 -207 479 61 -465 331 -28 24 153 -640 -14 327 -331 277 -673 -194 587
4757 587 -701 -140 63 -324 213 -381 -469 609 -113 351 29 -694 767 -30 -596 508 -39 541 336
4776 336 -773 711 492 -491 201 -638 240 995 -524 279 270 -451 928 -614 -325 1093 -50 -124 279
4795 279 -401 905 -11 -964 585 -490 379 297 -1289 752 313 -535 584 -470 63 1172 -1148
4812 -1148 184 425 -525 857 -752 -596 1121 -638 -356 162 -936 1139 -530 -1381 847 -291
$$ packed form
4670i1r9Q7N2m73L48k40L47k70M1J21L47j56j63J56k38j9J30O3j21L25q9L7j81
4693h6J34R9j71Mk3j88M82n25N06j58k19J12J99O0q6K6j98L18k05L37j52m88N25
4716C03j12l27J77j33K50K17p10O94l63j72L51l17J97M16m69J07J6l81P73n44
4736b7j38M56n51J46O8j61O86m18n26P96l59N2J29p93O26L41o58O08r50M79P81
4757E87j288N61K03l87N37n94q8J078p22M64l22p23J461p97n66J104n47N80k05
4776C36j109J484k19r83O92q39Q78P55j519Q03rp21J379j542K89J418j143p4M03
4795B79o80J306r16r53J549j075Q69q2j586K041m39q48J119j054N33J109k320
4812a148J332K41r50J382j609J56J717j759K82N18j098K075j669q51K228j138
$$ plain form
4828 -291 189 272 -1396 1105 377 -1208 305 -740 241 864 -1693 261 821 -906 754 -913 -79
4845 -79 1727 -1082 13 312 -381 1461 -700 -1070 1621 -563 227 402 -1257 1731 146 -1349 733
4862 733 -246 584 823 -1837 855 802 -916 858 -992 462 1646 -1473 -285 788 -566 1202
4878 1202 -1023 -910 1761 -705 -199 -252 -1815 1338 -32 -1516 1129 -326 498 -143 -1749 1525
4894 1525 190 -1363 622 -608 -375 1154 -2434 371 764 -1014 1129 -1469 -990 896 -1010 232
4910 232 417 -1109 1474 -510 -1173 1153 -888 -176 -83 -2258 1965 -100 -1592 535 -374 408 1386
4927 1386 -2141 165 883 -404 1369 -1109 -440 1741 -2198 226 133 -1542 2009 -592 -803 2003
4943 2003 -791 -144 -607 -1881 2292 749 -1715 804 188 512 884 -1370 173 337 -1265 775
$$ packed form
4828b91M80Q3j668K501p28j585J513j045R81O23k557J954N60j727J660j667Q34
4845g9J806k809J095K99o93J842k161l70K691k184P90J75j659K988j585j495K082
4862G33r79Q30K39k660K692n3j718J774j850J454J184l119J188J073j354J768
4878A202k225J13K671k466N06n3j563L153j370j484K645j455Q24o41j606L274
4894A525j335j553J985j230K33J529l588K805L93j778K143k598M79J886j906J242
4910B32J85j526K583j984o63K326k041P12R3k175M223k065j492K127r09P82R78
4927A386l527K306P18j287J773k478O69K181l939K424r3j675L551k601k11K806
4943B003k794O47m63j274M173j543k464K519o16L24L72k254J543J64j602K040
$$ plain form
4959 775 -653 -291 1003 -1588 186 949 -418 768 -1509 -1141 1366 -1069 -533 161 -743 924 -541
4976 -541 -1035 722 -143 5 52 -1578 862 446 -1316 -129 -958 -122 658 -1337 -213 467 83 231
4994 231 -779 -299 1156 -654 -319 437 -451 670 -299 -728 1077 -188 142 233 -670 899 352 -525
5012 -525 637 -131 -51 467 -641 492 592 -539 329 -273 40 817 -613 -14 389 -346 528 -251 -401
5031 -401 666 -151 -256 102 -319 695 125 -686 238 -181 -62 183 -529 -64 46 -617 277 -50 -83 245
5051 245 -684 75 329 -391 -185 -202 -199 356 -198 -97 438 -173 246 23 -362 178 -169 -102 7 -203 85
5072 85 -10 -497 133 -199 -64 286 -505 242 -18 -34 271 258 -164 188 -48 -53 174 -289 219 343 -74 30
5094 30 29 -41 311 -225 93 259 -19 173 56 -21 -1 -169 -78 294 -331 93 -139 -20 104 -8 45 194 -284
$$ packed form
4959G75j428L62J294k591J774P63j367J186k277L68K507k435N36O94r04J667j465
4976e41m94J757q65J48M7j630K440m16j762J187q29Q36P80j995J124O80l84J48
4994B31j010M80J455j810L35P56q88J121r69m29J805j265L30R1r03J569n47q77
5012e25J162p68Q0N18j108J133J00j131Q68o02L13P77j430N99M03p35Q74p79j50
5031d01J067q17j05L58m21J014n70q11R24m19J19K45p12M65J10o63Q94l27l3L28
5051B45r29P59K54p20K06j7LN55n54J01N35o11M19k23l85N40l47O7J09k10K88
5072H5r5m87O30l32J35L50p91P47k60j6L05j3m22L52k36nK27m63N08J24m17J04
5094C0jp0L52n36L18J66k78J92j17p7K0j68R1L72o25M24k32J19J24j12N3J49m78
$$ plain form
5117 -284 -112 -85 -335 105 -173 -47 -28 -174 -13 -39 -240 202 -63 -298 33 152 -58 94 -81 178 115
5138 115 -88 118 -87 -211 327 -176 92 48 -176 -14 34 79 -29 120 150 76 -96 179 120 80 89 182 147 107
5162 107 39 -112 159 27 12 -67 -148 -2 61 287 2 -180 28 -199 -7 58 -280 101 -41 -192 32 -141
5184 -141 -35 -13 -395 -69 -53 -317 -88 69 -198 -148 -32 46 48 -368 -46 -155 -164 301 -102 -242 79 -363 203
5207 203 -230 -251 275 -146 -209 -70 -541 360 143 -313 324 -104 48 396 -242 91 302 -61 504 -54 -174
5228 -174 586 -157 13 167 -135 697 270 -87 243 -198 212 505 -477 143 358 -249 325 -101 -22 652
5248 652 -560 133 442 -74 476 -370 -178 312 -169 -107 187 -562 750 -4 -486 167 -314 171 -61 -1040
5268 -1040 117 13 -578 319 -598 -21 799 -652 76 94 -323 409 -543 -496 617 -581 -178 -172 -434 715
$$ packed form
5117b84J72K7k50M40k78J26J9j46J61k6k01M42k65k35L31J19k10J52j75K59o3
5138A15k03K06k05j24N38n03K68m4k24J62M8M5j08J49L0p4j72K75n9m0RR3l5m0
5162A07o8j51K71j32j5p9q1J46O3K26k85j82K08k27J92O5l38L81j42j51K24j73
5184a41J06K2l82L26J6k64K29J57k67N0J16P8Km16L22j09rM65m03j40L21m42N66
5207B03m33k1N26m21o3J39m71R01k17m56O37m28J52L48o38L33K11l63N65n58j20
5228a74P60p43J70J54l02Q32m27l57L30m41M10K93r82O20K15o07N74m26P9O74
5248F52j212O93L09n16N50q46J92M90m81O2K94p49J312p54m82O53m81M85k32r79
5268a040J157j04n91Q97r17N77Q20j451P28J8m17P32r52M7J113j198M03Ok62J149
$$ plain form
5288 715 -264 -996 400 -102 342 55 -594 525 369 -604 431 -13 30 1079 -1100 80 426 -448
5306 -448 559 -947 222 985 -469 86 509 -221 835 -414 -971 1031 -138 695 150 -651 946
5323 946 -28 -1022 554 215 633 552 -1386 181 713 -640 620 -846 -231 1199 -788 149 248 -419
5341 -419 938 -421 -410 1392 -519 -797 95 -1497 558 -95 -1418 125 -708 -27 658 -1374 670
5358 670 782 -931 26 -660 376 417 85 -262 573 -493 746 -887 -580 1010 -704 -333 574 -479
5376 -479 1105 225 -847 553 43 125 645 -1111 1150 785 -933 656 -177 337 687 -875 269
5393 269 735 -646 598 -845 -212 1634 -1290 -432 310 -159 423 -785 -771 933 -334 -241 -380 -530
5411 -530 1054 134 -1114 328 -157 295 398 -1463 630 857 -801 176 -664 46 1240 -1155 -264
$$ packed form
5288G15r79p32J396n02M44k87o49J119j56r73J035m44M3J049k179J180L46q74
5306d48J007j506J169P63j454N55M23p30J056j249n57K002j169Q33n45q01J597
5323I46r74r94J576l39M18q1j938J567N32j353J260j466O15J430j987R37R9o67
5341d19J357j359J1J802j911k78Q92j592K055o53j323J543q33O81O85k032K044
5358F70J12j713R57o86J036M1l32l47Q35j066J239j633L07J590j714L71R07j053
5376d79J584q80j072J400n10Q2N20j756K261l65j718J589q33N14L50j562J144
5393B69M66j381J244j443O33J846k924Q58P42m69N82j208J4J704j267R3j39j50
5411e30J584r20j248J442m85M52J03j861K093K27j658R77q40P10J194k395Q91
$$ plain form
5428 -264 623 -319 632 -665 -562 1019 -499 -518 171 -627 912 128 -1181 978 -350 150 514 -1035
5446 -1035 1014 779 -1047 609 -215 218 1073 -1054 -51 878 -286 499 -331 -180 1122 -609 -451
5463 -451 457 -359 1026 -281 -515 935 106 -93 36 -814 517 549 -1020 592 -290 -75 643 -1090
5481 -1090 235 504 -690 143 -319 -118 729 -664 -206 327 -566 309 -379 -606 538 -400 -612 152
5499 152 -805 503 165 -945 425 -163 -307 56 -885 193 572 -619 196 -350 53 306 -463 -19
5517 -19 189 -337 476 41 -216 699 -421 -433 223 -528 353 162 -55 719 -42 -23 2 -205 269 381 -177
5538 -177 264 181 109 500 -487 -54 650 -109 274 -248 -141 461 -151 0 192 -36 267 -86 -52 171 18
5559 18 -208 -19 -203 260 -161 -372 102 -55 -47 -171 -440 57 -77 -188 -98 -261 -180 170 -196 -227 37 -108
$$ packed form
5428b64Q87r42R51j297J03J581j518j9O89p98J539p84j309K159j328N00L64j549
5446a035K049k35j826J656q24M33Q55k127J003R29j164P85q30J51J302j731J58
5463d51R08q16J385j307k34J450q29j99J29q50J331L2j569J612q82K15P18j733
5481a090J325K69j194Q33m62K01Q47j393M58N33q93Q75o88k27J144r38k12P64
5499A52r57J308l38j110J370n88j44L63r41J078L79j191Q15n46M03K53p69M44
5517a9K08n26Q13m35k57R15j120j2O56p51Q81j91k17P74p61J9K5k07M74J12n58
5538a77M41q3p2L91r87M33P04p59L83n22J07O02o12J51J92k28L03l53L4K23j53
5559A8k26J89j84M63m21k11M74j57Qj24k69M97j34j11R0j63Q1L50l66l1K64j45
$$ plain form
5581 -108 47 3 -233 99 -1 -185 257 -267 -292 -183 37 137 90 -223 7 -44 54 173 -9 32 225 92
5603 92 140 198 -40 312 -440 171 369 164 5 -193 171 -25 -17 -139 205 -25 113 261 150 260 84 -10
5625 -10 115 -337 -40 -228 -85 -7 -101 201 3 7 -223 -201 -305 28 35 -97 120 -42 19 -10 -235 -55 218
5648 218 -60 -151 -252 67 113 -252 149 136 -205 5 -13 39 12 -215 98 117 -98 287 -34 -108 -117 124 296
5671 296 -192 69 214 199 -99 122 -238 86 89 53 201 151 61 352 -128 3 107 -40 388 -100 5 318
5693 318 -109 -150 122 -153 193 213 -53 246 -98 66 94 -106 79 129 -253 -125 -195 -204 380 -274 -108 154
5715 154 -367 -85 164 -314 202 -101 22 -187 -398 419 -21 -512 193 -317 120 134 -680 186 250 -497 89
5736 89 -309 199 486 -562 -63 291 -235 288 -20 -268 613 -197 -137 401 -344 447 165 -481 492 89
$$ packed form
5581a08J55m4k36L32j00j84M42n24k5J09K20J00m7l13K30n1R8J19j82M1J93j33
5603I2M8N8k38L52p52O11J98k05j59j98L64j96Qj22L44k30J38J48j11J10j76r4
5625a0J25m52K97j88J43P8r4L02j98Mk30K2j04L33Pj32K17j62O1k9k25J80K73
5648B18k78r1j01L19M6l65M01j3l41K10j8N2k7k27L13J9k15L85l21p4rK41J72
5671B96m88K61J45j5k98K21l60L24Ll6J48n0r0K91m80J31J04j47M28m88J05L13
5693C18m27m1K72k75L46K0k66K99l44J64K8k00J85N0l82J28p0rN84o54J66K62
5715A54n21K82K49m78N16l03J23k09k11Q17m40m91P05n10M37J4q14Q66O4p47N86
5736H9l98N08K87j048M99L54n26N23l08k48Q81q10O0N38p45P91k82o46R73m03
$$ plain form
5756 89 139 197 -502 257 434 -416 336 -84 -8 998 -600 111 546 -387 502 -361 -390 877 -302 16
5776 16 186 -311 642 79 -658 731 70 -79 36 -674 199 346 -447 289 -58 -189 438 -1149 -142
5795 -142 480 -324 189 -357 -230 974 -771 -383 315 -416 708 -374 -616 682 -239 -153 43 -354 917
5814 917 248 -981 407 41 93 641 -1000 683 503 -536 334 -647 110 613 -630 -215 457 -300
5832 -300 939 -585 -532 990 -298 19 327 -597 611 113 -795 728 -63 366 409 -778 571 424
5850 424 -709 93 -204 261 771 -929 39 618 -148 395 -413 -420 847 -484 -274 290 -191 658 -427
5869 -427 -1097 870 187 26 178 -727 721 286 -1193 209 -53 -19 558 -1139 84 599 -517 104
5887 104 -307 -253 1030 -756 -155 565 -276 412 -260 -586 1035 -17 -30 211 -321 791 354 -947 470
$$ packed form
5756H9N0N8o99P59J77q50P52m20P6J006j598P11M35r33Q89q63k9J267j179L18
5776A6J70m97R53n63p37J389o61j49J15p10Q73J47p93P36l47j31O27j587J007
5795a42O22q04N13n46J27J204j745L88O98p31J124j082k42J298r21Q6J96l97J271
5814I17o69j229J388l66N2N48j641J683j80j039Q70r81P57N03j243M15O72p57
5832c00J239j524N3J522j288L17L08r24J208m98r08J523p91M29M3j187J349j47
5850D24j133Q02k97M65N10j700R68N79p66N43q08pJ267j331K10N64m81Q49j085
5869d27o70J967o83j61J52r05J448m35j479J402k62L4N77j697J223N15j116O21
5887A04m11N4J283j786O01P20q41O88o72l26J621j052j3K41n32J112m37j301J417
$$ plain form
5906 470 199 188 604 -841 186 572 -665 250 -152 305 937 -609 -303 665 -449 -176 -20 -554 652
5925 652 -397 -184 564 -471 630 64 -1030 474 -161 -156 52 -699 224 487 -733 86 -77 56 452
5944 452 -806 -179 281 -296 133 -288 -410 586 -534 -519 193 -434 612 155 -609 667 -125 -319 131
5963 131 -382 446 262 -545 397 133 -32 284 -601 86 648 -316 18 -168 -266 482 87 -520 687 198
5983 198 805 492 -220 303 -199 -118 -5 -394 84 354 -359 504 -100 -166 233 -300 281 389 -367 -53 59
6004 59 86 462 -288 -264 456 -182 21 -362 -374 348 -220 -524 171 -60 207 -187 -213 206 37 -217 256 -401
6026 -401 -35 249 -457 -22 -22 -17 72 -334 -255 160 -206 225 -209 24 109 -12 178 245 -304 120 34 -204 139
6049 139 128 -17 -55 -50 205 107 60 178 103 128 166 24 48 130 -154 107 -50 40 139 -217 -212 356 -339 -153 -7
$$ packed form
5906D70k71j1M16j445J027L86j237R15m02M57O32j546L06R68j114K73J56n34J206
5925F52j049K13P48j035J101n66j094J504o35NK08p51R23K63j220Q19j63J33L96
5944D52j258O27M60n77M29m21j22R96j120J5P12o27J046m57p64J276p92j94M50
5963A31n13Q28j84q07R42k64j65L16q85O87N62r64L34j86r8P48l95o07J207m89
5983A98O07l13p12N23n02Q1J13l89M78K70p13Q63o04o6L99n33N81J08p56L14J12
6004E9K7L76p50K4P20o38K03l83j2P22n68l04O95k31K67l94k6M19j69k54M73o57
6026d01L66K84p06M35%NQ9m06P9M15l66M31m34K33Q5j21J90O7n49M24q6k38L43
6049A39j1j45l8NK55r8m7J18p5K5L8j42K4Q2k84K61j57R0R9l56NN68o95J86J46
$$ plain form
6074 -7 65 -234 235 -186 157 -303 -241 -99 -91 51 -6 -261 63 -73 -120 130 -361 -83 4 26 -128 205 -315
6097 -315 -87 -96 -149 -112 -214 8 -402 -82 -61 116 -56 61 -3 -168 62 30 174 44 93 -58 -151 81 60
6120 60 -189 227 -23 61 -58 -171 -59 43 47 6 44 -83 309 -58 45 49 31 152 234 14 62 -49 115 322
6144 322 21 107 43 -278 48 -228 25 148 -208 296 138 -216 17 -43 -150 -132 -67 160 84 -54 -154 -50
6166 -50 -172 24 230 -45 124 -126 -170 22 -263 56 66 19 31 -301 -143 -152 -382 239 -114 -17 -85 -269 177
6189 177 128 -313 -44 -53 98 240 -227 -119 200 86 -94 249 210 310 -91 -229 250 -35 204 114 -240 311
6211 311 -198 -216 91 -186 301 75 -399 16 -3 101 69 -492 77 292 -55 -118 -122 -258 379 -177 -144 36
6233 36 -282 147 -391 -314 151 -116 -303 -54 -198 317 -188 -461 251 -99 -12 399 -550 361 78 -378 41
$$ packed form
6074gP2k99M69m21L43m60O2J42QJ42n7k55L24j36m7K50m91K78Q7K2j54L33n20
6097c15K28rn3L7j02K22m10L20K1J77j72J17o4j65K30l2J44j30M9j51r3K32k1
6120F0k49M16k50Q4j19j13J12J02Mm1L8j27L92l67J03Mj8J21Q2k20M8j11J64K07
6144C22l01Q6o4l21L26k76K53J23l56N04j58l54K33o0j07J8O5K27p6j38j00J04
6166e0j22J96K06k75J69k50m4J92k85L19J0m7J2l32J58rk30O21l53R7o8j84M46
6189A77m9m41K69rJ51J42m67J08L19j14j80L43l9J00m01j38M79k85K39r0l54N51
6211C11n09j8L07k77M87k26m74M15j9J04l2n61N69K15l47o3mj36O37n56L3J80
6233C6l18M29n38P7M65k67j87K49j44N15n05k73P12l50Q7M11r49R11k83m56M19
$$ plain form
6254 41 -147 -113 533 -429 -243 463 -380 277 -49 -356 577 -223 -265 -22 -198 461 -183 -721 574 81 -69
6275 -69 308 -429 402 228 -561 349 19 69 522 -475 342 563 -224 349 -268 11 830 -477 -251 583
6295 583 4 406 26 -648 823 180 -149 233 -388 245 169 -569 384 28 -275 333 -673 200 322 -462
6315 -462 83 -231 34 496 -957 -301 425 -399 351 -174 -414 849 -89 -204 452 -498 398 75 -812
6334 -812 476 35 -36 541 -568 511 618 -714 161 -404 -89 464 -701 214 512 -463 424 -216 -363
6353 -363 773 -394 -381 333 -220 549 -64 -379 794 -73 -123 341 -569 516 453 -580 490 -181 73
6372 73 359 -679 329 547 -478 257 -233 -287 727 -305 -275 240 -172 239 -32 -423 962 -188 -74
6391 -74 406 -446 619 193 -840 283 -396 -341 101 -588 316 473 -876 156 -253 -105 717 -777 -455
$$ packed form
6254D1j88L4O46r62J86P06q43O57l26l07R33q00m2K43j76O59o44n38J295m93j50
6275f9L77p37Q31j74p89R10l30N0M53r97Q17K21p87N73o17K79Q19j307K26Q34
6295E83n79M02l80o74J471o43l29L82o21O33p6p38R53l56l03O08j006Q73J22p84
6315d62N45l14K65M62j453O56P26q24P50n25k40J263r38j15O56r50Q96l23q87
6334h12J288m41p1N77j109J079J07j332Q75n65L15N53j165R15K98r75Q87o40j47
6353c63J136j167J3P14n53P69o13l15J173q67n0M64r10J085o3j033J070o71K54
6372G3K86j038J008K18j025P35m90n4J014j032L0N15m12M11k71l91J385j150J14
6391g4M80q52J065m26j033J123o79N5M42o89R04J57j349J032m09J48Q22j494L22
$$ plain form
6410 -455 915 -22 574 -470 -230 22 -150 -271 363 -254 691 519 -485 713 290 -163 -114 -167 181
6429 181 374 -513 2 100 97 207 -75 -181 825 -396 589 59 36 1348 -262 47 229 -318 549 13
6449 13 -228 107 -7 -240 -48 179 -255 413 -704 -173 380 -118 841 -387 64 217 -289 18 546 -528
6469 -528 -55 -1033 -161 262 281 -607 574 -456 36 -91 -20 -329 191 300 59 -473 -465 -228 224 144 -443
6490 -443 130 65 -387 232 317 -77 230 -269 497 508 -21 -31 96 -488 -167 -63 -137 184 -357 -139 139 178
6512 178 442 -179 -349 3 369 41 -194 -794 357 349 -105 -382 -263 14 503 -60 154 -275 -339 -242 -315
6533 -315 135 579 -603 30 -567 -125 152 358 -171 -43 232 -112 93 -183 117 92 47 256 -251 -539
6553 -539 -817 -470 365 137 -1242 -704 129 -188 164 183 -43 256 -67 -26 14 -207 -110 -97 110 138 260 -32
$$ packed form
6410d55J370r37N96j044K40K52j72j21O34o17R45j72j004J198m23m53M9n3L48
6429A81J93q87N15R8lJ10k82j06J006j221R85n30k3J312j610L09J82n47Q67n36
6449A3k41L35j14k33J92K27m34O68j117N31N53m98R59j228M51J53n06L07N28j074
6469e28M73r78Q72M23J9q88J181j030M92j27P1l09N20J09k41n32QK37M52q0n87
6490d43N73o5m52O19Q5l94L07m99P66J1n29j0J27n84L21J04p4L21n41K18K78L9
6512A78K64o21j70L52L66l28k35o00J151qm54k77J19K77M89n63K14m29o4R7p3
6533c15M50M44j182O33n97M42K77K06n29J28K75l44K05k76L00k5m5K09n07k88
6553e39k78L47Q35k28j379N38Q33l17L52J9k26K99l23M1M0k21R7J3K07K8J22k92
$$ plain form
6575 -32 -7 -41 -134 113 -127 35 -85 -101 52 189 -286 329 -144 237 -245 -91 304 -5 202 196 -86 216
6597 216 -41 -50 -140 227 63 -1 54 -16 -94 -256 -112 -320 -306 5 -349 75 -232 -101 81 -192 -169 141 -366
6620 -366 -135 -36 61 52 -467 -18 153 -96 -27 44 -240 181 -72 -61 45 -69 14 27 -219 -24 -130 47 29
6643 29 -107 -4 -12 11 375 49 14 124 -208 -216 357 -165 30 19 -133 204 35 282 163 195 105 -7 -38 130
6667 130 178 1 198 7 171 166 106 121 -128 -123 240 -442 19 202 -135 97 68 -263 -121 -229 17 52 -64
6690 -64 -27 -387 -11 272 -357 -253 99 77 -44 109 117 234 -48 -65 -48 -269 267 368 -179 250 -9 316
6712 316 198 -119 38 310 -200 150 406 -412 414 -63 37 425 73 187 -207 -284 481 -15 -78 507 618
6733 618 494 58 -77 293 535 558 -72 -146 132 91 -138 143 81 -171 384 -1127 -137 671 628 401 -350
$$ packed form
6575c2K5l4r3K47k40J62j20j6J53J37m75O15m73L81m82J54L95l09K07ok82L02
6597B16k57rr0L67j64o4N5p0p8j62J44k08J4L11l54M24l07J31J82k73K3L10n07
6620c66K31R9R7rn19M49J71k49O9P1k84M21k53J1J06j14Q3J3k46J95j06J77j8
6643B9j36J03qK3L64l26l5J10l32qN73n22J95j1j52L37j69K47j19L2r0j12l1J68
6667A30M8j77J97j91J64no0J5k49NL63o82M61J83l37K32k9l31J42j08K46L5j16
6690f4L7l60L76K83o29J04L52k2j21J53QJ17k82j7J7k21N36J01n47M29k59L25
6712C16j18l17J57K72n10L50K56q18Q26m77J00L88l52J14l94p7P65m96o3N85J11
6733F18j24m36j35L70K42K3o30p4K78m1k29K81o2k52N55j511R90Q08m3k27p51
$$ plain form
6754 -350 -580 211 -372 -647 -63 -273 -79 -497 -263 505 391 -363 138 -808 135 333 -741 -93 -173 -920
6774 -920 334 -456 695 -152 -379 -415 -644 -654 578 33 -468 166 77 255 -121 -432 176 -133 -414 298
6794 298 -145 199 224 -935 -11 79 -256 246 -133 225 2 -830 32 -180 -331 270 -407 136 372 -70
6814 -70 362 96 -190 715 -21 -297 332 -139 298 263 -193 464 131 -212 223 -305 346 370 -558 3 -11
6835 -11 -83 381 -432 -43 511 -155 214 -350 -387 432 -314 -579 195 -216 451 -144 -598 469 -2 -224 99
6856 99 -465 464 75 -577 -88 31 -200 1046 -932 392 143 -436 454 -637 59 660 -626 -425 -2
6875 -2 663 1244 -339 -984 868 -345 630 317 -410 867 -247 -516 422 523 -56 828 -480 57 869
6894 869 -747 -499 49 -134 458 -435 -238 308 -221 168 112 -164 445 -227 -238 13 -282 229 -65 -319
$$ packed form
6754c50k30P91n83k75N84k10J94m18K34P68j14p54N01r46R43J98j074O48q0p47
6774i20J254p90J151q47k27l6k29j0J232n45n01O34q9J78l76l11O08l09k81P12
6794B98m43L44K5j159R24R0l35N02l79L58k23q32Q62k12j51O01o77N43K36m42
6814g0M32k66k86R05p36k76O29m71M37l5m56O57l33l43M35n28O51K4r28N61j4
6835a1p2M64q13L89N54o66L69n64l7Q19p46k65P74m11O67n95m54J067m71k22L23
6856I9n64R29l89o52M89J19k31J246j978J324k49n79Q90j091O96O01j286K01M23
6875bO65N81j583o45J852j213R75l13p27J277j114k69R38J01n79Q84j308N37Q12
6894H69j616K48N48j83N92q93J97N46n29L89n6k76O09o72j1K51k95N11k94k54
$$ plain form
6914 -319 74 279 -36 8 -265 88 419 -489 266 -28 -239 97 -257 -125 339 -390 111 152 -241 515 304
6935 304 183 85 -210 -338 518 5 512 -122 -347 281 -396 720 377 -731 5 136 716 419 -226 -548
6955 -548 -76 -112 -468 -334 -86 -114 152 225 210 -4 -171 -137 -254 441 538 212 271 -519 235 241 -370 675 165
6978 165 335 -309 -62 -246 106 -563 128 -59 -60 120 -569 -301 173 169 -29 701 -386 71 153 397 12
6999 12 -298 -20 392 -377 334 376 902 532 -194 -753 210 -111 346 525 -535 668 -10 -192 747 84
7019 84 -685 535 -445 134 -304 -481 676 1280 -220 -187 680 216 438 -595 -480 1382 217 -546 1038
7038 1038 149 -138 414 29 294 242 -428 779 378 -44 -576 523 259 570 -136 188 152 -133 -205 -491
7058 -491 -313 93 -565 -462 -421 -506 -620 769 600 369 -147 -945 189 -272 -199 -1055 -456 -67 -385 -372 533
$$ packed form
6914c19L93K05l15M4k73L53L31r08P55k94k11L36l54J32M64p29N01M1l93P56k11
6935C04j21r8k95j28Q56n13N07o34k25O28o77J116l43j108P36J31N80k97o45l22
6955e48M72l6l56J34K48k8K66P3j5k14j67L4j17O95R7l26N9p90P54Oo11J045n10
6978A65J70o44K47j84L52o69O91j87jJ80o89K68M74mj98P30j087M57Q2K44l85
6999A2l10K78M12p69P11M2N26l70p26n59R63l21M57J79j060J203o78j82R39o63
7019H4p69J220r80N79m38j77J157O04j500L3Q67m64K22j033J15J862j165p63J584
7038A038q89k87N52l85K65n2o70J207m01m22n32J099k64L11p06L24l6k85p2k86
7058d91J78M06o58J03M1q5j14J389j69k31n16p98J134m61P3q56N99L89l18J3R05
$$ plain form
7079 533 -86 -987 186 256 209 -61 -298 539 524 -227 -308 -27 26 166 -791 263 -200 120 285 -53 113
7100 113 -522 -216 142 344 -479 277 65 382 157 -100 -240 -72 -125 -152 -285 -90 -19 29 264 65 257
7121 257 -77 38 140 0 46 22 -140 91 -57 254 6 -116 76 21 271 -211 1 244 23 -439 -33
7142 -33 -2 155 23 25 18 74 133 112 70 -130 155 -103 -101 15 -86 255 -212 -23 29 -107 463 368 10 67 78
7167 78 -200 81 -248 101 102 -95 -134 238 -61 197 34 52 182 10 197 -36 80 367 17 0 34 142
7189 142 155 -14 -294 99 -131 112 63 7 104 167 -328 -110 199 -200 202 -105 62 72 -326 242 -4 -267
7211 -267 262 -303 -150 264 -319 -294 69 -255 93 -99 -430 -25 -56 160 84 -157 177 149 -32 -37 -327 196
7233 196 -5 -200 73 49 -356 313 -587 -87 303 -572 134 15 -293 14 328 -112 437 -578 -158 85
$$ packed form
7079E33o19r01J173P0m7k70k37Q37j5p51q1K81N3J40r57J054m63L20J65l38J66
7100A13o35L06L58K02q23P56k12L17k25k57j40J68n3k7j33J95P1M8K35j99J92
7121B57l34J15J02j40M6k4j62K31j48L11k48j22J92n5K50m82K12K43k21m62M06
7142c3L1J57j32KpN6N9k1m2k00K85k58KJ16j01L41m67J89N2j36N70r5l58N7J1
7167G8k78K81l29L49Jj97l9L72k99K58j63J8J30j72J87k33J16K87l50j7L4J08
7189A42J3j69k80L93k30K43m9n6R7O3m95K18L09l99M02l07J67J0l98N68k46k63
7211b67N29n65J53M14n83K5L63l24L48j92l31M05l1K16p6k41L34k8j81nk90N23
7233A96k01j95K73k4m05O69r00N00L90q75P06j19l08L07L14m40N49j015M20K43
$$ plain form
7253 85 -29 508 230 -52 170 41 381 338 -322 285 153 223 76 -176 84 370 -260 -493 168 -11 349
7274 349 -519 -203 321 -198 50 91 -393 301 -199 -94 18 -227 381 32 -254 118 158 -190 172 -296 185
7295 185 3 -464 193 46 -144 465 -263 107 269 -142 369 -117 -290 267 163 -242 79 -80 197 248
7315 248 -686 235 218 61 -173 93 87 641 150 248 602 -201 65 -378 66 777 -409 -316 -41 42 593 242
7337 242 650 471 180 370 202 113 594 257 51 328 244 417 381 -76 281 448 709 -1 122 503 -53
7358 -53 -361 307 -49 99 240 -277 -158 267 -212 99 130 -200 387 -56 -272 410 -508 338 -57 -383 534
7379 534 -90 110 1187 -18 157 68 -442 -157 268 108 125 -118 -452 395 -207 83 -238 -249 165 -46
7399 -46 -259 -22 -390 -21 -84 -145 165 187 -173 415 -185 222 202 -294 26 251 -87 298 26 -267 414 -150
$$ packed form
7253H5j14N37k78k82K22j29L40m3o60O07j32P0j47k52K60K86o30k33O61j79L60
7274C49q68L16N24n19K48M1m84O94n00J05J12k45O08l49k86L72M0l48L62m68M81
7295A85j82m67O57j47j90O09p28L70J62m11N11m86j73N57j04m05L21j59K77N1
7315B48r34R21j7j57k34K66oN54m91R8L54q03K66m43M44P11j186R3K75Q3N51l51
7337B42M08j79k91J90j68q9M81l37k06K77q4J73l6m57L57J67K61p10J23L81n56
7358e3l08O68l56J48J41n17J19M25m79L11L1l30N87m43k16O82r18Q46l95l26R17
7379E34o24K00J077j205J75q9n10K85M25j60J7k43l34Q47o02K90l21j1M14k11
7399d6k13K37l68L69o3o1L10K2l60N88o00M07k0m96L20K25l38L85k72k93O81n64
$$ plain form
7421 -150 -146 52 82 404 -266 -169 379 217 96 150 -143 98 105 -248 -54 -41 -53 44 -630 -80 150 -75 431
7444 431 70 -379 -87 -316 242 -48 143 378 -119 -463 -479 197 -199 -444 -296 -93 -947 747 -587 -10
7464 -10 -357 225 -703 -103 214 82 664 -715 -526 185 443 -57 -33 48 -189 403 -158 -554 430 -120 -481
7485 -481 558 -46 413 207 -177 -535 131 779 -751 26 -499 -728 245 311 346 -538 832 205 -272 -145
7505 -145 -9 415 95 485 -518 -188 -668 362 18 -336 -238 63 0 802 -257 -326 -3 818 -89 -131
7525 -131 -149 -147 222 -578 -194 807 -319 899 67 -488 -117 -177 337 -99 -639 -342 74 -501 433 -87
7545 -87 -680 96 -99 50 196 136 -161 41 112 430 -100 -105 41 -435 268 -204 581 417 -164 -704 -176 -723
7567 -723 -476 854 219 416 201 -185 281 8 174 210 245 48 -47 -270 472 -576 -491 -118 -438 55 -471
$$ packed form
7421a50MJ98L0L22o70R7N48j62j21N4k93K41Pl53J94J3j2R7o74N50K30k25N06
7444D31l61m49K92k29N58k90J91K35m97l44j6O76l96k45J48K03q54J694j334N77
7464a0l47N82r28O00L17j32N82j379J89P11K58n00K4Q1k37N92n61l96R84n50l61
7485d81J039o04M59k06l84l58O66O48j530P77n25k29R73O6L5q84J370o27m77J27
7505a45J36M24l20L90j003L30m80J030l44l54R8L01o3Q02j059o9L23Q21r07m2
7525a31j8KL69q00L84J001j126J218q32n55L71o0N14m36n40K97M16n75R34n20
7545h7n93P76j95J49J46o0k97K02P1L18n30nJ46m76P03m72P85j64n81n40N28n47
7567g23K47J330o35J97k15l86M66k73J66L6L5j97r5k23P42j048Q5L73l20M93n26
$$ plain form
7588 -471 122 72 251 -142 -70 432 364 -189 -161 -134 -82 -199 -282 -352 -6 447 -208 410 127 89 -513 -527 -354
7611 -354 -203 126 178 -228 174 574 -439 -389 -237 210 250 292 -38 260 640 296 146 -865 74 40 316
7632 316 537 23 481 -488 190 -396 501 176 28 -449 15 525 -192 35 25 -151 133 -27 26 33 170
7653 170 140 77 -59 373 286 -120 131 -79 75 176 50 -83 311 -83 -2 -158 -142 205 -147 107 281 -212
7675 -212 248 -200 79 380 -49 -315 -60 -306 104 212 -271 7 47 -77 153 12 238 -70 -69 162 -159
7696 -159 1 286 -81 68 12 56 23 81 -86 328 49 -221 200 -257 246 129 -171 282 37 -143 292
7717 292 -242 112 -184 -173 339 -95 -183 256 -311 198 54 -206 26 -138 -198 106 -82 198 41 -245 58
7738 58 -377 -362 94 -133 101 -216 -217 55 7 -114 22 -264 5 270 -399 247 2 -21 34 -134 -226 512 -282
$$ packed form
7588d71N93n0J79l93P2N02o8n53K8K7N2j17q3p0L46M53o55O18k83l8o02j4J73
7611c54J51L29N2m06M02M00j013N0J52M47M0M2l30K98L80l44j50j011R39l4K76
7632C16K21n14M58r69O78n86Q97l25j48m77M64N10p17K27j0j76K84j60N3PJ37
7653A70l0o3j36M32q7m06K51k10J54J01j26j33L94l94Q1j56J6L47l52K54J74m93
7675b12M60m48K79L01m29k66K55k46M10J08m83K78M0j24K30j41K26l08JK31l21
7696a59J60K85l67J49n6M4l3N8j67M14k79k70M21m57N03j17l00M53k45j80M35
7717B92n34L54k96J1N12m34q8M39n67N09j44k60K32j64o0L04j88K80j57k86L03
7738E8m35J5M56k27K34l17jK72m8j21J36k86K69K65o69O46k45k3N5j68r2P38p94
$$ plain form
7761 -282 37 140 -197 334 -117 -369 214 135 270 61 -60 94 353 -106 -137 1 30 296 -151 224 111
7782 111 -162 197 13 -106 449 -242 -149 155 25 217 0 -37 442 88 178 60 -90 426 -20 -134 138
7803 138 -5 61 229 -634 214 262 -214 199 -119 108 16 -357 149 -150 -164 153 -167 -273 243 -139 93
7824 93 -119 -101 215 275 -292 203 -15 82 -77 -154 107 65 -498 198 -149 150 117 -287 319 93 -133 173
7846 173 -15 6 257 -200 2 -17 88 176 10 -17 281 3 -142 32 -117 64 294 -313 191 46 -72
7867 -72 336 -54 133 107 27 169 -17 17 274 -6 -26 -73 -152 457 -17 -18 342 -184 105 173 -271 230 -171
7890 -171 -185 182 48 158 62 -224 188 23 -141 -88 143 50 -4 37 -79 165 -303 -55 -171 90 228 -34
7912 -34 29 -14 -79 -48 88 -491 331 9 -292 -159 -10 -130 127 -300 -28 43 -4 176 -75 229 -119 -93 105
$$ packed form
7761b82L19J03l37N31m51k52N83p9J35k09j21J54K59m59l1J38K9K66m47L75j13
7782A11k73L59j84j19N55o91R3L04j30J92k17l7M79l54R0j18j50N16m46j14K72
7803A38j43O6J68q63Q48M8m76M13l18K27r2l73N06k99j4L17l20j06N16l82K32
7824I3k12J8L16O0n67M95k18R7j59p7K61m2n63O96l47K99l3m04O06k26k26L06
7846A73j88K1K51m57K02j9J05Q8j66k7K98k78j45J74j49J81K30o07N04j45j18
7867g2M08l90J87k6q0J42j86L4K57k80k0m7p9O09m74jL60n26K89O8m44N01m01
7890a71j4L67j34J10r6k86M12j65j64N3K31r3n4M1j16K44m68K48j16K61J38k62
7912c4O3m3o5L1J36n79Q22l22l01J33J49j20K57m27K72P1m7J80k51L04l48K6J98
$$ plain form
7935 105 -126 133 -190 -357 416 46 -240 235 -112 62 -132 475 106 -336 261 667 -189 -207 453 -116
7955 -116 -128 -243 -82 7 285 113 -73 482 -256 -237 -852 -237 163 -368 40 -170 -19 549 -605 -185 -120
7976 -120 -541 277 -76 -289 543 -254 -190 180 153 -185 256 -467 236 230 262 377 39 -172 -129 118 -73 -125
7998 -125 -63 224 23 -138 -26 8 -60 216 -68 -134 188 34 31 24 -122 49 -115 216 -158 -153 -177 -51 123 370
8022 370 305 61 78 -147 -207 156 -117 -386 48 253 -202 121 -355 -243 -52 -174 7 75 513 306 -141
8043 -141 -366 -610 -141 104 -80 31 -177 68 33 -103 -28 -27 0 200 260 62 -31 250 -631 -212 117 241
8065 241 8 -45 236 -256 84 -41 8 23 110 -311 -79 45 -10 7 195 61 -21 162 -99 -250 53 5 -441
8088 -441 -57 143 -28 61 22 173 231 -76 -39 119 249 8 -133 -115 91 -121 -124 -60 -333 -243 -151 -33 -176
$$ packed form
7935A05k31K59l23j67P73l70k86M75l47J74j94O07l69m42N97M06q56j8O60n69
7955a16j2j15J61Q9K78j72j86N55p38J9o15O15M00n31M08k10J51N68j154M20O5
7976a20m21Q18l53k13Q32p97O4L70k7l38M41p23P03oL2J15l38k11M3K47j91n2
7998a25O2K87k01j61J12L4o8K76k84o6L22j54lpj46J71j64L31l74Nk4J26J74K47
8022C70o5k44J7k25o0L63k73k69M34K05m55L23m76J12J91j22J81O8M38k07m47
8043a41k25k44M69K45j84J11k08K45l5j36P5JK7K00O0j98r3K81q81M19L29J24
8065B41k33n3K81m92L40j25M9J5Q7m21K32J24n5J7J88j34q2J83k61j51L03m8m46
8088d41L84K00j71Q9l9J51N8l07L7J58J30k41j41J8K06k12lO4k73R0R2J18j43
$$ plain form
8111 -176 -245 73 -322 -57 16 140 17 -76 131 119 255 -338 84 -149 -30 44 -86 145 108 36 127 -4 -2
8134 -2 -12 -86 97 222 49 -84 163 -63 278 17 -179 126 -266 299 76 -101 -96 -81 -54 96 -61 -111 259
8157 259 -85 122 -242 72 161 -54 -70 243 121 -175 3 -169 26 31 122 32 53 125 19 25 181 -34 -23 60
8181 60 -162 200 -81 33 281 -52 40 65 -234 -30
$$ packed form
8111a76o9L18l95K65P3J24j23r3K07j2J36n93M22k33J19P4j30K31l7p2R1j31K
8134bj0p4J83J25j73j33K47k26L41k61j96L05l92N65k23j77NJ5K7J50j57n0L70
8157B59l44K07l64L14Q9k15j6L13j22k96J78j72J95NR1r0K1P2j06OJ56k15J1Q3
8181F0k22L62k81J14K48l33R2K5k99K04
8191c0
$$ Imaginary data points
##PAGE= N=2
##DATA TABLE= (X++(I..I)), XYDATA
$$ plain form
0 0 0 0 0 0 0 0 0 0 -8 8 -8 16 -16 24 -32 40 -48 56 -72 86 -103 122 -145 175 -205 239 -279 323 -371 429
30 429 -492 563 -639 724 -819 924 -1038 1165 -1302 1457 -1623 1804 -2001 2219 -2455 2713
46 2713 -2996 3306 -3643 4014 -4420 4869 -5366 5915 -6532 7223 -8004 8897 -9928 11134
60 11134 -12567 14303 -16454 19206 -22864 27994 -35771 49124 -78577 289654 -256006 -190355
72 -190355 298375 -85882 375499 -7631 -80474 429960 123965 -154454 -129806 39279
82 39279 320837 -149215 -62617 104643 -243902 75511 -6951 -257746 270181 -94552 -357955
93 -357955 21143 -217252 -123960 38585 -223207 2590 -110526 -318335 -123551 -244466
103 -244466 -58131 52471 -331185 -168802 -163657 -271603 19487 -194945 -200963 47310 -243349
$$ packed form
0@%%%%%%%%qJ6j6K4l2M0n6P2q8J04j28J58j89K25k67L20l80M44n18O02o94Q00
30D29r21J055j202J363j543J743j962K203k467K759l080L427l805M220m674N168
46B713n709O302o949P657q434R289j0235J1281j2447J3755j5227J6901j8825K1062
60A1134k3701K6870l0757L5660m2070N0858o3765Q4895j27701L68231n45660O5651
72a90355M88730l84257M61381l83130p2843N10434l05995k78419K4648J69085
82C9279K81558m70052Q6598J67260l48545L19413q2462k50795N27927l64733k63403
93c57955L79098k38395R3292J62545k61792K25797j13116k07809J94784j20915
103b44466J86335J10602l83656J62383N145j07946K91090k14432o018K48273k90659
$$ plain form
114 -243349 -208304 -201716 -261816 114877 -62228 -204374 -15798 -236156 -81199 -31121 -269855
125 -269855 61840 37957 -138032 5212 -157114 -29053 97141 -96708 31716 -26719
135 -26719 -43436 106663 -100307 46283 188847 -23896 90881 -3922 -88185 201105 93606
146 93606 27098 160972 60582 94415 71686 -8933 150069 169119 131702 101795 3
157 3 116035 137598 42338 167565 147930 76848 129711 14844 34305 156771 75726 107606
169 107606 143758 56827 59350 6611 31335 134049 60483 55937 50563 -10204 82348 26821
181 26821 -33030 87237 31620 -10487 1264 -71369 15375 64093 2380 -7894 -71923 -48898
193 -48898 -10978 -70492 -17351 -12771 -39520 14137 -87858 -146048 -50319 -41217 -13798 -9577
$$ packed form
114b43349L5045O588o0100L76693j77105j42146J88576k20358J54957N0078k38734
125b69855L31695k3883j75989J43244j62326J28061J26194j93849J28424n8435
135b6719j6717J50099k06970J46590J42564k12743J14777r4803q4263K89290j07499
146I3606o6508J33874j00390L3833k2729q0619J59002J9050l7417k9907j01792
157CJ16032K1563r5260J25227j9635p1082N2863j14867J9461J22466q1045L1880
169A07606L6152q6931K523n2739K4724J02714p3566m546n374o0767R2552n5527
181B6821n9851J20267n5617m2107J1751p2633Q6744M8718o1713j0274o4029K3025
193d8898L7920n9514N3141M580k6749N3657j01995n8190R5729R102K7419M221
$$ plain form
205 -9577 -101006 -99999 -72775 -77815 -66855 -60485 -26051 -37619 -99855 -100147 -104124 -73943 6074
218 6074 -37256 -81531 -52085 -95313 -84585 -21781 -45578 -33521 -18536 -63811 -64739 -58488 -37196
231 -37196 5879 7197 -1506 -55990 -82476 -11186 4648 18902 47328 -8033 -11797 -5300 -44751
244 -44751 2129 54336 66389 61193 3307 -17332 -1591 22392 74752 69602 52486 55276 8746
257 8746 4776 45741 58304 84950 84436 39885 18791 24830 47643 66833 77495 77575 44257 23072
271 23072 29387 29095 60187 92109 58861 25311 18433 6847 27381 63106 56339 39759 31274
284 31274 418 -19168 5283 33358 42104 41514 11521 -36187 -33501 -3095 3699 15981 17478
297 17478 -17672 -33322 -32464 -43443 -25926 6794 -1174 -30063 -48159 -60971 -51749 -18345 -11581
$$ packed form
205i577r1429J007K7224n040J0960O370L4434j1568o2236k92l977L0181Q0017
218F074m3330m4275K9446m3228J0728O2804k3797J2057J4985m5275r28O251K1292
231c7196M3075J318q703n4484k6486P1290J5834J4254K8426n5361l764O497l9451
244d4751M6880N2207J2053n196n7886k0639J5741K3983N2360n150j7116K790m6530
257H746l970M0965J2563K6646n14m4551k1094O039K2813J9190J0662Q0l3318k1185
271B3072O315k92L1092L1922l3248l3550o878j1586K0534L5725o767j6580q485
284C1274l0856j9586K4451K8075Q746n90k9993m7708K686L0406O794J2282J497
297A7478l5150j5650Q58j0979J7517L2720p968k8889j8096j2812R222L3404O764
$$ plain form
310 -11581 -31241 -37995 -48720 -68081 -57965 -32422 -21949 -16980 -31774 -68874 -76621 -48334 -26923
323 -26923 -16832 -14428 -36503 -59160 -51785 -42349 -37214 -11453 2512 -15915 -31402 -46433 -50124
336 -50124 -14644 15192 9257 -4885 -12320 -22191 -26623 -3131 17693 20318 30110 8497 -23486
349 -23486 143 18345 23652 48126 31109 5907 15100 15854 21019 35718 45996 47539 30737
362 30737 19430 9318 16076 59731 58624 33870 39861 14835 9051 38945 30575 44263 58358
375 58358 26535 16237 6946 7465 39064 40361 40122 25645 -7024 10137 6606 2856 41543 21627
389 21627 7402 9707 -29326 -7175 12854 -1496 25173 1627 -25172 -17578 -36972 -787
401 -787 12721 -21929 1626 -19418 -42176 -24199 -46445 -2658 23952 -33142 -34009 -45547 -41527
$$ packed form
310a1581j9660o754j0725j9361J0116K5543J0473M969j4794l7100p747K8287K1411
323b6923J0091K404k2075k2657P375R436N135K5761J3965j8427j5487j5031l691
336e0124L5480K9836n935j4142p435r871m432K3492K0824K625R792k1613l1983
349b3486K3629J8202N307K4474j7017k5202R193P54N165J4699J0278J543j6802
362C0737j1307j0112O758M3655j107k4754N991k5026n784K9894q370J3688J4095
375E8358l1823j0298r291N19L1599J297k39j4477l2669J7161l531l750L8687j9916
389B1627j4225K305l9033K2151K0029j4350K6669k3546k6799P594j9394L6185
401g87J3508l4650K3555k1044k2758J7977k2246M3787K6610n7094q67j1538M020
$$ plain form
414 -41527 -1282 -36592 -19537 10312 -40521 -36901 -46635 -47630 14721 -9818 -28302 -10922 -46611
427 -46611 -31594 -23803 -27653 18524 -5527 -26636 -18312 -49857 -8791 13954 -17858 16760 -4501
440 -4501 -31525 1636 -27682 -7137 43162 6796 3003 -9775 -23381 22926 6671 5366 39127
453 39127 11908 14277 -9389 -27508 52792 43742 4619 24153 -3695 21898 31400 -20173 36394
466 36394 59927 18731 12887 -22321 15892 63347 10714 20571 29619 11526 30248 -20037 -5971
479 -5971 72191 36319 11647 -3700 -20445 39130 20031 -13532 34294 26053 17045 -7524 -50577
492 -50577 22382 46168 -2272 8459 -16717 -5285 20160 -43025 -9332 41454 -1207 -5878
504 -5878 -38143 -36779 30744 -11885 -24665 4544 -19296 563 -36398 -61093 25904 7651
$$ packed form
414d1527M0245l5310J7055K9849n0833L620r734r95O2351k4539j8484J7380l5689
427d6611J5017P791l850M6177k4051k1109Q324l1545M1066K2745l1812L4618k1261
440d501k7024L3161k9318K0545N0299l6366l793j2778j3606M6307j6255j305L3761
453C9127k7219K369k3666j8119Q0300r050l9123J9534k7848K5593R502n1573N6567
466C6394K3533m1196n844l5208L8213M7455n2633R857R048j8093J8722n0285J4066
479e971P8162l5872k4672j5347j6745N9575j9099l3563M7826q241r008k4569m3053
492e0577P2959K3786m8440J0731k5176J1432K5445o3185L3693N0786m2661m671
504e878l2265J364O7523m2629j2780K9209k3840J9859l6961k4695Q6997j8253
$$ plain form
516 7651 -21023 -14690 -64350 -5312 7389 -59358 822 2211 -17625 -3746 -79620 -34278 32304
529 32304 -17495 -2726 -34083 -38334 23932 -47577 -40120 19393 -8583 24133 -30446 -72242
541 -72242 30993 1180 -17093 14090 -31541 27113 10934 -65940 18792 25524 9793 25798
553 25798 -48034 6224 46870 -23851 18221 19751 15995 46155 -41866 -12132 59013 15707
565 15707 43395 5605 -16595 61886 -8227 -12455 59487 17034 53190 21599 -46765 44755
577 44755 27620 6459 52063 -2790 36856 34809 -41409 29647 23107 16308 59951 -28964 669
590 669 38078 -28367 32713 15630 -13436 47780 -25902 -22919 24038 -19183 33854 5621 -40607
603 -40607 18655 -29166 -15787 19283 -36502 24534 6282 -62194 -4451 -32891 -15475 35350
$$ packed form
516G651k8674O333m9660N9038J2701o6747O0180J389j9836J3879p5874M5342O6582
529C2304m9799J4769l1357m251O2266p1509P457N9513k7976L2716n4579m1796
541g2242J03235k9813j8273L1183m5631N8654j6179p6874Q4732O732j5731J6005
553B5798p3832N4258M0646p0721M2072J530l756L0160q8021K9734P1145m3306
565A5707K7688l7790k2200P8481p0113m228P1942m2453L6156l1591o8364R1520
577D4755j7135k1161M5604n4853L9646k047p6218P1056o540o799M3643q8915K9633
590F69L7409o6445O1080j7083k9066O1216p3682K983M6957m3221N3037k8233m6228
603d0607N9262m7821J3379L5070n5785O1036j8252o8476N7743k8440J7416N0825
$$ plain form
615 35350 -43995 -17821 146 -53762 -9907 -29305 -25748 32184 -33332 -38335 -16268 -42553
627 -42553 5845 -17792 -38818 18196 -24713 -32586 -14719 -40293 19848 4036 -45894 1372
639 1372 -21061 -14131 12167 -35905 13743 21262 -37434 -2649 -15756 -1962 42471 -15322 -1623
652 -1623 16401 -18959 12531 -4457 3753 51350 2469 1282 6791 -15335 35121 18078 1970
665 1970 42533 8266 7777 15125 -10481 33374 33693 9363 26663 2660 10695 23715 745
678 745 28758 28019 5972 17638 -2659 7547 33175 8334 13854 13996 -4133 11278 2798 2508
692 2508 25963 9702 2964 -1214 -15941 6214 8107 -121 14405 -375 -7588 -7151 -22981 -2079
706 -2079 10424 -646 748 -15296 -16490 -7062 -19015 -5693 1150 -7475 -4447 -23221 -23254 -4680
$$ packed form
615C5350p9345K6174J7967n3908M3855j9398L557N7932o5516n003K2067k6285
627d2553M8398k3637k1026N7014m2909p873J7867k5574O0141j5812m9930M7266
639A372k2433O930K6298m8072M9648P519n8696L4785j3107J3794M4433n7793J3699
652a623J8024l5360L1490j6988Q210M7597m8881j187N509k2126N0456j7043j6108
665A970M0563l4267m89P348k5606M3855L19k4330J7300k4003Q035J3020k2970
678G45K8013p39k2047J1666k0297J0206K5628k4841N520J42j8129J5411q480k90
692B508K3455j6261o738m178j4727K2155J893q228J4526j4780p213M37j5830K0902
706b079J2503j1070J394j6044j194R428j1953J3322O843q625L028j8774l3J8574
$$ plain form
720 -4680 -11475 -6342 -6419 -18331 -12644 -17826 -17148 -3174 -5848 -9336 -16013 -21570 -11940 -9702 -5674
735 -5674 -1325 -7822 -10584 -15980 -19621 -8054 569 3220 1456 -7855 -14336 -14052 -8614 807 8714
750 8714 7910 -74 -8228 -10870 -4781 3739 9383 11702 5856 -1492 -3005 -1872 6107 13041 12143 8827
766 8827 3844 287 3449 9861 15606 15208 9226 4522 1624 6761 14176 16378 16428 11470 3450 1446
782 1446 5020 11918 18645 18683 12410 3723 -44 669 7187 16108 16871 12244 4221 -2428 -2050 4211
798 4211 9401 12464 9179 3039 -3270 -5172 -148 4798 6382 3698 -2515 -6162 -6000 -2756 249
813 249 1899 -979 -9063 -12274 -8534 -5269 -461 -814 -6739 -11100 -15391 -15530 -9128 -2769 -587 -5602
829 -5602 -12574 -17506 -19294 -12785 -4466 -2000 -2058 -10132 -18335 -17212 -13713 -5796 -312 -3074 -6177 -13375
$$ packed form
720d680o795N133p7j1912N687n182O78J3974k674l488o677n557R630K238M028
735e674M349o497k762n396l641J1567Q623K651j764r311o481K84N438R421P907
750H714q04p984q154k642O089Q520N644K319n846p348j513J133P979O934q98l316
766H827m983l557L162O412N745l98n982m704k898N137P415K202N0m958q020k004
782A446L574O898O727L8o273q687l767P13O518Q921P63m627q023o649L78O261
798D211N190L063l285o140o309j902N024M946J584k684o213l647J62L244L005
813B49J650k878q084l211L740L265M808l53n925m361m291j39O402O359K182n015
829e602o972m932j788O509Q319K466n8q074q203J123L499P917N484k762l103p198
$$ plain form
845 -13375 -14370 -7383 -7638 -851 1334 -7317 -3814 -7522 -10774 3400 2783 483 3495 -7088 -4363
860 -4363 2409 1928 10440 7477 3175 2140 -5634 4494 10461 9704 18260 5462 1221 9205 -2487
875 -2487 8546 18825 11012 19910 5994 -3581 11979 5328 12965 19352 7014 16288 5503 -4989
889 -4989 13735 8538 13559 16045 -4180 8991 9499 -3253 11364 4382 6187 13523 -10823 -839
903 -839 7739 -618 13615 -4316 -7548 8843 -14340 -4945 4796 -6297 14100 -7705 -23370
916 -23370 1322 -13144 -2155 5152 -17424 5970 -7046 -28004 -3276 -14348 58 10488
928 10488 -25727 -6513 -6206 -20956 1619 -17550 -6123 14042 -22263 -11307 -9427 -15967 14887
941 14887 -13326 -16834 10532 -15827 -4885 -5178 -18551 21657 860 -21821 1167 -12322 8350
$$ packed form
845a3375r95O987k55O787K185q651L503l708l252J4174o17k300L012j0583K725
860d363O772m81Q512k963m302j035p774J0128N967p57Q556j2798m241P984j1692
875b487J1033J0279p813Q898j3916r575J5560o651P637O387j2338R274j0785j0492
889d989J8724n197N021K486k0225J3171N08j2752J4617o982J805P336k4346R984
903h39Q578q357J4233j7931l232J6391k3183R395R741j1093K0397k1805j5665
916b3370K4692j4466J0989P307k2576K3394j3016k0958K4728j1072J4406J0430
928A0488l6215J9214L07j4750K2575j9169J1427K0165l6305J0956J880o540L0854
941A4887k8213l508K7366k6359J0942k93j3373M0208k0797k2681K2988j3489K0672
$$ plain form
954 8350 11428 -20200 12860 8543 -12755 2734 -13792 12422 28707 -14279 1688 5257 -3692
967 -3692 17547 -10717 2184 34979 -2618 -1078 -342 -5849 32363 3518 -9332 22899 1336
980 1336 8728 3778 -13941 30575 15634 -9166 9714 -7454 15145 19579 -16263 16730 13440
993 13440 -5731 10680 -14917 7771 30738 -8795 2137 -629 -8824 19311 -6819 -4918 21114
1006 21114 -4430 1419 -7004 -18826 19855 4971 -8020 6217 -13037 2985 1881 -23923
1018 -23923 7831 9283 -4560 1070 -24257 -6193 14899 -13067 -3777 -2227 -8595 7492 -20360
1031 -20360 -17631 14242 -2191 -2186 -11969 -22242 11242 -2454 -17712 3294 -5199 2871 -5738 -31286
1045 -31286 3690 10852 -6294 -1199 -17767 -1578 9486 -21537 -6330 8095 1911 6309 -20500
$$ packed form
954H350L078l1628L3060m317k1298J5489j6526K6214J6285m2986J5967L569q949
967c692K1239k8264J2901L2795l7597J540P36n507L8212k8845j2850L2231k1563
980A336P392m950j7719M4516j4941k4800J8880j7168K2599M434l5842L2993l290
993A3440j9171J6411k5597K2688K2967l9533J0932k766q195K8135k6130J901K6032
1006B1114k5544N849q423j1822L8681j4884j2991J4237j9254J6022j104k5804
1018b3923L1754J452j3843N630k5327J8064K1092k7966R290J550o368J6087k7852
1031b0360K729L1873j6433Nr783j0273L3484j3696j5258K1006q493Q070q609k5548
1045c1286L4976P162j7146N095j6568J6189J1064l1023J5207J4425o184M398k6809
$$ plain form
1058 -20500 -13801 15984 -2234 -3279 -172 -4853 13595 -6726 -17878 10943 8614 6432 1024
1071 1024 -15087 9368 11934 -6682 5813 3979 8790 11792 -14328 -156 17881 6973 11803
1084 11803 -2621 -3531 20107 542 -1420 12778 6260 18554 2482 -13671 14867 11484 6851
1097 6851 9938 -5405 14925 12549 -12889 5736 8872 12265 15448 -14196 -707 14745 -2391
1110 -2391 6156 -464 1801 17837 -11856 -11239 8614 779 9531 -4067 -14616 10299 -3116
1123 -3116 -11308 -265 -6076 9208 -619 -23289 -2059 -2485 -4783 1553 -16837 -1549 3905 -21007
1137 -21007 -8262 -5446 -4453 6311 -18508 -14076 924 -12494 -2668 -8105 -10849 7925 -13581
1150 -13581 -15941 -630 -9549 4257 -1984 -16337 3229 -6295 -9330 2362 -7793 5501 3351
$$ packed form
1058b0500O699K9785j8218j045L107m681J8448k0321j1152K8821k329k182n408
1071A024j6111K4455K566j8616J2495j834M811L002k6120J4172J8037j0908M830
1084A1803j4424r10K3638j9565j962J4198o518J2294j6072j6153K8538l383m633
1097F851L087j5343K0330k376k5438J8625L136L393L183k9644J3489J5452j7136
1110b391Q547o620K265J6036k9693O17J9853p835Q752j3598j0549K4915j3415
1123c116q192J1043n811J5284r827k2670K1230m26k298O336j8390J5288N454k4912
1137b1007J2745K816R93J0764k4819M432J5000j3418R826n437k744J8774k1506
1150a3581k360J5311q919J3806o241j4353J9566r524l035J1692j0155J3294k150
$$ plain form
1163 3351 -13340 619 -3069 -1585 10088 -4886 2843 6635 -7247 3931 1873 1934 14746 566
1177 566 945 6224 -1863 10071 7556 2405 14373 2577 1694 8355 1458 12548 11905 1573 8229
1192 8229 3112 2646 10167 3395 10945 9909 -527 5279 1112 2986 12400 4009 5759 6695 -2336
1207 -2336 3210 2127 1416 9192 3008 1092 546 -4742 1194 1507 202 4448 -2009 -3728 -2610 -6561
1223 -6561 128 1303 -3144 -1890 -6421 -6715 -2618 -4290 -2415 -2277 -5689 -5683 -7762 -6909 -2744 -3007 -2743
1240 -2743 -4895 -8349 -7142 -7127 -5034 -1587 -2642 -4071 -5840 -8420 -5863 -3352 -2111 -499 -2573
1255 -2573 -4963 -5674 -5680 -2903 -270 578 -641 -2914 -4052 -3010 -935 1317 1732 437 -740 -2163
1271 -2163 -1227 1212 2687 3562 2169 450 -256 512 2563 4405 4793 4477 2049 142 487 2917 5533
$$ packed form
1163C351j6691J3959l688J484J1673j4974P729L792j3882J1178k058O1J2812j4180
1177E66L79N279q087J1934k515n151J1968j1796q83O661o897J1090o43j0332O656
1192H229n117m66P521o772P550j036j0436N806m167J874R414q391J750R36r031
1207b336N546j083p11P776o184j916n46n288N936L13j305M246o457j719J118l951
1223f561O689J175m447J254m531k94M097j672J875J38l412Ok079Q53M165k63K64
1240b743k152l454J207J5K093L447j055j429j769k580K557K511J241J612k074
1255b573k390p11oK777K633Q48j219k273j138J042K075K252M15j295j177j423
1271b163R36K439J475Q75j393j719p06P68K051J842L88l16k428j907L45K430K616
$$ plain form
1288 5533 6696 4996 2981 1701 459 2390 4927 6691 6629 3766 1306 1086 2257 4716 5250 5227
1304 5227 4199 1719 890 1935 2786 4449 4183 1917 1752 446 588 3346 2500 2478 2122 -1367 -764
1321 -764 369 545 3203 1800 -740 -1223 -3242 -1726 521 583 1958 -646 -3739 -3338 -4989 -1724
1337 -1724 1710 -991 -607 -3791 -6081 -2695 -3735 -2366 1010 -2755 -2991 -4532 -7062 -1269 -1814 -4009
1353 -4009 -708 -4562 -3980 -2710 -6671 -496 449 -3861 -2333 -6424 -3889 1785 -3465 -756 545
1368 545 -4041 -1320 -5589 -4119 5354 422 -54 -551 -5771 1737 -1299 -3162 6864 2014 1260 1056
1384 1056 -7388 3650 5854 -1793 6040 270 901 7011 -5737 1236 9036 734 6295 -214 -2538
1399 -2538 10306 -213 740 7508 -355 7803 282 -5761 11154 3891 2443 5133 -7336 7079
$$ packed form
1288E533J163j700k015j280j242J931K537J764o2k863k460k20J171K459N34k3
1304E227j028k480q29J045Q51J663k66k266j65j306J42K758q46k2l56l489O03
1321g64J133J76K658j403k540m83k019J516K247O2J375k604l093M01j651L265
1337a724L434k701L84l184k290L386j040J369L376l765k36j541k530N793n45k195
1353d009L301l854N82J270l961O175R45m310J528m091K535N674n250K709J301
1368E45m586K721m269J470R473m932m76m97n220P508l036j863J0026m850p54k04
1384A056q444J1038K204p647P833n770O31O110j2748O973P800q302N561o509k324
1399b538J2844j0519R53O768p863Q158p521o043J6915p263j448K690j2469J4415
$$ plain form
1413 7079 5249 -7119 8645 2133 1720 7695 -12180 879 9347 -4294 7632 -2436 -5069
1426 -5069 11053 -9858 -4200 7302 -5022 8803 -3302 -13985 9743 -3939 -4182 3620 -11219
1439 -11219 8401 1624 -17654 4525 -2574 -63 6872 -18791 1335 7425 -13061 4307 -6503
1452 -6503 -3262 13801 -18324 -6642 8637 -7721 9453 -7461 -12080 15640 -9873 -6918 5320
1465 5320 -8953 15547 -543 -18934 11455 -4197 -337 8748 -15910 12337 8984 -16463 7365
1478 7365 -4963 2445 17806 -16953 2556 11388 -9214 11517 -6980 -4212 22907 -10681 -2956
1491 -2956 7528 -8094 18693 -2168 -14904 17766 -4280 -4 7222 -14351 17798 7580
1503 7580 -17439 8707 -5442 3865 14535 -19190 6989 10804 -11648 7011 -11731 -505
$$ packed form
1413G079j830j2368J5764o512m13N975j9875J3059Q468j3641J1926j0068k633
1426e069J6122k0911N658J1502j2324J3825j2105j0683K3728j3682k43P802j4839
1439a1219J9620o777j9278K2179p099K511O935k5663K0126O090k0486J7368j0810
1452f503L241J7063l2125J1682J5279j6358J7174j6914m619K7720k5513K955J2238
1465E320j4273K4500j6090j8391L0389j5652L860R085k4658K8247l353k5447K3828
1478G365j2328P408J5361l4759J9509Q832k0602K0731j8497K768K7119l3588P725
1491b956J0484j5622K6787k0861j2736L2670k2046M276P226k1573L2149j0218
1503G580k5019K6146j4149R307J0670l3725K6179L815k2452J8659j8742J1226
$$ plain form
1515 -505 22792 -14601 -3003 4965 -9079 14569 -10237 -12059 20376 -6426 -3140 -610 -14454
1528 -14454 18695 558 -17245 9415 -5259 2766 4008 -20198 11844 9079 -13017 3119
1540 3119 -10797 3442 15108 -17732 667 7715 -7367 6796 -12407 -4492 19871 -7501
1552 -7501 -3361 1617 -8447 12992 -5046 -11421 14928 -1494 519 -253 -14451 12731 5859
1565 5859 -10291 6534 -4545 2833 7532 -15340 4986 9015 -5066 5314 -8848 -1353 14082
1578 14082 -7893 -1106 4103 -4076 8847 -6218 -7582 12327 -1082 147 22 -9134 9425
1591 9425 1810 -8659 6301 -708 2487 3274 -12302 3797 7730 -3754 3566 -4268 -1056 8110
1605 8110 -7874 -1679 6025 -911 5081 -4939 -6089 9074 -814 -1595 2330 -3493 6176 113
$$ packed form
1515e05K3297l7393J1598P968j4044K3648k4806j822L2435k6802L286K530j3844
1528a4454L3149j8137j7803K6660j4674Q025J242k4206L2042k765k2096J6136
1540C119j3916J4239J1666l2840J8399P048j5082J4163j9203P915K4363k7372
1552g501M140M978j0064K1439j8038o375K6349j6422K013p72j4198K7182o872
1565E859j6150J6825j1079P378M699k2872K0326M029j4081J0380j4162P495J5435
1578A4082k1975O787N209q179J2923j5065j364J9909j3409J229j25r156J8559
1591I425p615j0469J4960p009L195P87j5576J6099L933j1484P320p834L212R166
1605H110j5984O195P704o936N992j0020j150J5163r888p81L925n823R669o063
$$ plain form
1619 113 -8261 5472 1967 706 2389 -7879 2901 4899 -5089 2710 -20 105 4786 -7665
1633 -7665 -1652 5368 -1161 2543 -2406 -3612 4984 -4014 -2734 3231 -1347 3348 -1527 -7060 2792
1648 2792 -467 -2053 2136 -3721 879 1203 -6472 181 462 -847 2294 -4709 -2142 2235 -3337
1663 -3337 509 -348 -2321 3057 -3436 -3616 2212 -1530 1757 117 -4536 1812 -684 -1913 2602
1678 2602 -756 2070 1614 -4527 811 893 390 3977 -1074 613 2272 -2499 1423 2059 1151 4485
1694 4485 -221 -308 2461 -471 2378 2741 917 3411 373 -407 2186 899 2866 2903 29 1703
1710 1703 521 -636 2858 1109 2202 2014 -1379 11 112 91 2483 765 -205 60 -2196 -909
1726 -909 338 -53 1161 -424 -1690 -1042 -2408 -1170 -106 -871 392 -1734 -2950 -1860 -1587 -905
$$ packed form
1619A13q374J3733l505j261J683j0268J0780J998r988P799k730J25M681j2451
1633g665O013P020o529L704m949j206Q596q998J280N965m578M695m875n533R852
1648B792l259j586M189n857M600L24p675O653K81j309L141p003K567M377n572
1663c337L846q57j973N378o493j80N828l742L287j640m653O348k496j229M515
1678B602l358K826m56o141N338Q2n03L587n051J687J659m771L922O36r08L334
1694D485m706q7K769k932K849L63j824K494l038p80K593j287J967L7k874J674
1710A703j182j157L494j749J093j88l393J390J01k1K392j718r70K65k256J287
1726i09J247l91J214j585j266O48j366J238J064p65J263k126j216J090K73O82
$$ plain form
1742 -905 -24 -1811 -1628 -2116 -3000 -1468 -846 -716 -1130 -2357 -1979 -2394 -1911 -173 -858 -738 -1064 -1968 -1852
1761 -1852 -876 588 244 -235 -1397 -1152 -598 -49 423 843 674 368 256 325 -105 1378 1820 967 1210
1780 1210 810 38 895 1254 2134 2317 837 1001 885 101 2097 1707 1818 1854 -368 927 1099 761 2609
1799 2609 1201 764 1298 -1232 723 1564 493 2589 113 -823 987 -1200 556 1645 -656 1677
1815 1677 -262 -1892 696 -1345 398 1619 -1912 227 -617 -2402 1311 -1232 -278 2116 -2918
1830 -2918 -589 -617 -2344 2410 -1212 -1711 1955 -3020 -960 100 -2561 3334 -239 -3053 1099 -2424
1846 -2424 394 1803 -3069 2190 381 -2731 1164 -2881 914 3762 -3652 641 477 -2530 2935
1861 2935 -2613 -1388 5047 -2339 -963 -646 -2893 4494 -498 -3454 3297 -1460 58 151 -4688 4426
$$ packed form
1742i05Q81j787J83m88q84J532O22J30m14j227L78m15M83J738o85J20l26r04J16
1761a852R76J464l44m79j162K45N54N49M72M20j69l06j12O9m30J483M42q53K43
1780A210m00p72Q57L59Q80J83j480J64j16p84J996l90J11L6k222J295J72l38J848
1799B609j408m37N34k530J955Q41j071K096k476r36J810k187J756J089k301K333
1815A677j939j630K588k041J743J221l531K139q44j785L713k543R54K394n034
1830b918K329k8j727M754l622m99L666m975K060J060k661N895l573k814M152l523
1846b424K818J409m872N259j809l112L895m045L795K848p414M293j64l007N465
1861B935n548J225O435p386J376L17k247P387m992k956O751m757J518R3m839R114
$$ plain form
1877 4426 2130 -3800 1255 -3122 841 3747 -5392 1433 3269 -2905 1738 -3804 -1086 6611 -3218
1892 -3218 -1369 1975 -2358 4099 -2367 -4385 6534 -209 -755 586 -4850 5377 2606 -5088 3535
1907 3535 -765 959 3521 -6868 2469 5978 -2847 1976 -3059 -649 8104 -4626 -1216 4827
1921 4827 -1633 4514 -2738 -5550 9776 387 -1701 2420 -4652 6229 2305 -8657 5178 2186
1935 2186 -327 2929 -8961 3025 7770 -6699 1123 -1182 -846 8073 -8690 -3193 8171 -3307
1949 -3307 2539 -4128 -6728 10445 -3173 -5678 4088 -4738 5504 -750 -12600 7562 1567 -3338
1963 -3338 2583 -10373 4080 6748 -11542 2495 94 -1230 7625 -11791 -2182 9520 -5840
1976 -5840 2313 -2877 -5314 11784 -6680 -6630 6920 -3639 6759 -913 -11556 10863 921 -4025
$$ packed form
1877D426k296n930N055m377L963K906r139O825J836o174M643n542K718P697r829
1892c218J849L344m333O457o466k018J0919o743n46J341n436J0227k771p694Q623
1907C535m300J724K562j0389R337L509q825M823n035K410Q753j2730L410O043
1921D827o460O147p252k812J5326r389k088M121p072J0881l924j0962J3835k992
1935B186k513L256j1890J1986M745j4469P822k305L36Q919j6763N497J1364j1478
1949c307N846o667k600J7173j3618k505R766q826J0242o254j1850K0162n995m905
1963c338N921j2956J4453K668j8290J4037k401j324Q855j9416R609J1702j5360
1976e840Q153n190k437J7098j8464N0J3550j0559J0398p672j0643K2419r942m946
$$ plain form
1990 -4025 4941 -7594 7592 6673 -12687 5679 2855 -631 8620 -11107 1232 11744 -7626
2003 -7626 3557 -899 -2267 14277 -8212 -5214 9772 -3390 7089 -1454 -9550 13774 -1531
2016 -1531 -6035 5327 -6246 9614 3623 -14272 7392 1313 -1907 5795 -11752 4726 9266
2029 9266 -11983 2286 -1350 -1589 10293 -11906 -3496 9491 -6691 3318 -3833 -6950 13000
2042 13000 -6198 -7342 4891 -5821 6683 -453 -12399 8767 -713 -4605 3630 -9280 6462
2055 6462 6289 -12152 3085 -1046 -1152 7520 -10252 543 8645 -7208 2737 -3029 -3177 11836
2069 11836 -5938 -4211 5865 -4313 6188 -1268 -7535 10558 -515 -3113 3389 -5864 7616
2082 7616 4110 -8962 5081 817 -271 5058 -8214 3656 7563 -5922 2304 -2208 -514 8562
$$ packed form
1990d025Q966j2535J5186r19j9360J8366k824l486R251j9727J2339J0512j9370
2003g626J1183m456j368J6544k2489K998J4986j3162J0479q543q096K3324j5305
2016a531m504J1362j1573J5860n991j7895K1664o079l220P702j7547J6478M540
2029I266k1249J4269l636k39J1882k2199Q410J2987j6182J0009p151l117J9950
2042A3000j9198j144J2233j0712J2504p136j1946K1166r480l892Q235j2910J5742
2055F462j73j8441J5237m131j06Q672j7772J0795Q102j5853R945n766j48J5013
2069A1836j7774J727J0076j0178J0501p456o267J8093j1073k598O502r253J3480
2082G616l506j3072J4043m264j088N329j3272J1870L907j3485Q226m512J694R076
$$ plain form
2096 8562 -5915 -1374 5847 -3019 2985 -2587 -4136 8732 -1788 -3110 2380 -3871 4367 30
2110 30 -6556 5268 -19 -1864 1228 -5708 3563 3335 -5825 1503 -817 -748 3378 -5550 166 4082
2126 4082 -3210 953 -2163 -1976 5058 -2449 -1741 2770 -1850 1992 -954 -3612 4353 277 -1290
2141 -1290 1317 -2588 2250 1609 -3397 2660 622 -392 1884 -2963 761 2861 -1629 1414 165
2156 165 -758 2391 -1712 -190 2335 -687 1014 -342 -1412 2464 -356 -757 1122 -1247 465 120
2172 120 -1936 1197 441 -748 360 -1762 -668 356 -1245 440 -21 -1241 -37 -1552 -772 572
2188 572 -895 -287 -227 -1383 178 -1103 -876 534 -438 -184 -35 -1093 192 -88 -554 548 -269 37
2206 37 319 -511 486 701 106 626 39 -8 858 533 963 981 717 640 206 207 1041 1083 1265 1081 379 330 483
$$ packed form
2096H562j4477M541P221q866O004n572j549J2868j0520j322N490o251Q238m337
2110C0o586J1824n287j845L092o936R271k28r160P328k320O9M126q928N716L916
2126D082p292M163l116J87P034p507P08M511m620L842k946k658P965m076j567
2141a290K607l905M838o41n006O057k038j014K276m847L724K100m490L043j249
2156A65r23L149m103J522K525l022J701j356j070L876k820m01J879k369J712l45
2172A20k056L133p56j189J108k122J094J024j601J685m61j220J204j515P80J344
2188E72j467O08O0j156J561j281K27J410r72K54J49j058J285k80m66J102q17L06
2206C7K82q30R97K15n95N20n87m7Q66l25M30J8k64p7m34JQ34M2J82j84p02m9J53
$$ plain form
2229 483 731 1054 825 746 853 543 426 491 435 560 595 211 141 39 127 364 281 450 266 -283 -107 -93 7
2252 7 -69 -151 -356 -656 -1002 -485 -265 -297 -653 -909 -924 -1040 -886 -506 -652 -832 -832 -1270 -1057 -537 -497 883 -505
2275 -505 -808 -919 -1075 -322 -432 -731 -197 -379 -715 164 -970 -444 805 -395 553 -146 -747 1245 -219
2294 -219 1 1416 -209 830 518 -782 2109 472 356 1759 -472 1237 1172 -866 2029 671
2310 671 538 1517 -1587 990 1563 -184 1625 332 -184 2224 -1556 -75 2072 -899 2097 -482
2326 -482 -1681 2739 -1198 -437 1740 -1987 2125 -76 -3279 1942 -665 -495 1509 -3306 1042 1209
2342 1209 -3258 1629 -1310 -460 2522 -4248 -327 1849 -2686 2021 -1894 -2015 4420 -2836 -2200 1236
2358 1236 -2525 3430 -812 -4251 3695 -1176 -675 2107 -4206 3251 1747 -4323 2452 -1058 346
$$ packed form
2229D83K48L23k29p9J07l10j17O5n6J25L5l84p0j02Q8K37q3J69j84n49J76J4J00
2252Gp6q2k05l00l46N17K20l2l56k56j5j16J54L80j46j80%m38K13N20M0J380j388
2275e05l03j11j56P53j10k99N34j82l36Q79j134N26J249j200R48o99o01J992j464
2294b19K20J415j625J039l12j300K891j637j16J403k231J709o5k038K895j358
2310F71j33R79l104K577N73j747J809j293n16K408l780J481K147k971K996k579
2326d82j199M420l937P61K177l727M112k201l203N221k607J70K004m815M348J67
2342A209m467M887k939Q50K982o770L921K176m535M707l915j21O435p256O36L436
2358A236l761N955m242l439P946m871N01K782o313P457j504o070O775l510J404
$$ plain form
2373 346 3892 -5079 1358 3301 -3354 3070 -2006 -860 5936 -4092 -928 2677 -2406 4776 -1130
2388 -1130 -3798 5922 -2031 -843 1514 -4393 5073 1133 -5290 3321 -1519 429 2942 -6617 2748
2403 2748 3276 -4313 1865 -3199 -163 6231 -6074 -751 2384 -3298 3969 -3139 -4616 6727 -1935
2418 -1935 -1745 930 -4147 5453 -559 -6204 4301 -1090 445 1964 -6714 4178 4123 -5009 2220
2433 2220 -1719 1087 5797 -6606 387 4773 -2381 3117 -4549 -1942 8422 -2462 -893 1971
2447 1971 -1916 6191 -1388 -5489 6630 344 284 577 -5097 5951 4042 -5890 2182 -670 1840
2462 1840 4204 -7501 965 5754 -2337 1022 -3256 -975 7691 -4179 -3485 2787 -1259 3945 -2871
2477 -2871 -6383 6482 564 -3039 222 -4639 4682 2001 -8381 1496 1163 9 1553 -7765 1156
$$ packed form
2373C46L546q971O437J943o655O424n076J146O796j0028L164L605n083P182n906
2388a130k668R720p953J188K357n907R466l940o423Q611m840J948K513r559R365
2403B748N28p589O178n064L036O394j2305N323L135n682P267p108j477J1343q662
2418a935J90K675n077R600o012n645J0505n391J535J519q678J0892n5r132P229
2433B220l939K806M710j2403O993M386p154N498p666K607J0364j0884J569K864
2447A971l887Q107p579m101J2119o286o0K93n674J1048j909r932Q072k852K510
2462A840K364j1705Q466M789q091L359m278K281Q666j1870O94O272m046N204o816
2477b871l512J2865n918l603L261m861R321k681j0382R877l33j154J544r318Q921
$$ plain form
2492 1156 6181 -4769 -988 -2209 -334 6394 -6048 -4024 5269 -556 1830 -3414 -4836 8354
2506 8354 -329 -4696 1339 -1385 4898 841 -7991 4132 3624 -951 1310 -5090 3409 6413 -5963
2521 -5963 198 2167 799 5247 -5811 -1837 7824 -1381 108 -841 -2142 7949 -1571 -5389 4516
2536 4516 19 3264 356 -6837 5901 2607 -3805 1690 -3091 3348 4049 -7743 1530 2529 -1497
2551 -1497 3018 -5882 -456 6347 -4596 -779 -142 -1990 5444 -4440 -4403 4778 -2103 625 -1019
2566 -1019 -5215 5412 -777 -4868 2379 -2767 1962 1481 -7080 2538 1508 -2723 2088 -3839 926
2581 926 4695 -5533 425 1092 -1330 4274 -3577 -1679 5003 -2422 883 356 -2568 5649 -1101
2596 -1101 -3012 3827 -1481 2117 1513 -4026 3851 910 -1888 3061 -2140 2136 3284 -3725 2115
$$ packed form
2492A156N025j0950L781j221J875O728j2442K024R293n825K386n244j422J3190
2506H354q683m367O035k724O283m057q832J2123n08m575K261o400Q499L004j2376
2521e963O161J969j368M448j1058L974R661r205J489r49j301J0091r520l818R905
2536D516m497L245k908p193J2738l294o412N495m781O439P01j1792R273R99m026
2551a497M515q900N426O803j0943L817O37j848P434r884L7R181o881K728j644
2566a019m196J0627o189m091P247n146M729m81q561R618j030m231M811n927M765
2581I26L769j0228N958O67k422N604p851J898O682p425L305n27k924Q217o750
2596a101j911O839n308L598o04n539P877k941k798M949n201M276J148p009N840
$$ plain form
2611 2115 1078 -895 3266 -2587 38 3415 -2575 1170 355 -1453 3500 -1629 -1395 2401 -1761
2626 -1761 984 362 -2620 2475 -601 -1747 1321 -2145 833 902 -2901 1038 -531 -1617 836 -2410
2642 -2410 -279 1284 -2601 45 -352 -1201 1294 -1460 -1064 926 -1622 75 -294 -1607 1198 -727
2658 -727 -1110 546 -1175 408 536 -1239 958 -118 -442 712 -767 439 729 -548 585 211
2674 211 -102 740 -425 130 1114 -180 387 373 -81 1196 313 271 993 -224 253 377 -366 932 471
2693 471 319 555 38 319 741 -63 560 262 -197 441 76 -20 344 -167 62 -13 -278 7 -100 -27 8
2714 8 -373 -235 48 -145 -258 -235 -290 -25 -511 -372 -192 -337 74 -133 -170 -26 -357 -326 45 49 -77 72 -332
2737 -332 -4 -32 -357 70 -67 -98 309 -181 -220 84 17 280 -61 -29 72 -321 -112 88 -73 322 -306 -163
$$ packed form
2611B115j037j973M161n853K625L377n990L745q15j808M953n129K34L796m162
2626a761K745o22k982N095l076j146L068l466K978O9l803L939j569j086K453l246
2642b410K131J563l885K646l97q49K495k754L96J990k548J697l69j313K805j925
2658g27l83J656j721J583J28j775K197j076l24J154j479J206K90j277J133l74
2674B11l13Q42j165N55R84j294N67j4m54J277q83m2P22j217M77J24p43J298m61
2693D71j52K36n17K81M22q04O23k98m59O38l65r6L64n11K29p5k65K85j07P3L5
2714Hl81J38K83j93j13K3n5K65m86J39J80j45M11k07l7J44l31L1L71Mj26J49m04
2737c32L28k8l25M27j37l1M07m90l9L04o7K63l41L2J01l93K09K00j61L95o28J43
$$ plain form
2759 -163 199 -415 -66 10 -401 359 -267 -285 -263 -387 287 243 -532 -132 -163 -353 358 -483 -194 212 -696 146
2781 146 -465 -508 382 -558 -76 384 -409 -39 -130 -330 881 9 -326 228 -577 613 558 -603 916 -94
2801 -94 -168 884 -762 662 967 -483 930 112 -80 1627 -509 -57 1538 -415 1325 58 -671
2818 -671 2333 59 -127 1558 -822 1303 375 -1597 2024 476 -152 1253 -1588 831 1371 -1356
2834 -1356 1606 110 -560 2129 -2103 -370 1806 -2029 1968 -19 -974 2367 -1540 -1987 1423 -1219
2850 -1219 1464 -642 -3219 2291 -1314 -1959 510 -3705 885 957 -3701 884 -771 -1499 1957 -3900
2866 -3900 -261 3127 -2940 1002 -1250 -1426 4070 -2675 -1314 1819 -3032 2344 -1084 -3449 4115
2881 4115 -717 -1409 1709 -3061 3494 1956 -4314 2975 314 7 3369 -4427 1727 4380 -3018
$$ packed form
2759a63L62o14L49P6m11P60o26j8K2j24O74m4p75M00l1j90P11q41K89M06r08Q42
2781A46o11m3Q90r40M82M60p93L70r1k00J211q72l35N54q05J190n5j161J519j010
2801i4p4J052j646J424L05j450J413q18j92J707k136M52J595j953J740j267p29
2818f71L004k274j86J685k380K125r28j972L621j548o28J405k841K419N40k727
2834a356K962j496o70K689m232J733K176l835L997j987r55L341l907m47L410k642
2850a219K683k106k577N510l605o45K469m215M590P2m658M585j655p28L456n857
2866c900L639L388o067L942k252j76N496o745J361L133m851N376l428k365P564
2881D115m832o92L118m770O555j538o270P289k661l07L362p796O154K653p398
$$ plain form
2896 -3018 2173 -468 88 5981 -3745 -761 4285 -1466 3432 -1085 -2852 6629 -904 -1589 2409
2911 2409 -2075 4858 929 -5393 4733 584 -169 1947 -5389 3678 3809 -5325 1184 -869 707
2926 707 4479 -6368 -264 4430 -2904 1450 -3010 -1918 6538 -4091 -3004 1957 -2463 3739 -2482
2941 -2482 -5906 5315 -787 -2325 341 -4708 4486 1503 -7078 1713 -296 -45 2171 -7100 1475
2956 1475 4489 -4264 539 -2383 -370 6018 -5470 -2087 3848 -1601 2881 -2823 -3578 6928 -1007
2971 -1007 -2325 1247 -2421 5330 270 -5746 4090 1243 43 1469 -5114 3930 3767 -4391 1317
2986 1317 -511 1280 4541 -5186 -410 4430 -1771 1629 -2397 -1243 6188 -2370 -2391 2002 -1146
3001 -1146 3730 -1191 -4540 4579 492 -1444 796 -2976 3469 2383 -4890 1518 368 -60 2103
$$ packed form
2896c018N191k641N56N893r726K984N046n751M898m517j767R481p533o85L998
2911B409m484O933l929o322J0126m149p53K116p336R067J31r134O509k053J576
2926G07L772j0847O104M694p334M354m460J092Q456j0629J087M961m420O202o221
2941b482l424J1221o102j538K666n049R194k983q581Q791k009K51K216r271Q575
2956A475L014q753M803k922K013O388j1488L383N935n449M482n704p55J0506p935
2971a007j318L572l668P751n060o016R836k847j200J426o583R044j63q158N708
2986A317j828J791L261r727M776M840o201L400m026J154P431q558k1M393l148
3001a146M876m921l349R119m087j936K240l772O445j086p273O408j150m28K163
$$ plain form
3016 2103 -4663 566 4082 -2505 308 -1073 -1033 4217 -3102 -2213 2601 -1230 1822 -1118 -3093 4251
3032 4251 -108 -2202 1117 -2132 2444 1014 -3947 2056 723 -632 1367 -3263 1267 2896 -2856
3047 -2856 343 71 -438 3017 -2464 -1349 2830 -894 846 -373 -1939 3229 -455 -1976 1512
3062 1512 -1251 1508 640 -3189 1631 723 -1086 925 -2406 496 2203 -2902 25 423 -879 1754
3078 1754 -2036 -1082 1982 -1394 201 -430 -1980 2609 -948 -1762 1538 -1189 760 268 -2764 1640
3094 1640 511 -1406 952 -1376 686 1411 -2245 465 332 -600 1117 -1350 -288 2288 -1077 327
3110 327 467 -718 2021 -322 -607 1569 -419 840 637 -1134 1844 554 -999 827 -117 882
3126 882 1308 -1083 953 911 -276 1077 -694 109 1255 -969 415 656 -498 1195 -755 -509 1083
$$ packed form
3016B103o766N229L516o587K813j381M0N250p319Q89M814l831L052k940j975P344
3032D251m359k094L319l249M576j430m961O003j333j355J999m630M530J629n752
3047b856L199k72n09L455n481J115M179l724J740j219j566N168l684j521L488
3062A512k763K759q68l829M820r08j809K011l331K902J707n105K927L98j302K633
3078A754l790R54L064l376J595o31j550M589l557q14L300k727J949m92l032M404
3094A640j129j917K358k328K062P25l656K710j33r32J717k467J062K576l365J404
3110C27J40j185K739k343k85K176j988J259k03j771K978j290j553J826r44R99
3126H82M26k391K036m2j187J353j771Q03J146k224J384K41j154J693j950K46J592
$$ plain form
3143 1083 -784 -364 -46 -1061 969 -350 -1093 749 -474 -386 -66 -951 305 -147 -778 397 -824
3160 -824 -290 -40 -1158 -371 -53 -837 -93 -681 -624 187 -664 -335 -215 -671 149 -92 -580 -29 -363 -312
3180 -312 132 -187 172 29 -319 169 -45 -59 374 -99 156 -77 5 309 -78 438 661 257 792 -129 964
3201 964 386 30 229 572 100 432 517 283 654 313 103 583 69 37 336 83 268 75 -63 314 -159
3222 -159 -137 198 -238 159 -69 -316 119 -215 -325 82 -603 75 -88 -590 196 -427 -171 -128 -481 -374 -263
3243 -263 -549 34 -396 -361 90 -686 -197 92 -440 116 -46 -290 295 -317 108 338 -382 290 274 -196 589
3264 589 36 -82 519 -371 315 438 -312 663 89 -13 831 -354 275 539 -219 657 -170 -284 1206
3283 1206 -262 73 588 -302 695 64 -621 705 -347 -118 639 -1019 324 226 -882 484 -566
$$ packed form
3143A083j867M20L18j015K030j319p43J842j223Q8L20q85J256m52o31J175j221
3160h24N34K50j118P87L18p84P44n88N7Q11q51L29J20m56Q20k41m88N51l34N1
3180c12M44l19L59j43l48M88k14j4M33m73K55k33Q2L04l87N16K23m04N35r21J093
3201I64n78l56J99L43m72L32Q5k34L71l41k10M80n14l2K99k53J85j93j38L77m73
3222a59K2L35m36L97k28k47M35l34j10M07o85O78j63n02P86o23K56M3l53J07J11
3243b63k86N83m30L5M51p76M89K89n32N56j62k44N85o12M25K30p20O72j6m70P85
3264E89n53j18O01q90O86J23p50R75n74j02Q44j185O29K64p58Q76q27j14J490
3283A206j468L35N15q90R97o31o85J326j052K29P57j658J343r8j108J366j050
$$ plain form
3300 -566 -211 896 -1248 -135 584 -747 617 -862 -937 1051 -707 -438 142 -875 814 -107 -1758
3317 -1758 599 -360 -299 316 -1513 789 704 -1340 223 -231 48 1212 -1605 55 1253 -585 445
3334 445 -591 -615 2240 -746 -804 1117 -452 1457 -160 -1785 2244 519 -459 961 -1324 1908
3350 1908 1435 -2110 955 684 72 1656 -2335 599 2723 -1437 174 -375 -409 3097 -1722 -1492 2243
3367 2243 -449 975 -508 -2135 3166 -294 -1850 877 -1305 1564 593 -3880 1577 1045 -1090
3382 -1090 634 -3016 1006 2445 -3153 206 255 -484 2542 -3167 -1358 2953 -1727 384 -1025 -2129
3398 -2129 3854 -1421 -2552 1830 -784 1835 155 -4193 3360 952 -1805 1147 -2537 2079 2601
3413 2601 -4060 1023 1000 -305 2583 -3668 -84 4151 -2338 486 -95 -957 4798 -2105 -2206 3469
$$ packed form
3300e66L55J107k144J113P19j331J364j479p5J988j758K69N80j017J689r21j651
3317a758K357r59O1O15j829K302q5k044J563m54K79J164k817J660J198j838J030
3334D45j036k4K855k986n8J921j569J909j617j625M029j725r78J420k285L232
3350A908m73l545L065k71o12J584l991K934K124m160J611n49l4L506m819K30L735
3367B243k692J424j483j627N301l460j556K727k182K869r71m473N457n32k135
3382a090J724l650M022J439n598L359M9p39L026n709J809M311m680K111j409j104
3398b129N983n275j131M382k614K619j680m348P553k408k757K952l684M616N22
3413B601o661N083k3j305K888o251L584M235o489K824n81q62N755o903j01N675
$$ plain form
3429 3469 -774 1637 -366 -3285 4330 258 -2293 1804 -2047 2502 1644 -4748 2245 946 -877
3444 -877 2210 -3846 965 3613 -3851 526 -46 -1308 3746 -3359 -1819 3488 -2095 775 -1093
3459 -1093 -3215 4592 -1069 -2945 1907 -1974 2147 493 -4736 2638 498 -1673 1752 -3341 1567
3474 1567 2885 -4068 1217 147 -851 3488 -3302 -638 3480 -2140 972 -665 -1813 4673 -1350
3489 -1350 -1930 2567 -1354 2339 285 -3412 3615 588 -1685 1877 -2562 2160 2569 -3824 1768
3504 1768 860 -301 2627 -3180 737 3473 -2374 694 -392 -1047 3562 -2081 -1331 2623 -1090 1236
3520 1236 -552 -3189 3137 -328 -1758 935 -2033 1754 900 -3660 1420 319 -868 1029 -3201
3535 -3201 352 2175 -2722 491 -457 -684 2284 -2524 -1039 2062 -1350 262 -974 -1569 2599 -665
$$ packed form
3429C469m243K411k003k919P615m072k551M097l851M549q58o392O993j299j823
3444h77L087o056M811K648p464M377n72j262N054p105J540N307n583K870j868
3459a093k122P807n661j876M852l881M121j654n229P374k140k171L425n093M908
3474A567J318o953N285j070r98M339o790K664M118n620L112j637j148O486o023
3489a350n80M497l921L693k054l697P027l027k273L562m439M722M09o393N592
3504A768r08j161K928n807L917K736n847L068j086o55M609n643P50L954l713K326
3520A236j788k637O326l465j430K693k968L787q54m560N080j101j187J897m230
3535c201L553J823m897L213r48k27K968m808J485L101l412J612j236n95M168l264
$$ plain form
3551 -665 -1867 1422 -1001 1365 208 -2620 1767 443 -873 600 -1385 1238 1580 -2065 529
3566 529 415 -126 1539 -1465 -18 2022 -688 583 70 -303 1869 -761 -801 1548 -289 1007 608
3583 608 -1205 1799 319 -1113 902 -440 736 1023 -958 742 615 -228 221 -820 221 1239
3599 1239 -1026 175 326 -383 714 -877 -715 925 -642 -314 92 -828 915 -37 -1006 462 -571
3616 -571 -29 124 -1127 224 27 -615 110 -181 -319 528 -941 186 194 -874 -21 -433 -257 468 -180
3635 -180 -39 37 -36 360 -183 -303 448 -44 58 118 -287 478 103 -307 560 -8 67 60 -140 289 60 -172
3657 -172 321 166 30 68 53 213 342 -166 362 145 -58 32 -125 -179 229 -192 -55 42 -42 -18 -170 -184 -85
3680 -85 -213 70 -19 -360 -208 -4 -30 135 -94 -470 -8 -150 -44 64 -85 308 -85 -168 -181 -162 -300 195
$$ packed form
3551f65j202L289k423K366j157k828M387j324j316J473j985K623L42l645K594
3566E29j14n41J665l004J447K040k710J271n13l73K172k630m0K349j837J296l99
3583F08j813L004j480j432K015j342J176K87j981J700j27q43M49j041J041J018
3599A239k265J201J51p09J097j591J62J640j567L28M06r20J743r52r69J468j033
3616e71N42J53j251J351j97o42P25k91j38Q47j469J127Qj068Q53m12J76P25o48
3635a80J41P6p3L96n43j20P51m92J02O0m05P65l75m10Q67n68P5pk00M29k29k32
3657a72M93j55j36L8j5J60J29n08N28k17k03R0j57n4M08m21J37R7q4K4j52j4R9
3680h5j28K83q9l41J52K04k6J65k29l76M62j42J06J08j49L93l93q3j3J9j38M95
$$ plain form
3702 195 -229 294 -92 -175 211 -171 -16 243 95 312 -153 119 355 198 180 204 109 275 428 17 307
3723 307 -76 370 501 -7 127 42 -39 56 -323 -76 500 -256 211 -114 -343 250 -207 -389 168 -333 275
3744 275 -140 -503 273 -251 -267 129 -576 -189 160 -721 -67 -369 -465 205 -965 -133 27 -829 28 -533
3764 -533 -412 608 -897 -281 446 -607 119 -192 -732 891 -460 -312 487 -569 599 376 -978
3781 -978 630 109 -102 754 -1108 673 782 -874 777 209 -183 1282 -1084 479 1267 -724 887
3798 887 73 -464 1888 -791 -179 883 -490 1141 233 -911 1726 69 -300 587 -1076 835 599
3815 599 -1491 776 33 -69 882 -1901 75 1544 -1091 566 -562 -680 1851 -1591 -907 1065
3831 1065 -918 430 -756 -1816 1705 -717 -900 387 -1303 1132 134 -2393 968 264 -322 317
$$ packed form
3702A95m24N23l86q3L86l82J55K59j48K17m65K72K36j57j8K4r5J66J53m11K90
3723C07l83M46J31n08J34q5q1R5l79K47N76p56M67l25k29N93m57j82N57n01O08
3744B75m15l63P76n24j6L96p05L87L49q81O54l02r6O70j170Q32J60q56Q57n61
3764e33J21J020j505O16P27j053P26l11n40J623j351J48P99j056J168k23j354
3781i78J608n21k11Q56j862J781J09j656J651n68l92J465k366J563P88j991J611
3798H87q14n37K352k679O12J062j373J631r08j144K637j657l69Q87j663J911k36
3815E99k090K267p43j02R51k783J976J469k635J657j128j18K531l442O84J972
3831A065j983J348j186j060L521k422j83J287j690K435r98k527L361p04n86O39
$$ plain form
3847 317 -2037 594 1422 -1784 557 -430 -197 2038 -1987 -366 1558 -754 859 -785 -1244 2497
3863 2497 -752 -969 1219 -730 1487 229 -2097 1771 430 -367 824 -1756 1460 1496 -2120 556
3879 556 257 148 1740 -2479 -188 2201 -816 335 -617 -914 2701 -1231 -1424 1353 -501 1199
3895 1199 -362 -2333 2242 634 -1301 676 -1654 1295 1203 -2912 755 494 -409 1097 -2548 -147
3911 -147 2321 -1902 -313 -202 -887 2260 -1672 -1890 1809 -732 670 -561 -2285 3021 141 -2043
3927 -2043 827 -1096 1527 1195 -3356 1385 1234 -823 965 -2097 693 2978 -2001 -89 447 -437
3943 -437 2564 -1716 -1284 3004 -616 70 -99 -1634 3381 -190 -1966 1627 -406 1260 784 -3161
3959 -3161 2096 1121 -1329 955 -1946 1131 2178 -3230 348 1027 -545 1758 -2654 -1136 3272
$$ packed form
3847C17k354K631Q28l206K341r87K33K235m025J621J924k312J613j644m59L741
3863B497l249k17K188j949K217j258k326L868j341p97J191k580L216L6l616K676
3879E56k99j09J592m219K291K389l017J151r52k97L615l932j93K777j854J700
3895A199j561j971M575j608j935J977k330K949r2m115L667k61r03J506l645K401
3911a47K468m223J589J11o85L147l932k18L699k541J402j231j724N306k880k184
3927b043K870j923K623l32m551M741j51k057J788l062K790K285m979J912N36q84
3943d37L001m280M32M288l620O86j69j535N015l571j776L593k033J666m76l945
3959c161N257r75k450K284k901L077J047n408L578O79j572K303m412J518M408
$$ plain form
3974 3272 -1394 -494 -185 -1534 2781 -1326 -2189 1956 -668 742 -104 -2977 2334 411 -2073 713
3990 713 -1592 917 1457 -3208 1050 1049 -1033 1127 -2078 -11 2643 -2225 -236 329 -1024 2353
4006 2353 -1734 -1419 2492 -993 525 312 -1630 2987 104 -1864 1602 -881 1056 977 -2446 1775
4022 1775 1046 -825 971 -1155 780 2054 -1772 530 872 -621 1695 -1266 -352 2105 -1196 100
4038 100 229 -1134 2105 -785 -1237 1751 -449 515 522 -1621 1482 282 -992 673 -1071 227 842
4055 842 -1934 409 220 -833 722 -1624 -266 1102 -1438 -21 -5 -914 1003 -955 -829 1252
4071 1252 -813 -75 -39 -1271 852 -327 -968 728 -284 292 441 -981 540 180 -568 561 -227
4088 -227 -17 796 -520 92 260 -775 699 -399 -171 755 -282 200 307 -367 973 -187 -258 550
$$ packed form
3974C272m666R00L09j349M315m107q63M145k624J410q46k873N311j923k484K786
3990G13k305K509N40m665M258jk082K160l205K067K654m868J989N65j353L377
4006B353m087L15L911l485J518k13j942M617k883j968L466k483J937p9l423M221
4022A775p29j871J796k126J935J274l826K302L42j493K316k961R14K457l301J296
4038A00J29j363L239k890m52K988k200R64Pk143L103j200j274J665j744J298O15
4055H42k776K343j89j053J555k346J358J368k540J417J6r09J917j958J26K081
4071A252k065P38L6j232K123j179o41J696j012N76J49j422J521l60p48J129p88
4088b27K10Q13j316O12J68j035J474j098K28R26j037M82J07o74J340j160p1Q08
$$ plain form
4106 550 -230 259 160 -537 451 194 -249 478 -99 112 681 -512 316 235 -478 222 -126 36 13 -261 221
4127 221 -97 -407 449 -209 -272 39 -228 -313 41 -194 30 -223 29 163 -200 141 387 -283 235 348 -396
4148 -396 -45 -293 -12 332 -113 -112 73 -284 249 -38 -149 72 -60 -485 149 -74 -21 166 411 134 251
4169 251 -165 607 166 172 225 385 90 300 331 10 90 202 -128 -185 290 44 561 71 351 -92 -55 422
4191 422 -615 405 -94 -185 244 -417 -228 -288 45 -161 -101 135 -362 -155 -145 -295 -180 -44 -563 -395 -23
4212 -23 -430 -2 -259 8 200 -529 -6 123 -421 249 -373 -208 -84 217 -189 420 -300 -105 -293 -139
4232 -139 741 -567 28 -50 94 638 5 -298 712 -37 148 217 -367 692 372 -200 326 -137 413 374
4252 374 -337 367 411 -275 502 -194 -111 529 -333 0 -23 -509 657 -353 -655 713 -572 366 -46 -886
$$ packed form
4106E50p80M89r9o97R88k57m43P27n77K11N69j193Q28q1p13P00l48J62k3k74M82
4127B21l18l10Q56o58o3L11k67q5L54k35K24k53K52J34l63L41K46o70N18J13p44
4148c96L51k48K81L44m45JJ85l57N33k87j11K21j32m25O34k23N3J87K45k77J17
4169B51m16P72m41ON3J60k95K10L1l21Q0J12l30n7M75k46N17m90K80m43L7M77
4191D22j037J020m99r1M29o61J89o0L33k06O0K36m97K07J0j50J15J36n19J68L72
4212b3m07M28k57K67J92p29N23J29n44O70o22J65J24L01m06O09p20J95j88J54
4232a39Q80j308N95p8J44N44o33l03J010p49J85O9n84J059l20n72N26m63N50l9
4252C74p11P04M4o86P77o96Q3O40q62L33k3m86J166j010l02J368j285R38m12q40
$$ plain form
4272 -886 515 -216 -493 298 -991 140 581 -1218 58 -43 -500 513 -1163 -500 928 -550 24
4289 24 -256 -599 926 -612 -860 810 -813 287 177 -1026 1121 105 -881 704 -650 605 657
4306 657 -1320 443 447 -234 1137 -1017 -13 1450 -801 514 -75 -541 1394 -787 -590 1428 -610
4323 -610 653 128 -1310 1938 -139 -721 675 -1031 1052 491 -1957 1379 325 -462 676 -1719
4339 -1719 617 1749 -1839 504 -70 -435 1641 -1822 -594 1600 -1094 375 -563 -1327 2054 -968
4355 -968 -1219 805 -995 883 67 -2308 1601 23 -1122 588 -1796 915 981 -2545 511 221
4371 221 -531 1541 -2114 -363 1897 -1529 469 -406 -919 2477 -1351 -1264 1595 -509 1122 -290
4387 -290 -1978 2476 182 -1059 973 -1252 1571 1065 -2274 954 645 -136 1310 -1783 566 2136
$$ packed form
4272h86J401p31k77P91j289J131M41j799J276j01m57J013j676O63J428j478N74
4289B4k80l43J525j538k48J670j623J100j10j203K147j016r86J585j354J255N2
4306F57j977J763Mo81J371k154J004J463k251J315n89m66J935k181J97K018k038
4323f10J263n25j438L248k077n82J396j706K083n61k448L336j054p87J138k395
4339a719K336J132l588K343n74l65K076l463J228K194k694J469r38p64L381l022
4355i68k51K024j800J878q16k375L909j578j145J710k384K711O6l526L056k90
4371B21p52K072l655J751K260l426J998q75n13L396l828Q7K859k104J631j412
4387b90j688M454k294j241K032k225K823n06l339L228l09p81J446l093K349J570
$$ plain form
4403 2136 -1589 325 -112 -64 2083 -1689 -890 1934 -387 479 -303 -1353 2613 -588 -1435 1025 -798
4420 -798 1211 359 -2579 1579 452 -921 584 -1560 687 1471 -2325 261 294 -435 1416 -2237
4436 -2237 -697 2291 -1223 122 -366 -1134 2118 -1115 -1563 1287 -654 1078 21 -2158 1803 542
4452 542 -1272 350 -1028 1046 1319 -2368 316 1049 -205 933 -1796 -3 2331 -1241 82 -78
4468 -78 -399 1778 -1142 -1181 1766 -328 418 250 -1667 1977 293 -1297 626 -528 893 743 -1992
4485 -1992 772 858 -836 642 -1044 279 1556 -1372 176 156 -403 1177 -1135 -986 1504 -752
4501 -752 -252 72 -1195 1492 -17 -1382 986 -472 317 53 -1699 864 427 -1109 337 -907
4517 -907 66 1228 -1464 76 202 -551 593 -746 -549 1288 -728 -11 7 -774 1026 -184 -891
$$ packed form
4403B136l725J914m37M8K147l772P99K824k321Q66p82j050L966l201q47K460j823
4420g98K009q52k938M158j127j373J505k144K247P84l796K586L3p29J851l653
4436b237J540K988l514J345m88p68L252l233m48K850j941J732j057k179L961j261
4452E42j814J622j378K074K73l687K684P33j254J138k729J793K334l572J323j60
4468g8l21K177k920l9K947k094P46j68j917L644j684j590J923j154J421j50k735
4485a992K764Q6j694J478j686J323J277k928J548k0n59J580k312J49K490k256
4501g52N00L24j267K687j509j365K368j458P89k64j752K563m37j536J446j244
4517i07R73J162k692J540J26p53J144j339J97J837k016P17J8p81J800j210p07
$$ plain form
4534 -891 1265 -156 53 7 -889 1153 255 -670 459 -456 556 907 -992 655 493 -548 710
4551 710 -563 -12 891 -929 -40 351 -356 658 -205 -617 800 -470 -95 85 -701 703 21 -557
4569 -557 438 -79 25 122 -746 266 165 -602 405 -537 -28 533 -691 -91 332 -123 265 -369 -164
4588 -164 611 -425 -267 -37 -285 334 -259 -343 258 51 47 305 -215 221 223 -353 69 170 281 329 -391 248
4610 248 442 -94 246 106 176 438 193 74 541 -24 332 156 114 383 -156 226 287 17 368 260 -101
$$ packed form
4534h91K156j421K09m6q96K042q98r25J129r15J012L51j899J647j62j041J258
4551G10j273N51R03j820Q89L91p07J014q63m12J417j270L75J80p86J404o82n78
4569e57R95n17J04R7q68J012j01p67J007r42N09N61j224O00M23m55L88o34K05
4588a64P75j036J58K30k48O19n93q4O01k07mK58n20M36Kn76M22J01J11M8p20O39
4610B48J94n36L40j40P0K62k45j19M67n65L56j76m2K69n39L82O1k70L51j08l61
$$ [...]
8191a43
##END NTUPLES=NMR FID
##END=
