##TITLE=1H_LR-729-B2-C1
 CDCl3, 8 sc, 
 17.12.2020
##JCAMPDX= 6.0         $$ Bruker NMR JCAMP-DX V2.0
##DATA TYPE= NMR FID
##DATA CLASS= NTUPLES
##ORIGIN= UXNMR, Bruker Analytische Messtechnik GmbH
##OWNER= root
$$ XWIN-NMR		Version 3.5
$$ Thu Dec 17 10:22:33 2020 Russian Standard Time (UT+4h)  she@DPX200
##.OBSERVE FREQUENCY= 200.1315066352
##.OBSERVE NUCLEUS= ^1H
##.DELAY= (6, 6)
##.ACQUISITION MODE= SIMULTANEOUS
##.ACQUISITION SCHEME= undefined
##.AVERAGES= 8
##.DIGITISER RES= 18
##SPECTROMETER/DATA SYSTEM= spect
##.PULSE SEQUENCE= zg30
##.SOLVENT NAME= CDCl3
##.SHIFT REFERENCE= (INTERNAL, CDCl3, 0, 15.7039)
##AUDIT TRAIL= $$ (NUMBER, WHEN, WHO, WHERE, WHAT)
$$ ##TITLE= Audit trail, XWIN-NMR		Version 3.5
$$ ##JCAMPDX= 5.01
$$ ##ORIGIN= Bruker BioSpin GmbH
$$ ##OWNER= she
$$ F:/spectra/data/she/nmr/H-F/1/audita.txt
$$ ##AUDIT TRAIL=  $$ (NUMBER, WHEN, WHO, WHERE, WHAT)
(   1,<2020-12-17 10:21:32.04 +0400>,<she>,<DPX200>,
      <created by zg, POWCHK disabled, PULCHK disabled
       configuration hash MD5:
       00 E9 B6 7A A2 85 ED C7 34 08 36 98 17 FE 4E 26
       data hash MD5: 16K
       B4 64 57 F5 B3 2C 43 BA 07 D1 ED B4 74 E5 5B 5F>)
$$ ##END=
$$ 
$$ hash MD5
$$ A3 FD 3B FB AE 22 2B B5 16 71 84 8F 7F 82 24 46
##$RELAX= 
##$RELAX= 
##$RELAX= 
##$RELAX= 
##$RELAX= 
##$RELAX= 
$$ Bruker specific parameters
$$ --------------------------
##$DU= <F:/spectra>
##$EXPNO= 1
##$NAME= <H-F>
##$PROCNO= 1
##$TYPE= <nmr>
##$USER= <she>
##$AMP= (0..31)
100 100 100 100 100 100 100 100 100 100 100 100 100 100 100 100 100 100 
100 100 100 100 100 100 100 100 100 100 100 100 100 100 
##$AQSEQ= 0
##$AQ_mod= 1
##$AUNM= <au_zg>
##$AUTOPOS= <>
##$BF1= 200.13
##$BF2= 200.13
##$BF3= 200.13
##$BF4= 200.13
##$BF5= 200.13
##$BF6= 200.13
##$BF7= 200.13
##$BF8= 200.13
##$BYTORDA= 1
##$CFDGTYP= 0
##$CFRGTYP= 5
##$CHEMSTR= <none>
##$CNST= (0..31)
1 1 145 1 1 1 1 1 1 1 1 1 1 1 1 1 1 1 1 1 1 1 1 1 1 1 1 1 1 1 1 1 
##$CPDPRG= <>
##$CPDPRG1= <>
##$CPDPRG2= <>
##$CPDPRG3= <>
##$CPDPRG4= <mlev>
##$CPDPRG5= <mlev>
##$CPDPRG6= <mlev>
##$CPDPRG7= <mlev>
##$CPDPRG8= <mlev>
##$CPDPRGB= <>
##$CPDPRGT= <>
##$D= (0..31)
0 1.2 0 0 0 0 0 0 0 0.06 0 0.03 0 0 0 0 0.0002 0 0 0 0 0 0 0 0 0 0 0 0 
0 0 0 
##$DATE= 1608186091
##$DBL= (0..7)
120 120 120 120 120 120 120 120 
##$DBP= (0..7)
150 150 150 150 150 150 150 150 
##$DBP07= 0
##$DBPNAM0= <>
##$DBPNAM1= <>
##$DBPNAM2= <>
##$DBPNAM3= <>
##$DBPNAM4= <>
##$DBPNAM5= <>
##$DBPNAM6= <>
##$DBPNAM7= <>
##$DBPOAL= (0..7)
0.5 0.5 0.5 0.5 0.5 0.5 0.5 0.5 
##$DBPOFFS= (0..7)
0 0 0 0 0 0 0 0 
##$DE= 6
##$DECBNUC= <off>
##$DECIM= 32
##$DECNUC= <off>
##$DECSTAT= 4
##$DIGMOD= 1
##$DIGTYP= 9
##$DL= (0..7)
0 120 120 120 120 120 120 120 
##$DP= (0..7)
150 150 150 150 150 150 150 150 
##$DP07= 0
##$DPNAME0= <>
##$DPNAME1= <>
##$DPNAME2= <>
##$DPNAME3= <>
##$DPNAME4= <>
##$DPNAME5= <>
##$DPNAME6= <>
##$DPNAME7= <>
##$DPOAL= (0..7)
0.5 0.5 0.5 0.5 0.5 0.5 0.5 0.5 
##$DPOFFS= (0..7)
0 0 0 0 0 0 0 0 
##$DQDMODE= 0
##$DR= 18
##$DS= 0
$$ [...]
##$SUBNAM2= <"">
##$SUBNAM3= <"">
##$SUBNAM4= <"">
##$SUBNAM5= <"">
##$SUBNAM6= <"">
##$SUBNAM7= <"">
##$SUBNAM8= <"">
##$SUBNAM9= <"">
##$SW= 16.9725356469052
##$SWIBOX= (0..15)
0 0 2 0 0 0 0 0 0 0 0 0 0 0 0 0 
##$SW_h= 3396.73913043478
##$TD= 16384
##$TD0= 1
##$TE= 0
##$TE2= 300
##$TE3= 300
##$TEG= 300
##$TL= (0..7)
0 120 120 120 120 120 120 120 
##$TP= (0..7)
150 150 150 150 150 150 150 150 
##$TP07= 0
##$TPNAME0= <>
##$TPNAME1= <>
##$TPNAME2= <>
##$TPNAME3= <>
##$TPNAME4= <>
##$TPNAME5= <>
##$TPNAME6= <>
##$TPNAME7= <>
##$TPOAL= (0..7)
0.5 0.5 0.5 0.5 0.5 0.5 0.5 0.5 
##$TPOFFS= (0..7)
0 0 0 0 0 0 0 0 
##$TUNHIN= 0
##$TUNHOUT= 0
##$TUNXOUT= 0
##$USERA1= <user>
##$USERA2= <user>
##$USERA3= <user>
##$USERA4= <user>
##$USERA5= <user>
##$V9= 5
##$VALIST= <valist>
##$VCLIST= <CCCCCCCCCCCCCCC>
##$VD= 0
##$VDLIST= <DDDDDDDDDDDDDDD>
##$VPLIST= <PPPPPPPPPPPPPPP>
##$VTLIST= <TTTTTTTTTTTTTTT>
##$WBST= 1024
##$WBSW= 4
##$XGAIN= (0..3)
0 0 0 0 
##$XL= 0
##$YL= 0
##$YMAX_a= 307947
##$YMIN_a= -146455
##$ZGOPTNS= <>
##$ZL1= 120
##$ZL2= 120
##$ZL3= 120
##$ZL4= 120
##$ABSF1= 10
##$ABSF2= 0
##$ABSG= 5
##$ABSL= 3
##$ALPHA= 0
##$AQORDER= 0
##$ASSFAC= 0
##$ASSFACI= 0
##$ASSFACX= 0
##$ASSWID= 0
##$AUNMP= <proc_1d>
##$AZFE= 0.1
##$AZFW= 0.1
##$BCFW= 1
##$BC_mod= 2
##$BYTORDP= 1
##$COROFFS= 0
##$CY= 11.3945322036743
##$DATMOD= 1
##$DC= 2
##$DFILT= <>
##$DTYPP= 0
##$F1P= 15.9154993809931
##$F2P= -4.1035820241983
##$FCOR= 0.5
##$FTSIZE= 0
##$FT_mod= 4
##$GAMMA= 1
##$GB= 0.15
##$INTBC= 1
##$INTSCL= 1
##$ISEN= 128
##$LB= 0.24
##$LEV0= 0
##$LPBIN= 0
##$MAXI= 10000
##$MC2= 0
##$MEAN= 0
##$ME_mod= 0
##$MI= 1.114404
##$NCOEF= 0
##$NC_proc= 0
##$NLEV= 6
##$NOISF1= 3.799351
##$NOISF2= 2.8
##$NSP= 1
##$NTH_PI= 0
##$NZP= 0
##$OFFSET= 15.70392
##$PC= 1
##$PHC0= -10757.13
##$PHC1= 6.600941
##$PH_mod= 1
##$PKNL= yes
##$PPARMOD= 0
##$PSCAL= 0
##$PSIGN= 0
##$REVERSE= no
##$SF= 200.130013532006
##$SI= 16384
##$SIGF1= 3
##$SIGF2= 2
##$SINO= 400
##$SIOLD= 16384
##$SREGLST= <1H.CDCl3>
##$SSB= 0
##$STSI= 0
##$STSR= 0
##$SW_p= 3612.71676300578
##$SYMM= 0
##$S_DEV= 0
##$TDeff= 0
##$TDoff= 0
##$TI= <>
##$TILT= no
##$TM1= 0
##$TM2= 0
##$TOPLEV= 0
##$USERP1= <user>
##$USERP2= <user>
##$USERP3= <user>
##$USERP4= <user>
##$USERP5= <user>
##$WDW= 1
##$XDIM= 8192
##$YMAX_p= 0
##$YMIN_p= 0
$$ End of Bruker specific parameters
$$ ---------------------------------
##NTUPLES= NMR FID
##VAR_NAME=  TIME,          FID/REAL,        FID/IMAG
##SYMBOL=    X,             R,               I
##VAR_TYPE=  INDEPENDENT,   DEPENDENT,       DEPENDENT
##VAR_FORM=  AFFN,          ASDF,            ASDF
##VAR_DIM=   8192,          8192,            8192
##UNITS=     SECONDS,       ARBITRARY UNITS, ARBITRARY UNITS
##FACTOR=    0.0002944,     1,               1
##FIRST=     0,             0,               0
##LAST=      2.4114304,     0,               0
##MIN=       0,             -146455,         0
##MAX=       2.4114304,     307947,          0
$$ Real data points
##PAGE= N=1
##DATA TABLE= (X++(R..R)), XYDATA
0@%%%%%%%%%%%Qj6J6j6K2l0L2m0M8n6P2q8J04j20J39j63J90k20K52k86L26l71
33a97M19m73N34o00O72p51Q37r30J034j150J274j409J556j715J891k085K297k529
51a325K786l071L387l743M144m599N123n730O445p305Q356r677J1397j3733J7101
66I556k2395L1946n4376K00068J43148l40164J19961K3301j02776R2134R9253
77A99656p1299r446M7760k9588r4301O5749N8362m9778L0279R101p4885J981j6830
90F6761M0123R0268o4687o9124M9450n9549m1575Q6865J3672j5951j660m9145
102D5448m1086k63N9934N956o0266L1158L056q2275J1894K3245K299K7296l5219
115h823j9081j4493l7122M0294J5398j5720K2271l5474m6280K1208J0319L874
$$ plain form
0 0 0 0 0 0 0 0 0 0 0 0 0 8 -8 8 -8 14 -16 16 -24 24 -32 40 -48 56 -64 75 -88 102 -118 134 -152 174 -197
33 -197 222 -251 283 -317 355 -396 441 -489 545 -605 669 -740 816 -899 992 -1093 1204 -1325
51 -1325 1461 -1610 1777 -1966 2178 -2421 2702 -3028 3417 -3888 4468 -5209 6188 -7545 9556
66 9556 -12839 19107 -35269 164799 307947 -32217 87744 111045 8269 100403 199656
77 199656 128357 118911 166671 137083 42782 108531 166893 117115 147394 156495 81610 83591 66761
90 66761 106884 197152 132465 63341 112791 53242 11667 98532 112204 96253 94593 45448
102 45448 4362 4099 64033 69989 9723 40881 43937 -38338 -26444 -3199 -900 26396 -8823
115 -8823 -27904 -42397 -79519 -39225 -23827 -39547 -17276 -52750 -99030 -77822 -67503 -63629
127f3629R734p80k37l8415j9893L2082P842J0955J4415l8228j5775K0205p068
140h8792J0828K1682P84r655k7427J1420J7547j3550L2843J5601l3531M728j829
153e9351j4587L1099K7074J601j8749j2950J6572o644O802L9165n090j5414L591
166f881o907J845J4462J7154J1448j4816m641M167j6066J6361L5718o070j3123
179C2651K158r317o071J1939K3966N558j6789K192n886j8046K0992J9883q126
192E5104j4k142j2295j1746O910K6774k695j2437O318j9605j5907J9734J2671
205E0670k621k115m045j3258j6665R785J6970q826L939M312k7092j3596J2522
218I980Q905pk67j314j6907j7179J2303P932q689J4257m57k9243q500P912N004
$$ plain form
127 -63629 -53895 -54675 -54912 -93327 -113220 -81138 -73296 -62341 -47926 -86154 -101929 -81724 -88792
140 -88792 -77964 -56282 -55498 -65153 -92580 -81160 -63613 -77163 -44320 -28719 -62250 -57522 -59351
153 -59351 -73938 -42839 -15765 -14164 -32913 -45863 -29291 -35935 -29133 10032 4942 -10472 -6881
166 -6881 -13788 -11943 2519 19673 31121 16305 11664 15831 -235 16126 51844 45774 32651
179 32651 34809 25492 19421 31360 55326 60884 44095 46287 40401 22355 43347 63230 55104
192 55104 55090 52948 40653 28907 35817 62591 59896 47459 53777 34172 18265 37999 50670
205 50670 48049 45934 41889 28631 11966 21751 38721 29895 33834 38146 11054 -2542 9980
218 9980 18885 18878 18611 17297 390 -16789 -4486 3446 -5243 9014 8557 -20686 -29186 -21274 -16270
233a6270K624O389p64k2737j0729J4654k747l188J8153n074j7820m383N93J787
247c9512K405J4604K122k1286m241P254q148Q163K0674l895j1897p591j484L087
261c9745R045J8868l903j9541M498N189m436J1061J0223l755r30m48J96o011M540
276a5149K1885L20q493K888n136o027J3862J4273J120o437j861p00q528J2775
290A4792K0066q930n416K933p822r01J2163P383k847m470L093m018j1279J1092
304B5839R543n620M179j204j3745n948P968J0181p72l516P03j4612r998J5976
318A8974N294n045L093o239j3113l421Q012M902n055K212J893j6338o212Q856
332b187j676J935P928m870j3657q021O193M450n47R665k191j9929k131P403k248
$$ plain form
233 -16270 -13646 -7257 -8021 -30758 -41487 -26833 -29580 -32768 -14615 -19689 -37509 -41892 -41299 -39512
247 -39512 -37107 -22503 -20381 -41667 -45908 -38654 -46802 -38639 -17965 -21860 -33757 -41348 -42832 -39745
261 -39745 -30700 -11832 -15735 -35276 -30778 -25589 -30025 -18964 -8741 -12496 -13426 -13874 -13678 -19689 -15149
276 -15149 6736 7056 -1437 1451 -3685 -9712 4150 18423 19543 13106 11245 10545 2017 14792
290 14792 34858 25928 20512 23445 15623 14722 26885 34268 31421 26951 30044 26026 14747 25839
304 25839 35382 29762 33941 32737 18992 13044 21012 31193 30421 26905 27608 12996 2998 18974
318 18974 24268 19223 22316 16077 2964 -457 7555 12457 7402 9614 11507 -4831 -11043 -2187
332 -2187 -3863 -1928 6000 1130 -12527 -20548 -14355 -9905 -10452 -787 -2978 -22907 -25038 -17635 -19883
347a9883O068Q681m670j1681l161M620k544L260J3989l746j1883J533j337k636
361b3390Q095J0064L71r628k547J888m849P248J4416m235p420K332k281n045P177
376g804J3093k355p667M826k604q927J1173R321o132J141K661p012m640Q077P613
391A0764l562N88L121q207m519Q908M203j401J56n4l161n700N404O789n807J114
407H636M656q256m146Q192K231n087J994L774o703o088R130L4n845P158rr593
423G8P00N616n72j168Q47J192o087k949Q966l093l075N813l021n342M78K820Q24
440B027j262K650k97q507Q63Q390o549Q60M799m728k581j82J047J150j19L792
456A353k333q110M790K280n546N247K485n460j591n94J664l4K44O442n681o266
$$ plain form
347 -19883 -13815 -5134 -9804 -21485 -24646 -20026 -22570 -19310 -5321 -9067 -20950 -19417 -20754 -23390
361 -23390 -15295 -5231 -4860 -14488 -17035 -15147 -19996 -12748 1668 -2567 -9987 -7655 -9936 -14981 -7804
376 -7804 5289 2934 -4733 93 -2511 -11438 -265 9056 2924 4065 6726 -286 -4926 3151 10764
391 10764 7202 7790 10911 2704 -1815 7093 11296 9895 10051 9997 6836 1136 6540 13329 7522 8636
407 8636 13292 5036 890 9082 11313 6226 8220 11994 5291 -797 8333 8367 2522 9680 9671 78
423 78 778 6394 5822 4654 5501 6693 606 -2343 6623 3530 455 6268 3247 -2095 -1617 1203 2027
440 2027 765 3415 3118 -5389 -4526 3864 -2685 -1825 2974 -1754 -4335 -4517 -3470 -2320 -2439 1353
456 1353 -980 -9090 -4300 -2020 -7566 -2319 166 -5294 -6885 -7479 -5815 -5849 -5605 837 -4844 -11110
472a1110P147l626k991R085m10n014O72o66l62r12L496N882p633l66L475m739
488h072Q26O551j178j7j482n4K78m229P075N108o477J205K626p050K248P719m83
505D594j697n8Q32l351j520R231j215m157N892k259o015M332K580r07J381Q62
521H525K22n177j779O878j041q23M679m439n274J356L737K48j579K626o01q261
537g03K699N467o511R22N774m500m132K108P0l507K598M311l955m870K991o07
553a845m017M792K548m617k497Q28R43k057R62M060l269m093M560o72l937L511
569d800K675l019k061L755o29n491N608L746n646J019L249l954q23M841J269k898
585c159m3L019l107r66N788m42k842K001O32k015k62L437J537l344J106K764m206
$$ plain form
472 -11110 -3963 -7589 -10580 -1495 -1905 -6919 -6247 -6913 -7275 -8187 -4691 1191 -6442 -6808 -3333 -8072
488 -8072 -7246 -695 -1873 -1890 -3372 -3426 -3148 -7377 -302 4806 -1671 -466 2160 -4890 -2642 5077 4594
505 4594 2897 2839 3671 320 -1200 8031 6816 2659 8551 6292 277 4609 7189 6282 7663 8525
521 8525 8747 3570 1791 8669 7628 6805 11484 7045 1771 3127 6864 7112 5533 8159 7558 -703
537 -703 1996 7463 952 1874 7648 3148 -984 1124 1194 -2313 285 4596 641 -4229 -1238 -1845
553 -1845 -5862 -1070 1478 -3139 -5636 -4808 -3865 -5922 -4960 -900 -4169 -8262 -3702 -4374 -8311 -4800
569 -4800 -2125 -5144 -7205 -3450 -4079 -9570 -3962 -216 -5862 -4843 -1594 -5548 -6371 -1530 -261 -3159
585 -3159 -3202 -183 -3290 -4256 1532 1090 -1752 249 881 -1134 -1396 2041 3578 234 1340 4104 -102
602a02j082N865j598j802L052j36m159n74M479O03l384L299N49o990K437M373
618D830l261Q13J897j953l272k4L915k336j362N168k086n748L677J13k925L155
634F01K242j301m078P22J775l746K277N723m121m111L920j642j846L380K004j164
650F35l302K035J646n915L024N508m342J66L519l939k152K433L220n50j754L344
666C576k475n121N374J922k844K531P71l288j510K070K067j667L3L728l519l289
682a641M006q94k457L568J440k462k532J453N02k732K453M370n674j700L810l309
698a799j086L909P07k943j529K322j749k709M535J430m724J443J864l828k94K581
714a870R10k096N05K447m021j840N031m75k604L410M56m493J111L067j53k125
$$ plain form
602 -102 -1184 4681 3083 1281 4333 4197 38 -536 3943 4546 1162 4461 5010 -1980 457 4830
618 4830 1569 2382 4279 2326 -946 -970 2945 609 -753 4415 2329 -3419 258 371 -2554 601
634 601 2843 1542 -2536 -1814 -39 -3785 -1508 4215 94 -4017 -97 -1739 -3585 -205 1799 635
650 635 -2667 -632 1014 -4901 -1877 3631 -711 -545 2974 -965 -3117 -684 2536 1986 232 3576
666 3576 1101 -4020 1354 3276 432 2963 3734 446 -1064 1006 3073 1406 1439 5167 1648 -1641
682 -1641 2365 1471 -986 2582 4022 1560 -972 481 983 -1749 704 5074 -600 -2300 1510 -1799
698 -1799 -2885 1024 1731 -1212 -2741 -419 -2168 -4877 -342 1088 -3636 -2193 -329 -4157 -4451 -1870
714 -1870 -960 -3056 -2551 -104 -4125 -5965 -934 -1409 -4013 -603 -147 -4640 -3529 -462 -615 -2740
730b740K655R83m693J510L864k768o09L867j471j929J022K281j250j693L956r9
746B886l788K625J218k581P79K671j107k199R97J916k199k35L836k428k436K859
762B814j38k027J249J291j824j317J938O46k868Q21K569l266n11K924j699j666
778a064J395J155k016j089K690n54k813K689R78l627O90K188j803n47J757P89
794H18l098R4L014j809r26K777o04k705J622J121j462L21J827K21l317J584J776
811A254l035J050L288j628j939J306K3j150J082K311j048k605K038k34k217K165
827F61K094j707j112O37l18j124N24K403j430j704K079j342k102J929J106q31
843b37o16Q76q41k612J563K697k206J14J288l044o15K411M85p27PN26j187j801
$$ plain form
730 -2740 -85 898 -3795 -2285 1579 -1189 -1798 2069 598 -1331 -309 1972 722 -971 2985 2886
746 2886 -902 1723 2941 360 1139 3810 2703 504 1501 3417 1218 983 4819 2391 -45 2814
762 2814 2676 649 1898 3189 1365 48 1986 2632 -236 585 3154 -112 -623 2301 602 -1064
778 -1064 331 1486 -530 -1619 1071 517 -2296 393 1371 -2256 -1566 622 -1181 -1728 29 818
794 818 -2280 -2186 828 -981 -1907 870 266 -2439 -817 304 -1158 -837 990 1211 -2106 -522 1254
811 1254 -1781 -731 2557 929 -1010 296 319 -831 251 2562 1514 -1091 947 713 -1504 661
827 661 2755 1048 -64 573 255 -869 -345 2058 628 -1076 1003 -339 -2441 -512 594 -237
843 -237 -853 23 -818 -3430 -1867 830 -1376 -1262 26 -3018 -3633 -1222 -737 -1464 -1457 -931 -2118 -3919
861c919K601L30j597J138P59j751J11J119Q3j22J25K222j851j964L028l7j567
878a292K595O75k810L18K054j22j058J842J094l569J408K855k644J70K874j793
894B597j365J784J91q25j87J887j70k779J799J076k518J158J290j050j360M22
910A950N26p85m98K308j117l397K123M53k002J636N33j956q59N39O3j250N81J886
928G34j955j893K039j329r68J987J11r22r86O9L18j315J124J785k148l94J656
945b087j963n88K168Q97q60m60Q38j178r35K513Q78j824J125J214k515K51K006
962e20J99m88N44J375k078m53K605J85j884K176O08k385N30J701m97q07J756O24
980C191k430L69J762p40r07K133p61j553J324M86j054m00J224j55j533Q42M31
$$ plain form
861 -3919 -1318 -988 -2585 -1447 -688 -2439 -2328 -1209 -1126 -1248 -1123 1099 -752 -2716 312 275 -1292
878 -1292 1303 1978 -832 -514 1540 1418 360 2202 3296 -273 1135 3990 1346 1516 4390 2597
894 2597 1232 3016 3207 2382 2195 4082 3912 1133 2932 4008 1490 2648 3938 2888 1528 1950
910 1950 2476 1691 1193 3501 2384 -1013 1110 1563 -439 1197 1730 -226 -1085 -546 -483 -1733 -1152 734
928 734 -1221 -3114 -1075 -2404 -3372 -1385 -1274 -2196 -3182 -3113 -2795 -4110 -2986 -1201 -3349 -3743 -2087
945 -2087 -4050 -4638 -2470 -1573 -2433 -2893 -2055 -3233 -4168 -1655 -777 -2601 -1476 -262 -2777 -2526 -520
962 -520 -321 -809 -265 1110 -968 -1421 1184 1369 -515 1661 2269 -116 414 2115 1618 811 2567 3191
980 3191 761 1130 2892 2152 1245 3378 2617 1064 2388 2874 1820 1420 2644 2489 956 1798 2229
997B229p39l29J300q98j610J733M99j482o75J531p05j665J832R5j579N98J109
1014A244j562j189J906J3j180N45Q74j705n04J501J5q65N35O60j374o81J576K2
1032a69p04R73O21k377kJ643k64o15J234N99k398p8J419j133K10K259o02k335
1050a719Q77L21o06N48J447l24j870M52Q05j621O63K265j210j170J70l2j374J106
1068a272J770p48j438P37j91j840J668J591j015l77J19j232m59J366J531n42n43
1085h75M19q18j420J726J449q10N80R2j495o91J153J864l23l71J159j538j369
1102a268K084L06m28J585J26j486p42J165J001l36P51P72k168n12J566n58J84
1119B042J517P2j420j051O52L20q1J403L58k521j94J039j068K30J312k49j470
$$ plain form
997 2229 1490 1161 2461 1563 -47 1686 2185 703 28 1559 854 -811 1021 1116 -463 135 1244
1014 1244 -318 -1507 399 412 -768 -223 651 -1054 -1558 -57 -42 -907 -372 288 -1086 -1767 -191 -169
1032 -169 -873 100 721 -1656 -1658 -15 -279 -894 340 939 -1459 -1537 -118 -1251 -1041 1218 616 -1719
1050 -1719 -842 -521 -1127 -579 868 544 -1326 -874 -69 -1690 -1027 1238 28 -1142 -972 -1004 -2378 -1272
1068 -1272 498 -250 -1688 -951 -1142 -2982 -1314 277 -738 -1115 -996 -2228 -2687 -1321 210 -332 -875
1085 -875 -456 -1274 -2694 -968 481 -329 251 343 -1152 -1843 -690 1174 851 480 1639 101 -1268
1102 -1268 816 1122 694 2279 2405 919 177 1342 2343 2007 2758 3530 1362 850 2416 1858 2042
1119 2042 3559 3631 2211 1160 1812 2132 2051 3454 3812 1291 1097 2136 1068 1298 2610 2361 891
1136H91o52O46n81l23J637n8k241L92J74j514P79P38m76r85p9J88j322M23J511
1155h52n57j737J017l64j317J471O82j095k97M95l83j329J591L07O02j420J035
1172b151j193J35J335L97l7n40J63k03j03J207J358q69l78Q05r83j96J610O85
1190A042m17j72N38r25m21J709J129j167N88L48j805K05J676M0R9K38k16j336
1208A153q0J258M64o36Q73m51j268J5O26k6L76K37j99j701k84J457n07k73J132
1227B166n86k088P76L74m06Q6P74m17j613J47R14j118O25J310j261j167P08k81
1245a057k55N35P69k71j287K77L17r03J018Q54r09l94L95q7l86P55N36l27j028
1264a448J140m93n27J053L93r97J8M41l30l06Q71J049j518l96P46p52q18J813
$$ plain form
1136 891 239 885 304 -19 1618 1560 -681 -289 -115 -1629 -850 -112 -588 -1573 -1652 -1464 -2786 -2363 -852
1155 -852 -1409 -3146 -2129 -2493 -3810 -2339 -1657 -2752 -3049 -2554 -2937 -4266 -2675 -2368 -1766 -3186 -2151
1172 -2151 -3344 -3209 -1874 -1477 -1514 -2054 -1891 -2094 -2197 -990 368 -501 -879 -74 -1057 -1253 357 1042
1190 1042 625 453 991 66 -355 1354 2483 1316 1904 2252 447 652 2328 2368 2467 2705 2489 1153
1208 1153 1073 2331 2795 2159 3032 2581 1313 1328 1954 1928 2304 2541 2342 641 357 1814 1307 1034 2166
1227 2166 1580 -508 268 642 236 322 1096 679 -934 -787 127 -991 -366 944 -317 -1484 -776 -1057
1245 -1057 -1312 -777 -8 -279 -1566 -1289 -972 -1875 -857 -3 -912 -1306 -911 -998 -1384 -629 -93 -420 -1448
1264 -1448 -308 -801 -1328 -275 118 -879 -861 -420 -750 -1056 -185 864 -654 -1050 -304 -1056 -1874 -61
1282f1L13o68l80P82o35k09J348q7j143K79N52j258N53P88j59j81k59k21q09M71
1302i84J053K39p75L88o13o88R72N17L07o15J61K5j398Q46J375k63n15L53k46
1321A39j405J270Q68p2O8L98o27j102Q82J125n91Q71J38j294p57Q05O06j0N92
1340A904O2q34q04R27K23j68Q00J30j109o42J30M37N9K97O13j238j074J123n07
1359C29L1R16j60r82p39K30j00l02J094L04j566m72Q62j289N94Q01k5o91o21J27
1379a659r7m76J059L61j261N23l58q73O84O59M52m56m33J55p45L65J221k53m19
1398a551Q12o21m12M32N46O68n04O4P82j298N27J128k94P3M16o62NN67K58N57
1418A493m05L77j85q66P55O15l13M96j79q21J79K60O79j59k58M92r08p99J423
$$ plain form
1282 -61 252 -416 -796 -14 -649 -858 490 403 -740 -461 91 -1167 -614 174 15 -166 -425 -646 -1455 -984
1302 -984 69 308 -467 -79 -692 -1380 -408 109 416 -199 -38 -13 -1411 -565 810 547 32 385 139
1321 139 -1266 4 872 800 868 1266 639 -463 419 1544 953 1824 1962 668 -89 716 1322 1312 1904
1340 1904 1966 1132 328 1255 1478 1310 2110 2240 1131 489 619 1056 1115 1412 2025 787 -287 836 329
1359 329 360 1276 1116 134 -605 -375 -475 -777 317 621 -945 -1417 -555 -1844 -1250 -449 -474 -1165 -1786 -1659
1379 -1659 -1756 -2232 -1173 -812 -2073 -1550 -1908 -2781 -2097 -1438 -986 -1442 -1875 -1720 -2465 -2100 -879 -1132 -1551
1398 -1551 -739 -1360 -1772 -1340 -794 -126 -630 -566 216 -1082 -555 573 279 352 768 106 111 678 936 1493
1418 1493 1088 1465 1280 414 1169 1784 1471 1967 1788 967 1146 1406 2085 1926 1668 2160 1252 453 1876
1437A876j35o22O81m20n65n71N31P05m81j49L31j528m4J246r23K12M81n88o00
1456e63m03J60M64j82N94J86j707l04Q00n40J365J7r70k02n88N45L57m23J250
1475a44j6j633P81l62l01J594Mj46k50r36R77m04L0J651n77q97P94r61j96J342
1495C50L78Q5o02o30P00n29J33J564j066Q0N44j102j94O35N83K12n36k15n4j039
1515g03J122N72r30M34J44j296M76L76K8K66k50L27p33r99J153J03q03J015O1
1534C63r07J7K00J67K85m59R06j198n36J300k45J08M09m04p13M10j80O64p2k6
1554H9O82j488K90J024m31N4P02o92j56n9L25M24r1N6M99j449K85N03l49M29M91
1575A138m37n35j45J73J27J12M43K70j802R83mk67L53P3p77j41m12N05r16L64
$$ plain form
1437 1876 1741 1119 1800 1380 815 244 775 1480 999 850 1181 -347 -391 855 -68 144 625 37 -563
1456 -563 -966 -806 -342 -524 70 256 -1451 -1755 -955 -1495 -130 -113 -1083 -1285 -1873 -1328 -971 -1394 -144
1475 -144 -160 -1793 -1012 -1374 -1675 -81 -77 -223 -473 -1409 -432 -836 -806 845 268 -629 165 -796 -992 350
1495 350 728 813 211 -419 281 -248 -115 1449 383 463 1007 -95 -289 346 929 1141 605 390 336 -703
1515 -703 419 991 61 495 639 -657 -181 195 223 489 239 566 -167 -1166 -13 90 -713 302 363
1534 363 -544 -527 -327 -160 125 -334 572 -626 -1162 138 -107 1 410 6 -707 -297 -477 187 115 89
1554 89 771 -717 -427 597 166 220 922 230 74 15 340 764 673 729 1228 -221 64 567 218 647 1138
1575 1138 701 166 21 194 321 433 876 1146 -656 327 323 56 409 482 -295 -436 -848 -343 -1259 -895
1595h95J591k336j49L11J346j204J189k04k03m51L49k64q2J18Q04o15l23K78m93
1614a233K49L42K61j03o4O3j42p9M56M06n46K53J90o55J13R53k37j43JK67m31
1635g9J01N01J66l62O29j41o24L47K08r1J13L34k36q5j19M16k6j83K39P2o34K06
1657G52O2j41j7J23%n96J63M05m89N9O9l06m36M11mo42M09mk94k69J10M31o23
1680h27J40L43m08k91L68p1k52L21K71p30J15M90p3m88M98J32m99J29L18j59k01
1701h74N60M6o95L37N99l82J29M82M1m84L22Q6j73L47M44l52m62N07K15l23K87
1722F57N11n01k21J26P5J97o2J08r9m82J78r2j54N84K4j55k79l43K05j41K80K3
1744D39k37m87M48m04l02O65n7Nk87M19n77l75L35K62j74l60M12k56k60O17k59
$$ plain form
1595 -895 696 -1640 -1789 -1478 -132 -1336 -147 -351 -554 -1005 -656 -920 -1002 -884 -80 -695 -1018 -740 -1233
1614 -1233 -984 -642 -381 -484 -548 -485 -627 -706 -250 156 -390 -137 53 -602 -489 464 227 84 85 352 -79
1635 -79 22 523 689 327 956 815 191 538 746 655 768 1102 866 781 662 1078 1052 869 1108 1180 546 752
1657 752 814 673 656 779 779 183 346 751 262 321 390 84 -352 59 55 -587 -178 -182 -476 -745 -635 -204 -827
1680 -827 -687 -344 -752 -1043 -675 -746 -998 -677 -406 -1136 -1021 -531 -604 -1092 -594 -462 -961 -832 -514 -673 -874
1701 -874 -314 -268 -963 -626 -27 -409 -280 202 243 -241 81 167 -6 341 785 433 -29 478 693 370 657
1722 657 1168 667 446 572 647 844 782 890 791 309 487 395 241 825 849 694 415 72 277 136 416 439
1744 439 202 -285 163 -241 -543 122 65 70 -217 202 -375 -750 -415 -153 -327 -687 -275 -531 -791 -174 -433
1765d33j21Q6n6Pm02N15nK17J59j34m52L58m0J15J20J31M2j59l18P20j68r5M33
1788E20o2k42M1L56j29M1Q0L5o25L33N46l19O2p6p6N9j52J69K11j83k80J78l69
1811A18n2O46o27K40L8R9m75j29R3Qj52M08m12q6k9p9k29K51j41J42l78j21M55
1834d12o0j22L82j67n57L86k33J05K74K83m54k25K31k16OO01M43p64J6L44n21
1855f60K92M60r5o7jL3j2nK44K84j37l5J15m65M47j22M10om25L21k56l6N29k37
1879E76Q9q5n6m86M38J39j22J96j00q4n96K29L19j53k4q7j01j81j57L16K02l24
1901e2p4J57l89K62M9m9k01K51l13j81L05m9R2j59L26j13m18M39j55N2K43K1l92
1924c48N8J18K00m8K44N1m19j68M02K14pJ8N9J50l53k38K02J42K18r3j37k39M27
$$ plain form
1765 -433 -554 -468 -524 -517 -919 -404 -409 -192 -33 -167 -619 -261 -301 -186 -66 65 107 -52 -370 350 182 87 520
1788 520 458 216 257 613 484 525 605 640 15 348 894 575 637 561 485 544 392 561 772 589 309 487 118
1811 118 66 712 85 325 363 462 -13 -142 -49 -41 -193 215 -197 -283 -312 -391 -620 -369 -510 -368 -746 -867 -412
1834 -412 -472 -594 -212 -379 -936 -550 -783 -678 -404 -121 -575 -800 -569 -785 -779 -178 265 -499 -483 -139 -660
1855 -660 -368 92 -3 -70 -71 -38 -50 -55 189 473 336 301 416 -49 398 276 686 680 255 576 320 284 813 576
1879 576 665 580 524 38 476 615 493 689 589 505 -91 138 457 304 280 193 92 -89 -246 70 272 -52
1901 -52 -126 31 -358 -96 -47 -96 -297 -46 -359 -540 -235 -284 -192 -351 -25 -138 -556 -117 -272 -220 23 44 -348
1924 -348 -290 -172 28 -20 224 275 -144 -312 90 304 297 315 374 524 171 -67 135 277 495 402 265 26 453
1947D53k40P5K19j50j38j70j18M24k00k6J60k53ok24L07k69K31P3k90k69K33k18
1969c96k9J53R0n62L5J61m0l34N85l96m7Q1Q5l07K50M39n28K08j41m0k14M58M1
1992d48q7K49j6N2J70l06K91K85k57r0M36l36M28m9k07K77m1j78K46L0j50M89
2014G88KJ66Kk87L42J97j97N3m16R5j3o33M23O35m48K91j46l34K73j11L49m85
2036E46l4P8m0k5j82P0QJ8l62J8J86o32M84j4m09k60L37j85l23J68K2j24j92J04
2060g43K40k06J55k03j04K94m53J9L1m11M73P1j40K59M85n02L44nk95l98J31M78
2082d80m82O94K36K25q6k10L68J98m99L44m25K48M95k96p51J702k62k69n16J49
2102C83j31j52L91p4L72r46L21K69j73K32Rj66L48k33j06k07L73O8k51j81K55
$$ plain form
1947 453 213 288 507 357 219 49 -69 355 155 129 289 36 30 -194 113 -156 75 148 -142 -411 -178 -396
1969 -396 -425 -272 -182 -744 -709 -548 -588 -922 -337 -733 -780 -699 -614 -921 -671 -232 -760 -552 -693 -733 -947 -489 -448
1992 -448 -535 -286 -302 -250 -80 -386 -95 190 -67 -157 279 -57 371 322 115 392 351 173 419 449 299 788
2014 788 790 956 958 671 1013 1210 1013 1066 650 745 732 99 522 1157 709 1000 854 520 793 682 1031 546
2036 546 512 590 550 525 343 413 421 439 77 95 281 -351 133 119 -290 -550 -213 -398 -721 -553 -531 -655 -847 -743
2060 -743 -503 -709 -554 -757 -861 -567 -1020 -1001 -970 -1381 -908 -837 -977 -718 -233 -735 -391 -396 -691 -1089 -958 -480
2082 -480 -962 -268 -32 193 107 -103 265 463 -36 308 -117 131 626 330 -421 1281 1019 750 234 383
2102 383 252 100 491 417 789 -157 164 433 260 492 501 335 683 450 344 137 510 578 327 146 401
2123D01M6k36r6J75j22L8O8k61J10P9J4j41L0J36l65O9N7K58r5k8p9m1k86L25
2147E6K49k38J0k68K6J44J02K56j86j14K0j28m7K36l30K55J40j40j41Qm4L51r6
2170A21K83m87r0M60n26L23J27j51k68K08k24O9R9l42K08O7l14K14q9K7ML07l42
2193c16j46q9J01k53L72qj19j55K71l03m0M75l30J38j68J37j63R6K16j40p7J23
2215c78R8m2J24n4K12m3k6J06J42N9P0l29L05O5k2O5k14J21K09Q6q0L13l28K9
2239D88M58m93L78Rmn9L67k05J61m88K11m1l60N05n87o7P0L43j28P9n7j45p8K63
2263F20k56K2l78J68Rj32j01P1j94k38K44k36J8k93K39Jj22r1J54L5k66Q7J40
2286d99m47M26j53j95l06Q45k56n65O70j72lP7l6mj0R9L1k7L24l4j43J35P5J86
$$ plain form
2123 401 447 211 115 290 168 206 274 13 123 202 216 75 105 241 -124 -55 2 260 165 137 58 17 -269 56
2147 56 305 67 77 -191 -165 -21 81 337 151 37 57 -71 -118 118 -212 43 183 43 -98 -90 -134 217 121
2170 121 404 -83 -173 287 -239 84 211 60 -208 0 -224 -155 -56 -398 -190 -123 -437 -223 -312 -285 -281 26 -316
2193 -316 -462 -551 -450 -703 -331 -339 -458 -613 -342 -645 -685 -210 -540 -402 -570 -433 -596 -500 -284 -424 -501 -378
2215 -378 -280 -322 -198 -252 -40 -83 -109 -3 139 198 268 -61 244 309 287 352 138 259 468 554 474 787 459 488
2239 488 946 453 831 840 836 777 1144 939 1100 612 823 782 422 927 340 273 343 686 558 637 580 435 357 620
2263 620 364 386 8 176 185 53 -48 23 -171 -409 -165 -401 -383 -676 -437 -436 -558 -649 -495 -460 -726 -639 -499
2286 -499 -946 -520 -673 -868 -1174 -329 -585 -1150 -480 -652 -655 -578 -614 -618 -628 -529 -498 -525 -201 -235 -378 -243 -168 18
2310A8j65O2J67j76K03m4O4J08J01p2k38K25J24n4K26K59m97L4J72j92K99j65
2332D59J00k59J17rK33k08M6K99n47J75j96K7j77L16q9j2p9k3q4m20L95Qj40m1
2356a09k26J51J92J81j13k03J96l30n9r9M70k99p2J80p7M1l06K30M39k42j03R2
2378f6k39J79J27k30M16k51J18k95J70j4J7n4r7L45O5j93K2J48p5k81J12K62r1
2401I5j38Q1M3j04Q0m4rJ9n7q3R7O9l44Q1jR4N6R9k80m8J8K73P7k88j28K1q6L36
2429g1k38j85M51k97J65r4j91K25J44j32J47m9k48J07N4J91O6L8j81o9L29j3j13
2452C6J82L7N4j38R6k9J02O2j94J08j5L20k01J21k31L42k25l31N62k74J03M8L5
2475E70r0l54L7J36qJ01Mk8k92J23k24R7N3j10Q5j91P7o0j07L9j25k77K24j95
$$ plain form
2310 18 -147 -85 82 -94 109 65 129 237 338 266 28 253 377 323 549 808 311 345 517 325 624 459
2332 459 559 300 417 408 641 433 479 778 231 406 210 237 60 376 287 275 196 173 89 -331 64 72 -68 -109
2356 -109 -335 -184 8 189 76 -127 69 -261 -320 -419 51 -248 -320 -140 -217 -176 -482 -252 187 -55 -158 -66
2378 -66 -305 -126 1 -229 187 -64 54 -241 -71 -85 -68 -122 -219 126 191 -2 20 168 93 -188 -76 186 95
2401 95 -43 38 81 -23 57 13 4 23 -34 -117 -20 49 -295 -214 -215 -121 -65 34 -246 -294 -276 -3 74 -214 -342 -321 -407 -71
2429 -71 -309 -494 -43 -340 -175 -269 -460 -235 -91 -223 -76 -125 -373 -266 -212 -21 45 83 -98 -167 162 149 36
2452 36 218 255 309 171 267 238 340 402 208 316 301 621 420 541 310 652 427 96 658 384 487 535 570
2475 570 480 126 163 299 291 392 396 368 76 199 -25 72 125 15 100 -91 -14 -74 -181 -142 -267 -544 -320 -515
2499e15J25j08J67j23q6J8O2J39J37k91k62K42J25j18P1m25N90l50Q2R6l7q9j8
2522e68J91K77n0kJ11j37K61J42k79k65O89k74m83N69l8m9L19j81R3q3J34J2Q1
2545D70pq2r0lJ04j12J29R7l3o9j46K59j25L8j62K03j14l50P6L2J71J9m42J66
2569B9o1Q6j07nn9J0j78K23r8J27k35J19J97m10M2P5j21K51O0k50L4k54K28O0
2593b37J51l26O4J41r1J36k11J88L92l88MPM3o2l3L25P9o5j68J94j99J38K24l09
2617cK19l8j89J18J92n7Q5K8m4l39PL08J8l1kl13J46J8l81K32j0J92k74K26n20
2642d12j21K71J50K3l30L52m9n02K96K01j41K24j88m12O55l21l35N88M83o99l71
2663f38L18N15o97l69R3Q98n95O37n35L66l99l35R23j57m59l74J373j85l68Q77
$$ plain form
2499 -515 -390 -498 -331 -454 -540 -522 -460 -321 -184 -475 -737 -495 -370 -488 -417 -842 -252 -602 -520 -424 -461 -550 -568
2522 -568 -377 -100 -150 -152 -41 -178 83 225 -54 -319 370 96 -387 182 144 95 414 233 326 243 377 389 470
2545 470 463 381 291 288 392 280 409 506 473 404 258 517 392 430 268 471 357 7 83 115 286 305 -137 29
2569 29 -32 54 -53 -58 -117 -107 -285 -62 -160 -33 -268 -149 48 -362 -320 -245 -366 -115 -55 -305 -271 -525 -297 -237
2593 -237 -86 -412 -348 -207 -298 -162 -373 -185 207 -181 -177 -170 -127 -189 -222 103 182 117 -51 143 -56 82 306 -3
2617 -3 216 178 -11 107 299 242 327 355 311 -28 -21 287 305 274 272 -41 105 123 -258 -26 -36 156 -118 108 -412
2642 -412 -533 -262 -112 -89 -419 -67 -116 -618 -322 -121 -262 -38 -226 -638 17 -304 -639 -51 432 -267 -638
2663 -638 -320 195 -502 -871 -778 120 -475 162 -373 -7 -406 -741 182 25 -434 -808 565 380 12 889
2683H89q90j38P13o62j32J030m88L8m10L88M94k2o35p7o83L83M85k60J44R9j13
2704A53P8k4m08L63m35K98L0r5L71l49Q8m78L63j78M56q18O38j90q1l29K83l11
2726e75J47J76P5m12N61l97j40M1J98K74j61J26k83rJ2q3l6M56m41N88J67l87
2748a03J45K63m52j00J56j49j01M83k94J30j14m0P05j65k65M7j28K86k30l78J029
2769G25m87j59O42o7m79L33r41M88K62j59Q5l02P36q66l9L65L50n31L85O73j274
2790b60J99Q09j183M76j4k74L60O09j330O03J47k60J05j184J162o84k55Q57Oj07
2810b18P51r00L8k56l32J376p36m65J355p28r1O65m93m12N5P09j345M79M56l35
2830d27J132o38MJ95J0o7k49j5L42r1k92p2P08q53J461q80l28O10l01P75r56M62
$$ plain form
2683 889 -1 -139 574 -88 -220 810 322 360 -50 338 832 810 175 98 -585 -202 283 23 167 266 153
2704 153 231 207 -201 162 -273 25 55 -40 331 -18 70 -408 -45 -223 233 -585 53 -137 -218 -547 -264 -575
2726 -575 -428 -252 -177 -589 -28 -425 -565 -524 -326 -52 -213 -87 -370 -379 -367 -450 -486 -30 -471 117 284 -103
2748 -103 42 305 -147 -247 -91 -240 -341 142 -152 -22 -136 -176 529 364 99 146 18 304 74 -304 725
2769 725 238 79 721 654 175 508 -433 55 317 158 243 -59 677 -189 -228 137 487 -44 341 1014 -260
2790 -260 -61 748 -435 41 27 -247 113 722 -608 -5 142 -118 -13 -1197 -35 -719 -974 -117 -111 -218
2810 -218 533 -367 -329 -585 -917 459 -277 -742 613 -115 -206 459 -34 -446 -391 318 -1027 -548 -92 -427
2830 -427 705 67 71 266 276 209 -40 -55 287 196 -96 -168 540 -313 1148 268 -60 550 249 1024 68 530
2852E30r42L33pJ21M98p09m5K52j3k85Q19l41K08l17n8p07L46N56o38o74J198
2873A25J35j112J253p04N97m07p50J179j038J83K23K95j67j41l92J009j88o71
2891e71M99L12J14l68J67q94M71l84L9O06J076j387N51m63k21M55k61L85n94M82
2911A4R6L19o91q4Q28l24n13J382J33j417R20m2j734O64J537j210k56J74Q37q03
2931a70M96k52M82o0J82j489J163o82J45J49l35J110o31k86k60K54J01r3M88j40
2951A72m27j37k04M54j09k96J43j4k86M12J66J6o65P52M68m85k27m4pK81K8l1
2973d0K18n53M94P3k06l5J11j08j9m9J21l8P4Q5j76J84L8J3l7P9j72L25k15l3
2997A34O0R3k58J99m9J54j07k78q2L93l02R4P1j12j17J13q9J65r8j52j7M27l07
$$ plain form
2852 530 -412 -79 -86 35 533 -176 -221 31 18 -267 552 211 419 102 44 -663 -317 239 -399 -1073 125
2873 125 260 -852 401 -303 294 -113 -863 316 -722 -539 -316 -21 -188 -329 -721 288 100 -571
2891 -571 -72 240 354 -14 153 -741 -270 -654 -615 -9 1067 -320 231 -232 -453 2 -259 126 -468 14
2911 14 110 429 -262 -346 482 158 -355 1027 1160 -257 663 621 -1113 -449 1088 -122 -378 -204 633 -170
2931 -170 326 74 556 496 678 -811 352 -330 -185 -36 -371 739 108 -178 -438 -184 -83 -176 312 172
2951 172 -255 -392 -596 -142 -251 -547 -404 -418 -704 -292 -126 -110 -775 -23 445 -40 -267 -311 -318 -37 -9 -40
2973 -40 178 -375 119 192 -14 -49 62 -46 -65 -114 7 -31 43 128 -48 136 174 187 150 229 57 382 167 134
2997 134 194 287 29 228 179 333 226 -52 -134 259 -43 51 122 10 -107 6 -83 82 -16 -168 -185 242 -65
3020f5j9n8Q1Q3k36O2j2N0j35J32K2J73l9l45L55m55K54p8K23j7n6M1n9K00k02
3045a00l16J71K00N8K19l4Ok63OJ9J36J09n9qQ1j44L8j54L27j53M4L62l43l59
3069a57M59k74J98j16K53k93J94j20P0q0j6j43J08k5q6k14K90j34Q0n9j05J08
3091f2j0n1J93k83K0Q8k61J75n2r3K11k43J18J28m34J45K21j56kl9L85L13p61
3114d50K2J89n58L12j04Q68l27j11J82q8K79j33k98L91j95j62M01k54M10k94R
3135H9J81k29L82j70j38J29L7J56k47p0N09m44J67nk23k45K58M60o26P0J76P3
3157B90o0j67K60l85K82J41l34J49j94j04K0MM5r5l16K06J24n5r8J56m2j14j96
3180d83M47j35o6J85l05N6l5L77j16j66j48J68j43R8O0K4J13j50j02K39K26n7
$$ plain form
3020 -65 -84 -142 -61 22 -214 -152 -164 -114 -249 -117 -95 78 39 -306 49 -406 -152 -230 -7 -24 -80 -39 -98 102 -100
3045 -100 -416 -245 -45 13 232 198 204 -59 -53 -34 102 211 152 144 225 81 119 -35 292 139 183 545 202 -157
3069 -157 302 28 226 110 363 70 264 144 214 134 118 -25 83 58 -28 -242 48 -86 -6 -65 -170 -62
3091 -62 -72 -123 70 -213 -193 -105 -366 -191 -243 -336 -125 -368 -250 -122 -556 -411 -190 -346 -348 -387 -2 311 -450
3114 -450 -428 -239 -797 -485 -589 279 -48 -159 23 -65 214 81 -217 174 -21 -183 218 -36 374 80 89
3135 89 270 41 423 253 115 244 281 437 190 120 629 185 352 347 124 -121 137 597 -29 41 217 290
3157 290 230 63 323 -62 220 361 27 176 -18 -122 -102 -98 -53 -148 -464 -258 -134 -189 -287 -131 -173 -287 -483
3180 -483 -36 -171 -237 -52 -357 -301 -336 41 -75 -241 -389 -221 -364 -266 -206 -182 -69 -219 -321 -82 144 87
3202H7j27K7M4pJ16N0j89MK76k42J38L1m3k48L28J30j89N7k00QN1M3k07J53O1
3227A52J09k58o6J70N3p6P9o5J30l7k18L18j76o3k19Rp8J42K94j69k33Q5K28k33
3251a22J02J9r0j4J63k17j67p4L51m12L23MJ11m7N1J04m25K21M66k64M1j37q6
3274i9O7K34j59l11K93J01L41m31kL09m22K93j02Lk3J19o2O2Nr2L8j55K2L2j55
3299i4L38r6r6o9L88l31j23L3m2M6k4k02K95k1l5q9J88k07N0mm5J11j37j88K36
3324a18Q4k82j16K92M1Q9j38J17l16M15j85J14Kk61J17j38m7N1J45J4R1J11j79
3347i7j0J99k6j8K9Q3L8j05N8K46o0k17K23k67L95j94Q2m3K20m60N02j27l37K24
3371C38l61M00l14J16j86NJ70Lq9m2J65l6j86k18R6L30k52P1P4l63N2K16j8j1
$$ plain form
3202 87 -40 -13 31 24 140 190 1 5 281 39 177 208 165 -83 245 375 186 243 43 51 102 145 -62 91 152
3227 152 261 3 -63 107 160 84 163 98 228 191 -27 291 115 52 -167 -158 -236 -94 200 31 -202 -117 111 -122
3251 -122 -20 -1 -91 -105 58 -159 -326 -400 -49 -461 -138 -134 -23 -70 -19 85 -340 -119 347 83 124 -13 -99
3274 -99 -32 202 43 -268 25 126 467 36 34 343 -79 214 112 115 92 211 149 211 216 124 162 7 29 61 -94
3299 -94 244 148 52 -17 371 40 -83 -50 -92 -46 -70 -272 23 2 -33 -122 66 -141 -91 -95 -140 -29 -166 -354 -118
3324 -118 -34 -316 -432 -140 -99 -10 -148 -31 -347 68 -117 -3 -1 -262 -145 -283 -330 -279 -134 -120 -29 82 -97
3347 -97 -107 92 66 48 77 160 198 93 151 397 337 120 343 76 471 277 359 316 536 76 578 451 114 338
3371 338 -23 377 63 179 -7 -2 168 171 82 40 205 169 -17 -235 -139 191 -61 10 84 -279 -227 -11 -29 -40
3395d0k8K13l59K34o5p9K13q6k34L45l18K13k12J47q4n8J11j24K08K3Nl5q0P9
3419a1m19L55m6O8K4O4j93k4K32j40J29j37K06j47M4r9K49j80K66J2k58O7L8N7
3443A57j67N8K47j52J28r1j01J17j9l0P3j66J2R8q0J09l5O0j87Lo9K05j60J0O
3468B6J01j10r8m0J20K5j39nk64L84l0R8o7o6Ok26J40o0J03m7p0K32j52R3Q8k24
3494a82L04l14L08n9l62K74Q1J0J33j93M9l7K0j34J62r2J50N2k05L15j16q3J39
3517B20J23j54m29M42ol44M0L02l15N4k8K35k08M6P9l3Ql2J34m34L18j92q5JO
3542b52n3J74r6mj00J19J99K3k30J14p4O1P9j62J51j82J96%j41R4J11n8O4OM4
3567H3n7k9%q2J28J58kl79J55K64j19L2R9j37j7J15l11K05L47j18l11m7J21o4
$$ plain form
3395 -40 -68 145 -214 20 -45 -124 89 3 -231 114 -204 9 -203 -56 -140 -198 -87 -211 -3 20 25 -10 -90 -11
3419 -11 -430 -75 -121 -53 -29 35 -158 -182 50 -90 39 -98 108 -39 5 -94 155 -25 241 253 -5 62 100 157
3443 157 -10 48 295 143 271 180 79 196 177 147 220 54 66 164 84 193 158 218 31 34 -35 170 10 20 26
3468 26 127 17 -81 -121 -1 24 -115 -120 -384 0 -30 68 1 -65 -59 -285 -145 -205 -102 -149 -219 13 -139 -46 42 -182
3494 -182 122 -192 116 57 -305 -31 50 60 193 0 49 12 32 -102 60 -32 118 170 -35 280 164 81 220
3517 220 343 189 -240 202 196 -148 -108 194 -121 -67 -95 140 -68 -22 57 24 32 0 134 -300 18 -174 -259 -258 -252
3542 -252 -305 -131 -227 -231 -331 -212 -13 10 -220 -106 -180 -119 -40 -202 -51 -233 -37 -37 -178 -84 27 -31 33 39 83
3567 83 26 -3 -3 -85 43 201 199 -180 -25 239 120 152 251 114 97 212 -99 106 453 335 24 -23 98 34
3591C4K04k4k15Q2R4m9N9l5j9O5r0K52l24p7K60j02O4j22j60J03j10j66K54q6
3615a08J29n1j63m9K39q9p5lL11k13m1K3j18O2M9o3R6j85K74k01r7O0L9J71l31
3640c34K77M1n8k3j55M66m94k6M26k43K91j10J9j10J71j08M9K44j88p2m2L28j41
3663B08j08k2K11o0j30Qj40j33L74r8Q0q3K16k4n02J08J35K47j64j27J10J37j87
3686E6j29q3J58M2J7j29k5J43j74l4J57k06J30j86j30M62l0K6n36L27k82J96K0
3709b10j4M3j48K46m4L4Q2p0j08J93Q4j04j44J05K6j32L33j09Q0k61J6J08J74
3732A80k71K10J25m32L47m9O0j89K30j55k66L50P8l33K45j25j58K4L11r0k71K75
3754I6j67J05K1K52k43k61N7Q9o1q8K48K5l11J94L9J23k7j60m2J4O6J77k03M3
$$ plain form
3591 34 238 214 -1 81 175 126 185 150 131 196 106 358 34 -43 217 115 179 57 -103 0 -110 -276 -22 -108
3615 -108 21 -30 -193 -242 -3 -92 -167 -170 141 -72 -113 -90 -208 -146 -97 -160 -64 -249 25 -176 -273 -213 -174 -3 -334
3640 -334 -57 -16 -74 -97 -252 214 -280 -306 120 -123 168 58 77 -33 138 30 79 323 135 63 21 349 208
3663 208 100 78 289 229 99 107 -33 -166 208 110 190 107 323 299 -203 -95 40 287 123 -4 106 243 56
3686 56 -73 -156 2 44 61 -68 -93 50 -124 -158 -1 -207 -77 -263 -393 69 39 65 -471 -144 -426 -230 -210
3709 -210 -224 -181 -329 -83 -127 -93 -11 -81 -189 4 88 -16 -160 -55 -29 -161 172 63 143 -118 -102 6 180
3732 180 -91 119 244 -188 159 110 170 -19 211 56 -210 140 218 -115 130 5 -153 -129 182 92 -179 96
3754 96 -71 34 55 307 64 -197 -140 -51 -112 -200 48 73 -238 -44 -5 118 91 -69 -111 -97 -31 146 -57 -14
3778a4j99M16k19o4J47j20k47K43L7k2j02j78L84k08j05L79j76j19M60l25K5J47
3800A40j11k07M51j39N0k73L42k51K78l81K08k39M21p6k13J69K6o8k2R8j04k28
3822a29K88M6M3o1r6K7k84J60K6l06J94L23l03J36J0m3j62j6j91K55o0Q7K47n24
3846c33P6K84l20J75K9l44L68n16K85k87M96M5J95l74m3M13n25L30k1o8J40J16
3868A21O3j37j43K29l56J43J71Kl98K61J03J07n0j70P4O7M2m9P8j85K66k1k94
3891g6K21K68l64RN5M3l83M66k29J70K7J7J9o1p4P4j05j09L07r7l39K10Pj78l46
3916d68N16k77J74k73J8J59J18j05J29K1R3k18p2K78j22pj07K33k17k11J68J03
3938f7Pj7p5N0N2J70l28p1K79K2J96j72j04M7r2O9J07J05m0J25r9r3K65k40j32
$$ plain form
3778 -14 -213 203 -16 -80 67 -53 -300 -57 -20 -42 -144 -322 62 -146 -251 128 -48 -167 293 -32 -7 140
3800 140 29 -178 273 134 184 -89 253 2 280 -101 107 -132 289 213 0 169 195 127 105 203 99 -129
3822 -129 159 205 248 187 91 118 -166 -6 20 -286 -92 231 -72 64 74 31 -131 -147 -338 -83 -143 -56 191 -333
3846 -333 -257 27 -293 -118 -89 -433 -65 -581 -296 -583 -87 -42 153 -221 -264 149 -376 -46 -67 -135 5 121
3868 121 184 47 -96 133 -223 -80 91 93 -305 -44 59 166 116 -54 20 87 129 80 158 -27 239 218 -76
3891 -76 145 413 49 58 113 156 -227 239 10 180 207 224 243 182 108 182 77 -32 275 178 -161 49 56 -122 -468
3916 -468 48 -229 -55 -328 -310 -151 -33 -138 -9 12 105 -113 -185 93 -29 -36 -143 90 -127 -338 -170 -67
3938 -67 -60 -77 -152 -102 -50 120 -208 -279 0 22 218 46 -58 -11 -103 -34 73 178 138 263 164 71 336 96 -36
3963c6l2L19o0l25K33j5J00r4J14l59M78l46j5J63l11L79Jq0L6j36M9l9q6J15
3987E3j35m5L2o7m0J76j9j15J33jj5k8m26K49L27l56K48L3j78O7J5N0q3q2j05
4012c12L34j01l0K3j95N5M45l87J55k62M86l11R4N09m59J88j67p1K43jl60J95
4034G1j65K11J45j85M3Q5j82P4j33m8JJ82k22l6Q2L77m7k68K34q3r9j20L48l91
4058a26J46j8l1J49j89j05K74j8J7j19j80K41Q5q8j12j06R8K16j49R3j00l1j18
4081a71M1J78j95J2K04l89J78l7QJ7j58N40o5j45l2R4j42J27J5p3J8J90k55r5
4105a35J95K34j86M5pk41L25m0k75K11n0l0J93j48j17M32l84Q2R9j49j64K94l54
4128a70K83k54J95j27K16k03R4R5j04K12l62mK25l00O9J30o4j55R5J1K08m88K70
$$ plain form
3963 -36 -68 251 191 -134 99 84 184 90 204 -155 323 -23 -38 125 -186 193 194 114 150 14 63 24 -62 53
3987 53 -82 -127 -95 -162 -202 -26 -45 -160 -27 -28 -43 -71 -497 -248 79 -277 -29 4 -174 -107 -92 -42 -125 -207 -312
4012 -312 22 -79 -109 -86 -281 -226 219 -168 -13 -275 211 -100 -6 503 44 232 65 -6 237 236 -124 71
4034 71 -94 117 262 77 120 205 23 97 -36 -84 -83 99 -123 -159 -77 300 253 -15 219 136 37 -83 265 -126
4058 -126 20 2 -29 120 -69 -174 100 82 99 -20 -200 41 126 38 -74 -180 -82 134 -15 78 -22 -53 -171
4081 -171 -130 48 -147 -135 69 -320 -142 -179 -171 -154 -312 228 163 18 -14 80 -62 65 80 7 25 215 -40 -135
4105 -135 60 294 108 153 146 -95 230 190 -85 126 76 46 239 91 -26 406 22 104 203 54 -110 184 -170
4128 -170 113 -141 54 -73 143 -60 34 129 25 237 -125 -129 96 -204 -135 -5 -69 -224 -129 -118 90 -398 -128
4151a28L06k72J04o0j50j3Q1l1m9L08m57P7j74P02l08pn99R53j69Q1l25n13O51
4174HJ44r77M09Q90j24l82m25L71L88o99J84J28O24l39o11J344m0j348k0J438
4194I63k78j277k77J934Mr92k69J39K99l50k54M31J69J03p06L39O3k6M9k21J16
4215d1J47j83j59O4j08M85q4j3k52L5p5j6J25l1J22j52Kk08K46k25L9L39n6j32
4239a31N6M8j94J27n1K79j10n3J74j90p2J56R9j14K21p0J0k29J30r2R1J29j48
4262F6jo6K40l1O7m05M33k64O8J85l80Q7n4L47n43J55J50j01Q2J21j40p2J99j46
4286cj15K94j18q3J19k26L08k32P8j73J08j69J76m3N4J04K5j68L4j21K29j06n1
4309g9j17O2m4K30j93P8M6J4K68l20L07j20k19J8K93k93J56l4m6r6M15o3n0K9
$$ plain form
4151 -128 178 -94 10 -50 -200 -213 -132 -163 -212 96 -361 -284 -458 244 -64 -71 -670 283 114 195 -130 -643 8
4174 8 152 -825 -416 474 350 -32 -457 -86 302 -397 -213 -85 539 200 -411 933 893 -455 -475 963
4194 963 685 -592 -869 1065 1069 77 -192 -53 246 -104 -358 73 242 345 -361 -22 41 15 64 -157 -41
4215 -41 106 -77 -236 -172 -280 205 121 108 -144 -109 -184 -200 -75 -106 16 -136 -134 -342 -96 -321 -282 57 1 -131
4239 -131 -75 -27 -221 -94 -145 134 24 -29 145 -45 -117 39 138 24 245 175 185 -44 86 -6 85 214 66
4262 66 65 -1 239 208 275 -130 303 39 107 292 -88 -1 -55 292 -251 -96 54 -47 35 156 16 -56 143 -3
4286 -3 -118 176 58 -25 94 -132 176 -56 22 -151 -43 -212 -36 -79 -25 79 104 -64 -30 -151 78 -28 -79
4309 -79 -196 -134 -178 52 -141 -63 -17 -3 265 -55 252 132 -87 -69 224 -69 87 53 7 -89 326 263 213 242
4333B42j02j70L03q5j40j3J73J22m12J14Q2N0j82J09l0k45R8q6M15j28j61q7J1
4356a22K75j06o8j8J7K24k65O0L3l13K8K73j99l06J40K52p1m8L06l57M3p3m1O0
4380b76K02J33j39K27j47J1j46K32l18L46j29J11Q9l37J77j04j15J12J75j57J9
4401c4K88k3j13M1k84L39j24RJ80k69q1R6j36K15k8J10l14j05k0R02p66O5Jj66
4425b17Q9q6k03N05o35L77n65K73O58k32k90M04j77j29M07l61J97J23n72M21P2
4446E9r5m1L7r3J3l9K03L0k06q2J06j08L51q8r1n8Q8MJ11n5Q8J45j66K39l29q2
4472e9K63j81J88k42M6j08K00j10j17K08J10J05k24J79j9k29K00j04O4j75JK6
4494B2R8j90n0K94P9l57K7m6R2nl8R3M28k97j64m78Q65r25N27j48J98m66j06N56
$$ plain form
4333 242 140 -30 273 188 48 35 208 330 -82 32 114 164 -18 91 61 -184 -86 -172 243 115 -46 -133 -122
4356 -122 153 47 -21 -39 -22 202 -63 -3 30 -283 -255 18 -181 -487 -347 -95 -166 -214 92 -265 -222 -295 -336 -276
4380 -276 -74 59 -80 147 0 11 -135 97 -221 125 -4 107 196 -141 36 -68 -183 -71 104 -53 -34
4401 -34 254 231 118 159 -125 214 90 99 279 10 -71 25 -111 104 76 186 -128 -233 -253 649 -117 -52 -51 -217
4425 -217 -128 -214 -417 88 -547 -170 -735 -462 196 -36 -326 78 -99 -228 179 -182 15 138 -434 -13 59
4446 59 -36 -77 -40 -133 -120 -159 44 74 -132 -214 -108 -216 135 47 -44 -102 -14 -10 101 46 134 279 113 352 23 -59
4472 -59 204 23 211 -31 15 -93 107 -3 -120 88 198 303 79 258 239 10 210 106 170 -5 -4 22
4494 22 120 -70 -120 174 253 -104 -77 -123 -31 -36 -74 19 447 150 -14 -492 373 -552 -25 -173 25 -441 -547 9
4518In12M19l61N84n41L99Q2j79k23J49m1K54l46K93j75ol3L65R6k81K55p3J08
4541B42k5j45l01K22k08L10j62K56l99K26j53N0M28k31q2j0m1J1%n6R6k5Q0P1
4565A54j35J40j99j48L05k77L36P3j72k17L1P1J17J18p3j10rj47J03Kj08K95j80
4588c0m8m9M9k8NJn7K27j57o9M7p9k6K93q2R9l29L15J7k88Q3l8N9l0K60m30N57
4615B72k86K19l16N19n2k73j61J54o8R3O2k16J55q3L16m59K53J6m4k94K2R4K78
4638B01j94J21P5j34Q9j21m8j34L25p8j15lRq9J21L6j04J35j10P1j17p1lP5J54
4663I1j08l4L20k18k19J28N3k9j80L7J08R1j28J58K00m70Q0J22l9k12K31j00K5
4686i3P9j4m8J41l36K85p1k2R9J47K2k38N7Nj50j3R9L1J76o9j73K00Pp8J64j41
$$ plain form
4518 9 -503 -84 -445 139 -402 -3 79 -100 -323 -174 -215 39 -307 -14 -189 -195 -228 137 233 -48 207 134 242
4541 242 217 72 -229 -7 -215 95 -67 189 -210 16 -137 -87 341 110 28 18 -23 -12 -12 -68 28 3 83 154
4565 154 19 159 -40 -188 117 -160 176 249 77 -140 -109 -38 79 197 124 14 5 -142 -39 -37 -145 150 -30
4588 -30 -78 -127 -78 -106 -101 -100 -157 70 -87 -156 -109 -188 -214 79 -3 96 -233 82 99 -189 -106 -144 -85 -115 145 -285 272
4615 272 -14 205 -111 408 356 83 -78 76 8 101 163 -53 102 19 335 -124 129 145 101 -193 -171 -77 201
4638 201 7 128 203 69 158 37 -11 -145 180 102 -13 -16 -7 -96 25 61 -43 92 -18 53 -64 -135 -138 -63 91
4663 91 -17 -51 269 51 -168 -40 13 -16 -196 -159 -51 40 -88 70 270 -200 -120 2 -37 -249 -18 -118 -93
4686 -93 -14 -28 -76 65 -271 14 -57 -79 20 167 189 -49 8 13 -137 -150 -51 -20 156 87 -86 114 121 43 207 66
4712F6J2j34J21l9P0k47M11j6Qk32J6K48k97N7J54j29l53L85Nj24lm5k1K05j22
4737dJ93l69m6M00l25J17j17P6R3j8r3M7K5J41l59K20m0R9p3j5j24j83M34j00
4761b1n1J49n5m21K65J70j6l53N55j64P4q8J38o8m14L31rJ48k61Q9J76l0J4j00
4785E8J16l7k00K83j81l8J9N9q8o4J10j90J25J79P6j14l2q7N5J02rk00j03j4K72
4810I7j25nm6LJ05r1J94n9J24l31N0j33K96l40L27M3L0k4m07K0K1J64RK47m19
4835b50R1Q0j11n8K68kl3M9m6j73M28j0m97L73L89M8q36O51o52O35m72J74J00
4858A46J19R4k44K07m75L83k23J80R8j97J52k76J82k50J14J01o9k16J18j39K44
4879D9q9J57l99J10Q8L6Q8k1n1K35l56M16j94j34LJ91k03r0J53j44K68r4j43K50
$$ plain form
4712 66 78 -56 65 26 96 -151 260 244 252 20 36 284 -13 44 198 69 -284 101 106 -18 -21 -66 -87 118 -4
4737 -4 189 -180 -226 174 -151 -34 -151 -75 18 0 -93 -46 -21 120 -239 -19 -59 40 -33 -48 -172 -355 79 -21
4761 -21 -72 77 22 -399 -134 36 20 -333 222 58 132 44 182 114 -300 31 22 170 -91 -2 174 144 158 58
4785 58 174 137 -63 220 39 1 20 79 -9 -73 37 -153 -28 151 227 113 81 -6 49 151 142 -58 -161 -175 97
4810 97 -28 -33 -79 -76 29 -62 132 73 197 -134 -84 -217 79 -261 66 109 139 115 -292 -272 -251 -87 -78 169 -250
4835 -250 -159 -79 -190 -248 20 18 -15 34 -12 -185 243 233 -264 109 498 546 -290 361 -291 344 -128 46 146
4858 146 265 359 115 322 -153 230 7 187 285 88 240 -36 146 -104 10 111 42 -174 -56 -195 49
4879 49 -40 117 -282 -172 -84 -48 40 19 -32 203 -153 263 69 -65 -62 129 -74 -164 -11 -155 113 19 -124 126
4903A26M2k24K12k45m97P24p8m23M33m72J058L2k24k22L4o65Q98l54m82J049m01
4924C21j203J044m43M3N77M77R8q91n31Q47m02N05n57L36k14J7p9N0o2K09J61
4945C03j80k11K53m3R8j57l5o2k4o0J85l36K47K7J8K0JJ31j78k00J9L25k66l6
4969a61R7J3j2q1J90k53K94K8j46k7J01j09J00l42L72k56M2L72j20j48n3L35k83
4992d7L33l32J50q2J51J17m24M3L57j0j38j92P4J07M6r6j90L06J4L23m62O1p9
5015C0j09q8L66M4j22j05j23L07j71K56l40P4Kl8K06j38O3k81L0n1L93j7l44J33
5039b3k34L0J45J32l02M37m17L48l12R9K84j23j62J1RK24j51j9k4k5N27r88M48
5062h6n3r1M4J08m4L16k4j59Q8l14L22r6K72l13j29L36j19L19j35l06J20l26J19
$$ plain form
4903 126 168 -56 156 -89 -586 138 60 -363 70 -402 656 688 464 242 276 -389 509 155 -327 722 321
4924 321 -882 162 -281 -238 339 816 914 23 -508 339 -63 442 -115 221 7 24 -55 -5 -67 142 303
4945 303 123 -88 165 122 220 63 28 -34 -58 -118 67 -269 -22 5 23 43 44 175 -3 -203 -184 141 -125 -161
4969 -161 -64 -51 -63 -144 46 -207 87 115 -31 -58 43 -66 34 -308 64 -192 -150 222 102 -46 -99 236 -47
4992 -47 286 -46 104 22 173 290 -134 -91 266 256 118 -74 0 107 153 57 -133 173 187 510 48 109 30
5015 30 -79 -167 199 243 121 16 -107 200 29 285 -55 19 21 -17 189 51 114 -167 -137 -188 205 188 -156 -23
5039 -23 -257 -227 -82 50 -252 185 -232 116 -196 -97 187 64 -98 -87 -78 146 -5 -24 -48 -73 454 -534 -86
5062 -86 -139 -230 -186 -78 -122 194 170 11 99 -215 107 11 283 -30 -159 177 58 377 242 -64 56 -270 -151
5085a51R3J9j15K61J83k37J2l87P5K90M02l06l76K98q9J72m5m53m04Q14J44N8
5107B58m01m48P42O0m23L24j05M46m79J38o23J074j38p83Q01q43P21j237M23J68
5127c25k54M05M59l89j4n0J20K28Lm1l3k93k46N72Q4k11R0J1k54n9O1L72M9k43
5151D2N0O6NO1j95N82l46m48P54m15O7K73o33l1N72k41K10k84n2M2l66J91Q7K91
5175B82m28K70k60K35j25j67M2o9J04K5K12k35J45L9r8o4J24q1J22k64P4M35m62
5198a44N7J48j49K14m56J78P30n75k40Q5j25L20m55L73j15L57j25J16o5Kj08n
5220A8o0r0k80N86q40M00R23p12m79J004J50l30m52K47J117j560M21n35P40q2
5240A86m17K36m78j15J010p45P86n10L70j14R6n3j29nk25p26R21n9m60L30L20
$$ plain form
5085 -151 -58 -39 -154 107 290 53 65 -322 -247 43 445 139 -237 61 -28 144 99 -354 -758 56 200 258
5107 258 -143 -591 151 211 -212 112 7 453 -26 112 -511 563 425 -358 443 -400 321 -916 -493 -325
5127 -325 -579 -174 285 -104 -118 -168 -48 180 183 142 109 -184 -430 142 226 15 105 116 -138 -197 -136 236 285 42
5151 42 92 158 163 224 29 611 265 -183 571 156 223 496 -137 -168 404 163 373 89 37 79 -287 -96 -9 282
5175 282 -146 124 -136 99 -26 -193 -151 -220 -116 -91 121 -114 31 70 -28 -92 32 -49 73 -191 -117 318 -144
5198 -144 -87 61 -88 126 -330 -152 578 3 -237 -152 -277 43 -412 -39 -154 203 78 194 129 131 23 18
5220 18 -42 -132 -412 174 -666 -266 657 -55 -534 470 620 290 -162 85 1202 -358 63 -472 268 186
5240 186 -231 5 -473 -588 422 -323 463 -47 323 209 305 252 123 118 -107 -833 88 29 -431 -101 219
5261B19n59m5P73m84l28R5K13K44L05l03k91K05l58K36l28O23k19j62j00NJ62
5282i7k13J07l95L17j73O9M55j85o4L33j75j50K24K25j58j71k97O05l89M67q08
5303d73J76K04L59j86N1R2k14l4Q21q27q5J0K03K00o65J025n88L25q0o75J02K84
5325B5j11p15P26K37J6r79P04J09M8j26J78l78j16L50j98l34N19j75l94O47j78
5346a45J76j57j89k76j000J198J344n1p18Q65m95k67p92j301J988n70N42K65O09
5365A026j130M61n67O52q18M27M99m4J02j014P07k83r4J13o9q5N35n04N1j64K5
5386a74J7l95Q68k59J27j48j61NL54l70k18K92l17q8M20J08K36n00K3L30k55j86
5408b91J49n4K4p7J99p5j30K68p7O3j09K79n28N99l59K03P8j44K02k53k15J81
$$ plain form
5261 219 -340 -385 388 -96 -424 -329 -116 128 433 130 -161 44 -314 -78 -406 217 -2 -164 -264 -259 -97
5282 -97 -310 -203 -598 -281 -454 -385 70 -115 -179 154 -21 -171 53 278 120 -51 -348 257 -132 335 -473
5303 -473 -297 -93 266 80 131 223 9 -25 796 -31 -116 -106 97 297 -368 657 69 394 314 -361 -259 25
5325 25 -86 -801 -75 162 178 -801 -97 12 60 -66 112 -266 -382 -32 -230 -564 -45 -220 -614 33 -145
5346 -145 31 -126 -315 -591 -1591 -393 951 900 182 1047 552 285 -507 -1808 180 -390 152 417 1026
5365 1026 -104 357 -210 442 -376 51 550 506 608 -406 301 18 -76 37 -32 -117 418 -86 -35 -199 -174
5386 -174 -157 -552 316 57 184 36 -125 -120 234 -136 -354 -62 -379 -467 -47 61 297 -203 -180 150 -105 -291
5408 -291 -142 -196 -172 -249 -50 -125 -255 13 -64 -1 -110 169 -359 240 -119 84 162 18 220 -33 -248 -67
5430f7j50J84O0J5Q9J0j19J60j7K8k73R3j27QK22k05j80K39j9M9R2m6L2O8k23
5455g7R7J46OK02m18J38l32L12K42l46o0J18j6L6j25K56l28K28Q4m9l05L29k52
5478a14J1L5J37j40%L5J82l3j76j42J74l1j3R1j22L04k85J83P1n6J03k78K34k04
5502c4q3K18%j20K07k78L08k09q9O5j51n9J98K30l04K03j68K24Nj72j06K47j28
5525Dq8J0J81j58mK78r8p7n4l0j58O8M62l45K26m2Q1m13J08L11j64N4j26j03J9
5550e8q5K16k06K02J63k81K72j68j11Q5J36j83K59l07J6K69k07j09O8J44j16J64
5572A63k57k03K07K3P9J32j91j10j51J58J35j14J16J62m0L1r0l1j16K86j4j14
5594F1n67P40m07L9K23N3k37K78j06K57m72J25m5K23R1j97R4j59J00k90K16L43
$$ plain form
5430 -67 -217 -33 27 42 131 141 22 182 165 193 -80 13 -114 -106 116 -89 -269 -30 -49 0 92 46 78 146 -77
5455 -77 20 166 172 374 -44 94 -238 74 316 -30 -90 28 12 48 -77 179 -149 79 163 114 -191 138 -114
5478 -114 -103 -68 69 -71 -71 -36 146 113 -63 -205 -31 -62 -75 16 -106 198 -87 96 167 111 214 -64 170 -34
5502 -34 -117 101 101 -19 188 -90 218 9 -80 -15 -166 -225 -27 203 -101 102 -66 158 163 -9 -115 132 4
5525 4 -84 -74 107 -51 -55 223 125 48 -6 -36 -194 -126 336 -9 217 175 256 -157 -49 262 98 152 26 -77 -58
5550 -58 -143 73 -133 69 232 -49 223 55 -56 29 165 -18 241 -66 -50 219 12 -97 -29 115 -1 163
5572 163 -94 -297 -90 -67 12 144 -47 -157 -308 -150 -15 -129 -13 149 109 140 50 19 -97 189 175 61
5594 61 -506 234 -173 -134 89 142 -95 183 77 334 -138 -13 -58 165 256 59 153 -6 94 -196 20 363
5616C63m30lj24L49j01q5K78j04n7k26K90rn4j29n4K64n2k74J45r3j48K08J21
5639G5l98L46j74L00k31Q0Km1k49J47J37j16J0r9J52j7J04j66K20J55L28l58J83
5662C90m89N92M61q15J98k09k52M50K8m27O40q35R7O9L84k15k35N47o1k35n71
5683d88N01K74M45j064j11N09o0o1j73k03M92k45L63n45L80K5J59q0k16L80m47
5704a65K38k12K18l5j56R5k1k8M1Q4r1p3M3o0K87m14R3P1QK27l11m4K64q6J76
5729A49j92J13j45O9m1L00Q20j551N42J11m43N26k51l4j1K7M0n5K81m11K65J78
5751B87k12L1O9j30Oj5jk1J72j40j08L00j94m5j71K98q5J79l59P0K82k47N4J10
5775A30k6J3k84J26k8l2rK28j48J23l1j78J30j12L16k11J5Kl03K16P3k71M61K9
$$ plain form
5616 363 -67 -70 -194 155 54 -31 247 143 86 -140 150 141 87 -42 -96 168 116 -158 -13 -106 -254 -46 75
5639 75 -323 23 -151 149 -82 -2 0 -41 -290 -143 -6 -122 -112 -211 -59 -76 28 -138 82 237 565 207 390
5662 390 -99 493 954 139 337 128 -124 326 354 -73 567 -268 -171 -102 282 67 -168 379 318 83 -488
5683 -488 13 287 732 -332 -443 66 6 -55 -228 -431 61 -184 179 -366 14 39 198 118 -98 282 -165
5704 -165 73 -139 79 44 -112 -17 -38 -66 -25 59 -32 -105 -62 -122 165 -249 -156 -85 -77 150 -161 -205 59 -27 149
5729 149 -43 70 -75 -6 -47 253 1073 -478 64 175 -268 258 7 -27 -38 -11 29 -26 255 -156 109 287
5751 287 75 106 175 45 51 36 35 14 186 46 -62 238 44 -1 -172 126 41 220 -139 -69 213 -34 20 130
5775 130 104 117 -167 -41 -69 -101 -110 118 -30 93 62 -116 14 -98 218 7 22 24 -279 -63 10 -261 200 229
5799B29k36O7j46p0J52j53J01L53l91J71r9l4P2R6j78J16j87j89K95J83k74J86
5821F4K0k77n3P0L18j40m5Qj32J91k6k9j9k6M8J88q3J46m64O24m60n9M49n20J95
5846a2K24l78M7J45l46l98L66N9M51o80O78k38K79K6n33k1K36J79q4J87j38K27
5868B76Lj95r5J65q8J09m56N57l38j43K46p9J6m4r8J93J03k55k5R4R2k4Q8J05
5892B07o3m4j06p2n0P7j62M15k61O5n6p7K88l79L88p7R3n07Q21k31m90J42l4j1
5916a24j19R72k19m52L0Oo41J73O69k85L5L72k35l02j22o37O18p30M91O49K45
5937C94r82K52L70n38Q68o10M45n71L13J07N3j45o1O3J45Q0k05L0l22M09J37l82
5959a50p9J25K7J86j84m9L39k13R8o2Q1k26J05J37j71J16j43J61J05K5j96J44
$$ plain form
5799 229 -7 60 -86 -156 -4 -157 -56 297 -94 77 -22 -56 16 112 -66 50 -137 -326 -31 152 -122 64
5821 64 84 -193 -246 -176 142 2 -43 -35 -167 24 -2 -31 -50 -76 -28 160 77 223 -241 383 -77 -136 313 -207 -12
5846 -12 212 -166 -119 26 -320 -718 -352 -293 158 -522 156 -82 197 223 -310 -331 -95 84 0 187 49 276
5868 276 279 84 -11 154 66 175 -281 276 -62 -205 41 -38 -22 -66 -164 29 132 -123 -148 -54 38 14 102 207
5892 207 144 100 -6 -78 -128 -51 -213 202 -59 6 -50 -127 161 -218 170 93 186 -321 500 269 -221 -79 -113 -124
5916 -124 -243 729 510 58 88 94 -547 -374 295 10 45 417 182 -120 -242 -879 -261 -991 -500 149 394
5937 394 -588 -336 34 -504 364 -246 199 -372 -59 48 101 -44 -105 -42 103 183 -22 8 -314 95 232 -150
5959 -150 -229 -104 -77 109 -75 -124 215 2 100 38 119 -107 -2 135 -36 80 -63 98 203 228 32 176
5981A76l7k3j79J01o8jJ26j59K03O0l20N9o0j59J56K26l8j75K25p7J8K55k96j56
6005a43L7N9j35K32j7LJ74l02K14j08J1j57K90l01k64L73J18k21K69j5K0M8j25
6028F0j06J80j89J21K1k6Q1j80j8K3n2Q8M8m0n5K97k39N5j79J11j90K55J10j06
6052G0n3j57q8L21l36m37Q82k08L59n47o59M66M11o69K74J289j439M50J98k01
6072g4j0m1J64k7o9q2L99k22k6J39p2j50o2Q2J8J60l48L99j01J09l69K41j60J49
6096D7k65M11q0L9k45O9J32L4j96m4K05k75J98m2j06M7j33J50L47j47Q2k04M9
6119G3j85K21j79K89k51LK1k5l2k0L03k77K75j02M5j19J15j58k76J19K64k08K48
6142A44j8K3L3k25N2r7j37M05n39K47J60m2j3o9rp4J98q1qQ0p3K75k80j9j79K39
$$ plain form
5981 176 139 116 -63 38 -30 -31 95 -64 139 199 -121 -62 -122 -281 -125 101 63 -112 113 36 54 309 13 -143
6005 -143 -106 -47 -182 50 33 36 210 -92 122 14 25 -132 158 -143 -407 -34 84 -137 132 117 137 185 60
6028 60 -46 134 -55 66 87 61 142 -38 -56 -33 -85 3 51 11 -44 253 14 69 -110 1 -189 66 176 70
6052 70 17 -140 -228 93 -243 -680 202 -6 353 -194 -853 -387 24 -645 -371 918 -521 -71 127 -74
6072 -74 -84 -125 39 12 -57 -139 260 38 12 151 79 -71 -133 -51 -33 127 -221 178 77 186 -183 58 -102 47
6096 47 -218 193 113 152 -93 -24 108 142 -54 -98 107 -168 30 -12 -118 -71 -204 -54 293 146 228 24 73
6119 73 -112 109 -70 219 -32 -29 -8 -33 -65 -85 218 -59 216 114 159 40 155 -3 -279 -160 104 -104 144
6142 144 126 149 182 -43 9 -88 -225 180 -359 -112 48 6 -7 -76 -85 -159 39 -42 -50 30 -43 232 -48 -67 -246 -7
6168gj84K55j41K57k46k76K44J06j16j5J83j51L02j61j54K86J26k13lk3j64K26
6190A31j09q4Q2j91K39K07j88k06J9K38J57l66j47L7M15l34l4J40M8L7j82M2l
6213e2J43k8J59j97j8J9q4L45k07j60Q7o9K98j72J74j17o6R8k85K41l9J1j10j69
6237a98K19m8j32J68j25M6J12j45J12j90N13n46K36j67K92j63j04K25q6j59J19
6258b1n5K61r0L4n3L5j2j24j06K16k48J78k32M50j66P7n0N0l13k3j8L27q3q6O8
6283A6n0L03k01j9J8Rk64M32j56P0k67J22J00k64P4j4O5j07K62R8l51K62k65J06
6307b1o7K76j12lj62M8qk0Or5O1m5k80M20j83R6K3K87j85j89K91j34m4j27J5K19
6333F7j06Mo2J30j19P1K09Q2l24j20L14j21j37J83k09J98j9j19l3J49Q0j72N7
$$ plain form
6168 -7 -191 64 -77 180 -66 -342 -98 8 -108 -123 60 -91 211 50 -104 182 308 95 92 69 -95 131
6190 131 22 -62 20 -171 68 275 87 -119 -100 138 295 -71 -218 -181 234 -100 -134 6 54 91 -91 -49 -52
6213 -52 91 63 222 25 7 26 -58 287 80 -80 7 -62 236 64 238 121 55 153 -132 109 70 81 -29 -198
6237 -198 21 -27 -159 9 -116 -70 42 -103 9 -181 332 -214 22 -145 147 -16 -120 105 19 -140 -21
6258 -21 -76 185 95 129 76 111 99 -25 -131 85 -163 15 -217 233 67 144 94 144 -169 -192 -210 117 34 -52 16
6283 16 -34 269 68 49 67 76 -188 244 88 158 -109 13 113 -151 -77 -91 -26 -133 129 227 -124 138 -127 -21
6307 -21 -88 188 76 73 -89 -41 -49 -69 -63 -158 -97 -142 -422 -2 -185 -89 -66 221 36 -153 138 4 -40 -167 -152 67
6333 67 -39 -35 -97 33 -86 -15 194 276 -48 -168 146 25 -112 71 -138 60 41 -78 -111 38 118 -54 3
6356Cj5m0K46J83m32J86j70J83j27J81m4k22L4j24K77J01j08k80J14M0J82j88
6378b0Mj25J05j60J67N5k94J75L9j64K49q2P6J68m18N3K09l0J7M5M5j18K1J36
6402A53k97q7P1K05r7J01Q4j72Q9m2K05k97J25P5k49K42l8j31K3M1j26J31k00
6425a91K37J46N8j50l8J7r4k9N6j01J94j35J31k7p1j16r7L23j76k2L51q7q3k07
6449a11J98n9r3J25P1J5J19m89o3J15K38k58K23j59J74n2n1L05j36r1M9j5n0k18
6473b13M05k65K16k4K3j92J69k62k2N1K82j66j17L57m47nK03K09J1j52j6j57P7
6496c5MK1J44k75K18nj89K49k8o9r2l2J20j6j11mK0K79L2l04K68k53k43M66k7
6521A38p6rk1J06j05k82N17m04J32n6o8K10o2k8p5J03L5l20R7K47n0L5j21J03
$$ plain form
6356 3 -12 -52 194 377 -55 131 -39 144 17 198 154 -68 -34 -158 119 220 112 -168 -54 -14 168 -20
6378 -20 -16 -141 -36 -196 -29 26 -268 -93 -54 -218 31 -51 25 193 -225 -172 37 7 24 69 114 -4 17 153
6402 153 -144 -231 -160 45 -52 49 133 -39 50 8 213 -84 41 116 -133 109 71 -60 -37 4 -122 9 -191
6425 -191 46 192 250 100 62 79 -15 -44 12 -89 105 -30 101 74 3 -113 -210 113 -63 -85 266 179 96 -111
6449 -111 87 28 -65 60 131 146 265 -224 -287 -172 66 -192 31 -128 46 -6 -57 248 112 21 70 55 5 -213
6473 -213 192 -73 143 119 142 -50 119 -143 -165 -114 168 2 -115 242 -205 -210 -7 202 213 61 45 -112 -35
6496 -35 -31 -10 134 -141 77 72 -117 132 104 35 -57 -89 31 15 -96 -100 -80 199 231 -73 195 -58 -301 165 138
6521 138 62 53 32 138 33 -249 268 -136 -4 -60 -128 82 20 -8 -83 20 55 -265 -168 79 29 64 -57 46
6545D6p9K98k92N0J00Kl3P6m0j45J49k17J70j86q4K02n5J85k91J86j96Q9K3LK65
6570B26k29J0k59L24m1R2k05Q7J59l7j01Q5j8q2L7Mj2K12j89n0O8j24J45rk01
6595a08P1K52k11j12J56k1j95J36N1j72J6J3L54p9k81L82j76j27K0j31J59J26
6617A23R3l17J06J21m1M9l34j2J41J90n7j35l5LL9J25N4J93l65P6n2j86P2K39
6641I0k44J08n2j80K51m0N6l0k03K98j9j17J75k46L26n5p5K5k61R5K81o11M30
6664BK2k02J17k29J28K78o4l31M46p4k2l82L49j33J15%j70L04k98O9J2K8P6p7
6688c6k09K12Q7k10O4N8k35L32M96m79j80M01j99J02q8k84L16j67J7k92L77l91
6710c08P21l65q0N8o9K75j26k66L79m0j69l4k15L95m01K30J27j04OK9l05N29l17
$$ plain form
6545 46 -33 265 -27 23 123 125 92 168 128 -17 132 -85 85 -101 -185 17 -38 147 -144 42 -154 -65 -42 -39 226
6570 226 -3 7 -252 72 31 123 -82 5 164 127 26 111 93 11 48 52 40 252 63 13 81 -43 102 93 -108
6595 -108 -37 215 4 -108 48 27 -168 -32 19 -153 -137 -124 230 151 -130 252 76 -51 -31 -162 -3 123
6617 123 216 -101 5 126 85 134 -200 -212 -71 119 62 -73 -108 -105 -66 59 113 306 -59 17 -35 -221 -149 90
6641 90 -154 -46 -98 -278 -27 -67 -11 -41 -244 54 35 -82 93 -153 173 118 43 68 -193 -98 183 -428 2
6664 2 24 -178 -61 -290 -162 116 52 -279 167 93 71 -311 38 -95 20 20 -150 154 -144 -75 -63 -35 41 -36
6688 -36 -245 -33 54 -156 -92 -34 -269 63 559 80 -100 301 102 204 116 -168 148 -19 -2 -294 83 -308
6710 -308 413 48 -32 26 -43 232 106 -160 219 179 10 -24 -239 156 -245 -15 112 8 14 43 -262 267 -50
6733e0O6N8j00O5k82K38M09l95k30L05J23j41J79J75m37L6j2M1%K04l43J38j56
6756a09J40k3m7j80J01J09J55p6l7J11l38J03K88l74K66M7k05J11Q1n1k56J08
6778g6K28j62n5K82k96L02l53K53J66l32J65l35O7J08o5J76j87K61j07l6L1k2
6800A3O2j32O0k40K08O6j11L39l15R0Q1l50K08r8J39l7K99n01K37J49j73j22J73
6823D5m7n1p4J37J11k30nJ24p1L4J84r9J29p1L1n7j96j71J81l1j35N6J71n5J51
6848F1q7o1m9J41p8N6O0J05k16q2J63m3J01j08MK21k27%L1j79K3p8J17J8J41l01
6874b67M30j81J1R9q6N5n7J49j47J19m9k75J81R4j95p1J10J35M6J4j91pJ00r8
6898h1j20J68O6n0J5J04l7j15o6N9j68L27p9L7m5k46N0P6L7J10QL4R6l28J02L69
$$ plain form
6733 -50 16 74 -26 39 -243 -5 404 9 -221 84 207 66 245 420 -17 19 7 48 48 252 -91 47 -109
6756 -109 31 8 -39 -219 -118 -9 146 70 33 144 -194 -91 197 -177 89 136 -69 42 123 72 -184 -76
6778 -76 152 -10 -65 217 -79 223 -130 123 289 -43 122 -213 -146 -38 -103 73 -114 147 40 4 35 13
6800 13 75 -57 3 -237 -29 37 -74 265 -50 40 121 -229 -21 -119 20 -17 282 -219 18 167 -6 -128 45
6823 45 -2 -53 -127 10 121 -109 -114 10 -61 -27 157 58 187 116 147 90 -106 -277 -96 -127 -262 -206 -35 -90 61
6848 61 -26 -87 -136 5 -73 -17 43 148 -68 -150 13 -30 71 -37 -33 188 -39 -39 -8 -187 -164 -242 -125 -107 34 -267
6874 -267 163 -18 -7 92 6 61 4 153 6 125 76 -199 -18 76 -119 -190 -80 55 101 115 -76 -83 17 -81
6898 -81 -201 -33 33 -17 -2 102 65 -50 -116 -57 -225 102 23 60 15 -231 -181 -105 -68 42 50 84 180 -148 -46 323
6924C23l40J4p7J09q5j75K28j68K17K45k59N9N4l48K28Mm2r7K24j37o4p0J63J36
6948A42j96K63Nj69J19j44j74J68K9Lj84J31J71j50J03n25L15M1K1j77L63o1k88
6971a94L78k23J66k56K21j79o6L92j51l23L17K70k95j0k24L01k98K13j4k02J78
6992An2Oj80J77J02r2r8k3J28K6j40J24j71L72j66J95k74j14K59j64R9O2J49k05
7016B1M0K8J20j86J05j53j42J45m3Q8m7q8J52j23J50q1k30K17k54K40K55l37%
7039a23K80k24j1r1L77j30k80J50n5L6Q9k04k5J86k1j14M6K46j43M8J20o26O85
7062B16j84rk08K45J59j13o0j99J91l0R8j93L08k07m6kk08L81k99L37l60K37k11
7085a57J96N8Oj35j10MP0j5MR8J58m6J4r1N5k2j11K3K5l1k8K28k32k9P0P8K54
$$ plain form
6924 323 -17 -3 -80 29 -56 -231 -3 -171 46 291 32 91 145 -203 25 29 -13 -110 114 -23 -87 -157 6 142
6948 142 -54 209 214 45 164 20 -154 14 43 46 -138 -7 164 14 117 -408 -93 -52 -31 -208 155 94 -194
6971 -194 184 -39 127 -129 92 -87 -153 239 88 -235 82 352 57 47 -177 124 -174 39 25 -177 1
6992 1 -51 -45 -225 -48 54 -38 -136 -159 -31 -5 -145 -21 -192 180 14 209 -65 -179 80 -84 15 77 226 21
7016 21 61 89 209 23 128 -25 -167 -22 -65 23 -24 -112 40 -83 67 -14 -244 -27 -281 -41 214 -123 -123
7039 -123 157 -67 -78 -169 208 78 -202 -52 -107 -71 18 -186 -211 -25 -46 -160 -114 132 -11 37 157 -469 216
7062 216 32 23 -185 60 219 106 46 -153 38 8 106 -87 221 14 -32 -34 -242 139 -160 177 -183 54 -157
7085 -157 39 97 103 -32 -142 -138 -68 -83 -79 19 177 131 145 54 109 87 -24 -1 24 -7 -35 193 -39 -68 2 80 334
7112C34k63L0j5N7j34j8o1L69l67J31J70j93p6o9J09l1J23K4O7k13J79k71K6J15
7136B3J17k18N9P1j01l5P0k49K82j63K17q7Q1j42K98j85jj38P9J16p2J51l15R5
7160d7p9p1L03k06J90P3j74k50N8J31K09J23k73j95l2K51k5K09m84O55k54j95
7182h3J16K5j7m0j56J85j50R6l3P4j33K7J29q5r6J77QJ5J33k41J0j19L06Jk61
7207a12K3l6J03P8P1J7k75J0j7L52k77n1kO5R2m32M76J30k47J41l1j28j75J50
7231g5j56K88k02L5Q6j61L73J21l83K11q5K21k92j90M2J40J87j00l1J62k29n1
7253h9J17O5J08j43j27P2P2j62J73M1l81J36Q7K51k67q9K71q9j93L3L12j99Qr8
7277i1K13k33M4L17k96L0L4j03j1P6k40M31p8l91K72L1n8N5J16m2q7Q6pN9n8k9
$$ plain form
7112 334 71 101 86 143 9 -9 -70 299 -68 63 233 40 -36 -105 4 -27 96 120 187 -26 153 -118 -92 23
7136 23 140 -78 -19 52 -49 -84 -14 -263 19 -144 73 -14 67 -75 223 38 37 -101 -22 94 22 173 -142 -47
7160 -47 -126 -197 106 -100 90 163 -11 -261 -203 -72 137 260 -13 -208 -240 11 -14 195 -289 366 112 -83
7182 -83 33 58 41 1 -155 30 -120 -24 -57 17 -116 -89 40 -45 -141 36 44 59 192 -49 -39 -158 148 149 -112
7207 -112 -89 -125 -22 56 127 144 -131 -121 -138 214 -63 -114 -116 -51 41 -391 85 215 -32 109 78 -50 -225 -75
7231 -75 -231 57 -145 -110 -24 -185 188 309 -74 137 52 273 -19 -209 -167 -27 160 60 29 191 -38 -89
7253 -89 28 93 201 58 -69 3 75 -87 86 127 -254 -118 -31 220 -47 -136 135 46 -147 -114 198 -1 7 -91
7277 -91 122 -111 -67 250 -46 -16 18 -85 -96 -20 -260 171 93 -298 -26 5 -53 2 118 76 -11 75 68 127 69 40
7303D0j38K18qr3k0k02L52Q4k83J52lj69k7J8qm8J44R9j20L5JK1m2j36j18P9J79
7330Gm1J68j65j50O1J80j11M5M6J9N9n0q9Q1M0Mk94L44k00q4L32j49j15J59L7
7355A34R3j10n8J36k78r1k6J55K1j45J08J18p3n9O1J15K83l40K1K8j99O9L4L7
7379C4j34j54L86j77J25J42k65J31j56qJ54J7j6k22K64l07J81J40j55k43L06K55
7401B98j25l87R4M17k96Q6m6j40R5K35p8k96M5Q6n0Q7J30j63j93J65K14q7k12
7424a21L3J94N0L9k13k2M2K63k86J16K1j74j22M0K8L01k45K9J18j67k4M4N5N2
7448E1k28P1j22J62QK44j1k21j86Q31o91j50M96m46J25J53j76J64j61J77K65l41
7470A4K2K29l29J90k78M97k27K0j56J89l2k80J45j27J52j57J9n9o4L70K4k55K92
$$ plain form
7303 40 -98 120 112 19 -1 -203 149 233 -50 102 99 -70 -97 -79 -87 -135 9 108 -12 23 24 45 3 -133 -251 -172 7
7330 7 -34 134 -31 -181 -120 60 -51 -6 40 59 118 68 -21 60 100 104 -190 154 -46 -130 202 53 -62 97 134
7355 134 227 117 59 195 -83 -174 -200 -45 -24 -169 -61 57 -16 -75 -14 101 384 44 65 93 -106 -37 -3 34
7379 34 -100 -254 132 -45 80 222 -43 88 -68 -76 78 95 79 -143 121 -186 -5 135 -20 -263 43 298
7401 298 173 -214 -120 297 1 87 41 -99 -4 231 153 -143 -98 -12 -62 25 155 -8 -201 -36 178 91 -121
7424 -121 -88 106 156 195 -18 -40 2 265 -21 95 116 -58 -180 -140 -112 189 -56 -27 91 -76 -100 -56 -1 51
7448 51 -177 -106 -228 -66 -58 186 175 -46 -232 599 -92 -242 254 -192 -67 86 -90 74 -87 90 355 14
7470 14 36 265 -64 126 -152 345 118 138 -18 171 139 -141 4 -123 29 -128 -109 -168 -232 138 162 -93 199
7493A99j87j04J91k20r2J03K33r2j47J84K8k47l2n5L88o5p7J1k9j81J84j39P9
7516f7K75l20K91l64K23R7k20r0K52M4r6L1O8j44j59J26r8K04J86l96K33l54K71
7539gk05K46R1j52P0Q8k87L4M1K04l8O9k52J01Lp1JK37j67r4K6J90k28K80j24
7564E6J39j13k28K29l5jm6J9p7L12k89mo6L36k25l7m2J03j93K59l38J06j83M71
7588A53k20K53l19P4J6L18k41j31K55j73k38J39k03O03K84m83M1O80j279N1M80
7609F0l91J019j162L56j51L87k39J94M3p8j09J64j17m0j06J02jL00q3n9k22J70
7631C7K41k48M9J02l44l4j79J99Q3k5p1J79L29j38k27p0K13Q2l00R2J35Qk37K29
7655A05K0m57M13q9O5R5l20L05j91J68j34O1J8j4j53J96j63J26Nj16l8k9L14j72
$$ plain form
7493 199 12 -92 99 -121 -213 -110 123 31 -116 68 96 -151 -183 -238 150 85 8 19 -10 -191 -7 -146 -67
7516 -67 208 -112 179 -185 38 135 -85 -175 77 121 25 56 124 -20 -179 -53 -151 53 239 -157 76 -278 -7
7539 -7 -212 34 125 -27 43 131 -156 -122 -81 123 85 154 -98 3 6 -65 -64 173 6 -88 -62 128 -100 180 56
7564 56 195 82 -146 83 48 47 1 20 -57 255 -34 -38 -104 232 7 -30 -72 31 -162 97 -241 -135 -318 153
7588 153 -67 186 -133 -59 -43 275 34 -97 158 -15 -253 -114 -317 286 570 87 128 808 -471 -420 60
7609 60 -331 688 -474 -118 -269 118 -121 73 116 38 -71 93 -24 -64 -170 -68 -69 231 148 89 -133 37
7631 37 278 30 79 181 -163 -197 -376 -177 -94 -119 -190 -11 318 180 -47 -117 96 178 -122 -30 105 113 -124 105
7655 105 125 -332 81 -8 57 152 -168 137 -54 114 -20 41 59 45 -108 88 -75 51 56 -60 -98 -127 187 15
7679A5J58l50R8J47k07n2K02P9J7j41j55j5J90K10j76L2k02K12N4k00L22p2j41
7702B5L1k57K53oj21K2J64J5J61j38R9l2m84K54j41J30j92J39l2J74k6k24J59
7725b7L8L7k12J45J13j46m5J2M3j52K16k19J28Qj72L50J2j9l16L71k82K74p9j57
7749g9J34N6k37K72N2j72J22K12l63K79l60J73k67N43n37J88q0K8j2L4J33m9j51
7772h1L90n07N26m44K53n5O3k70N0j61R2J40L30Jl85k61N29o6m50P10o93J111
7794H22j026M25j077R76m25M59J91j27j66j76N63j25o91k10R56n41L83L08p80
7813b61N49q6j43J44k86J46M78l71m33K04O31n98p4J83l31L47j36K04J4n33K72
7834h0J6j13J08PJ79n54N17k31N0j0K18j06L94m04j44O0L36q5l91L40k30K27r
$$ plain form
7679 15 173 -177 -79 68 -139 -191 11 90 107 -34 -189 -204 -14 196 20 52 -150 62 116 -84 238 166 25
7702 25 56 -201 52 46 -75 -53 111 126 287 149 248 216 -268 -14 -155 -25 -217 -78 -110 64 38 -186 -27
7725 -27 11 48 -164 -19 94 -52 -97 -85 -42 -194 22 -197 -69 -61 -233 117 129 110 -206 165 -117 157 78 -79
7749 -79 55 111 -126 146 198 26 148 360 -3 276 -84 89 -178 365 -172 16 -64 -36 -48 -14 119 70 -81
7772 -81 309 -198 328 -116 137 82 145 -125 -75 -236 -144 -4 326 327 -58 -319 210 144 -306 404 -289 822
7794 822 -204 221 -856 120 -305 154 345 218 52 -124 439 314 -377 -587 369 -172 211 519 -261
7813 -261 288 202 59 203 -83 63 541 170 -263 -59 572 -26 -100 83 -248 99 -37 167 181 -352 -80
7834 -80 -64 -177 -69 -62 117 -437 80 -151 -101 -111 107 1 395 -9 -153 -93 243 158 -233 107 -123 104 95
7857I5j1j97rK5q7M41P5j20m9n0j88K34r0M48m22l38N03j12J39l34P11o15j35
7880h6J72O6k29j89J29k16J17J71k62M25l8m84O78J9n8k55n6K45J6j82J08m2J07
7903A56J82j57j86j24j00N63q9k13J82l83O65o80J47J93l62j86L72J22J97j38
7923A61Ko6q6P5j90M03l04K09o66N60j5K8j78M1k04N86q5o44M21M66o29j36J7
7946b34J12N85m76m1j52M94k60k27K96k60K95j54J40l2r3o1K28j91m0J0J72j62
7968e1k21M7Q7L82k26K61n41J48K18j80N4K21j87j84K45Pj55J14L2k14J29J65
7990A51j30j69K85j87L14m38M91J07m51J30k62L44J62m78L42l23N05p21K88K02
8010A62k66j8J00J98l27K45L6j17j07p0K53k91L70l02J16Q4j83J40j4J06j28J63
$$ plain form
7857 95 84 -113 -122 -97 -184 257 332 212 163 113 -75 159 69 517 95 -243 260 148 287 -47 664 49 -86
7880 -86 86 152 -77 -266 -137 -353 -236 -65 -327 98 60 -424 254 273 215 -40 -96 149 165 -17 91 49 156
7903 156 338 181 -5 -129 -229 334 245 32 214 -169 496 -184 -37 156 -206 -392 -20 102 299 161
7923 161 163 97 11 86 -104 299 -5 204 -462 98 83 111 -67 -26 -230 356 271 -373 48 514 -115 -251 -234
7946 -234 -122 463 -13 -54 -206 288 28 -199 97 -163 132 -22 118 86 -7 -68 160 -31 -71 -61 111 -51
7968 -51 -272 -225 -138 244 18 279 -262 -114 104 -76 -22 199 12 -172 73 80 -75 39 71 -143 -14 151
7990 151 21 -148 137 -50 264 -174 317 424 -27 103 -159 185 347 -131 211 -112 393 -328 -40 162
8010 162 -104 -122 -22 176 -151 94 130 13 -94 -164 89 -202 168 -134 -18 66 -117 23 9 115 -13 150
8032A50L3l34K97j6k39K07j31q1L19k50J34j37m7Rj05J30O3j31J98k32J54N2j71
8055a28R7K14Q2l27L2J40k0m25N93l69J53k57K56K1j74J00l2j20J64K11k66N0
8077ek85K17J53n1j25J25q7m9J02P0r0K40j11l78M50j16m31J77L30k62J72K07
8099B53m50j05J99nr8L04r2j39Q1j25Q0K53j24j8k55J76K28k21J59R5j20j03M2
8122A5j30J6k6L14k28J91k10j49L48K3j67j88K17P5j95p1pL05j30J9J57k78J66
8145F7k4jk98Q4J94j34j7Q6l1M0j16K14p5K55r7n7j99Q3J7j5J71r1j5j60K1L7
8171f1J22j98N9q4K70k58J11Q7k36K32j45K08r3J66l61K92j40J32j44k11
$$ plain form
8032 150 183 -151 146 130 -109 98 -33 -114 205 -45 89 -48 -95 -86 -191 -61 2 -129 69 -163 -9 43 -128
8055 -128 -31 183 265 -62 -30 110 90 -335 258 -111 42 -215 41 62 -112 -12 -44 -164 0 211 -55 -5
8077 -5 -290 -73 80 29 -96 29 -58 -107 -5 65 -25 215 104 -274 176 60 -371 -194 136 -126 46 253
8099 253 -197 -302 -103 -108 -206 98 6 -133 -52 -177 -97 156 32 14 -241 -65 163 -58 101 196 76 -27 15
8122 15 -115 -99 -125 189 -39 152 -58 -207 141 164 -3 -191 26 101 -94 -165 -172 133 3 22 179 -99 67
8145 67 43 42 -256 -172 22 -112 -129 -43 -74 -34 -150 64 -11 244 147 90 -109 -26 -9 -24 147 56 41 -119 -98 -61
8171 -61 61 -137 -78 -162 108 -150 -39 48 -188 44 -101 107 14 180 -181 111 -29 103 -41 -252
8191b52
$$ Imaginary data points
##PAGE= N=2
##DATA TABLE= (X++(I..I)), XYDATA
0@%%%%%%%%%%%Qj6J6j6K4l2L5m3N6o7P5q8J08j32J54j78K08k40K75l17L64m13
33b19M69n32O00o75P57q46R47j058J176j307J449j604J774j958K162k385K627
50A377k894L187l510L871m272M720n229N809o473P249q169R275j0640J2370j4652
65g981J7819k2548L0493m7336J51411j29170k3211J98616j60358O4499P9318q6864
77F4688p0156N8197k1748o4303M0955Q8304p8165k2766J4785p5159o368L6341
89c5395J0689O2849o2755r8170N1550K103n4371Q6117K1389o2730j2407l0640
101a21771j9967L0658N2020J1405o8915N298L0850o6033R096O2967r025J0842
113g2575k3026l0320J9435j0520L6790L6616l2800O287j1564l6936L8594L5869
$$ plain form
0 0 0 0 0 0 0 0 0 0 0 0 0 8 -8 8 -8 16 -16 19 -24 32 -35 40 -48 60 -72 82 -96 112 -128 147 -170 194 -219
33 -219 250 -282 318 -357 400 -446 501 -557 619 -688 761 -843 931 -1027 1135 -1250 1377
50 1377 -1517 1670 -1840 2031 -2241 2479 -2750 3059 -3414 3835 -4334 4941 -5699 6671 -7981
65 -7981 9838 -12710 17783 -29553 121858 -7312 -30523 168093 7735 72234 151552 64688
77 64688 -5468 52729 30981 -33322 7633 95937 17772 -4994 9791 -65368 -71736 -35395
89 -35395 -24706 38143 -24612 -122782 -71232 -69129 -123500 -37383 -15994 -78724 -91131 -121771
101 -121771 -141738 -111080 -59060 -47655 -116570 -111272 -80422 -146455 -137359 -74392 -83417 -72575
113 -72575 -95601 -125921 -106486 -117006 -80216 -43600 -76400 -70113 -81677 -118613 -80019 -44150
125d4150k583Q453m563m412j5233q358M7250K1584p640Q007k5602j4720L7719
138d248J0047J686K1927p519j2904j1942J1862L3440q939J1367J9698l8038m160
151B2277K1044q524K4978K3370j6981k2005j1375K0502Q534m297K7725p637l1832
164D5779M427K409M25J4963O546l247j9098j3406R979n926O344K8421j5020k9605
178C2991J043j733l983J2109J3751n018k6270p547L856j3282J4398K0006j9152
191B1169j3367j723j0916m781Q573J9833o370k6649J478p191j3903K1787J4080
204B020j3382j0433n945q519p091J1633J9178j0170j0200M481j9699r720K2011
217c5836J1659n347o300l747r795q670J6614J6341j0443K905L457k5824k860K1854
$$ plain form
125 -44150 -46733 -38280 -42843 -47255 -62488 -70846 -23596 -2012 -9652 -1645 -27247 -41967 -4248
138 -4248 5799 7485 29412 21893 8989 -2953 8909 42349 33410 44777 64475 26437 22277
151 22277 43321 34797 59775 83145 66164 44159 32784 53286 61820 57523 85248 77611 45779
164 45779 50206 52615 53040 68003 74549 71302 52204 38798 48777 42851 49195 77616 62596 32991
178 32991 34034 32301 28318 40427 54178 49160 22890 15343 19199 5917 20315 40321 21169
191 21169 7802 6079 -4837 -9618 -1045 18788 12418 -14231 -12753 -19944 -33847 -12060 2020
204 2020 -11362 -21795 -27740 -36259 -43350 -31717 -12539 -22709 -32909 -28428 -48127 -57847 -35836
217 -35836 -24177 -29524 -35824 -39571 -49366 -58036 -41422 -25081 -35524 -32619 -29162 -54986 -57846 -35992
231c5992R314J59L26k534j5358m900K2344P934p347J3493j423j9144L089J0344
245a9695P487M925P251J499j9018k907J8114J483M061J8286p049j6493n78O525
259C891J0257P983J0438n583k1403N389J4164k644N870R347q567n397J150J312
273B6207M57K531J6377k061j8110R20P58m310J1890J0802p863j2046m387K340
287B3505l088O642J5439j3367j5757M177l312k377J0468K840r596q437j17j175
301E845q557P155J1201j1611m597l00j2468k264J0404Q048n047j0309k116p108
315b1724o730J7062Q009j2350k085l207j0148K034J1181N616o695k977K287j0564
329c0291m640J5285L554l019N710n497j1162j061J1401R173k065K471q33j6245
$$ plain form
231 -35992 -26678 -26519 -26193 -28727 -44085 -48985 -26641 -18707 -26054 -12561 -13984 -33128 -30039 -19695
245 -19695 -12208 -7283 -32 1467 -17551 -20458 -2344 -861 3200 21486 14437 -2056 -2634 3891
259 3891 14148 22131 32569 26986 5583 10972 25136 22492 28362 37709 29142 23745 24895 26207
273 26207 26664 29195 45572 43511 25401 26321 27079 22769 34659 45461 37598 25552 21165 23505
287 23505 20417 27059 42498 29131 13374 17551 14239 11862 22330 25170 15574 7137 7020 5845
301 5845 -2712 4443 15644 4033 -564 -864 -13332 -15596 -5192 2856 -2191 -12500 -14616 -21724
315 -21724 -28454 -11392 -3383 -15733 -17818 -21025 -31173 -29139 -17958 -12342 -19037 -22014 -19727 -30291
329 -30291 -34931 -19646 -16092 -19111 -13401 -18898 -30060 -31121 -19720 -10547 -12612 -10141 -10974 -27219
343b7219P29J6387K188J519O576o523r847Q45J0191L440J033R558l945j3494L259
358e303O255l05P433P620m345j0322k263O923J398L701J1629o209j2406K763K594
373I163k617O650R897n137j1848L135K447p057Q083J0774j0022m825L646n992
387F297k818Q141O554o205m999K147n163m062Q938M924n871k409j129k571k831
402a057L840P342o668l889M913o152m766R203K779o700j135L570l678n781P376
417h03M196q701L337K628j0009J484P328r47k584k28P17m074k338Q904M19p255
433g926L978j0o108K192L636J286k295N35O20o484L44R809l547l208O701m998
449e475l805L085J669J491r13P11k96o586L232O262n027K778M155o344j268K450
$$ plain form
343 -27219 -26490 -10103 -7915 -6396 180 -6343 -16190 -15345 -5154 -1714 -681 8877 4932 -8562 -5303
358 -5303 952 647 8080 15700 11355 1033 -1230 5693 7091 10792 22421 16212 3806 6569 9163
373 9163 6546 13196 23093 17956 6108 9243 11690 4633 12716 23490 13468 8643 12289 6297
387 6297 3479 11620 18174 11969 6970 9117 3954 -108 8830 13754 7883 5474 4345 1774 -1057
402 -1057 2783 10125 3457 -432 4481 -1671 -6437 2766 5545 -1155 -2290 1280 -2398 -8179 -803
417 -803 3393 -5308 -1971 657 -9352 -7868 -540 -1487 -4071 -4299 -3582 -7656 -9994 -1090 -671 -7926
433 -7926 -3948 -3958 -10066 -7874 -4238 -2952 -5247 -4712 -4092 -10576 -10232 -423 -3970 -7178 -477 -5475
449 -5475 -9280 -6195 -4526 -3035 -3948 -3237 -3533 -10119 -6887 -625 -5652 -2874 1281 -5063 -6331 -3881
465c881K619J99r66N106l053o727P098J209m614P749N87p642K348O15P30R78J680
482D035M489o314l757O567j735j093O825j228l042m39r30K058j274L072O335q168
498E401k472N118m792M67Q119j964m647m98N86q57j967O950O09p928L389L30p613
515a769M316M387l136m60j09j685k830k388O568R29m844K780l361n634L067M170
531AR4k972m35K66n668Q87P748m958k358O401m070n255L470K307k587J036L934
548b159l428m936L252K887l354L294L794n346k090K137K292m57M14L494k312m241
564f759M711J852l959L011L727l172k062L518J148m626L847N392o123r45M798
579D358k858j401M859J273l863o02K867j165k105N284q8m584J249J358j751n23
$$ plain form
465 -3881 -1262 -1063 -2029 3077 24 -6703 395 1604 -3010 4739 5326 -2316 32 647 1377 2355 4035
482 4035 8524 2210 -1547 5020 3285 2192 9017 7789 4747 4308 3378 5436 4162 7234 13569 5401
498 5401 2929 8047 3255 3722 11841 9877 5230 4732 5318 4461 2494 9444 10053 2125 5514 5844 -1769
515 -1769 2547 6934 3798 3338 3229 1544 -1286 -3674 2894 3823 -1021 1759 -1602 -7236 -4169 1
531 1 95 -2877 -3312 -3046 -8714 -7827 -79 -5037 -7395 -994 -5064 -10319 -6849 -4542 -7129 -6093 -2159
548 -2159 -5587 -10523 -7271 -4384 -7738 -4444 -650 -5996 -8086 -5949 -3657 -4114 -3700 -206 -2518 -6759
564 -6759 -2048 -196 -4155 -1144 2583 -589 -2651 867 2015 -2611 1236 6628 505 -440 4358
579 4358 1500 99 4958 6231 2368 1766 4633 3468 1363 6647 6559 1975 3224 4582 2831 2308
595B308K720O81l254p24K977k684k392N419n95m016K423o06l405Q4M127O10m304
612f31M52J992n606J059O496l709j928K805k385k170N38L768n05l435M265o33
628C73o398L157L536l387J714K968k599l200N38L410j581K15N336m111m872M451
644d50Q53k203L018J771k067k482J155K711l857Q21O571m059k875L817k939k215
660b430L603K947q29l312J598l07m915M723L816m555O22J265l916q27K634J871
676A988j472j480K587k333m264M507J358l770K597J638l689k074J879J650k214
691c092J191L753m523l564M940j093k047M546J20l054j434K429M21k551L393K441
707A876m873Q9L349k768n26L417J017k193m53K675k268k106N353P44m256K343
$$ plain form
595 2308 5028 5709 2455 1731 4708 2024 -368 5051 4456 440 2863 2257 -1148 -1064 3063 3673 -631
612 -631 -179 1813 -3793 -2734 3762 53 -1875 930 -1455 -3625 -3087 681 176 -3259 1006 373
628 373 -6025 -2868 668 -2719 -1005 1963 -636 -3836 -3298 112 -1469 -1254 4082 -29 -4901 -450
644 -450 403 -1800 1218 2989 922 -1560 -405 2306 -1551 -730 5841 1782 -1093 2724 -215 -2430
660 -2430 1173 4120 3291 -21 1577 1270 -3645 1078 4894 339 961 2226 -1690 -2517 117 1988
676 1988 516 -964 1623 -710 -4974 -467 891 -2879 -282 1356 -2333 -4407 -2528 -878 -3092
691 -3092 -1901 1852 -2671 -6235 -1295 -2388 -4435 111 231 -2823 -4257 -1828 -1407 -3958 -565 1876
707 1876 -2997 -2908 441 -2327 -2853 564 1581 -612 -1065 1610 -658 -2764 2589 3333 -923 1420
723A420J656m191R94L725j62k474J395J537l740KN010k638j879L355n71k819J008
740A628K388j519j687K327R84m560J468K715k974mK479j167k913J066J902j777
756C56j028L019j219l963L192P09k660R70J317j549j882K169Q40k521m9K991k493
773a801j997L671p49k153J324J375j318j531K295Q50k885J703J895l249J31L089
789F50j304o51J217N96k080k50L165q79j865K169N37l513J944J763j531j42J499
806A325J45k760P17K974k454l06K993j471k608J354Q62j231L99K273j407k768
822a963J276J472k189J427J961k551j423R25P48j035O00J307o76k417J766L1j931
839b672J783J616j278j080J74K22j396J241L218k194j602K367j740j156L032Q35
$$ plain form
723 1420 3076 -1115 -121 3604 3442 968 2363 3900 160 162 5172 2534 655 4010 3439 620 1628
740 1628 4016 2497 810 3137 4121 -439 1029 3744 770 766 3245 2078 -835 231 2133 356
756 356 -672 2347 1128 -2835 357 1066 -1594 -624 693 -856 -2738 -569 271 -2250 -2299 692 -1801
773 -1801 -3798 -127 -876 -3029 -1705 -330 -1648 -3179 -884 -34 -2919 -1216 679 -2570 -2439 650
789 650 -654 -1305 -88 508 -1572 -1822 1343 464 -1401 768 1305 -2208 -264 1499 -32 -174 1325
806 1325 1470 -1290 -573 2401 -53 -359 2634 1163 -1445 -91 771 -460 -61 2212 805 -1963
822 -1963 -687 785 -1404 23 1984 -567 -1990 -1065 -317 -1352 -752 555 -121 -2538 -772 -741 -2672
839 -2672 -889 727 -551 -1631 -1457 -1235 -2631 -1390 1828 -366 -1968 399 -1341 -2497 535 1370
855A370j310o14R28l02p11J428J607j717j09J897j768m39K084M1k54k89J378q87
873B333k401K754P25k029J525J222l275K31K460l40j756J408O73k971j46L458
889C871k122j788L159j339k244J641O01j544k18R31R6k358j5K122j957m09J898
906C25j668j600O53O71j62o49J015ql715J776K156k464R41J198j929q28Q45Q50
924b593o01r6J767r93k009K012K63r95K325J34j315m81L39Q55k76Q31J967j636
942e02j369K412r16q77K864O21j336n32J089n20n28K181J158k339n1K160j951
959A564m65K514k78n88m24J031j162j104K447M64k377P76J443k696j05K091o25
976B506r54M16Q06k624L38J979r32j450J544l05k133J071J084j414j003J553N0
$$ plain form
855 1370 60 -554 374 72 -639 789 2396 679 570 2467 699 260 2344 2385 2131 1842 3220 2333
873 2333 -68 2686 3411 1382 2907 4129 854 1085 3545 3205 1449 2857 3530 559 413 3871
889 3871 1749 -39 3120 1781 -463 1178 1779 235 17 948 1044 -1314 -1329 793 -1164 -1573 325
906 325 -1343 -2943 -2290 -1619 -1781 -2430 -1415 -1423 -5138 -3362 -1206 -3670 -2729 -1531 -3460 -4288 -3443 -2593
924 -2593 -3194 -3290 -1523 -2516 -4525 -2513 -2250 -3245 -920 -786 -2101 -2582 -2243 -1388 -1664 -833 1134 -502
942 -502 -1871 541 -375 -1252 1612 2233 897 365 1454 934 406 2587 3745 1406 1355 3515 1564
959 1564 1099 3613 3335 2747 2323 3354 2192 1088 3535 3999 1622 2398 3841 1145 1040 3131 2506
976 2506 1552 1968 2774 150 488 2467 1535 85 1629 1324 -809 262 1346 -68 -1071 482 532
993E32j934L57J362j325n87J385n96j687J375P94j190r60J417K62j697J091J006
1010c95j610J18J516j200j226J750R38j373j48J280j444o30K114M17j386L20Q84
1027g5j034r07J707P31j326O54R69k202l37K328k57r62R74L39k072J4J709j54
1045I9o05J592l93k323M06J413o79K86J032n93k007L03J708p46l18K507j127k272
1063a717R08N90l63O42J521q98j893M86Q64j351J525J818j468j042O96k98j33
1080a13J260J278r36r07M27j38q60J428J855j439n01K74q13l85J518J428o80j036
1098A660L93n89j565K275J064j303N49l65j491q01J780J051j073j03K79j873q77
1115i89J996K82r85Q83k00j967p09Q74N92l74L72J9k190n64K128j008j37J316
$$ plain form
993 532 -1402 -1045 317 -1008 -1595 -210 -806 -2493 -1118 -324 -1514 -2474 -1057 -795 -2492 -1401 -395
1010 -395 -2005 -1887 -371 -1571 -2797 -1047 -109 -1482 -1630 -350 -1794 -2424 -310 107 -1279 -959 -75
1027 -75 -1109 -2016 -309 422 -904 -250 719 -1483 -1820 508 251 -711 263 602 -1470 -1456 253 99
1045 99 -506 1086 693 -1630 -1224 189 -490 -204 828 235 -1772 -1469 239 -507 -825 1682 555 -1717
1063 -1717 -809 -219 -582 60 1581 683 -1210 -724 140 -1211 314 2132 664 -378 318 20 -113
1080 -113 1147 2425 1489 582 1009 871 11 1439 3294 1855 1354 1628 815 430 1948 3376 2696 1660
1098 1660 2053 1464 -101 2174 3238 1935 2484 2119 628 -173 1607 2658 1585 1482 1761 -112 -989
1115 -989 1007 1289 304 1187 987 -980 -1689 -815 -223 -597 -225 -206 -2396 -2960 -832 -1840 -1977 -661
1133f61q79j488m70Q92J41l35J196L0k226K47J221q10K93J376o96j273L12P32
1151b398j32o9J778m21j647J053Q53j504J371J384p77j027O83R37n45O35R13k38
1169H49j057R86N36l19J254R67j772O0J0M37j54R57P79p97j040Q81o92j83J718
1188C420L75j126n90J06r9l30J203O32j340l47L84j397k41J956l21q58r8n15r18
1207a04r9J281R5q94L4k45j594O79R51k3l50j39o98q78l88J888m61n37J118r66
1227a330j764O58J488n73j02P57n10j296K97J340l63j14J153q08j416J228J92
1244a163l42Q49N03m27j195M60R05o40N86Q88j000p39J152j6m13P35M92o34r11
1263i10J182M2m84O19L53r86k80O58r2o4P27L62j230m15J045l47j047K185o11
$$ plain form
1133 -661 -1540 -3028 -3498 -2606 -2465 -2800 -1604 -1574 -3800 -3553 -2332 -3142 -2849 -1473 -2169 -3442 -3130 -2398
1151 -2398 -2530 -2599 -821 -1242 -2889 -1836 -983 -2487 -1116 268 -509 -1536 -853 84 -461 174 1087 849
1169 849 -208 778 1314 995 2249 3216 1444 1504 1514 1951 1797 2754 3533 2736 1696 2577 1885 1702 3420
1188 3420 3795 2669 2079 2185 2086 1756 2959 3591 2251 1904 2288 891 650 2606 2285 1427 1329 814 -104
1207 -104 -203 1078 1173 279 313 68 -1526 -847 104 81 -269 -408 -1106 -1984 -2372 -484 -945 -1482 -364 -1330
1227 -1330 -3094 -2436 -948 -1521 -1623 -866 -1376 -2672 -2375 -1035 -1398 -1512 -359 -1167 -2583 -1355 -1163
1244 -1163 -1505 -656 -153 -580 -1775 -1315 -410 -1050 -464 424 -576 -1315 -163 -179 -592 143 635 1 -910
1263 -910 272 314 -170 449 802 -184 -464 194 102 38 765 1127 -103 -518 527 180 -867 1318 707
1282G07j067k78J031j73j37P60k1j224P7Q66p99J79J244m61q84L32J90n31K82
1301I3J132n7j095J14L64p50O50J151m96l95j41p4m93L84J730l35j179O94l94
1320I03j326J338Q94n41k30k2q2j307R80J218q17j22M57j385o15J386J19k33k36
1339C79l5n74r90P56J063r32L86L2j254n39R36q3L13l1J10j090j021J003P89n36
1359a318O27l06j042n74P25K47q6Q46J2q31q99J027j46j50J671n74p96l79O71
1378a275RJ89J061L5r46r1P42n40P71P67k89Q8o47M36jn6J485J32j257K25L86
1399A224m91R65M05N3m24k97M75r84P18J174o88p90M22l42o63J266k13j94m81
1418A135J36k7o81N10N40q59P3M5r55J53L39J21j4r56J21j04q67J192L41j231
$$ plain form
1282 707 -360 -638 393 220 83 843 822 -402 -325 541 -258 -79 1165 704 -180 152 342 -189 93
1301 93 1225 1168 73 187 551 -199 451 1602 1106 711 570 496 3 387 2117 1782 603 1297 903
1320 903 -423 915 1809 1268 1038 1016 934 -373 607 1825 1008 886 1343 -42 -657 729 848 615 379
1339 379 344 -230 -1220 -464 599 -333 53 85 -1169 -1708 -772 -855 -542 -573 -463 -1553 -2574 -1571 -782 -1318
1359 -1318 -691 -997 -2039 -2613 -1888 -1641 -1727 -881 -869 -1700 -2599 -1572 -1718 -1868 -197 -771 -1567 -1946 -1275
1378 -1275 -1266 -1077 -16 19 -927 -1018 -276 -816 -45 722 433 521 -126 310 309 253 1738 1870 613 838 1224
1399 1224 733 1698 2103 2156 1732 1435 1910 926 1644 2818 2130 1340 1762 1420 757 2023 1810 1616 1135
1418 1135 1271 1244 563 1073 1613 754 827 872 -83 70 409 530 516 -440 -319 -423 -1290 -98 243 -988
1438i88N17j51q10j22L91Q38m31p13L52n94m35J769l89p39O34n48m75k6N14Q44
1458e62k53J36J58j446k0J599k67M08M06j149kO3L27J159m18L69K86j968M36J107
1478C69l14J134K0j020%m99N93P22k19Q54l00j486O26j87l28J456N7n18n93n88
1498b21O51O4l64J374q32j391J183p49k17J324k18J40o98n71O38p88O51R01j116
1517b39k11N30j141K89P36K3M63q33l23M62j246J437J076j421J54K92r70O05L99
1536H2K05k32k75N30m70q01J674n0p51N39j86o49M56L20K99j21k66L58q50q5J329
1557A056l96m13O37n90m22J89J42L88k00j96L76j048j75J002n39P8N85p76o41
1576i43K92N57J41l94n9J07j096N19Q34n46KL50m47l23q0O7J025n07n7P40j307
$$ plain form
1438 -988 -471 -622 -1432 -1554 -1163 -325 -756 -1469 -1117 -1711 -2146 -377 -766 -1505 -871 -1419 -1894 -1920 -1406 -562
1458 -562 -815 -679 -521 -1967 -1987 -388 -655 -247 159 -990 -992 -929 -602 557 139 508 794 -1174 -738 369
1478 369 55 1189 1209 189 189 -310 283 1005 786 1640 1340 -146 480 293 -35 1421 1478 960 367 -221
1498 -221 430 494 130 1504 672 -719 464 -285 -502 822 604 744 46 -525 113 -675 -24 877 -239
1517 -239 -450 80 -1061 -772 -36 -13 450 -383 -706 -244 -1490 -53 1023 -398 -244 48 -922 -317 82
1536 82 287 55 -220 310 -160 -961 713 663 -88 451 265 -384 72 392 691 570 304 662 -188 -273 1056
1557 1056 660 247 884 294 -128 61 203 591 391 195 571 -477 -652 350 -189 -111 474 -302 -943
1576 -943 -651 -94 47 -347 -406 -299 -1395 -876 -42 -588 -586 -236 -683 -1006 -1086 -1019 6 -501 -558 182 -1125
1597a125Q73M91j113K57R65q79J82l45N00J10J55M43n36l73M59K44l16Q75j16
1616G51n18J61K24k87l9O39L37l57k98L14m3j11L78r9k69j35L64l93J12K07rn49
1638C80K38K36q86L18N85l08m11M02k51l94Q2L02l10l37J30r7l66K76J59j62l36
1659g50P7J92n30K23L26l20k55L25m1p84O88K99n39J95J16p4k2lK22l51L37K90
1681c79k95O1K90j50l0L19mn0k20N39L85m70M31j28j69J47N79j67j75J36n8j09
1703D83K55K19k97R4K98k81k74N6J49J93k73J61j67k59K7L80k80M3J77m04n41
1724b41M52Q6j62J07M3j67o03L44J57l76L63Q1n51o3j9J87q1P4L08m97m24J49
1746h33M50k43L03K24l73l92L39l24J57R4O66m76M0L58l41j00N06L01l56k45K24
$$ plain form
1597 -1125 -252 239 -874 -617 348 -531 -349 -694 -194 -84 71 514 -22 -395 64 308 -8 867 751
1616 751 233 394 618 331 292 931 1268 911 613 927 884 773 1151 1052 783 648 1012 619 731 938 929 380
1638 380 618 854 -32 286 871 563 152 554 303 -91 -9 293 -17 -354 -224 -321 -687 -411 -252 -414 -750
1659 -750 -673 -481 -1011 -788 -462 -782 -1037 -712 -753 -1537 -849 -550 -1089 -894 -778 -852 -874 -877 -655 -1006 -669 -379
1681 -379 -674 -613 -323 -473 -503 -184 -188 -238 -458 81 466 -4 427 299 130 277 856 689 514 650 592 483
1703 483 738 957 660 754 1052 771 497 553 702 895 622 783 616 357 384 764 484 527 704 300 -241
1724 -241 211 297 135 242 285 118 -485 -141 16 -360 3 84 -467 -530 -549 -362 -443 -369 -61 -558 -982 -833
1746 -833 -383 -626 -323 -99 -472 -864 -525 -849 -692 -598 68 -408 -368 -10 -351 -451 55 356 0 -245 -21
1767b1J11P3M39k58J58j81r5o3P5L28M8m34J09K18k42j93O25N5k57N0J38o78N40
1790E45M8l55Q2K02l02j66j19N35l63Ok6l21j06J50K1P3k67J56k6m80K26N37l95
1813c45l19M91n06q5K21J63j97n8O5k35K77p5J95k12L48Rm4l82m1N49k6J07K3
1836g7j39k2o8L90K95m03M33l14m26O80J21k60M46J66n64j50L92N4J6J80k21J9
1858E48j29J54J8J42J8j30k86L8l7O0J13L79l49j92k93L4MK2L84l14n40K17K14
1881G5m83L01J94m8l15P4n1l24L82O09p79J02j65O7%J3K67n3m2m40J12J08M2M03
1905D9j89J2R3m85K17J53r1j1J65N6K53m75K97L08K1j26m5k77J04M49j33j41J76
1928C80Jm36J99K7K35n7oMl81r8P6K27l87M8K89k91pK4J54j69K19j78k62o7J8
$$ plain form
1767 -21 90 163 602 344 502 321 226 163 238 566 614 180 289 507 265 72 697 752 495 545 683 5 545
1790 545 593 238 320 522 220 54 -65 470 107 113 87 -234 -340 -190 -169 -96 -363 -207 -233 -713 -487 50 -345
1813 -345 -664 -173 -679 -764 -543 -380 -577 -635 -570 -805 -528 -603 -408 -620 -272 -263 -307 -689 -730 -181 -207 -100 -77
1836 -77 -216 -238 -306 84 379 -24 409 95 -331 349 470 210 656 822 258 108 500 554 570 750 529 548
1858 548 419 573 591 733 751 621 335 373 336 396 509 888 539 347 54 88 92 114 498 184 -356 -139 75
1881 75 -408 -107 87 39 -276 -202 -253 -577 -195 414 -365 -263 -428 -361 -361 -348 -81 -134 -176 -616 -504 -396 -354 49
1905 49 -140 -128 -35 -520 -303 -150 -241 -252 -87 -31 222 -253 44 352 373 247 202 -75 29 478 345 204 380
1928 380 381 -55 144 171 406 349 343 347 -34 -132 -56 171 -216 -168 121 -170 -177 -153 1 -168 51 -127 -389 -456 -438
1953d38J48OJ06l9k66r9J82n61M33M31k5j99k06q0kM21J23m64K27r0J50o05M88
1976c59K59J94l38q6M20j61K69m7K12l89J19M35l28K89j9J97k2m7k13q3M78J2
1998G92K01l61j06L57Mj18N21l25j88N4j6q1K03k79RJ17l4j32m66L65J20l48R8
2021C87k79k89N5j36j3l1K3j42J2k28M12l54k39L65j15j57L6j74lJ3O6q0p0j46
2045a087K37J2k37K71j74L27j63J77k43J3J46K17l40R6M78K9N7q9m7l06N9M92
2067g5Q3l87N07K93o62J68O55L1l7j01k73j26N56O53n89j45M34r9l82k79J30L29
2089F84O32j82q03L57r80R81R75r17L01j48O4n18K10j51k94M97m13j47J68K77
2109E93m15J3J37m85K56j90mn8K21j67j80K12k5k32j32J99J60j88J45q8pj02L09
$$ plain form
1953 -438 -290 -284 -178 -217 -483 -582 -400 -961 -528 -97 -122 -321 -527 -607 -609 -188 -65 -529 -302 -392 -242 -847 -359
1976 -359 -100 94 -244 -330 90 -71 198 151 363 -26 93 528 200 489 470 667 645 598 385 302 780 792
1998 792 993 632 526 883 887 769 1290 965 777 831 815 734 937 658 667 784 750 618 152 517 637 289 387
2021 387 108 -181 -126 -262 -275 -306 -283 -425 -413 -641 -229 -583 -822 -457 -572 -729 -693 -867 -870 -857 -791 -871 -941 -1087
2045 -1087 -850 -838 -1075 -804 -978 -651 -814 -637 -880 -867 -721 -504 -844 -748 -270 -241 -184 -273 -320 -626 -567 -75
2067 -75 8 -379 128 421 -241 -73 582 613 576 475 202 76 632 1285 696 551 985 886 504 225 355 684
2089 684 1316 1134 331 688 -292 689 1664 747 1048 900 964 446 656 505 211 708 295 148 316 593
2109 593 178 191 328 -157 99 -91 -95 -153 68 -99 -279 -67 -92 -324 -456 -257 -97 -285 -140 -228 -235 -337 -28
2132b8p1j93N7j9k2J22K32k08j88K16P9J89p7l1J78j51k03k4q0J91L6J43j38K6
2156C6N6k53P9K11o2j05J44k65O8m19M20j55R9m3m6k69K16p5N1N1j61K2j63K61
2180c02o2O5j69J67R2m26J19J00J25k17K83k07K1Q6M8O4L10o8l14M3M52pn48M82
2204A37J2J27k43K15J02l36M67p1Jk46K66m8Q3O15o67M02J8lK17k69K32k51l76
2227C84M08n0l01K08J5J43j13o4Jk55J11q2O1k23L43k55q6j30Oj60kj96K8r3K30
2252g2n5o10o1O25j61P29o55o07J57n21O56l60n6J09L75m61K14J07j76j27J84
2273g66K38k75O2P4j30M22n4j00m8K17j86K1n4N77l16r0N90k57L35k58N24l74
2295A52l6J66n2J96J28J14r4k47J67J41q2o8L8J53j02l7l9K6r6J73Oj00L59j83
$$ plain form
2132 -28 -99 -292 -235 -254 -276 -154 78 -130 -318 -102 -23 166 89 58 236 85 -118 -142 -222 -31 5 148 10 36
2156 36 92 -161 -82 129 67 -38 106 -159 -91 -510 -90 -245 -146 -189 -235 -504 -288 -363 -312 -261 -422 -400 -563 -302
2180 -302 -364 -299 -468 -301 -209 -635 -516 -416 -291 -508 -225 -432 -411 -325 -277 -213 97 29 -285 -242 210 203 -345 137
2204 137 149 276 33 248 350 14 481 410 411 165 431 383 466 1081 414 816 834 831 1048 779 1011 760 384
2227 384 792 742 441 649 664 807 694 630 631 376 487 405 466 243 586 331 245 115 121 -39 -41 -237 -209 -302 -72
2252 -72 -127 -737 -798 -173 -334 395 -260 -867 -710 -1231 -575 -935 -991 -882 -507 -968 -754 -647 -823 -950 -766
2273 -766 -528 -803 -741 -667 -797 -375 -429 -529 -577 -360 -546 -525 -579 -2 -318 -408 182 -75 260 2 526 152
2295 152 116 282 230 426 554 668 574 327 494 635 553 485 523 676 574 537 498 524 428 601 607 507 866 683
2319F83j98QJ5l14J44K64m92k04J70L2k6J1K84l56j49R7J10r2j19j3L7k9l56J62
2343c31K07kj59n9r5K6K73k65L3J76j04J8qJ50j6j13MK4l6K6RL2L41j04j99J74
2369Bl98M99k30Q8K7J77k27MK24l63M33k49P1J19k53K43j31Q2K05l00j58L5J0
2392i0Q5k9r3M62n68J10J12k71K47J15l34L73k19J0n4P4P6j95K3O3J23l48L02
2415b6m6n7Lk27J24j72M75l48J20J59jm1l3J52j97K71p9Q4Lj17K96Ml89J69K85
2440D12k24J60J89j38J21J8k87R1k1J09O3j31j44L0r2L89k12j28NJ9k1j95J98
2463B11J86m50P2L54m54j40k6K33m6l6j6j77k23J51K68n5r4O1j96qk43K53J11
2486b64j26K4j71j94K57r7j5M20k53K7j78J70j70K87j2J18l61K58M2kn1L33l06
$$ plain form
2319 683 485 493 508 194 338 602 110 -94 76 108 82 93 377 21 -128 -31 79 -13 -132 -145 -108 -137 -493 -331
2343 -331 -124 -126 -285 -344 -439 -413 -140 -405 -372 -196 -300 -282 -290 -140 -156 -269 -265 -241 -277 -251 -242 -210 131 27 -172 2
2369 2 -396 103 -127 -39 -12 165 -62 -58 166 -197 236 -13 58 177 -76 167 36 118 323 23 -135 -100 -90
2392 -90 -5 -34 -127 335 -233 -123 -11 -282 -35 80 -254 119 -100 -90 -144 -70 6 -189 -166 -103 20 -328 -26
2415 -26 -72 -129 -126 -353 -229 -401 74 -274 -154 5 4 -37 -70 82 -115 156 77 161 164 47 343 347 -42 127 412
2440 412 188 348 537 399 520 538 251 342 321 430 493 362 218 248 156 545 333 205 210 229 208 13 211
2463 211 397 -53 19 373 -81 -221 -247 -14 -60 -96 -112 -289 -512 -361 -93 -148 -242 -181 -377 -385 -628 -375 -264
2486 -264 -390 -366 -537 -731 -474 -571 -586 -166 -419 -392 -570 -400 -570 -283 -295 -177 -538 -280 -238 -240 -291 42 -264
2509b64M6J17J29Km7J56O0k19J54q0K10r8K81q1r0K89M6k58J44R9Mk75K77k23
2533C79j23M36M2k08jk24J27p1M3R5j07q4j56j4K6j26J80n7Nk39n8rj84L10m41
2558d59L59K35m53l17L67J53l3J28n01K03j4K33l04RJ06M8m1j04L12n02K94j1
2580b92P5k25Q6K85j29j31M54k48n1J96j28j37M24j5K3k39L5M46l49K2L29j32
2602B99k70J81j7k53K29L1J14l34J26j2M2K50j53Op3k51k6R5K98k48J94l49r1
2625b12P1J54J81p5j43Lj03l66L25m5m1O6M6k04P9P28q09J11K72K5j44l08R5M43
2649A49n69O3M20m19O25r87O91M81O8j095P85l81k39N35J62r68J106p34P71K76
2669G40n99j934J040K055j032r20n76K006k96m10L25m58p60P29N70l57n11P26
$$ plain form
2509 -264 -218 -101 28 30 -17 139 199 -20 134 54 264 166 447 366 276 565 611 353 497 596 600 325 602 379
2533 379 256 692 734 526 525 301 428 357 400 495 388 304 148 134 160 34 214 157 162 -77 -135 -144 -328 -18 -459
2558 -459 -100 135 -318 -635 -268 -115 -148 -20 -521 -318 -332 -99 -403 -394 -288 -240 -281 -385 -73 -575 -281 -292
2580 -292 -217 -442 -356 -71 -200 -331 123 -125 -176 20 -108 -245 179 164 187 -52 -17 429 80 102 431 299
2602 299 29 210 193 -60 169 200 314 -20 106 94 136 386 233 239 166 -85 -111 -16 282 34 228 -121 -212
2625 -212 -141 13 194 119 -24 -21 -124 -490 -165 -210 -251 -185 -139 -343 -264 464 -345 -234 38 63 -81 -389 -294 149
2649 149 -420 -357 63 -356 269 -718 -27 454 522 -573 212 -169 -408 127 289 -679 427 -307 464 740
2669 740 141 -1793 -753 1302 270 -650 -1226 780 484 74 399 -59 -819 -90 480 123 -388 338
2687C38Q63j120M9m8k5J24L15m16k9o05M68l56N34k60o3L79M17q31j05L4L47k31
2709b21j22K81q6k05L28l70J85n5j29O1o4M7K9l1J80k02k41N74jk2j31J14J78
2732I7m30L09j82q5L70j60K23p7p5N20k98m4LK38j23m75P50j02M1J34l36j14j30
2755E4M83o90O50J57p42lK42RN9Q4o8N2M17o92L80l72J56r8K80l85K07k45n6K91
2779A70o93L41N35j20m41j66J80K99n18P36j43n63l1M15M51m0j52m25K03J42j99
2800a9K16n34m60K70J23m11O47R69n10q64J684j291N55j024J216m76n62j79R86
2819C36r1J7p9j42j59N19l45O76l67q48K47N03L62o88J85J64M80r28N81K84l46
2840C61K89p0M6n05m72J079j84m78k10N35l75L99l72l33L69K2M3n51J56O46m04
$$ plain form
2687 338 1201 81 130 82 57 181 496 80 51 -554 -86 -442 92 -168 -231 148 565 -266 -371 -337 10 -221
2709 -221 -343 -62 -148 -353 -25 -395 -210 -265 -394 -333 -397 -350 -321 -352 -172 -374 -615 -41 -42 -64 -195 -81 97
2732 97 -333 -24 -206 -291 79 -81 142 65 -10 510 212 168 171 409 286 -189 561 459 500 634 298 184 54
2755 54 537 -153 497 654 -88 -91 151 160 219 303 235 287 704 12 392 20 176 78 358 -27 180 -65 -121 170
2779 170 -523 -182 353 233 -208 -374 -194 105 -413 323 180 -383 -414 1 452 412 260 -165 38 180 -19
2800 -19 197 -337 -797 -527 -404 -815 -168 801 291 -573 1111 -180 375 -649 567 91 -471 -650 336
2819 336 245 262 183 41 -118 401 56 732 365 -483 -236 267 629 -59 126 290 770 -158 423 707 361
2840 361 650 580 626 121 -351 728 544 66 -144 391 16 415 43 -290 79 101 144 -407 -251 395 -9
2861iM5L28m61m88M63o19L27M60l72r1j83L77N91m63q9k2j74Q5L55L21l93J62
2883A50J31k57r5M10j16l74M35JL96J67o11m92M88L06n52r2L90l19M07r60P56
2904A69kN52j065L64N08J35j311N40M7P39n78n90P83K20L11q16P9K43K32p09N2
2925i7LJ155j140m1k43K76O83j260K10O52l34J07J31l52K74p6p55L71J7K83L70
2946B34j55Q8m34j14M3j91P25j53k43J68j16m47L18M04K98n87O12r15M41j66L42
2967A52l05N04p0O8k20n3K07j4m1p3j11K77N3m84mK88j5K6k39K10j26J40J87j00
2991B57l51Q5o7R0L4j67J6k75M62J26l11j77M61l14j21L40j93k62K78O5k2k27
3013b73J53N3j93M48j23j73P9n2L6j22J85j20K6k7K6K12l08j23M13k10P7J63k15
$$ plain form
2861 -9 36 364 -97 -585 -122 -741 -414 46 -326 -417 -600 -223 368 -95 -184 -206 -380 -295 60 381 -12 150
2883 150 281 24 -71 339 223 -151 284 285 681 848 237 -255 233 539 -13 -105 285 -34 373 -587 169
2904 169 167 719 -346 18 526 661 -650 -110 -63 676 98 -492 291 511 822 6 85 328 560 -149 -97
2925 -97 -94 1061 -79 -120 -363 -87 596 -664 -454 198 -136 -29 102 -250 24 -52 -807 -436 -419 -136 234
2946 234 79 167 -267 -381 -338 -529 196 43 -200 -32 -148 -595 -277 127 425 -162 450 -465 -24 -190 152
2967 152 -153 351 281 349 129 76 283 269 228 155 44 321 374 -110 -114 174 159 185 -54 156 30 170 357 257
2991 257 -94 -9 -76 14 48 -119 -103 -378 84 210 -101 -278 183 -131 -252 88 -105 -367 -89 -24 -46 -273
3013 -273 -120 -67 -260 188 65 -108 -29 -81 -45 -167 18 -102 -76 -103 -77 135 -173 -296 117 -93 -16 147 -68
3036f8p5K07M1PJ93k96J55mj0J46j80J80J7k74j15L75j92j70K37l9r0q7L02k69
3060ij39K17J28j61o3O4R9J02m9r0l07M0o9J90q2Q4M1k14K83p6j07k95K52p6K13
3085b4j0j60j42J28lj58K16n2jJ84j67Jk5j31K14K33l43m0O72l86r8O4L1K5J29
3110A57qj60N32k29N32p85p28Q85M03o54q5M01k04J66J37n18J13K30j35N5J64
3131B69k6q9q2K25o2j33J51q2j44R2JM5o7J96k85j67K83j50j55j33J02k2m5K61
3155a7l12K31j06J32k03J67j71J22j80L4K06j86J2j72L43K9j62lJ70j49Ro4j7
3178b87L00r4l4J4K32k59K20k9n3k6M4R2J64l11K83k29K83k53J63L7l48L15r9
3201A25J71k23J1OQ8K61L9l97j1K97m44j5J40K01k34J43j96n9rJ08j49M7K56J1
$$ plain form
3036 -68 -143 64 105 112 305 9 164 160 150 296 116 296 313 39 -76 299 107 -63 174 135 45 -42 260 -9
3060 -9 -148 69 197 36 -27 37 136 238 189 99 -208 -168 -237 -47 -129 -45 -4 -218 65 -11 -118 -413 -161 -237 -24
3085 -24 -34 -194 -336 -208 -211 -369 -153 -205 -206 -22 -189 -188 -213 -344 -130 103 -240 -280 392 6 -92 -28 3 28 157
3110 157 149 -11 521 292 824 39 -689 196 599 -55 -140 261 57 223 360 -158 -45 185 50 105 269
3131 269 243 154 72 297 235 102 253 171 27 119 120 165 98 294 9 -158 125 -25 -180 -313 -211 -233 -278 -17
3155 -17 -329 -98 -204 -72 -275 -108 -279 -157 -337 -303 -97 -283 -271 -443 -100 -71 -233 -236 -66 -215 -206 -270 -287
3178 -287 13 -81 -115 -101 131 -128 92 63 10 -16 28 120 284 -27 256 27 310 57 220 257 -91 224 125
3201 125 296 73 84 90 178 439 478 81 70 367 -77 -92 48 249 15 158 -38 -97 -106 2 -147 -100 156 167
3225A67l71L02j64j44K46N1o9j38j02p3j67M16Q4k23N3L28l68R0P1j48J62n5k43
3248b95M6M16j94J67j90J02k16J49K60j15j92p2J11K06k19P7nN7p1J12L4j78N3
3271D3N1R2J37j77r1%j55J80J83k54k5J99j32J80k41Q2J10j09m9m7Km5k2l3l0
3296a51K81n37M19o9o2p5M8n2m4Km2q7L36k60J08j64J1P2J11K60l62L13j54mo6
3321a68J02J45k15K06j89L25j99n9O7K40j16J18n82L64MJ47j06J8m0J94K8K0k31
$$ plain form
3225 167 -204 98 -66 -210 36 87 18 -120 -222 -295 -462 -46 38 -185 -132 196 -172 -82 -11 -159 3 -52 -295
3248 -295 -249 167 -27 140 -50 52 -164 -15 245 130 -62 -134 -23 183 -36 41 36 93 22 134 168 -10 43
3271 43 94 186 323 146 55 55 -100 80 263 9 -16 183 51 231 -10 72 182 73 24 -23 -21 -66 -88 -121 -151
3296 -151 130 -407 12 -57 -119 -194 -146 -198 -242 -240 -282 -369 -33 -293 -185 -349 -338 -266 -155 105 -257 56 -98 -102 -168
3321 -168 -66 79 -136 70 -119 206 7 -52 15 255 139 257 -325 39 43 190 84 102 62 256 284 304 73
$$ [...]
8191A1
##END NTUPLES=NMR FID
##END=
