##TITLE=1H_LR-729-B-R4C1
 CDCl3
 8 sc, 
 19.11.2021
##JCAMPDX= 6.0         $$ Bruker NMR JCAMP-DX V2.0
##DATA TYPE= NMR FID
##DATA CLASS= NTUPLES
##ORIGIN= UXNMR, Bruker Analytische Messtechnik GmbH
##OWNER= root
$$ XWIN-NMR		Version 3.5
$$ Fri Nov 19 11:31:31 2021 Russian Standard Time (UT+4h)  she@DPX200
##.OBSERVE FREQUENCY= 200.131346
##.OBSERVE NUCLEUS= ^1H
##.DELAY= (6, 6)
##.ACQUISITION MODE= SIMULTANEOUS
##.ACQUISITION SCHEME= undefined
##.AVERAGES= 8
##.DIGITISER RES= 18
##SPECTROMETER/DATA SYSTEM= spect
##.PULSE SEQUENCE= zg30
##.SOLVENT NAME= CDCl3
##.SHIFT REFERENCE= (INTERNAL, CDCl3, 0, 15.7039)
##AUDIT TRAIL= $$ (NUMBER, WHEN, WHO, WHERE, WHAT)
$$ ##TITLE= Audit trail, XWIN-NMR		Version 3.5
$$ ##JCAMPDX= 5.01
$$ ##ORIGIN= Bruker BioSpin GmbH
$$ ##OWNER= she
$$ F:/spectra/data/she/nmr/H-F/1/audita.txt
$$ ##AUDIT TRAIL=  $$ (NUMBER, WHEN, WHO, WHERE, WHAT)
(   1,<2021-11-19 11:30:28.32 +0400>,<she>,<DPX200>,
      <created by zg, POWCHK disabled, PULCHK disabled
       configuration hash MD5:
       00 E9 B6 7A A2 85 ED C7 34 08 36 98 17 FE 4E 26
       data hash MD5: 16K
       52 C4 BD 64 07 E9 DF 56 88 DB AD 17 FC C0 7D 59>)
$$ ##END=
$$ 
$$ hash MD5
$$ E6 44 FF 27 D9 C1 7B 57 D7 44 28 CA B1 35 7F F6
##$RELAX= 
##$RELAX= 
##$RELAX= 
##$RELAX= 
##$RELAX= 
##$RELAX= 
$$ Bruker specific parameters
$$ --------------------------
##$DU= <F:/spectra>
##$EXPNO= 1
##$NAME= <H-F>
##$PROCNO= 1
##$TYPE= <nmr>
##$USER= <she>
##$AMP= (0..31)
100 100 100 100 100 100 100 100 100 100 100 100 100 100 100 100 100 100 
100 100 100 100 100 100 100 100 100 100 100 100 100 100 
##$AQSEQ= 0
##$AQ_mod= 1
##$AUNM= <au_zg>
##$AUTOPOS= <>
##$BF1= 200.13
##$BF2= 200.13
##$BF3= 200.13
##$BF4= 200.13
##$BF5= 200.13
##$BF6= 200.13
##$BF7= 200.13
##$BF8= 200.13
##$BYTORDA= 1
##$CFDGTYP= 0
##$CFRGTYP= 5
##$CHEMSTR= <none>
##$CNST= (0..31)
1 1 145 1 1 1 1 1 1 1 1 1 1 1 1 1 1 1 1 1 1 1 1 1 1 1 1 1 1 1 1 1 
##$CPDPRG= <>
##$CPDPRG1= <>
##$CPDPRG2= <>
##$CPDPRG3= <>
##$CPDPRG4= <mlev>
##$CPDPRG5= <mlev>
##$CPDPRG6= <mlev>
##$CPDPRG7= <mlev>
##$CPDPRG8= <mlev>
##$CPDPRGB= <>
##$CPDPRGT= <>
##$D= (0..31)
0 1.2 0 0 0 0 0 0 0 0.06 0 0.03 0 0 0 0 0.0002 0 0 0 0 0 0 0 0 0 0 0 0 
0 0 0 
##$DATE= 1637307027
##$DBL= (0..7)
120 120 120 120 120 120 120 120 
##$DBP= (0..7)
150 150 150 150 150 150 150 150 
##$DBP07= 0
##$DBPNAM0= <>
##$DBPNAM1= <>
##$DBPNAM2= <>
##$DBPNAM3= <>
##$DBPNAM4= <>
##$DBPNAM5= <>
##$DBPNAM6= <>
##$DBPNAM7= <>
##$DBPOAL= (0..7)
0.5 0.5 0.5 0.5 0.5 0.5 0.5 0.5 
##$DBPOFFS= (0..7)
0 0 0 0 0 0 0 0 
##$DE= 6
##$DECBNUC= <off>
##$DECIM= 32
##$DECNUC= <off>
##$DECSTAT= 4
##$DIGMOD= 1
##$DIGTYP= 9
##$DL= (0..7)
0 120 120 120 120 120 120 120 
##$DP= (0..7)
150 150 150 150 150 150 150 150 
##$DP07= 0
##$DPNAME0= <>
##$DPNAME1= <>
##$DPNAME2= <>
##$DPNAME3= <>
##$DPNAME4= <>
##$DPNAME5= <>
##$DPNAME6= <>
##$DPNAME7= <>
##$DPOAL= (0..7)
0.5 0.5 0.5 0.5 0.5 0.5 0.5 0.5 
##$DPOFFS= (0..7)
0 0 0 0 0 0 0 0 
##$DQDMODE= 0
##$DR= 18
##$DS= 0
##$DSLIST= <SSSSSSSSSSSSSSS>
$$ [...]
##$SUBNAM2= <"">
##$SUBNAM3= <"">
##$SUBNAM4= <"">
##$SUBNAM5= <"">
##$SUBNAM6= <"">
##$SUBNAM7= <"">
##$SUBNAM8= <"">
##$SUBNAM9= <"">
##$SW= 18.0517287032376
##$SWIBOX= (0..15)
0 0 2 0 0 0 0 0 0 0 0 0 0 0 0 0 
##$SW_h= 3612.71676300578
##$TD= 16384
##$TD0= 1
##$TE= 0
##$TE2= 300
##$TE3= 300
##$TEG= 300
##$TL= (0..7)
0 120 120 120 120 120 120 120 
##$TP= (0..7)
150 150 150 150 150 150 150 150 
##$TP07= 0
##$TPNAME0= <>
##$TPNAME1= <>
##$TPNAME2= <>
##$TPNAME3= <>
##$TPNAME4= <>
##$TPNAME5= <>
##$TPNAME6= <>
##$TPNAME7= <>
##$TPOAL= (0..7)
0.5 0.5 0.5 0.5 0.5 0.5 0.5 0.5 
##$TPOFFS= (0..7)
0 0 0 0 0 0 0 0 
##$TUNHIN= 0
##$TUNHOUT= 0
##$TUNXOUT= 0
##$USERA1= <user>
##$USERA2= <user>
##$USERA3= <user>
##$USERA4= <user>
##$USERA5= <user>
##$V9= 5
##$VALIST= <valist>
##$VCLIST= <CCCCCCCCCCCCCCC>
##$VD= 0
##$VDLIST= <DDDDDDDDDDDDDDD>
##$VPLIST= <PPPPPPPPPPPPPPP>
##$VTLIST= <TTTTTTTTTTTTTTT>
##$WBST= 1024
##$WBSW= 4
##$XGAIN= (0..3)
0 0 0 0 
##$XL= 0
##$YL= 0
##$YMAX_a= 315953
##$YMIN_a= -363719
##$ZGOPTNS= <>
##$ZL1= 120
##$ZL2= 120
##$ZL3= 120
##$ZL4= 120
##$ABSF1= 10
##$ABSF2= 0
##$ABSG= 5
##$ABSL= 3
##$ALPHA= 0
##$AQORDER= 0
##$ASSFAC= 0
##$ASSFACI= 0
##$ASSFACX= 0
##$ASSWID= 0
##$AUNMP= <proc_1d>
##$AZFE= 0.1
##$AZFW= 0.1
##$BCFW= 1
##$BC_mod= 2
##$BYTORDP= 1
##$COROFFS= 0
##$CY= 11.3945322036743
##$DATMOD= 1
##$DC= 2
##$DFILT= <>
##$DTYPP= 0
##$F1P= 2.36226072786647
##$F2P= -0.459571619588291
##$FCOR= 0.5
##$FTSIZE= 0
##$FT_mod= 4
##$GAMMA= 1
##$GB= 0.15
##$INTBC= 1
##$INTSCL= 1
##$ISEN= 128
##$LB= 0.24
##$LEV0= 0
##$LPBIN= 0
##$MAXI= 10000
##$MC2= 0
##$MEAN= 0
##$ME_mod= 0
##$MI= 1.114404
##$NCOEF= 0
##$NC_proc= 0
##$NLEV= 6
##$NOISF1= 3.799351
##$NOISF2= 2.8
##$NSP= 1
##$NTH_PI= 0
##$NZP= 0
##$OFFSET= 15.70392
##$PC= 1
##$PHC0= -15511.02
##$PHC1= 11.60081
##$PH_mod= 1
##$PKNL= yes
##$PPARMOD= 0
##$PSCAL= 0
##$PSIGN= 0
##$REVERSE= no
##$SF= 200.130013532006
##$SI= 16384
##$SIGF1= 3
##$SIGF2= 2
##$SINO= 400
##$SIOLD= 16384
##$SREGLST= <1H.CDCl3>
##$SSB= 0
##$STSI= 0
##$STSR= 0
##$SW_p= 3612.71676300578
##$SYMM= 0
##$S_DEV= 0
##$TDeff= 0
##$TDoff= 0
##$TI= <>
##$TILT= no
##$TM1= 0
##$TM2= 0
##$TOPLEV= 0
##$USERP1= <user>
##$USERP2= <user>
##$USERP3= <user>
##$USERP4= <user>
##$USERP5= <user>
##$WDW= 1
##$XDIM= 8192
##$YMAX_p= 0
##$YMIN_p= 0
$$ End of Bruker specific parameters
$$ ---------------------------------
##NTUPLES= NMR FID
##VAR_NAME=  TIME,          FID/REAL,        FID/IMAG
##SYMBOL=    X,             R,               I
##VAR_TYPE=  INDEPENDENT,   DEPENDENT,       DEPENDENT
##VAR_FORM=  AFFN,          ASDF,            ASDF
##VAR_DIM=   8192,          8192,            8192
##UNITS=     SECONDS,       ARBITRARY UNITS, ARBITRARY UNITS
##FACTOR=    0.0002768,     1,               1
##FIRST=     0,             0,               0
##LAST=      2.2672688,     0,               0
##MIN=       0,             -363719,         0
##MAX=       2.2672688,     315953,          0
$$ Real data points
##PAGE= N=1
##DATA TABLE= (X++(R..R)), XYDATA
0@%%%%%%%%%%qJ6j6J8k6L2m0N6p0Q6j01J17j36J60j92K24k61L03l50M04m64N29
32B81o02O83p72Q70r78J097j227J370j528J700j887K093k316K558k823L116l436
49a801L785m168M593n064N582o163O819p560Q406r385J0530j1893J3549j5611
63h381J8260k1807K6829l4552M8113p8908K81575M5735k86376K14922L041j51460
75E6991o8047J13638j25p3751j13008j6481M0834j1928j34765l3138O1788J319
87a76673l9505O5483N6725K7492Q5359Q0476m9310k1025R6917L7056r7919j8096
99D6980Q4763K5180k7351J6650J3564k2024o6716j15912o7301M3769J404r5798
111a62792j5349Q2007n90m0213M6690M0180j8924J8641K1815j6483M0582P2760
$$ y = [0, 0, 0, 0, 0, 0, 0, 0, 0, 0, 0, -8, 8, -8, 10, -16, 16, -24, 32, -38, 48, -53, 64, -72, 88, -104, 120, -141, 162, -188, 216, -248, 281, -321, 362, -410, 460, -518, 579, -648, 722, -806, 894, -993, 1100, -1216, 1342, -1481, 1635, -1801, 1984, -2184, 2409, -2655, 2927, -3236, 3583, -3977, 4429, -4956, 5574, -6319, 7230, -8381, 9879, -11928, 14901, -19651, 28462, -50446, 231129, 276864, -9512, 205410, 208451, 56991, -11056, 102582, 102457, 28706, -84302, -100783, -59949, -71877, -206642, -239780, -177992, -176673, -216178, -150695, -93970, -66478, 18881, 99357, 50047, 29022, 125939, 162995, 65076, 46980, 131743, 156923, 129572, 146222, 159786, 137762, 71046, -44866, -112167, -68398, -66994, -162792, -178141, -96134, -96724, -136937, -90247, -50067, -68991, -50350, -28535, -45018, -4436, 68324]
123F8324K292M910O4906K4497l8063j6956j0099l5983j7768j9530n7501j4111
135d5082L9131j9049n6001J0683K3500m5508m1990K6673L0652l261R768L1375
147c9109L9789M7383J3463j6821K8423L7850l4011l6980L3003J9612l8210j6513
159C7879J7555r606k6608k1691l8204k8191J551j8165k4925K4433L3721n34K302
172e0483J7462O959J1071K1000K206L107L7215K3356j9899k87L2715K391k9267
185E7546j3200M16j2806k8708l2489j6238J0377N837k0884o246K6862J582l4958
198f2909r359K0764J0491P599K1482K5688K5760J8001p509j3053J0963R592j8260
211C9250j3522R003L565q741j2413j5727o423P29j8048k7887l29J2256j3974j9493
$$ y = [68324, 70616, 75526, 140432, 164929, 126866, 109910, 99811, 63828, 46060, 26530, -30971, -45082, -5951, -25000, -81001, -70318, -46818, -92326, -134316, -107643, -76991, -80252, -70484, -39109, 680, 48063, 61526, 44705, 73128, 110978, 76967, 39987, 72990, 92602, 54392, 37879, 55434, 45828, 19220, -2471, -40675, -68866, -67315, -85480, -110405, -85972, -52251, -52785, -50483, -33021, -26062, -14991, 6009, 8215, 11322, 48537, 71893, 51994, 51707, 84422, 86813, 57546, 44346, 44762, 31956, 3248, -29241, -45479, -35102, -29265, -50149, -56395, -29533, -27951, -62909, -72268, -51504, -41013, -33414, -11932, 13756, 39516, 57517, 50008, 36955, 47918, 57510, 39250, 25728, 34731, 38296, 29555, 17142, 1415, -5008, -4279, -22327, -50214, -50543, -38287, -52261, -71754]
225g1754J4656L0162J2502K727J1274J9430J1605r770j4185J0092K0795q04p105
238B9625J6962J9072j2377k5798j4539j1310j7446j6192j0975J929J3006J150
250b6893j1180K79J1655K670m613L020R220R352P364K711Q248K4180J9450m950
264E0513o159N983l976k3054k1097l812L640l415r284k193P988l810k2442j4962
278d6080N113K975p874K905J7630J5853P629O956J0528J2272P799m032q840J32
292B2966L761l870l765N770P595j436j3210j7741j1074n356j3363j4843L261J5027
306b6278J993n298N261J2398L276l967J337R670J0113P92k010R113J4968M367
320C5735k652L798K812j0796j7530j3769p633k724o42p03L131N691k969j2609
$$ y = [-71754, -57098, -26936, -14434, -11707, -433, 18997, 30602, 20832, 6647, 16739, 37534, 36730, 29625, 46587, 65659, 53282, 27484, 12945, 1635, -15811, -32003, -42978, -41049, -28043, -26893, -38073, -37794, -26139, -23469, -28082, -25062, -15842, -6490, 874, 3585, 11833, 36013, 55463, 50513, 44354, 50337, 46361, 23307, 2210, -1602, 2038, -1377, -10661, -12854, -4866, -8676, -31118, -46080, -40967, -37992, -45866, -42961, -25331, -9478, -1849, 5107, 15635, 27907, 35706, 31674, 22834, 22966, 26727, 22857, 19092, 24862, 32457, 31021, 17811, 70, -11004, -16360, -29723, -44566, -41305, -26278, -24285, -29583, -24322, -11924, -8648, -12615, -11278, -1608, 8505, 9297, 7287, 16400, 31368, 35735, 33083, 36881, 39693, 28897, 11367, -2402, -10035, -12759, -13401, -14104, -10973, -5282, -8251, -20860]
334b0860r076j256l87R60O755J2705J3646R551J998M8O700N024m954m450L291
349A9695J234q358p710J565N491R82m627o351m138q118j5811j0579L863P760L281
364b1821O477J2904Q248L2k710k567k032Q44K312L380R068Q584J760k950j465
379B0064k822o176p049o366o030l919k394k835J374O924N091k229j166J242j169
394g460m327o23M447O215N464M925N705O336K429n675o453l086m179o653j054
409c989L704J161j667m11o46l066l051l709l743k05L191J203K778P332N466P40
425E088K382L603q49j989j179j154Q04K988j340l460J228P05n721n723o3j598
441f278n317k405J232J489J577J362J183M854N626k310m346L814N328j540L52
$$ y = [-20860, -29936, -31192, -31579, -30619, -23864, -11159, 2487, 12038, 14036, 14084, 20784, 25808, 20854, 16404, 19695, 20929, 12571, 4861, 6426, 11917, 12899, 8272, 1921, -2217, -10335, -26146, -36725, -32862, -25102, -21821, -15344, -2440, 5808, 5840, 3130, 563, -1469, -625, 1687, 5067, 14135, 22719, 24479, 21529, 20064, 17242, 11066, 4017, -2349, -8379, -12298, -14692, -17527, -16153, -9229, -4138, -6367, -7533, -6291, -7460, -11787, -12410, -7963, -1748, 3716, 8641, 14346, 20682, 23111, 17436, 10983, 7897, 3718, -2935, -3989, -285, 876, -791, -1202, -1848, -4914, -7965, -11674, -15417, -15622, -12431, -11228, -8450, -1118, 4348, 5088, 7470, 11073, 10224, 8235, 7056, 5902, 6706, 9694, 8354, 4894, 6122, 6827, 1106, -4617, -4680, -6278, -11595, -14000, -12768, -11279, -9702, -8340, -7157, -2303, 3323, 1013, -3333, 481, 5809, 4269, 4621]
456D621O976L721r04k176k885l060j924m551o150K666O667m023p023R9k16n457
472a3619j294L449K483L762K429j376J293O144J772j514M333N649j066k979q87
487H579j594l65J084k948k246L336N89r543o972j02k262n292K955Q053M761Q07
503a160j932k511J410K415k724J126R214N369k576J677M455j899l671j073l181
518D939k086J268m321p298K101K668n056j735N581J566k940l002m599j834M969
533i779L563Q53R405J1009j626o827J902L102l960n056j96K258K811j185l859
548B415J686M235o083j1564j375L515m335m611L384M379J717L201J928J122N065
563D679Q66p798j957O418K697l55L446L434M89J563l142o317J829J404j1269q726
$$ y = [4621, 11597, 15318, 14414, 12238, 9353, 6293, 4369, -182, -6332, -3666, 3001, -1022, -8045, -7946, -8162, -13619, -14913, -11464, -8981, -5219, -2790, -4166, -2873, 3271, 5043, 3529, 7862, 13511, 12445, 9466, 8579, 6985, 6620, 7704, 4756, 2510, 5846, 6435, -3108, -10080, -10182, -12444, -17736, -14781, -6728, -1967, -1160, -3092, -5603, -4193, -1778, -4502, -3376, 5838, 11207, 8631, 10308, 14763, 12864, 9193, 8120, 4939, 2853, 4121, -200, -7498, -5397, -2729, -7785, -9520, -3939, -2373, -5313, -8315, -12914, -14748, -9779, -6216, -5363, 4042, 15051, 13425, 6598, 8500, 11602, 7642, 2586, 2390, 4648, 7459, 6274, 2415, 4101, 8336, 2253, -9311, -10686, -7171, -11506, -16117, -12733, -8354, -6637, -3436, -1508, -386, 4679, 5545, -2253, -4210, 2208, 4905, 4550, 7996, 11430, 11919, 13482, 10340, 4023, 5852, 7256, -4013, -12739]
579a2739N280L930m638N55N749K364k878n838n145K863N072k053o72J0160Q296
594A0306k967j935M867J001m900k900q61L54K607O6n086p74N213k724o956O66
610d023K916l912n139j751N94N039M490k066K880R512q85j1089m99P345j111l926
626a625L632O312K364j240n125k127J958k937q560l35P272l68n287P71L778m37
642a954j498K09j29K208K528k572l561M798N636k013j566N324K661l812m533l581
658a855l70K554j853m761M666P855m272p904K728L150m916m088K890M420L451
673A695j77k488K978N382k035o257J935N033k123l887L76J316N43k07k729j757
689b402L572J619p527n271N019L061m300j104N686M906j24l096j310M633K844
$$ y = [-12739, -7459, -3529, -8167, -7612, -1863, 501, -2377, -8215, -13360, -10497, -5425, -7478, -8150, 2010, 10306, 7339, 5404, 10271, 11272, 6372, 3472, 2611, 2965, 5572, 5638, 552, -222, 4991, 2267, -4689, -4023, -1107, -5019, -10158, -11909, -11315, -6276, -1786, -3852, -972, 8540, 7655, -3434, -3933, 3412, 2301, -1625, 2007, 8319, 10683, 9443, 4318, 2191, 4149, 1212, -7348, -7683, -411, -779, -6066, -5295, -1517, -1954, -3452, -3243, -3372, -1164, 1364, -1208, -4769, 29, 5665, 3652, 2086, 7410, 10071, 6259, 1726, -1855, -2225, 329, -1524, -6285, -1619, 6236, 1964, -5940, -3212, -62, -4978, -9066, -6176, -1756, 1695, 1518, -970, 2008, 7390, 5355, -902, 1033, 6066, 3943, 56, 432, 1748, 2291, 2084, -645, -2402, 1170, 2789, -4738, -10009, -4990, -1929, -6229, -7333, -1647, 3259, 3135, 39, -1271, 3362, 6206]
704F206o273l205P538N130o496l109N524J802n008m185l7J041o3l774k873M226
720c556L535l333k997K529L349j209j538R93K758L042Ql349P95N757O18n603k01
737A598N541J03o560k871K141J751k779m367R17N228j185p324q54O183N10m334
753f302J588O330J921k514j865Q05K829R06j310R91L902J192m067l284k6J021
769B117j193k766r34K038J455k994m122J192M300k058m557K099N704k94m048k72
785d333N242L639j806k105M421M137l902n613J253L457j752k924J254L067o21
800C414l363k854n90M98j552k221M0L087K653r47o66J478K519ol021j10M016K147
818D522l340j845M242M014l213l310J980K756l269n500p65L129l11l480l52M498
$$ y = [6206, -67, -3272, 4266, 9396, 2900, -209, 5315, 7117, 2109, -2076, -2113, -1072, -1135, -4909, -7782, -3556, -21, -3354, -6351, -3822, -473, -1682, -3220, -2227, 531, 3573, 3581, 232, 1027, 6784, 7402, 1799, 1598, 7139, 7242, 682, -2189, -48, 1703, -1076, -5443, -4526, 702, -483, -7807, -8661, -2478, -1968, -6302, -4714, 1616, 3537, 1023, -842, -37, 2792, 3698, 2388, 3379, 7281, 8473, 4406, 1122, 1096, 2117, 924, -1842, -2776, -738, 717, -2277, -6399, -5207, -907, -2965, -7522, -5423, 281, -13, -4061, -4333, 909, 4548, 2742, 637, 5058, 9195, 5293, -320, 933, 4390, 2638, -286, 968, 4035, 3414, 51, -2803, -3393, -2895, -4447, -6668, -6628, -3541, -888, -1835, -2501, -1023, 1496, 1490, -1531, -1641, 2375, 4522, 1182, -663, 3579, 7593, 4380, 1070, 3050, 5806, 2537, -2963, -3728, -599, -910, -4390, -4742, -244]
834b44J939l332k606J812J160j685j692J648K752K530m0k95J734J732j083l191
850A139j243J517O20j718j480J938K673j332m622k49L521q49m734p62M191R66
866d24l258m65L897L435j597k424J464K723j827l484Q13L471j66j063Q76J710
882C681L7k327j936j336R7K18q06J48J355J584o18j459n98J207J325r00j515J933
900I0K436j545k534K196K999j680k217J210J519j180k791j049J686Q39j714o18
916b353L029J421k663j448J638j13j074J013Q06M60J084N25j541p20J039k23o83
933A97J80N90N11r31j954j357K253Q37k649m64L475R36l796j023L185P63k126
950a373J25J960J622k29j822j2K789l05k951J35K861j226k273K02J05j837O72
$$ y = [-244, 1695, -1637, -4243, -2431, -1271, -2956, -4648, -3000, -248, 2282, 2242, 1947, 3681, 5413, 4330, 1139, -104, 1413, 2033, 315, -1165, 773, 3446, 2114, -2508, -2757, 764, -85, -4819, -5581, -1390, -424, -3682, -4147, -250, 3185, 1588, -836, 628, 3351, 1524, -1960, -1147, 2324, 2158, 1095, 1971, 3681, 3718, 1391, -545, -1881, -1784, -1566, -2372, -2224, -869, 715, 97, -1362, -1960, -753, 572, -328, -1843, 90, 2526, 981, -1553, 643, 3642, 1962, -255, 955, 2474, 1294, -1497, -2546, -860, -21, -1735, -2353, 676, 2097, -566, -2014, -376, -489, -1563, -550, 256, 716, 1800, 2325, 784, 64, 1103, 880, 197, 377, 967, 1478, 547, -1407, -2764, -511, 326, -2323, -2787, 688, 1624, -2172, -3195, -10, 753, -1373, -1248, 712, 2334, 2105, 283, 271, 3060, 2755, -196, -61, 2800, 1574, -699, -497, -392, -2229, -1557]
967a557J076j546L08K164j223k207J029J349q57R6J043L96J953N86j927L67K799
984C849j543l153J512K424j984k008K286M92j633r34j65r01m3j30j513L12K197
1001i35j142q43K118J057j516J644J829j458m11K404q89k133K030K062j522k14
1017B081J309j526j639m25j711n22J991o92k090K296J382k872j426K594M3k181
1033c388J948K182p30N90J169n96k59J378M64q21J318m22k429N3Q68j756m89K405
1051A485p61k591O36O4k589p56K395M7n11K280O99n42R00K30j181L60J390j109
1069D46O46K696p73k176J063J164k808r84K018j012j981n5L86q04N63N79l82Q18
1087e96J235j907p96J501k16j234J326K469j41l3J503l66j802J92l7j599j6J438
$$ y = [-1557, -481, -2027, -1719, 445, -778, -2985, -1956, -607, -1464, -1368, -325, 71, 2024, 2610, 683, 1050, 3849, 2306, -847, 665, 3089, 1105, -903, 1383, 1875, 242, -692, -857, -1758, -1801, -1931, -3444, -3132, -935, -2077, -2920, -802, 255, -1261, 383, 2212, 754, 343, 2747, 1858, -275, 1755, 3817, 2295, 2081, 3390, 1864, 225, -200, -1911, -2433, -442, -1134, -3224, -928, 454, -2418, -3844, -1250, -1207, -3388, -1440, 742, 12, 602, 1771, 1175, 916, 2294, 2758, 1937, 3255, 2833, 404, 457, 1325, -431, -920, 1485, 724, -1867, -1231, -1167, -3756, -4512, -2117, -2070, -2581, -301, 398, -144, 756, 986, -195, 165, 1555, 446, 1092, 3788, 3015, 839, 1902, 3066, 258, -726, 1292, 280, -1701, -1756, -1370, -2174, -1611, -1032, -1414, -596, 639, -1268, -2064, -563, -779, -2013, -687, 1782, 1641, 1608, 3111, 2745, 943, 1135, 1098, -501, -517, 921]
1105I21j122O5O94m84p64L20o53j325J142L90j247K51K259j32j112J653J501j230
1123A127o65J19m70J66k3q34R23J510m36k052J000J266k193j179M74L43o72M29
1141a167P41J13J212N10j564l15J244n15j088R00Q33k78N02k80o96N06P76k013
1159e79j294J885M69k072k79J264K80n32k46M53J180Q10j349r67J310N99j418
1176d86m0K675N10j252p45m29m20P7l92r89P20J400j059j178P09P62j234l27M29
1195a269K85J505J11j244J93J992q19j096R39K323j21j574n39Q0j18l98j069J51
1213f68K015p99k509K01J347n49j627O40J002N95j51m96P4J206O59q14m81K517
1231B162N86j270n76L20J84l01j048l93J395J098j933j672P54J088k041j352J323
$$ y = [921, -201, -136, 558, 74, -690, -370, -1023, -2348, -1206, -816, -2063, -1812, 447, 315, -797, 856, 2357, 1127, 462, 581, 111, 277, 254, -580, 343, 1853, 1417, -635, 365, 1631, -562, -1741, -1267, -924, -1596, -1167, -426, -313, 899, 1409, -155, -470, 774, 259, -829, 71, 904, 626, 1128, 848, 152, 658, 1434, -579, -1873, 12, 481, -1591, -1870, -606, -326, -858, -1104, -651, 529, 1339, -10, -977, 333, 932, -486, -526, 2149, 2659, 1407, 662, 233, -187, -110, -502, -1491, -771, 629, -430, -1608, -899, -137, -1371, -1698, -1269, -984, 521, 632, -612, -419, 1573, 754, -342, 597, 2920, 2799, 1225, 686, 766, 648, 250, -819, -668, 1347, 548, -1961, -1760, -413, -962, -2589, -1949, -947, -352, -503, -999, -925, 281, 940, 126, -355, 2162, 2748, 1478, 902, 1222, 1406, 1105, 57, -336, 1059, 2157, 224, -1448, -694, 394, -1647, -2999, -1676]
1248a676R23l95q71J4J161J367q45r14J692J743j136j482J344J261m03q58k12
1265G13J174O85j206j783M5Q56q82k034L47J254K32r63k58R67J135o32j469M17
1283a402J778K33j839N79K440N79j183l58P88P95j125j570p1J418Kj589q00J197
1301a28J121j831r12O48J060m05j402k66J388R95r85j65J680J737r58j481J36
1318B32J119l42j342k18J527J063j085j499N56R16p45j982L93J365O13j826o73
1335a928J298R72o72j058J096J686j10j790k95J383M32j067j48J169Q98n61j614
1352c09j71R63l57j222O9R66J008q66j334N47P81P8j516L8J824P56j135j167J002
1371d5J227n24j433M60J802j08j720q02J295N92j373o95J281J261j134j409L69
$$ y = [-1676, -753, -1148, -2019, -2005, -844, 523, -322, -1236, 456, 2199, 1063, -419, 925, 2186, 1783, 925, 713, 1887, 2572, 1366, -417, -372, 484, -398, -2432, -2085, -831, -599, -1562, -1820, -853, 282, -350, -1819, -1402, 376, 609, -1230, -651, 1789, 2368, 1185, 827, 1615, 2410, 1285, -285, -356, 1062, 1064, -525, -1325, -128, 993, -838, -1750, -1102, -42, -447, -1849, -2115, -727, 268, -717, -882, 798, 2535, 1577, 96, 232, 1351, 1009, -333, -551, 976, 2039, 954, -545, 11, 927, 182, -1800, -1407, -42, 571, -1255, -1928, -630, 342, -330, -1388, -292, 1394, 1284, -506, -801, 582, 1014, -53, -201, 968, 1866, 1305, -309, -480, 483, 126, -1096, -1027, -61, 947, 81, -1253, -706, 75, 153, -1363, -1325, 499, 1255, 120, -1047, -45, 1182, 658, -775, -315, 1487, 1379, -341, -1143, 152, 744, -629, -1324, -43, 1218, 84, -1325, -956]
1388i56J193l7q73J18R34P77r28p29N70Q15k40q73j9J136K92j110p08L06J066
1407G34n62j278j26J222M59j505n09J264J026j078r21O57J555k93j509N21J623
1424A280L47j754k37J341M65j210j089Q31R35m90j250K17O34O3r54o57P36Q83
1442I1l05j168J28J155O84q35r9R04J054o55j383R7J458J29j320j73J768L52j314
1461E68j245N32L71o85j200M33J240K9j695M6J113P2p15P9Q63P67m8p16l3J077
1481H53K41m45L5M15P33n55j092m35M21J70n25m76O11P06r60j611M83J122o83
1500i92j001P99J370P4r55j02J023Q78q32p41J553P96r99m99L85L80m25r8n56
1519E8M61J16n30r16l08O54J7o29r7O16K11l3p50M0J101N63r83l21J785O11j547
$$ y = [-956, 237, 200, -673, -555, 379, 1156, 228, -501, 69, 884, 644, -229, -248, 888, 1180, 70, -638, -332, 734, 172, -1106, -1232, -10, 449, -1056, -1565, -301, 725, -353, -1274, -617, 938, 645, -864, -343, 1280, 1627, -127, -364, 977, 1442, 232, -857, -26, 909, 419, -831, -614, 20, 83, -871, -1528, -792, 91, -214, -1382, -1254, -99, 585, -250, -349, 555, 1609, 954, -429, -332, 1126, 1255, -65, -238, 1530, 1882, 568, -677, -145, 226, -459, -1659, -1226, 14, 43, -1652, -1606, -493, -421, -1136, -1057, -194, 573, 525, -191, -224, 853, 1094, 649, 684, 1099, 1832, 1277, 185, -250, 171, 341, -184, -660, -49, 657, -303, -1914, -1431, -309, -992, -1993, -1194, 176, 250, -705, -807, 216, 1094, 262, -479, 1074, 1870, 871, 372, 757, 1137, 712, 614, 58, 519, 635, 105, -811, -1119, -465, -448, -1077, -1174, -558, -347, -380, -1130, -1090, 11, 574, -409, -730, 1055, 1666, 119]
1540A19j59J296L35j301l06O75J77j57j060k55Q40J33r21k84P76k19r00ML91j41
1560i57P16K23m13L80O31l54o52P71Q18n15m55J02N6M66R0n55k46J011o68j629
1580a180L74J312q88r36O82Q59m25k11J69N1L10j23o80M04J085j5r46J30M92l89
1600G5k72Q51k26m36P53n82j405P99J028r38J18Q24j32m66l43M7p5P38k63o09
1620e14Q15J031j107j131J332L06j378M0R04K6n30o5l22J44L84N6l11O41L07j044
1640d16l0N52j28n28R06O43r19K91P52j216k80R03Q7o99l06N32k17j46k08l13
1660g40K76Q50q86j74J117k39j274L22J183l96j97L54L52q2p9O1M4k43L34m25
1680A58k7L22o24r3L90J83q37L37o6m92o57J105N5o72M76P92k92o3J58L26j98
$$ y = [119, -40, 1256, 1591, 290, -16, 659, 836, 679, -381, -636, 204, 337, -584, -868, -92, -311, -1211, -1207, -816, -957, -241, -18, -431, -51, 580, 226, -426, 345, 1163, 648, 193, 295, 351, 817, 907, 352, 106, 1117, 449, -1180, -806, 506, -382, -1318, -636, 223, -202, -413, -244, -193, 117, -6, -686, -282, 803, 788, -158, -28, 464, 75, -197, 654, 428, -8, 745, 163, -1242, -443, 585, -353, -235, 589, 457, -9, -352, -305, -380, 358, 95, -514, 301, 1332, 225, -906, 426, 732, -646, -606, 298, 324, -206, -271, -593, -449, -65, -9, -320, 321, 628, -416, -446, 106, -22, -550, 356, 999, 80, 371, 1123, -93, -373, 530, 617, -82, -388, 144, -73, -219, -427, -740, -464, 386, -500, -674, 443, 204, -1070, -748, 435, 39, -158, 196, 548, 466, 387, 448, 492, 249, 583, 158, 131, 453, -171, -264, 126, 309, -528, -191, -257, -749, -1406, -301, -246, -918, -442, 350, 58, -5, 153, 479, 281]
1701B81K67l02l9O97m50j29L30J18q02rN98J49j124LL18m91m86J95O94j1O2l71
1723e02K60J64k78m96Q97L05r8j96O57K81p33R7M86k68l71K31K41n85k47k61K35
1744a81Q0l89O4L69j78j013K76M81j97k57P64P65J62q32M63M47q09j63L10O18
1764G80J36o13K51j52J30p15k02N92k21j07k09J56m6n47M50O1k84M55j5k4m62
1785e86K67J24J41j3Q3O65J3m80k91M08lm70j27P14K97n79n92N40On71j48P38
1807A36P2k25m73K08J98l6j59K00J73k04J48q8J86r7L35k04n8q3K57j46k33l7
1829a30K02K50n96J6O19K81p22l73J65O39m89l12K02L67r2m88K54O00n7m66j93
1850c23K16L22p06L6N73L29j69l00L49k41j06n8N0L2J76O5j63l47M82J16m26j86
$$ y = [281, 548, 246, 207, 904, 454, 325, 655, 773, -29, -38, 560, 709, -415, -412, -94, -585, -1071, -876, -182, -193, -131, -502, -242, -78, -356, -852, 45, 350, 252, 56, 713, 994, 261, 358, 844, 576, 205, 436, 677, 92, -155, -416, -181, -101, -490, -426, -57, -235, -1248, -972, -491, -688, -945, -181, 584, 746, -86, 377, 824, 15, -148, 162, 780, 916, 303, 554, 402, 532, -183, -385, 207, -14, -121, -330, -174, -220, -767, -317, -256, -540, -85, -100, -124, -586, -319, -195, -54, -67, 16, 681, 694, 214, -77, 331, 328, -142, -269, 445, 742, 163, -429, 111, 117, -454, -602, 136, 208, -17, -490, -282, -84, -120, -279, -79, 94, -110, 38, -50, 136, 39, 374, 170, 112, 29, 286, 140, -93, -130, 72, 322, -274, -258, 361, 642, -80, -453, -288, 351, -138, -450, -248, 119, 27, -461, -207, 393, 336, -130, -323, -107, 215, -491, -455, 118, 447, 278, -22, 327, 86, -20, -78, -28, 4, 180, 245, 82, -265, 217, 333, -93, -279]
1872b79J92M40m66n32p1N87K19n31k43R20M78r41l37L47K81j47n33O88M52M27
1892I51o49k32M07l79l8m09L80J01j48lp7p6L98j32j70l74M13O7o21J26L97J10
1914D2j52j65N88L08m27m54OQ73k93m72N36Q68o24o14j65M34k36m48R2j40M07
1935c6K32n71j01N85k23k21k44K50J97P0j08j58L58N12o4l47N46K17l67o51q6
1956b10N14k26j70P5L73K84o98l25M25K44n73p65M64O11k12l94N84L01J24l95
1976C1k9k66O70k87q3N2M15L61o95k32J82K42j59m79j68N46K62p08m21J144p3
1997C05m75n64L69M56k65l60j68P80K38n48l8P97J40n23p50O27L3M7n7k2K64M47
2019G33p14m13K70M97k66o36L09L32Po5m67J70O11l50o44J91Q05m01n63K31J91
$$ y = [-279, -87, 353, -113, -645, -716, -129, 90, -441, -684, 236, 714, -227, -564, -217, 64, -83, -616, 72, 524, 951, 302, 70, 477, 98, 60, -349, 31, 132, -16, -19, -96, -172, 226, 94, -76, -450, -37, 30, -591, -465, -68, 42, -110, -275, 313, 621, 194, -260, -254, 619, 326, -146, 390, 1258, 634, 20, -145, 289, 53, -395, -303, -443, -36, 196, -375, -476, 109, -114, -335, -579, -329, -132, -62, -170, -328, 30, 542, 478, 131, 677, 894, 527, -124, -210, 304, 78, -92, -17, 356, 640, -58, -383, 42, 286, -287, -1052, -588, 23, -189, -583, 1, 302, 426, 31, 2, -264, 406, 119, 36, 88, 503, 864, 169, -63, 119, 361, 202, -277, -445, 101, 363, -345, -766, 378, 305, -170, -734, -365, 91, -174, -534, -702, 78, 316, -232, -270, 527, 667, 144, -606, 21, 54, 101, 44, 22, 286, 733, 19, -394, -124, 373, 107, -529, -220, 112, 119, 54, -413, -243, 368, 18, -626, -435, 370, -31, -594, -363, -172]
2040a72L51m49L24M40r9j99q01R0P26j67l16M05K83P2o17o9K06k31J24j24j98
2061d21P50k33j59m41O55j5j65j51J01J35o0j60l82O82N95m40l35M29j58j95k65
2082b33J22L55K09q0n92K51N90o68k68J0M45j58m75K46M85R3m93j49J70M19j67
2103A12n58J61O32m44k53L93K56J07j21k41o0L61o6k99j92N13M5m22k91J93Q4
2124i0q5l01J47K84L12n82j85O95j53m66j01P83J47l69j79L97J12O4j72k18O61
2145G01k12o23m4R4L40m79R1N7K71J5k09n22P3M02r1m48J97M84q1N1k90L02L61
2168D40j4m29J29N07m55m68M30O3J22j94K07J84j20l82n65K56R4J05j68j23L16
2189f5J8j91q0j04K08k8m3K23R5L05N6m24L59K55k42l94J88L52m87l86K23J43
$$ y = [-172, 179, -270, 54, 494, 395, 196, -605, -515, 211, 44, -272, 133, 416, 488, -129, -198, 8, -223, -99, -223, -421, 329, 96, -63, -504, 151, 136, -29, -180, -79, 56, -4, -164, -546, 136, 731, 291, -44, 385, 227, 32, -233, -111, 244, 453, 373, -219, 32, 622, -46, -314, -304, 141, -17, -492, -246, 239, 332, -161, -310, -140, 279, 112, -446, -285, 347, -97, -350, 43, 299, 406, 285, 44, -16, 345, 279, -20, -212, 301, 346, -76, -367, -174, -90, -175, -476, -329, -45, 267, -315, -500, 195, 42, -424, -525, 258, 405, 36, -143, 254, 366, 430, 258, 40, 701, 489, -134, -178, -84, 256, -223, -132, -75, 196, 211, 2, -520, -447, -45, -136, -584, -387, 97, 16, 67, -223, 79, 440, 426, -3, 126, 633, 178, -290, 140, 203, 325, 131, 338, 522, 402, 20, -545, -289, -195, -90, -258, -381, -65, -47, -238, -318, -422, -214, -242, -285, -62, 33, 338, 394, -30, 329, 584, 342, -52, 136, 488, 1, -385, -162, -19]
2211a9J75j23k19J65L59m46o12L58L17j08J45K72k18J44K8m16J51j9L31n87K86
2232c6K23j03j67M6J50J17j02k45Q3J00j11p9K6Q5K59ll74L34j65J09n55R0L67
2255D9J31j57m13M15J71q3k48M13j06p9j91Q2Q3k66M29l13K08O0k12j75j13M04
2277H9j57Q7L73m47K45l05j80k14J64L71j45M2K66j13j35j93L24J49j66q6P9J03
2299A51r9l35K75K93j56J79j31J22j52k02J6q3o7J07L1l2m9K04l2l14j53K10J44
2322g3k1NP4L83m96L88k20j25K74k62L03j05J46k08l45M96J29j79j62l4K07m29
2344b54j32K45mm9J63L80k79j59O3j29Q0J30q3K35q6J6J90j03J80k8kq3j65j66
2368d0J05L11l49q1J91j09o0k79M2K12k30J7J01K69r9L0J94N5l45K32o2R3j5j85
$$ y = [-19, 156, 33, -186, -21, 338, -108, -720, -362, -45, -153, -8, 264, 46, 190, 218, -198, -47, -66, 265, -322, -36, 187, 84, -83, -37, 113, 230, 128, -117, -34, 66, -45, -124, -98, -13, 246, 243, -131, 203, 38, 147, -408, -318, 49, 180, 23, -390, 25, 196, 113, -135, 278, 172, 93, -98, -16, 67, -199, 230, -83, 125, 185, -27, -202, -315, 89, -68, 19, 392, -55, 190, -115, -295, -509, -345, 26, -119, -77, 189, 76, -59, -252, 72, 221, 55, -31, 48, 151, 52, -283, -8, 285, 129, 308, 177, 299, 147, -55, -39, -122, -189, -82, -51, -83, -132, 72, 40, -274, -427, -217, -73, -94, -89, -15, 368, -128, 260, 40, -85, 189, -73, 230, 125, 271, 63, -282, 214, 343, 164, 2, -32, 175, -254, -386, -141, -145, -194, -31, 349, 70, -89, -26, -155, -75, 55, -28, 207, 121, 137, 327, 224, 404, 376, 374, 291, 126, -40, 65, 376, 27, -54, 137, 28, -32, -311, -269, -57, -287, -270, -169, 100, 1, 31, 225, 280, -65, 167, 105, 198, 183, -2]
2392bJ9M61r5l93J63K12n17pJ39k39P9N3K18l56O4n0J15R4m7k7L7J98p6j84N7
2417h4K34j49J27q9K63k49Q5L9J60l04L7P4j6k45P2J36j52j3j52mK10k86R4K82
2441G0K91k52j9Q2k43l21K67K27J48j35J18J27l04j12J80K14n82K68K45l21J59
2462A07j30j25K88j24k27J62o9J19l74M25k6l42J81L16J1j69k61L80l19l0n2K60
2484AK18j47j97L14J70k76p1j93L47q5l59M25pk17L18j59Lk14J75k44l2j33K71
2507i2M53m04J63j80jK11l78J93K8RJ6r0K41l2j25j30K81j21j74J48o4J93Q3m28
2531b00J52oK61j96k68K08j03M1J49j88P3pL10l58j1K45N6j66m7L77l44p7JK96
2555A98R8R8n98M84N6j43j65J07Nk04K8j14K61j16jj49j30L04Q5J20l32L14o6
$$ y = [-2, 17, 478, 383, -10, 153, 365, -152, -159, -20, -259, -180, -127, 91, -265, -201, -251, -136, -42, -89, -116, -79, 119, 43, -141, -84, 150, 1, 128, 39, 302, 53, 138, 177, 337, 33, 70, 144, 128, -117, -45, 91, -61, -74, -226, -230, -20, -306, -212, 70, 361, 109, 90, 172, -71, -392, -125, 102, 250, 115, 233, 360, 56, -56, 124, 338, -244, 24, 269, -52, 107, -23, -148, 140, 16, -211, -49, -118, 1, -373, 52, 26, -316, -135, 181, 192, 23, -238, 142, -177, -207, -259, 1, 219, 72, -125, 189, 359, 83, 12, -181, 166, 81, -278, 147, 140, -77, 241, 82, 85, -129, 46, -198, -230, -363, -92, 361, -43, 120, -60, -61, 150, -228, -35, -7, 2, 18, -72, 169, 137, 12, -118, 163, 42, -132, 16, -48, 145, 228, -200, -48, -54, 207, 11, -257, -49, -152, -111, 38, -150, -77, -84, 226, -132, -143, 102, 158, -8, -55, 322, -22, -99, -98, 198, 296, 394, -204, 280, 336, 193, 28, 135, 140, -64, -36, -150, 111, -5, -6, -155, -285, 19, 104, 224, -108, 206, 140]
2578A40L8k15K15L0R6j58k53L36O0k97J41r5J18j51j29J04j01K64l18M2K45L8
2600A50k13j18K07lJ82l16M18r6l57J17K26N2j27J97m18L03j95j41j10J74J35
2621F7J06j59l56L21m8N3j83%J75J54k79J78J14j9k50%L89M3j86p5j4K12l1j65
2645D7l7K10J34k46r9N1K42k24k08j98K21K74o05M70q8J13k2j11k23L32l7M1j3
2668B4LJ60J5l02K6J11P7j6n1O5k82J24k11N92j47l07k08J32K37j05k3R1K26j87
2692D4Kp6R2n4K9J4J1k9j65q4L50%K11j98j19K2o7J58k11p6L26r9J23k77L4n7
2718i6pj00K11K09j94j63L04j70k49P3J00k3nL11k38M7O8j27m9L12j88J95m36
2741b15L70m11J91Q1k6J05k01K52j75j26L04M7l18o2J40R8k48j6K73O7m0k11N7
$$ y = [140, 178, -37, 178, 208, 304, 146, -107, 229, 289, -8, 133, 38, 156, 5, -124, -20, -121, 143, -175, -133, 112, 150, -63, -181, 26, 23, 205, -111, 307, 211, -146, -29, 197, 249, 122, 319, -99, 204, 9, -132, -242, -68, 67, 173, 14, -342, -21, -69, -16, -199, -199, -24, 130, -149, 29, 143, 124, -126, -126, 263, 306, 120, 45, 31, 243, 212, 47, 10, 220, 354, 108, 9, 60, 302, 78, -130, -328, -107, 167, -438, 32, -56, 57, 35, -76, -299, 33, -4, 37, 24, 27, 187, 202, -100, -74, 37, 114, 98, 47, 112, -170, -46, -257, 335, 188, -119, -327, -195, 42, -63, -86, 5, 231, 44, 46, -30, 62, 8, 37, 51, 62, 33, -132, -216, 134, 134, 345, 147, 28, 50, -17, 141, -70, -146, 180, 81, 204, -73, -39, -96, -103, -203, 8, 217, 23, -140, 164, -6, -255, -182, -82, -105, -110, 201, -37, 10, 78, -49, -98, 214, 26, 221, -215, 155, -256, -65, 16, -10, 95, -106, 146, -29, -155, 149, 196, -122, -184, -44, 54, -194, -210, 63, 130, 90, -121, -64]
2764f4K92j66O5l53L12J2J31k29rL26j40k46M0J45j99Q5j63P5p7L31%l17K2J73
2788D6p1o3P3j59K46j80K05j50L28l44r2L67J50K6m66J80j28L48l52J03J53K3
2810B43l36l5J06j2P8l35K60J78k79J73k11J31J56p2j87n5J94Q4j13K90l01P5
2832C2J24k84M3l4K76m98L36J09j68J21l42J54q1N28m55K13l19J00j5k30N14l94
2854b70K55P3R3j3j57kJ2L6K01P5l47J87o2%p5j8j21n4K26m12L00p5J16j6k61
2879c09N28k08j03O0m7M75m81j4m1L60j22j10Q0J04J31k81J47m5j16r5J79K24
2901C16k18o8r5K75l05j54L73n6k6J06j32o0j13L07j25j11J65j86J57J61p3l15
2923a77L59j40l08K96r1p7J26l33L96J37j83j79K53j23J94l72K91O2j75KJ02M5
$$ y = [-64, 228, 62, 127, -226, 86, 98, 229, 0, -9, 317, 177, -69, -29, 116, -83, 2, -161, -86, -163, 168, 168, -149, -127, 46, -25, -88, -15, -174, 72, -108, 97, -53, 275, -69, -161, 206, 356, 382, -84, 96, -32, 316, -36, 67, 220, 243, -93, -128, -22, -34, 44, -291, -31, 147, -132, 41, -170, -39, 117, 45, -142, -197, -3, 81, -32, 258, -43, 32, 156, -128, -85, -119, 157, -341, -5, 104, -64, 57, -285, -131, -212, 316, -139, 74, -245, -145, -160, -390, 124, -270, -15, 58, 151, 138, -19, -21, -9, 27, 228, 303, -44, 143, 81, 81, 6, -12, -133, -187, 39, -373, -73, -148, -32, -48, -309, 219, 11, -92, -32, -79, 396, -85, -99, -140, 220, 98, -12, 68, 172, 303, 22, 169, 124, 8, -87, 92, 316, 98, 30, -65, 210, -95, -249, 124, 68, 42, 148, 16, -44, -157, 150, 25, -86, 79, -107, 50, 211, 138, -177, 182, 42, -266, 30, -61, -138, -12, -345, 51, 188, 5, -174, 79, -44, 150, -222, 69, 131, -44, -42, 60, 105]
2945A05m0j17QK10j8k72K54l18J79j7l0Q7K7J27k93qR1J26j53O3j26R7J40J39
2969B61k13j63L06r2j78K69k72O7k41J67J03J85k1m78L97n6j94J27k6jQ5J20k81
2992a29K53rk5L3k10p5J58J1j60J43L1j22k10M09n6Q5j71J3l0R7o0j88R3N4L8
3017b7J05k22K40k9k05K69j11P1n5j32J1P1n9L62k31k60K34r7q5J83m7m0J37k22
3041a39O9M18k04l48J67k43M50j56m5RO5j77K86Q5j3J6j81q8J8RO5N9j39q5l2
3066a34L59j01j74q7K95k83q3K94lr5q5K10r6j87r2K65j0R8p6J76q1l4q8L4K28
3091B50q8j83j80L3K4N8j61K65j62J65j36J12l1J62k52R8j02L6K32l73K70P7j31
3114a7j98O6KK14q7K98j42k6r8k0N3j41L8R3l7r7J22j88L62k23J39M8k92K21j33
$$ y = [105, 65, -52, -44, 166, 148, -124, 130, -188, -9, -26, -56, 31, 58, 185, -108, -116, -25, 101, -52, 11, -115, -18, 122, 261, 48, -115, 191, 99, -79, 190, -82, -15, -256, -89, 14, 199, 178, -300, 97, 41, -153, -26, -52, -53, 32, 152, -129, 124, 115, 90, 123, -87, -162, -4, 7, -153, -10, 21, -101, -311, 98, 42, 127, -44, -31, -61, 36, -24, -212, -119, -65, -27, 78, -144, 96, 67, -138, 131, 20, 91, 36, -96, -85, -14, -73, 289, 58, -202, 32, -65, -150, 33, -14, -54, 83, -139, -70, 348, 144, -204, -37, -280, 170, 14, -31, -22, 43, -134, 152, 237, 224, 240, 59, -29, -11, -2, 63, 122, -17, -102, -134, 225, 124, -50, -137, 158, -125, -208, 86, 83, -12, -97, 113, 17, -170, -262, 3, -7, 91, 15, 191, 110, 76, -12, 22, 250, 162, -21, -201, -168, -144, -86, -247, 18, -144, 21, -115, -3, -34, 128, -124, -26, -128, -92, 140, -233, 37, 114, -17, -215, -149, -147, 67, -20, 278, 136, 110, 12, -8, 45, -96, -58, 35, -2, -99, 23, -165, 197, -26, 113, 161, -131, 90, -43]
3139d3k2J72n3k17L10k62L92m01p9J80J24j87O9J03P6k36J27k9J11M5j34P5N6
3162A77k09j40J73J11j62J21j29r7K91l73J45J64j51O7J05Q6J46l64m8K32r1j0
3184D4O1ok9j20Jn3q4J59P6k2j43Ol8J70j13J27j86r2L09Q0m6o8j3r7N5M02j57
3211B23k04J82Jk60K56l54K33o8o6o5P3R1NM9KP3j79k19J38K8MK30j06J5r4N7
3237D5j42J0J61Qj27p4J33J50k43K29k04L22k98J39j45J31l08K94R9q5n2Q9L3
3260A65k54k3R8M8J50k98L2J60Lq9j54J34J28j65M11l22K34j70j0k30K3j00L69
3283A40M8J22k24r5m0O6l6r7J25J71k23J48J4k9O8K4k45J54M4k97R6R3K6k33O2
3308a18J53j97N1K87m8k46L39k1l16k14L28M2J08j94k6J76k37K4k8K16n1j63K86
$$ y = [-43, -65, 107, 54, -163, 147, -115, 277, -124, -203, -23, 101, -86, -17, 86, 162, -74, 53, 24, 135, 180, 46, 121, 177, -32, -172, 1, 112, -50, 71, -58, -155, 136, -237, -92, 72, -79, -12, 93, 179, 325, -39, -87, 145, 54, 44, 105, 99, 70, -50, -49, -102, -186, -27, 49, 27, -116, -110, -148, 22, -91, 36, -150, -242, 67, 147, 101, 33, 20, -77, -22, 380, 223, 19, 201, 202, -58, 198, -156, 77, 9, -57, -122, -49, 42, 47, 96, 98, 171, -8, -227, -89, -61, -57, 173, 67, 82, -12, 45, -97, -87, 74, 82, -45, -119, 14, 164, -79, 150, -54, 268, -30, 109, -36, 95, -213, 81, 180, 95, 43, 132, 165, -89, -112, -14, 34, 184, -114, -82, 78, 81, -8, -162, -28, 100, -65, 346, 24, 258, 88, 78, -152, -129, -229, 140, 188, 310, 86, -9, -49, 17, -19, -116, 9, 180, -43, 105, 119, 90, 158, 182, -63, 91, 135, -162, -66, 27, 53, -180, -118, 35, -162, -111, 176, 128, -118, 221, 200, -116, -330, -2, 40, 148, -46, -72, 104, -133, -109, -137, 79, 28, -135, 151]
3331A51k39J78k98M69j85P4K25m81P2k2K59j24R3l18J61j36K85l31J42k0M4k96
3353b97K36L33k71j47k04M28j9j88J50q6J24ro1k54L13K7m1j71K75l63K00k65
3375b90P2J56K0N6K1o4P3j24k2j5J57o3j40J06N4J54l7l0r2o8J80j25J42L6m3
3400A14o4j10Q4P5LQk58K87J22l59J27j2Q9k12K31M7qmj10k78K48N3k22K35J70
3425B56l96J74K30j87K3k46J66k65K45J18j14K1O5J36l01L2m7J77o2r3j72L67
3447A27k46m3Q2Q3K4M8j95L1Q%o6L7p3K40J12l47K95L1k18J96j76J41o3j81r6
3472b49J87r3n3J93N3K42l17o0J53k5j16k1J37j24R2n7jP4J29L1j35k2Jj23L0
3497g4K17l8%k7q1J3K76o5K0l49J07j13J89o5J7Kk8l01O09k91J34k13k49M98m2
$$ y = [151, -88, 90, -208, 261, 76, 150, 375, -106, -34, -56, 203, 79, 172, -146, 15, -121, 164, -167, -25, -45, -1, -297, -61, 272, 1, -146, -350, 78, 59, -129, 21, -65, 59, 50, -11, -265, 48, 75, 34, -137, 138, -225, -25, -290, -218, -62, -42, 14, 35, -29, 44, -80, -102, -117, 40, -23, -163, -57, -3, 151, 114, 84, -8, -76, 104, -21, 121, 157, 114, 50, -60, 24, 99, 102, 110, -148, 139, 261, -98, 29, 17, 106, -106, 125, 172, 164, 160, 50, -228, 20, 73, -149, 86, 256, -140, 34, 264, 77, 100, -146, 20, -245, 0, 118, 4, 25, 90, 226, -75, -43, -90, 87, 25, -68, -240, 127, -119, -162, -80, 3, 27, 75, -120, -89, -81, -81, -147, -110, -183, 57, 169, -178, 117, 148, -70, 126, -50, 91, 28, -153, -249, -62, -155, -208, -15, 38, 280, -37, -97, 56, 31, -85, -106, 31, -93, -1, -58, -59, 15, 144, 175, 40, 18, 19, -104, -74, 143, 105, 105, 78, -3, 10, 286, 221, 241, -108, -1, -114, 75, 10, 27, 29, 1, -300, 309, 18, 152, -61, -310, 188, 146]
3522A46j87P9R1J82j81o9L3k24J87J25k68Q6L8j82J51l6l3O1J02P5j08l48K90
3545A0j18n0J23Qj9J97j06L0P9J15l16R0J55j18N6l17J25M1l8J28k57K60N0k67
3569a39K18p4j31K1J75l99M01j2j44M7l4J74k7J19n4L5j00J75j14l99L95k57K32
3592A08l1k53L59k23L2K3k03M44l27o8J90j75K28J5k18J39J76k99j19K46j64J18
3614bn6L2o8j53M26n0J32k51J93l72L88l1r0k20J64m6J21j95J74j23K8k15J09
3637a05K47j63L6L1j16J03J49k26M5kk6l4j44K71J7j27R9J15Pm10L81Ll24J65
3661hK70m04M9j24K77m10M31q1O8q6K7j04R0p8O7K10k12j02J0qL15j27K50p6r0
3686A54m2j48K6N0k33K68L4j95K65k79K3J21K2j16L06m05N7N0K53l24L49k31r4
$$ y = [146, -41, 38, 129, 311, 130, 61, 94, -130, 57, 182, -86, 0, 38, -144, 7, -29, -62, -1, 101, 176, 68, -280, 10, -108, -158, -35, -27, -46, 151, 45, 75, 154, 269, -47, 43, 198, 80, 136, -181, -56, -15, -53, 75, -182, 78, 128, -139, 79, 5, -126, -105, 70, -329, 72, 60, -84, -37, -71, 103, 76, 195, 141, 176, 76, 251, 137, -262, 133, -124, 108, 77, -176, 183, -40, -8, 15, -188, 256, -71, -139, 51, -124, 104, 119, -99, 40, 216, -83, -202, 44, -120, -2, -58, -26, -94, -247, 179, 129, 261, 10, 203, -169, 219, 188, 98, -122, 42, -4, 117, -78, 96, -27, 1, -214, -105, 142, -21, 15, 46, -70, 33, 182, -44, 1, -1, -27, -61, -205, 66, 83, -44, 55, 170, 177, -233, 148, 151, -173, -8, 262, -142, -93, -217, 60, -350, 81, 0, 68, -18, 9, -95, -5, -83, -16, 194, -18, -120, -110, -118, 197, 70, 320, 244, 154, 112, -36, -10, 40, -193, 75, 109, -86, 179, -100, -77, 44, 66, -50, 256, -149, -92, -42, 211, -113, 236, 5, -89]
3709h9Q8j23o4J86K19k63rK87m5l14RJ83j34K39j66j42O1j7M9Q1Oj20K16j15J40
3734A63m01J65j17K54O4l02M62l31J42k58M43j93n3O7O4k26R2J4k71LM53l56O8
3757e4O7P8J5k56J21K85k02j29K84l6j76L1j52k6L76l09N5J6J58n0JPj39Q2n7
3782a0K13k02K81l36M0j41K13J18J51o02K13K71r8j50jJ32m1j21R2q4j52L09k78
3805a83Q9J58k2n6j78M9J93N3j10LO2l2J28k77J36k41L57j79R2j74L17k45m2K63
3829A61j36rl61L48J41j14oL8o1K34j55m5j34j36J06J60J76k44J94j81m0l5p1
3852a70P0j10L00j94L12j90k41J37l5J83L6j45k69L26P6q8N8p4l9J35j05J7K39
3875B29k82j13N1K58k75J18QJ7J4j4N3j07K61j59o2O8j02o0j84J64j9L9j14K28
$$ y = [-89, -1, -124, -188, -2, 217, -46, -55, 232, 187, -127, -118, 65, -69, 170, 4, -138, -77, -94, -45, 36, 42, -78, 138, 23, 163, -238, -73, -190, 64, 128, -174, 288, -43, 99, -159, 284, 91, 38, 105, 169, -57, 35, 49, -222, -219, 234, -122, -54, 13, 91, 106, -150, -29, 256, 54, -75, 209, 173, -3, 28, -124, -150, 226, -83, -28, -12, 146, 96, 97, 104, -35, 47, -10, 203, 1, 282, -54, -14, -155, 58, 176, 327, -275, -62, 209, 111, -39, -40, 92, 51, -70, 22, -62, -214, 95, -183, -94, 64, 42, -14, -192, -143, 50, 103, -7, -4, 58, 26, 154, -123, 13, -228, 129, -50, 42, -132, 185, -60, -102, 161, 25, 16, -345, 3, 144, 30, 24, 62, 1, 235, 80, 35, -99, -235, -129, 31, 207, -37, 157, -24, -64, -99, -170, -100, -210, 90, -104, 208, 18, -223, -86, -121, 62, 98, -47, -316, 10, 86, -2, 56, -18, -57, 78, -27, -10, 229, -53, -166, -115, 143, -132, -14, -6, 11, 25, 11, 64, -43, 218, 59, -3, 65, -37, -97, -281, -117, -136, -97, -211, 17]
3899A7j91P2O9j9J0J10K12j20R4k47j9m5J28j19N3j8LJ29J34j96k02j69J89K75
3923A50k04q6J47J09n6k01L17k37O1k0K49l13r6L37J9nj86J88k55J08M1r8o4K60
3947A65m3j37O1j04O1L8o7k5o5K02P7k18M8p1J6K89l30K53k33J42q1K49j94R5
3971A28L4j71K85l08m1J34l4l24K57J55k39J67K16l25k4J66p6L73l34r2J31K2
3993A00j05K6K7k12L13j19m8J36k06q7L56k67Q8p1k0R6P6K0P2k51k50K27Q0k7
4017d6l3K3k1j15P5P9l4J70J39j10j66P4K1J20n9l8j14O6j47O9K12m32N11l13
4041f9j73K66q9m7J9J09L9o0r0K11k63N3K12J89o5l59J47q2M0n0M4p7J57P4n9
4066G7k20M13p1j21N8r0K3m2J62j45r2L35l84K49J19j16l36Q8Mj15M1K86k3k12
$$ y = [17, -174, -102, -33, -52, -42, 68, 280, 160, 254, 7, -12, -57, 71, -48, 5, -13, -10, 119, 253, 57, -145, -314, -125, 150, -54, -140, 7, 116, 60, -141, 176, -61, 0, -20, 229, -84, -180, 157, 176, 171, -15, 173, -82, 26, 67, -31, -95, 165, 122, -15, 46, -58, 3, 41, -26, -51, -116, 86, 163, -55, -7, -78, -62, 227, -103, 150, -83, 59, -22, 227, 33, 128, 162, -9, 276, -32, -73, 61, 27, -297, -40, 115, -124, 43, 259, -66, -90, 76, 0, 373, 39, -53, 78, 100, -5, 21, 48, -164, 149, 30, -18, 118, -88, -175, 181, -86, 2, -69, -89, 7, 83, 103, 175, -76, -326, -99, -19, -46, -79, -56, -77, -192, -117, -38, -72, 98, 237, 127, -39, 35, 56, 176, 117, 79, -35, 31, -116, -47, 165, -267, 244, -69, -242, 24, -65, -112, -93, 16, 55, -5, -95, 116, -147, -94, 118, 307, 242, -117, 30, -52, -12, -62, -18, -95, 62, 136, 77, -143, 270, 199, 78, 136, 46, 69, 27, 189, 44, -48, 287, -97, 152, 271, 155, -181, -93, -89, -204, -163, 123, 100, -112]
4090a12K18J56k19j38j33J12J00nN6L8k90K20r0J23p8k23L19q5m5J49N5j22p5
4113f9j01J16j04J69j14m3K54P4k30J40j72J46K20l97Q3m0j70K62m4K01l03M9
4135g3K6M9j82J78r0R9K49k15Lk77K65J50j44k37K31L0K28m36K21Q8k0Mqr8M8
4160H9q6j41K26p5J07N1j53j69q7K62q1j34J66P5m8k82L89k50K61k22M3m1k6K11
4184H5j22o8j12J99o0R5J5k7R1j77K20l30J94R7j71p1J87lm6LL19k01k19J73j94
4209a23J90m4K1j91L60j98K77k38J07k19K7J40k95L17j41K23k64K1j90K46l72
4230c46K63K17j2J7J5j21M9j2k61J32J33j54J23Lj8j55q9L20J76k08j39Q3J18
4253A34l04J04J42m6k1K7n6J93l48O9J09o6J08j54o1K80j51j08N5j48L00J61k77
$$ y = [-112, 106, 262, 43, -95, -228, -116, -16, -21, 35, 73, -217, 3, -87, 36, -42, -265, 54, -31, -76, 73, 128, 6, -69, -170, -54, -158, 11, -103, -146, 108, 182, -48, 92, -80, 66, 286, -111, -28, -68, -238, 24, -20, 181, -122, -73, -47, 2, -180, -2, -92, 7, 256, 41, 44, -233, 32, 182, 38, -199, 32, 62, 290, -146, 75, 163, 143, 147, 139, 41, 89, 3, -138, 88, 13, 120, 171, 18, -151, -238, 24, -57, -191, -25, 50, 2, -280, 109, -141, 120, -102, -59, -100, -126, 85, -37, -105, -217, -18, -78, 17, 32, 5, 96, -81, 139, -191, 3, 100, -71, -142, 45, 42, -4, -1, 318, 117, -102, 71, -123, 67, 23, 44, -147, 213, 15, 292, 54, 161, -58, -31, 109, -186, 131, -10, 213, -51, -30, -220, 26, -346, -83, 134, 122, 139, 154, 33, 82, 70, -191, -59, 74, -80, 43, 46, 28, -127, -216, 104, 280, 72, -67, 16, 134, -170, -66, 76, 30, 9, 36, -20, 173, -175, -106, 3, -63, 45, -109, -170, 110, -41, -149, -94, -242, 58, 219, -58]
4276e8j05K30j78L27mj25M5J14k01j19lK2O8J30k38j40K45O2N9M9k37K57Q7j02
4300A85j21j15mR6lq3KR1N5N1k09M2P6R8j65q3K04k80J60J23o6n6J4m9J42k28
4326a23J59K3M4K15l19L19l22M2k02J45j75K15j03P6K8o8j1M1qJ84l13j12L17
4349E2J63k39M1j58J13K2j35P6Q1j65l5J90Q9j62j78L21Rl2j0k29J92J09j01J38
4373A52P0j17j4J9k81L88j88R6PJ18l82J70P1l97L07J20k00j56L93m54J38L27
4395A87n6k84K00l36J60P8K8N5k5K5L1m2JM4j80J29j57N6P3J39q0j39kL9m1P5
4421b2j75K64P2K8m23K38J48j41J6K26k37L26k88J94j65K8j10K41k22j1J08j58
4443f3L14k38Qj43J14k8n6L0k5J9j1K77l30J18q2RJ07j13K40l10Q4J9J22J32q6
$$ y = [-58, -163, 67, -111, 216, 212, 87, 132, 246, 45, -74, -77, -55, 13, 143, -95, -235, 10, 72, 131, 180, -57, 200, 287, 185, 64, -51, -55, 41, 38, -45, -43, 48, 103, 154, -55, -13, 63, 161, -4, -87, 117, -163, -3, 120, 54, -2, 12, -37, 105, -123, 36, 59, 103, 318, -1, 318, -4, 38, -164, -19, -194, 21, -82, -6, 22, -46, -57, -16, -24, 160, -153, -265, 52, 215, -24, 17, -141, -28, -6, -141, -65, 16, -149, -184, 6, 95, -67, -245, 76, 85, 53, 43, -186, 6, 115, 14, 152, 222, 105, 91, 110, -171, 217, 29, 125, 132, 250, -132, 38, 109, -288, 19, 139, -61, -217, 176, -278, -140, 187, 131, -153, 47, -289, -129, -51, -23, 32, 7, 32, 63, 21, 22, 66, -114, 15, -142, -86, -13, 126, 46, -93, -95, -56, -97, -22, -197, 67, 139, 167, -256, -18, 130, -11, 5, 231, -6, 320, 32, 226, 61, 89, -21, 220, -2, -13, 95, -63, 251, 13, 21, -122, -8, -36, -92, -62, -87, -68, -79, 198, -132, -14, -96, -87, 20, -93, 147, -163, -79, -60, 62, 194, 108]
4468A08j03J52j18O3k50K32O6j86L40l77j06L96k38q6J57j60j01J46L04j68k21
4489a50Q9j68K80j51K03m1j77K6K82l0k34L3q2J45L7n8j39P7n3j8K9n6K26njp7
4515a3j08O2J54j20J69o4j92L40k46J25K4j84j70j27O40k23j45m0K85k10L58l07
4537Hk9j66N4J09p2Nl5K02q4o5O6J62j06k08J43P1o3K82k68k94L77k93J37M8k37
4562b56K01K68m64PK59o4R6q0K2K47k87j3K06j45N8j29L5K35k66K73k86j2Q2j4
4586b7J55j15O3r9m5J57j32R7R4R8k95m0Q5J20r1l2O2j08nj75L17r3K80j98Pk38
4612a58K04J5j00j67J43K02j04j07J4O5p7N2j69L15j38k10L35r4o1L0n0q9L05
4635A56p7k99K07J79k64p3Q1OJ87q2j56J45J01j93N1j59K21r6J87m4k92J22n0
$$ y = [108, 5, 157, 39, 102, -148, 84, 150, -36, 304, -73, -179, 217, -21, -107, 50, -110, -211, -65, 239, 71, -150, -61, -229, 51, -100, 103, 62, -115, -89, 193, 163, -71, -38, -120, 25, 62, 4, -135, -58, -111, -129, -100, -156, 70, 65, 64, -13, -121, -59, 95, -25, 144, 80, -112, 228, -18, 107, 131, -53, -223, -350, 290, 67, -78, -118, 167, -43, 315, 8, -21, -187, -133, -24, -96, -91, -126, 76, -8, -73, -7, 155, 49, -159, -16, 55, -8, 274, 6, -288, 89, -204, -67, -19, -256, -55, 213, -251, -244, 15, -49, 47, -33, -11, 236, -51, -64, 142, -3, 55, -74, -39, 196, -70, 203, -83, -95, -13, -27, 128, 13, 76, -23, -68, 89, -43, 54, 148, 246, -49, -89, -4, 116, 25, -7, 55, -53, -58, -233, 84, -9, 271, 73, 80, -158, 46, 61, -39, -206, -63, 139, 35, -72, -58, 7, -70, -18, -187, 128, -10, -220, 115, 21, -40, -10, -60, -149, 156, 79, -220, -13, 166, -98, -171, -90, -84, 103, 21, -135, 10, 111, -82, -31, -190, 31, -65, 122, 78, -214, -92, -142]
4658a42N4J03K39K9m10L82q2k00K80k49N2k09L8j17K50j59O0J43j71Q7j10J23
4680ij20K5L17k36J02J38lk02J30j08j17j5l6J24q8K13k45J93J09l76J93K11j86
4703A4j79N3K22k36j32J82J22j2q7K60l23J70N9J8l6J17Lj28k0k41J53K87j47
4726A19k70K69l04J59k8J69LL9l42J28R0l16M39J5j01j00J35K4L1j73J14j82K91
4749B09k72NJ0J25LMJ13j41K8j05J33p3j92K08q9m3kM5l3K37j76j87L25k15k50
4774c33J85M7J50l94K82m2L28j55j0K8o2J7k79J66Q8N2j05N5R2j64J49j37J03
4797F1O5l20K18M8j3Rj01J06m3J03l57K33J77q3j48ko7J02j95J24rK12M8r9j39
4822g0l0K79k59k14L67k07J21R1k92K78j17p5N0K16j52r9q6L15k75n4J32M5R5
$$ y = [-142, -88, 15, 254, 283, -127, 255, 173, -27, 253, 4, 56, -153, -115, -232, 18, -141, -81, 62, -109, -22, -132, -9, -129, -104, 213, -23, 79, 217, 214, 12, 142, 34, -83, -98, -134, -10, -98, 115, -130, 63, 172, -204, -11, 200, 14, -165, -112, 110, -126, -258, -76, 46, 34, -53, 207, -116, 54, 113, 131, 95, 212, 215, 87, 67, -174, -21, 266, 119, -151, 118, -186, -27, -55, 114, 117, 156, -186, -58, 32, -284, 155, 170, 69, -31, 104, 128, 159, -14, 100, -82, 209, -63, -58, -48, 77, 80, 84, 197, 56, 84, -21, 112, 39, -153, 55, -34, -77, -79, -34, -67, 170, -6, -193, 132, -83, -333, -148, -101, 49, -345, -63, -105, 223, 68, 58, 86, 24, 41, -238, -72, 16, 68, -37, 18, 110, -54, 95, -42, 61, 126, -194, 24, 72, 59, 68, -33, 73, 30, 133, -224, 9, 186, 103, -45, -47, -114, -12, -207, -83, -92, 120, 168, 69, -70, -100, 179, -80, -294, 73, -134, -13, 78, -214, 64, -53, -128, -78, 138, -14, -113, -199, 116, -159, -213, -81, -36, 59]
4845E9O6k37J10J49p8J63m08L36M1k63J1J27k05M37k78q1J69LL7k83J57J54k92
4868a06L3J44M0P7p2J3j81MK33R0j61j20p0P8m1O4p2j1L6k01L30p4j20M9J11k4
4894D9o0j40K5J5J58j19J45L1o1LRn1r5K05l60K43K21M5k87K49l16j12K83M0k65
4919a45O1R8j90J56K0L3M9j92J3J20mr6K17r2k40R1K54j36J4j99J17J78l91R0
4943a74L03q4L1k0P7j93J15J36j51j01k35Q4j08K68J73l26J62K33j28Q3j28Q2
4965I9m6N9j66P5m4l3J14l4MK8PL0J09j63j98J95p5Q0j32r6L3J25l16L0L97o8
4991A4j12J28j84J63j88J36K52j55l5j98K84j55j7Q1j50J13m4R8P4k15o1K92j74
5014e3k67M68j08j20j38M34r6q2R0l08L7L10k55q2M13k68L3k31K78M4j34R3j2
$$ y = [59, 125, -112, -2, 147, 69, 232, -176, 160, 201, -62, -51, 76, -129, 308, 30, -51, 118, 121, 158, -125, 32, 186, -106, -73, 71, 111, 188, 116, 129, -52, -48, 185, 275, 114, -6, -76, 2, -39, 25, -47, -58, -22, -223, 107, 33, -87, -38, 73, 49, -11, -151, -126, -111, 47, -72, 73, 104, 43, 46, 55, 4, -91, 114, -246, -3, 218, 263, -24, 225, -91, -203, 80, 120, -145, -84, 14, -176, -20, 0, 33, 82, -110, -97, 23, 19, -77, 140, 48, -192, -101, 153, 17, 31, -168, -51, 127, -264, -174, 129, 45, 76, 56, 133, -60, 55, 191, 40, -61, -296, -212, -320, -52, 121, -205, -43, 190, 62, 145, 17, 99, 53, 112, -54, 21, -23, -56, 58, 24, 28, 56, 63, 93, 202, 39, -159, 36, -39, 41, -91, -187, -154, -29, -345, -315, 82, 14, -98, 30, -154, 9, -179, -43, 209, 54, 19, -179, 105, -50, -67, 14, -136, -23, -67, 31, 105, -110, -171, 121, -53, -320, 148, 40, -80, -218, 216, 120, 38, 128, -180, -143, 167, -88, -170, 243, -25, 8, -223, 55, 99, -35, 58, 46]
5037D6Ok56J15L83l67O6Q8m2kj16j56K18Lj45N3N57m85n7K29k18J75o6K5m1j36
5062a23K81k83K14M7j08k02J86q8p8M4J79J04l37O7J71J27j26J2j33K45k72J43
5084G0j1k48L86j87L5r1k7l4J2j07K58j54K50r0R8j35J33k44p1P8j1k3K2P9Q3
5109G1m5J22k68K47l94J5K51p9R1k31K09j38J38o5L3J47j36J27R6n7n8n2j33J70
5133F1p0j01K74j25k38j08L68j02L66k88J29j44J06j55M8k26M26k47K5j59L15
5154A55j37N1k47K76r7m1k37P4J79R3lj30J19K9Q8j2j58J01K0k30J23K13r9r9
5178C1j45J15j21N2K0L0K37l4lm45K00J80j85L0J79P1j28j53M8k9rp3J75l4M8
5203E7k7l3p9JJ3K19k71K95j59n3R9k2k00j40L21q5L2Q5q5K45k43K24k81K04l10
$$ y = [46, 52, -204, -89, 294, -73, -7, 81, 39, 37, -79, -235, -17, -14, -159, -106, 451, -34, -91, 138, -80, 95, 29, 54, 13, -123, 158, -125, 89, 136, 28, -174, 12, -76, -154, -110, 69, 173, -164, -97, 74, 201, 75, 87, -46, 199, -73, 70, 59, -189, 197, 10, 45, -46, -73, -107, -95, -202, 56, -98, 152, 62, 160, 25, 158, -86, -157, -79, -90, -113, -91, -12, 71, 26, 148, -120, 127, -267, -252, -1, -80, 11, -220, -11, -149, -11, -76, -43, 104, -32, 95, 191, 134, 76, 24, -109, 61, -9, -110, 164, 39, -199, -307, 61, -41, 325, 37, 166, 22, 128, -27, 21, -205, 221, -26, -1, -160, 155, 18, 69, -178, 98, 1, -40, -277, -203, -24, 69, 66, -64, 55, 84, 172, 160, 2, 103, 123, -107, 16, 229, 130, 31, -114, 1, -120, -68, -48, -18, 219, 185, 182, -263, -63, 117, -68, -38, 141, 212, 84, -69, -21, -50, -59, -132, 43, 9, 57, 30, -3, -82, -81, -68, 151, -120, 175, 16, -37, 62, 40, -160, -300, 21, -64, -32, 53, -32, 213, -30, 194, -87, 117, -193]
5228a93J81k48J75J44k89L02m2j62M7J18Q0K2k5j97J8p4J16k2n9r6J27K87k6j39
5252D5o7L25m87J53J00j31rQ4L49l67m0n1N4J06j7O9l82J49K72q4j13N2j52L95
5276B53l37Q1j22O8K04Q0J38l50P3Q5K5k57j28J36r8j8j6J70j72J75R9j21J4l3
5300e1L8o4K47k55K8M0J62k04q5J39QM9J26k74J76k06j50N22l40PK87m3l58j05
5324c06K56jN2Q3qj54J10N9J6K6j17k15k5n8J42K74l18L35m05L93j03K5j60J56
5348E7n5J37J12n76M79j68J50j26j20J06R9n3R0k21K13l84J21J04k52N8M33k3
5370A81k32O6J43j74K4o4j93K92k31J93J94l98J65K28k88K8Q4q4J57j9j53K10
5392A29j61j81J07K80k8k18J92l09P9J76j01n2r0M44l81k1P3J35q0j36J91j34
$$ y = [-193, -12, -260, -85, 59, -230, 72, 30, -132, -85, 33, 113, 135, 110, -87, -69, -143, -27, -49, -108, -204, -77, 210, 184, 45, -22, 303, -184, -31, 69, -62, -71, 13, 362, -5, -45, -96, -42, 64, 47, 116, -266, -117, 155, 71, -42, 10, -142, 253, -84, -3, -125, -57, 147, 227, 365, 15, 88, 173, 198, -59, -187, -51, -149, -167, -183, -13, -185, -10, 89, -32, -18, -51, -13, -77, 170, -85, -57, -17, 145, -59, -144, -5, 3, 52, 178, -96, 80, -126, -276, 246, -94, -87, 200, 157, -201, -306, -50, -51, 1, 84, 76, -78, 32, 91, 107, 133, 16, -199, -224, -282, -140, 134, -184, 151, -254, 139, 36, 61, -99, 57, 2, 139, 251, -325, 154, -14, 136, 10, -110, -4, 95, 42, 132, -89, 124, -260, -139, -35, -287, -229, 204, 181, -51, 15, 158, -16, 8, -56, -249, 43, -188, 5, 199, -199, -34, 194, -94, -66, 18, -66, 91, 72, -81, 129, -32, -213, -106, 174, 146, -72, 120, -189, -110, 66, -35, -87, -177, 267, -114, -135, -62, 73, -7, -143, 48, -86]
5414h6n7K74K7j63m2P0j1j4L72l64J40j78%M1k98M47q6J35j06l03K39k0J10k90
5438a63K37j58J74o6M0k56M29k86J22j16J05p4m1J33l1j6l37K51J06k60L01K5
5460A19j19K7k02K93j80l0M6j21J26J0O0l8j02J82k75K60pj42P5N7Q3k49N4J17
5484D4l6j36J08l18K51P8Q9k84L12j42k17J46J57r8l52L24OQ2j01K37r5n9K14
5507B10oj6j88Q3oj8q9k13K87j43o5K57m12L81l07J06J38o7J7Q0O4k9m6J79r2
5532A05j35MJ83r4j5l09K88K45j12j71P9Q9n2k72K75k40J37M5M0k6k31K08M9j67
5556g7K4r0K49J8m05L03l05L84k85j22J44L00j49j7r1J44m6n9K02k54J10K7j92
5579a87J02K88j29j27L7R5l05J73o1J29J0qo1l5J15j13j11K76O1n4l24K74j44
$$ y = [-86, -143, 131, 158, -5, -47, 23, 12, -2, 370, 6, 146, -32, -32, 9, -289, 158, 72, 207, 101, -202, 37, 17, 127, -163, 74, -84, 90, 24, 64, -192, 237, -49, 73, -43, 62, -12, -53, 80, 49, 33, -304, -53, 53, -207, 94, 119, 0, 27, -175, 118, -62, -92, -46, -167, -41, -31, 29, -9, -111, 71, -204, 56, 49, -93, -18, 39, 122, -127, -73, 44, 8, -128, -20, -338, -87, -9, 80, -204, 108, -34, -251, -105, 52, -46, -398, -74, -68, 14, -87, 150, 55, -4, 210, 204, 188, 0, 83, 77, 59, -30, -243, 44, -99, -164, 93, -319, 62, -245, -139, -1, -68, -51, 29, 93, 64, 18, 197, 105, -30, -26, 157, 63, 48, -261, 27, 272, 160, -11, 68, 157, 105, -167, 108, -132, 5, 50, 90, 64, -167, 41, 90, -77, -53, -143, 106, 124, -281, 22, -283, 101, -184, -306, -162, 138, -11, -28, -119, 25, -21, -80, 122, -132, -22, 5, -187, -85, 203, 74, -53, -16, 79, -226, -53, -114, 15, 25, 17, -44, -79, 36, -77, -188, 88, 149, 95, -229, 45, -99]
5602i9K05k24P8NJ66j39K9P4P4j10o0o7L5j7p2J47r2K28k92K35K2j13K1P9k0N4
5628A47k70K66j89K17l4j63K80k03K5J42l05J23j26J93k67P7P2R2j49J65l9j23
5650f9m2O2k1Q9J25j38J91l83L29j0j14O6p8J70j14j73K32j20r8K95l72K23M7
5673I7k23lQJ11K3l3j9j05J27N8r5J7q0J84l17J70J37J0J41l87J91R1r2j91L21
5698A41l2l22J60o0J43j80J64n1q1J1J62k21J28kN7j31K55l92Q2K13R6j18P1j64
5722g1K6j33J99M8k21J43J7r4P9L39m30L11k25K2j58K67j33o6o7M61l18j7N5j
5746C3J00j37K00j30n6j67J37k08J92L0k40J85j51J1J77j55J44k33L34j3j06J62
5768A09p6j97M2n0K40j97k96K47L92k29P3k36J32j42K09J03J53j96q0K03j1l64
$$ y = [-99, 106, -118, -40, -35, 131, -8, 21, 95, 169, 59, -1, -68, -33, -50, -122, 25, -67, 161, -131, 104, 126, 13, 34, 113, 93, 147, -123, 143, -46, 171, 137, -26, 254, 51, 76, 218, -87, 36, -90, 103, -164, -87, -15, 77, -72, 93, 54, -69, -111, -49, -70, 19, 144, 6, 197, -186, 143, 133, 19, 85, 7, 177, 63, -110, 122, 2, -96, 199, -173, 50, 97, -126, -129, -121, -10, 13, -20, -39, -144, -17, 41, -54, -37, -117, 67, -250, -80, 57, 67, 208, -179, 12, 103, 11, -180, 141, 109, -213, -53, -113, 30, -150, 14, -37, -118, -107, 55, -166, -38, -40, 17, -114, 141, -251, -169, 44, 140, 22, 93, -71, -45, -178, 21, 69, -152, -9, 8, -86, -7, 332, -98, 213, -12, 10, -148, 119, -14, -80, -147, 314, -4, -21, 34, 33, 133, -4, 196, 66, 10, -157, -20, -228, -36, -6, -246, -61, -212, -201, -24, -179, -35, -268, 66, 53, -53, 109, 33, -164, -122, -172, 68, -129, -425, -178, 214, -15, 58, -178, -46, -188, 21, 124, 277, 81, 1, 204, 193, -171]
5790a71j1rK12K09j08Rj40l9J3J0J79k49j53L66o1j8j15QJ15m5J4l6j12L10j39
5815C9K73k37O2O4m01L13jL8j21J87k73o5J23P6p1k8j82o8j7L55p7o0J21j8O6
5840I8M3k82J68j04q2N6N8R1J8m7J88k10J09k04L31k6j15j42P1lJ21l3l18K07
5864gN2P6k47K31j30L11m32o1L33l12K64o7k8o3P8R8j1j73l6L98l26J83k66J12
5888b3m8j73J63J02K30k93N3j79J21J06k59J25k93J99M83m57m5J62j29K64p5r6
5910f2L5JP9K36l44J50J30l29m9J38p1M8q4M8P8j82J40J89j90J89j63L8K1j44
5934i8R7J10J28l27Q4j27K13N0k46J12J61J4J03r9k81k0O4l5Q3J15k52J02j37
5957a86M8K03K3k66K33j24K9j41L13p5k3mj2J12j25k95L90n9R3k20k8J42j00J84
$$ y = [-171, -182, -191, 21, 230, 122, 131, -9, -48, -35, -25, 154, -95, -248, 118, 57, 39, -76, -68, 47, 2, 16, -20, -132, 178, 39, 312, 75, 137, 201, -200, 113, 112, 150, 29, 216, -57, -122, 1, 77, 6, -22, -204, -272, -289, 66, -11, -71, 50, 32, 98, 141, -141, 27, -77, -159, -103, -45, 46, 64, 17, 205, -5, 104, -100, 231, 205, 90, -52, 19, 16, 137, 104, -214, -7, 45, 121, -126, 105, -25, 286, -146, -207, 126, -186, 78, 11, -17, -80, -2, 96, 85, -88, -124, 274, -52, 131, -135, -23, -71, -244, -81, 21, 251, -42, 11, -168, -47, 59, -200, -75, -368, -169, 314, -143, -188, -26, -155, 109, 34, -62, -27, -26, 53, 289, -55, 95, 225, -104, -153, -15, -86, -38, -122, -74, 4, -178, -38, 151, -39, 150, -13, 25, 46, -98, -1, 109, 237, -90, -6, -133, 80, 130, -116, -4, 157, 171, 274, 175, -106, -126, -62, -97, -14, 101, -151, -49, -186, -138, 65, 88, -178, 55, -69, -40, -181, 132, 57, 34, 30, 18, 130, 5, -290, 100, 41, 134, -86, -114, 28, -72, 112]
5981A12j20j32J82P3m1k76J67j6j25L3K6J1J41%j78J48M1j88P5K53k1j19j62n3
6005a69L74k12Q1k33J06Q0O1k76l3K03nK11p8k21J70j05J43j12K00j42j07J28
6027F4j10j9O8l7N3Q5Q0j98J21j88L49j32j89M8j04K06o7r1o3J60j57R2J20k61
6051a70K54n1l26K22K55r6m7J47j74K37k47j58M7p0L34j49N6m5J38j73o9J29J09
6074A53J24k33n9P3m5j12J73k35J12N7m7O8o3K9j99K57J03j48j17j0R0K52l48
6097a25j18J02K29q2O1K91k16j25j05N9p6n2K11j52J63p3kO8p2l8j05J37r0J47
6121C7k65O0M27j53j24L7P3o0J39l00J52K0N6j04M4J44K9q7N6k40J67p2j8k66
6145b48K08J6J08r4J0j1m8p0K12j39J35r0j85K02NJ30j59j45q6L48k50j18L86
$$ y = [112, -8, -140, 42, 115, 74, -202, -35, -51, -176, -143, -117, -106, 35, 35, -143, 5, 46, -142, -67, 186, 165, 46, -116, -169, 205, -7, 74, -159, -53, 27, 88, -188, -221, -18, -23, 188, 110, -111, 59, -46, 97, -15, 185, 43, -64, 64, -46, -65, 3, -34, 19, 104, 184, -14, 107, -81, 268, 136, -53, -5, -109, 97, 30, -61, -124, 36, -121, -29, 91, -170, 84, 33, -293, -71, 184, 88, 41, 188, 14, 251, 4, -154, -107, -177, 157, 8, 64, 19, 157, -16, -85, 44, 153, 277, 44, -15, 58, 13, -99, 74, -161, -49, 8, -39, 29, -34, -5, -204, 53, 156, 8, -109, -119, -29, 223, -125, -243, -141, 88, 6, 67, 358, 142, 17, -88, -29, -105, -157, 54, -98, 65, -8, -10, 58, -14, -52, -157, -20, -110, 37, -228, -168, 259, 106, -18, 19, 92, 32, 171, -129, 23, 43, 99, -5, 39, 183, 212, 125, 181, -59, 108, 36, 18, -248, -40, -24, 84, -10, 0, -11, -59, -129, 83, -56, 79, -11, -196, 6, 11, 141, -18, -163, -249, 99, -151, -269, 117]
6168A17j15j6J35j16J02j33m7N0j09J60K4k08R6N6J69j49q4p4J92j21k0n6K49
6191A02J00k75L17p6n4j67p9O7k22L71J4j00P1l0j96m9J66m4o5J10P3j9K45l46
6215h6k5J64l22L74o5j27o8K87o4J82m9l39P3O6p6k4J65r0P8j69Q4j6J18m8j14
6240i1K88l72J10j94L83M5l56K55j84K82q3Ol28L0L71k23K6K08k55K53l68J85
6262a2R7j61j39L36j59l10M08n6k19M36n3j22l07J80J80J81k34k8j8m1J8k81L48
6285D4R0k86M55j99q8N7P3J7q9j07l0R2r7J16j36L83m00N7j44L87m3j24k97J3
6309b56K08p4K02J6j17q7K37k47L33j67L7k8n8p3M5j50J17K3l3J78L9o9j51k6
6333a01M95m40l4J63q0Q8N5k11j47R9J61j0k13n7L02J1r1R6o1L5M7q7l10K89j42
$$ y = [117, 2, -14, 121, 5, 107, -26, -73, -23, -132, 28, 52, -156, -60, -4, 165, 16, -68, -142, 50, -71, -91, -147, 102, 202, -73, 244, 168, 114, -53, -132, -65, -287, 84, 98, -2, 69, 39, -157, -206, -40, -84, -149, -39, 34, 15, 260, -86, -111, 53, -269, 105, 40, -87, -155, 132, 68, 250, 201, -138, -65, 1, -75, -99, 66, -24, 54, -115, -31, -47, 71, 23, -91, 197, -175, -65, -259, 124, 169, -187, 68, -116, 166, 83, 89, -239, -209, 162, -61, -35, 173, -82, 171, -197, -12, 85, -76, -215, 121, -38, -348, 60, 4, -215, 221, 168, 46, -261, -81, 99, 280, 46, 18, 0, -41, -23, -304, 44, 134, -152, 303, 104, 16, 73, 146, 163, 74, -33, -63, 29, -68, 48, -88, 295, -105, -48, -192, 195, 152, 28, -269, -256, -48, -122, 80, 96, -21, -108, 129, -118, 215, 48, 85, 57, -1, -74, -29, -179, -62, -39, -72, 106, 145, 76, -75, -101, 394, -46, -80, 83, 3, 91, 146, -65, -212, -113, 48, 38, -175, -232, 70, 81, -10, 86, 25, 60, 107, 20, -290, -1, -143]
6358a43K61q7j50J74O5p9MO3j6j68p5O1J79j11rj66J20QJ20l07L37j21M2j83j09
6383b90M09l28K69j9J97l40p4lL87k12j93K26L6j05L62l22N7Rj22J81j14M5l0
6406B6k64M02l00P5M82k99k33K11o7n8j06L29k29j3K18j42n7j72J61r7o4K31r5
6429f1k7K24j16LO1j65K1N4j51q1J04K38j07M8j14M7j70m3J85K47N4k57R0k09
6453a25L54j93Nk43J51q2q7K05jJ16j68J36O1nr1M3k7L4j00M0j06L72l20O1j39
6478a09Q7l6J39j56L08j71J9j5k95L75l56L45J3m90K84J63m77M23m3m6m6P0O5
6501E1J01j35n6L0J99j89j14J86k2j25J56j21N4J3k1J21j60j27j75L24j62J5L3
6524a24J15J09L8j77j02qJ12L6K43k21%o4K18o2m7mJ77j70k9m9j77L09J68k97
$$ y = [-143, 118, 31, -119, 55, 120, 41, 45, 108, 92, -76, -151, -90, 89, -22, -31, -197, -77, -69, 51, -256, 81, -40, 2, -181, -290, 119, -209, 60, 41, 238, -102, -176, -179, 208, -4, -197, 29, 65, -40, 322, 0, 57, 66, -56, 125, 11, 56, 26, -238, 164, -136, -61, 421, 122, -111, 100, 33, -25, -131, 198, -31, -44, 174, 32, -25, -197, -36, -133, -197, 34, -61, -88, 136, 20, 23, 84, -81, -60, -6, -157, -238, -134, 104, -3, 45, -69, -22, -192, -235, -50, 197, 251, -6, 84, -125, 229, 36, 41, -202, -51, -133, -220, -15, -16, 100, -68, 68, 129, 124, 33, 76, 49, 83, -17, 23, -83, 289, -31, 30, -109, -22, -58, 81, -75, 233, 62, 81, 66, -229, 146, -210, 135, 148, -342, -58, 105, -372, 51, 8, -38, -84, -14, 51, 152, 17, -39, -9, 190, 1, -113, 73, 51, -74, 82, -39, 15, 28, 7, 128, -32, -159, -334, -10, -172, -157, -124, -9, 100, 138, -39, -141, -149, -37, -1, 242, 21, 21, -43, 175, 113, 66, 62, 239, 69, 40, -9, -186, 123, 291, -6]
6548fK00k99j25L28j93J7q4L43j10j78L19r7k80O3k9m6L40l6n03M42k35O0K52
6571A43m29L10J5o0j4p2L06k29N6L31m64j32P3L09m9k24K96k36j0n4J74j3k12
6594a85K54m1j5l1n7J41K5j20k7M5k4l5R2n1K19j66j15q0L8K04j17m3J44j53k28
6619c26K20P0j57K16j89J07R0k81Q5R2R3k9%m6K02k85J13Q3j0K32k55m2R7l85
6643c05O01j94k20K79q6P7l26K92o39L92L40j20O8k74J15p1l1L31k06L4J72o2
6665A67j75P8j99L4J90j38k3K89k50O4K7m9j76M2J86j97J40M6k5P9P6l05j5K55
6689A21M4j91q6O8J84j32O9J8j93R1J3kl0K62k59K14q3j11j86K52o5J30J3k91
6713a50J09j07jK5Q6j07J17p3j33L78lR3n9q8m8j51o6J29J80q7j70N4J40r0Q3
$$ y = [-6, 194, -105, -230, 98, -95, -78, -162, 181, 71, -107, 212, 115, -165, -102, -131, -177, 163, 127, -376, 66, -169, -109, 143, -286, 24, 39, -21, -35, -107, 199, -30, 26, 357, -107, -239, -166, 143, 94, -130, 166, -70, -80, -134, 40, 27, -185, 69, 28, 13, -18, -75, 66, 91, -29, -56, -11, -35, -70, 22, -29, 190, 24, -91, -171, -133, 71, -46, -89, 55, -98, -326, -106, -36, -193, 23, -166, -59, 31, -250, -165, -73, 20, -9, -9, -55, 147, -138, -25, 58, 48, 280, 25, -17, 80, -305, 296, 102, -118, 161, 75, 152, -174, 118, -521, -129, 211, 91, 159, -115, 0, -71, -102, 229, 23, 57, 229, 167, -8, 70, -129, -95, 95, -43, -66, 223, -27, 37, 64, 15, -161, -119, 67, -130, 10, 56, 31, 110, 186, -119, -134, 121, 165, -26, -112, -44, 140, 8, 77, 95, -98, -7, 6, 4, -26, 236, -23, 191, 108, -3, -189, 63, -2, 128, 141, -150, -41, -148, -149, -124, -38, -145, -28, -101, -234, 144, 141, 234, 175, 87, 39, -112, -178, -49, 131, 44, -126, -72, 68, -22, 61]
6738F1n1k04J31j48K09j07j66M35l94M23l13J72j60O0P9Or5J72L9n5Q1j85K70
6761B60j99k0n5K9K2j38k10L79j52j06J45P5J2j21P4k62M9J77K06jj64J0L3k46
6785b03Q8K47n09L44J2pK23j42K0L9q5k61J51J56K69m12M2J39k58J88J94k55j50
6808a70J28j85K41m9RQ7l4J15O1p4k33l8J57k05K0J26j11k5K09k4o1P9j87J61
6832cl1k1L8j98L2K95j13q9N6J06j69J76j66P4J45p3Q8j69k9l3J05J41P8j47p4
6857A9j4k8L19k76j55K33j07J94j92N7M9k2j28J70j15j38K50k64J69j51K09J74
6879B53k42O2k03K19j88L39j94j14J68l01K53K70l9m11L18l04k1j8K47k25RJ75
6901E3n6jM0k09J34O7K72o00O3Q8J31J91k79K60k3k04K84k67O2J36j68j5k36L57
$$ y = [61, 10, -194, -63, -211, -2, -109, -275, 160, -234, 189, -124, 48, -112, -52, 27, 33, -62, 110, 149, 94, 175, -10, 260, 61, 41, -14, 15, 37, -101, -311, 68, -84, -190, -45, 30, 42, -79, -5, -267, -218, -41, 165, 164, 0, 10, 43, -203, -115, 132, -377, -33, -21, -28, 195, 53, 73, 112, 27, -234, -83, 73, 342, -70, -28, 111, -147, 41, 235, -20, -170, -42, -227, 14, -35, -26, 61, 27, 142, 203, 129, -104, -142, 15, -190, -170, -44, -155, -180, 29, 5, -56, 23, -164, -3, -34, -55, -17, -215, -183, 112, -1, -90, -34, 72, -97, 79, -87, -13, 132, 59, 147, -22, -51, -84, 21, 162, 240, 93, 19, 5, -23, 296, 20, -135, 98, -9, 185, -7, 50, 99, 77, -51, 119, 4, -134, 116, -148, 21, -130, 79, 253, 11, 73, -130, 89, -99, 240, 46, -68, 100, -201, 52, 322, 283, -128, 190, -114, -135, -153, 94, -131, -122, 53, -3, -4, 36, -173, -39, 28, 300, -300, -237, -149, -18, 173, -106, 154, 131, -73, 211, -56, 6, 142, -26, -41, -277, 80]
6925H0J92k09J01o2l70M00j6k70J86O5k43Q5O4Lj11K06j91L26j91j74J15Q8m0
6948C4j36L27l90K45K42l84K09j39J9R9j97J39j8o5k47J4pJ55R9l4oNJ23k05J40
6973B2K76j61j42j26J59k38K43K6j44P7J81Q9j92j3q9J49j43j70K20m5o7j16J96
6996hr0J15j69K33r7m6q2J75J54q0k80L71j22q8n6j13K42J1k42J64r7J53p2J09
7020H5o7j19J9J74q8p9J13J70m68J83L5k03M33l95J22J37L5j97J20k8Q4j66j13
7043b13K16M1l2k1q1K39k26PL12m25N8K94k9O2k28O7k67K82k25J22J00l61J80
7066a28R2p4j05J67P5k7J24j58j22L48j80o5r1M97k97j91R5J02k9Kj46k0J07J24
7090A00n5n4j77M7J41J34k78Lk4K90j38O6O3k19O6J41J63j53j02K89l25K18j15
$$ y = [80, 272, 63, 164, 102, -268, 132, 116, -154, 32, 97, -146, -61, 3, 6, -105, 101, -90, 236, 45, -129, -14, 74, 34, -102, 225, -165, 80, 322, -62, 147, 8, 27, 126, -71, 68, 50, -15, -262, -248, -255, -100, -1, -35, -41, -36, 87, -118, 22, 298, 137, -5, -131, 28, -210, 33, 59, -85, -8, 173, 262, 70, 57, -32, 117, -26, -196, 24, -21, -88, -204, -8, -98, 17, -152, 81, -16, -62, -144, 31, 185, 105, -175, 196, 74, -14, -70, -183, 59, 70, -172, -8, -105, 48, -24, 85, 18, -101, -82, 92, 4, -75, 38, 208, -260, -77, -42, -245, 188, -207, -85, 52, 87, -110, 10, -18, 66, -100, -213, 3, 44, 12, -9, -90, 149, -77, -70, 242, -183, -125, 169, 140, 202, -26, 41, -226, 56, -169, -47, 53, -308, -128, -36, -110, -215, -48, 27, 0, 124, -34, -156, 192, 12, -53, -144, 353, 56, -135, -40, 62, 33, 35, -111, -131, -24, 100, 45, -9, -186, -139, 2, 136, -142, -139, -163, 127, -11, 55, 118, -101, -35, 106, 269, 116, 14, 303, -22, 196, 81]
7113H1k47K17K9nR0k63K08q9m1JM5J16j89J48o1J32k56l8J95k88L83l8m3l2o9
7138a4R6N8l47K81n4K6j54N7J64o4j88J33j69J47J0j13r2K80p5Q5O5k83L02k32
7162h1M6J40R5lj90N9J20k2Q3k15J45k15p3Q6K21j99K34k42Q8j47J07P8j09J6
7186B2m9k3J09l07K58Q1j78K01K2k49L3P4r6m6J65m5Q0j75J80j11oj09J22J50
7210A03J05j64k36K02k7K1J07j49J64l18K89k8j16j08K64j64P5N6r5q1J3K19r0
7233D2p2K9j71m2K66p7m3qL5R1k2N0k02K7J27j0k10L03j9j18k3J20m9p3q1J74
7259D4K35k20J60k34J23k93L3mL03j3J40k27J04l30J07M2J50p6j11N4n0j5L31
7282B53l6j97j90K33pk16K39j44m4J41O9J54k17l36M58k25NK10j55j12O8p6J10
$$ y = [81, -166, 51, 80, 75, 165, -98, 110, 21, -20, -19, 26, 142, -47, 101, 40, 172, -84, -122, 73, -215, 168, 130, 87, 55, -14, 82, 140, -207, 74, 20, 46, -108, -51, 113, 49, -139, -6, -175, -28, -18, -131, -223, 57, -18, 67, 132, -151, 151, -81, -35, 105, 200, 197, 7, 66, 186, 164, 247, 32, 177, -38, -111, -25, 196, -3, 231, -11, 77, -70, 37, 115, 6, 22, -27, -50, 59, -248, 10, 91, -87, 114, 136, -113, -80, -6, -102, -148, 17, -28, 52, -123, 57, -54, -60, -169, -47, 103, 208, 44, -192, 10, -17, 4, 111, -38, 126, -192, 97, 69, -47, -155, 109, -55, 20, 76, -19, -100, -87, 132, 42, -30, -1, -172, -214, 52, -25, -68, -76, -41, 50, 28, 78, -124, -97, 30, 20, -190, 113, 94, -24, -47, 73, 24, -49, -130, 44, 279, 59, 219, -15, 108, -185, -152, -156, 147, 134, 274, 47, 151, -179, -72, -30, 120, 44, -67, -13, -63, -78, 253, 217, 20, -170, 63, 56, -160, 79, -65, -109, 32, 101, 255, 38, -298, 160, -65, -60, 150, -5, -117, -49, -125, -15]
7305a5J99j79j58m1L00Mj66K05n6j85o4L86j21j06j22L99k35j30ko1J58j05o1
7328a56K06j27N3J08n9m0K8j0J6j16K4j85L78q0n0nP9k15Q4l5K21k22n6J63K41
7353B45k13JP5l2K12k84K09k35J67L7j69k61L10J00m11K59j68j37K32K29j49j0
7375Gr2K57k53J10j06O5R4j43L13j90n2j88J09n6J05j91L98k56L14j79j38L5K6
7398a1P8k41K82p9l67J19k8K09m1J91j3j58J6P9o3R5K02J4l50K05j08PR7l50K55
7423D0J7j64J85o3P8n8Oj36K09J62n06K45n9m2R6r1q4j06J64J14Q1J8k38J74M1
7448H3O8P0k32J77m1j79j06K93P0l75L29k88L31k12K73k25k55J10J0L0J99J23
7470B53l38l1L1L9J99j30j78K0K67J58m72J90k03L08J3j54J04R1k10J57j31J36
$$ y = [-15, 184, 5, -153, -194, 106, 110, -56, 149, 93, -92, -156, 230, 109, 3, -119, 280, 45, -85, -87, -148, 10, -95, -156, 50, -77, -24, 84, 25, -15, 13, 3, 19, -97, -73, -258, 120, 40, -10, -15, 64, -151, -67, -102, 119, -103, -159, 4, 245, 32, 33, 108, 76, 288, 4, 213, -22, 145, 182, 13, -248, 62, 162, -249, 10, -158, -295, -63, 166, 17, 7, -85, 172, -81, 29, -77, -12, 82, -61, 252, 62, 10, -178, -69, -125, -20, -211, 187, -69, 245, 66, -72, -37, -11, 67, -174, 108, 29, -338, -219, -247, -38, -79, 112, 99, -59, -43, 36, -27, 68, 270, 284, -66, 139, 31, 38, 135, -215, 40, 57, -107, 78, 15, 93, 35, 41, -95, 114, 276, -230, 15, -44, -86, 10, -81, -165, -271, -107, 7, 88, 106, -132, 42, 83, 151, 221, -11, 166, 125, -54, -160, 133, 203, -172, 157, -131, 200, -12, 261, 36, -219, -109, -99, -69, 130, 253, -85, -116, -85, -46, 153, 23, -155, -135, 132, 290, -182, 8, -195, 113, 126, -28, 76, 167, -43, 114, -17, 119]
7492A19k05L44j59r5J32J70l83m0L2O4R6M0j55l1J6p6Q7J8J63KJ1j28j13m5J57
7517B1Q8j6j32J50j86Q3l7k3J05r5j9j33J07K27k57j49P7R8j16K13Nj5P0q6k6
7542d6K91l84L28j70j4J60j63n3Q4j43M5R4J14j00k4q6r5K60j86J69k73K78j74
7565h8R2j76K66j27r0J15J40O0m14L31l00K62j01J13K18k24m0q1j11L71k16m6
7587d6j42P4K45j16K5M6J26l23N3J03l5k9J87M3k15j2m4Q8p6K28k05n9K33k02
7611e3L07j61kq4J27j9J4j7K5n2N1k38p6j6J34m6R5J09j95K01k42Q6J97k6j57
7636c8L20l22l3J21m5j64J01J27j26lp1J33k1J02o9p6K19k95L19l62M7k3J86O7
7660I4K28J2m89j66M11k05j2Q9N5q0K08l61L53k0j41M5k81K02J32nj51O9Q1l7
$$ y = [119, -86, 258, 99, 4, 136, 306, -77, -117, -85, -21, 75, 115, -40, -71, -55, -131, -44, -26, 137, 139, 150, 22, -91, -136, 21, 109, 93, -39, 111, -75, 8, -29, -52, 53, -42, -61, -194, -87, 140, -117, -266, -189, -91, -207, 6, 11, -4, 66, -20, -46, 245, -139, 189, 19, 5, 165, 2, -51, 33, -110, -65, 29, 143, 43, 19, -67, -162, 98, -88, 81, -192, 86, -88, 4, -172, 94, -33, -123, -8, 132, 192, -222, 109, -191, 71, -30, 83, 301, 77, 37, -44, -155, 216, 0, -46, -188, -114, 131, 15, 40, 86, 212, -111, -58, 45, 10, -19, 168, 211, -4, -16, -60, 28, -48, 180, -25, -84, 149, -53, 254, 93, 91, 7, 134, 115, 129, 112, 137, 85, 136, -102, -178, -194, -60, -106, -11, 98, -97, 104, -138, -52, 145, 119, -38, 282, -40, -73, 48, 3, -161, -60, 67, -59, -62, -133, 0, -21, 81, 12, -64, 155, -140, 179, -183, -136, -159, 27, 94, 322, 334, -155, -321, 90, -115, -127, -38, 17, -63, 145, -216, 137, 117, -24, 21, -260, -58, 74, 69, -82, -13, 68, 31]
7684C1K4k52K0L34j27J51j39j72J15R7J20k11J02j13OO6j57R0J95l22J84J29j57
7707A4n0j10K63k42j3J19q2j1J09J41k85K53k42Q6Oj40O4L8J45k38J12k9M7L60
7731C15m23J90K44m59o1N6K02l9J22m03K60J01j95K19m3j80J03J74j69l4lj50
7753a73O4K28k84m5M07n7j37J43M3k29J69k47j09J04P3K46j16J27k25j6K08k36
7775f2n0Lm3P1K82o1r0j57j46J93K78k55J93j49j40L04j54j18K53j39K31k50k73
7798b79K40n5J26J49l2j49O4j7L5Q5l13J76m3j34K9Q3J30k17J29k28L82k34J27
7821E4j9k26j21J94n4K23Jj98M6K07J3M1j57j21j43L35q1Q3o2j56J32K5q8j01
7845a73J97P4J7J2l01N6n7q9J89L34k23j65J52J18j36j18%J01j8n1j13K27l2j78
$$ y = [31, 55, -197, -177, 157, 30, 181, 42, -130, -15, 82, 202, -9, 93, -20, -14, 52, -105, -15, 180, -142, 42, 171, 14, -36, -146, 117, -125, -138, -19, -101, -112, -3, 138, -147, 106, -136, -50, -44, -184, -120, -82, 63, -175, -63, -92, -45, 315, -108, 82, 326, -133, -194, -138, 64, 25, 147, -256, 4, 105, -90, 129, 86, -94, 9, 183, 14, -20, -23, -173, -109, 119, -165, -210, 197, 140, 3, 146, 189, -40, 129, -118, -227, -123, -50, 196, 80, 207, -18, -34, 174, -62, -112, -109, -152, -81, 201, 140, 50, -107, -253, -60, 218, -37, 156, 7, -133, 171, 17, -101, 152, 13, 244, -6, -279, -39, -94, 32, 181, 149, 0, 64, 47, 82, 167, -146, 30, -13, -147, -118, -35, 95, -122, 7, -221, 161, -73, 54, 35, -191, -312, -118, -172, 51, 52, -146, -100, 107, 120, 161, 4, -117, -260, 75, -6, 77, 15, -141, -9, 16, -72, -173, 24, 98, 115, 127, -174, -118, -175, -264, -75, 259, 36, -129, 23, 141, 5, -113, -113, -12, -30, -81, -194, 33, 1, -177]
7869a77K70j55J90l92O07m08q2J28Nj45P2J03r0K7N6j73J97j40J25nj19J76j68
7892i8K93j44P6Lk63J56J10l5l7m4P9p1P4j96J99l16K20j21J72j00J5j28K43o9
7916A8P2k55J25r2K52m2J44j53o1K19k62j7O4J5l8O5j35M0L4K39l54P1J9K69l33
7941i6J67nj56R8j21K99R3k91J0k3k07Q3qJ40K29j76j4J10J35k09k31J5P9J32
7965E3j06R2K1j75k5K82j13Ko4r5j57L29k46K34K8j18Q0p9m3j0J60m5j6N8r9l5
7991h7J24j29K41l16J66k77L49J1r6j11J20k12k3L46k54N26k68k36K2J54L7j58
8013g1J66o1k13J88J16k62Q9L34l57J29J30k05j70L8K5Q7n4K63m26L04O1j14n0
8036e3K38j99qJ94j37N0L6J00j82k2j88K20M9j42J23j52J42m7j07K16J1j01p2
$$ y = [-177, 93, -62, 128, -264, 343, -65, -147, -19, -14, -159, -87, 16, -74, -47, 9, -164, 33, -107, 18, 13, -106, 70, -98, 195, 51, 127, 130, -133, 23, 133, 98, 61, 17, 96, 25, 99, -97, 102, -214, 6, -115, 57, -43, -28, -156, 87, 18, 90, -165, -40, -132, 120, 78, 222, 69, 8, 227, -35, -52, 12, 27, -11, 54, -81, -41, -7, 232, -122, -51, -32, 237, -96, 71, 66, -90, 8, -113, 186, 279, -12, -2, -25, -232, -149, -157, -17, 212, 36, 22, 132, 267, 58, -173, -158, -79, 53, -53, 39, 60, -115, -140, 142, 29, 31, -33, -128, -285, 44, -202, 32, 60, -58, 22, -57, -100, -110, 50, 5, -11, 47, -52, -87, 37, -92, 149, -167, -1, -278, 71, 82, -14, -125, -5, -217, -240, 106, -148, 378, 110, -126, -104, 50, 87, -71, 95, 34, -179, 9, 125, -137, -48, 286, -71, 58, 188, -17, -187, -149, -124, -37, -91, 172, -254, 50, 111, -3, -53, 185, -14, -22, 172, 35, 85, 121, 221, 39, 17, -171, 49, 98, -44, 79, -73, 69, 22, -85, 131, 142, 41, -31]
8059c1K3J21j26j93M19n25L47O6n2K1k1J24j6l1j85J75l53L23j95M3J45j46NJ40
8083G8j66K86q7m4j71K65r8N6k69J46K16n9k14Lm4J15MM5k31K97k49R0j8M6K43
8108B40k07K20k21j73K05O6l4k48K45l00J71J29l24L93k92j21j7K17l5J71m1R3
8130A37k39P8K0P1k18J03R5r0M3J1j25n5K99R5k77Q6k17J00j18K40k62lJ13j53
8154b66J25J79j57L03N5j10q5J32k19Q5n4p3o3J48J69l44K50nl18K63o5m5J95
8177A00k20L0M8J12r8J59k62J85N5j93J25j17r5L14
$$ y = [-31, -8, 113, -13, -206, 213, -312, 35, 101, 49, 70, 49, 173, 157, 126, -59, 116, -237, 86, -109, -66, 79, -67, -62, 78, -88, 198, 111, 67, -104, 161, 63, 119, -150, -4, 212, 153, -61, -58, -102, 13, 17, 62, -169, 128, -121, -31, -49, -3, 240, 33, 253, 32, -141, 64, 130, 96, -152, 93, -207, -36, 93, -231, 162, -130, -251, -268, -51, -86, 85, 44, 137, -102, -24, -4, 67, -151, -48, 47, -43, 0, 11, -114, -169, 130, 225, -52, 34, -183, -83, -201, 39, -223, -226, -113, -266, -141, 38, -119, 184, 239, 129, 44, 176, -43, 42, -12, -85, -148, 0, 169, -175, 75, 70, -248, 15, -50, -95, 100, -120, -90, -42, 70, -28, 131, -131, 54, 109, -84, 41, -76, -171, 143]
8191A43
$$ Imaginary data points
##PAGE= N=2
##DATA TABLE= (X++(I..I)), XYDATA
0@%%%%%%%%%%%lLqJ6j6J6k4L2l2M0n0N8p1Q4r6J12j30J49j71J94k20K50k82L21
35A72l64M08m56N09n71O36p06P84q64R52j053J162j282J413j556J717j892K084
53A093k300K543k815L125l482L898m390M977n702O616p808R446j1832J5652k2727
68a3706M0075j60590k29498L34287J78956q5169J7281J90220M4097q1102p5902
79A58949N918L6751l3100j40397n6321N3476j7498q8463O573K1534m2631j0255
91a05464Q157q5351n5704Q0665N1354o5167J9400J47201P8181o356L8400M5105
103A50421q504l5532m4378q25Q1337L0937q4351l2376O0516k8966j03499j8316
115c3536J29p2500l7933N544k3528J6678O3736K188r705N9455L5787k8233M442
$$ y = [0, 0, 0, 0, 0, 0, 0, 0, 0, 0, 0, 0, -3, 0, -8, 8, -8, 8, -16, 16, -16, 24, -26, 32, -39, 45, -51, 61, -69, 80, -91, 103, -117, 133, -149, 172, -192, 216, -240, 269, -302, 334, -372, 412, -452, 500, -553, 609, -673, 740, -816, 901, -991, 1093, -1207, 1336, -1479, 1646, -1836, 2062, -2328, 2649, -3053, 3563, -4245, 5201, -6631, 9021, -13706, 26369, -134221, -363719, -29432, 149524, 64355, 81636, 271856, 315953, 234851, 158949, 164867, 201618, 168518, 28121, -28200, 25276, 7778, -80685, -74112, -52578, -95209, -105464, -97307, -182658, -238362, -157697, -106343, -171510, -152110, -4909, 73272, 66916, 105316, 150421, 141917, 106385, 62007, 61182, 142519, 173456, 89105, 56729, 117245, 88279, -15220, -33536, -33407, -105907, -143840, -138296, -161824, -145146, -81410, -79222, -88927, -29472, 6315, -21918, -17476]
128a7476M0132J4432J9148L0144m001J2510N3223p579o4004p383J1439o0439o3270
141d3124R266J2808l5860k5418P332P391N157j2626k9304J5458M2785j1636j3855
154g1626O2762N7160q660N217M6016J2996k0406q453j3316j4459R564p177k8841
167B0777N148J0210l6142l9622j1911j5484j5160K788k776k482K9068K5243j2552
180d2895N376M5116J9132j4849P082K6852R457p331m939Q785K0868O508k5392
193E3770k1399N030j6910n3101k3985J4988J258j1085N357Q936L224j705j2567
206d8189r790J9782K4904R53N422L0995K3338K079L37K03K139M720j2599k4294
220B0000k095Q760j8665k7176L606J5686j0193k3210q856J024m074j4057p949
$$ y = [-17476, 22656, 37088, 56236, 86380, 82379, 94889, 148112, 140533, 76529, 69146, 80585, 20146, -43124, -33858, -21050, -56910, -82328, -74996, -67605, -62448, -75074, -104378, -88920, -46135, -57771, -71626, -8864, 48296, 39636, 44853, 90869, 103865, 83459, 75006, 61690, 47231, 56795, 49618, 20777, 25925, 36135, -7, -39629, -51540, -67024, -82184, -79396, -82172, -84654, -55586, -30343, -42895, -37519, 7597, 26729, 11880, 18962, 45814, 55271, 47940, 43001, 51786, 72654, 79162, 53770, 32371, 37401, 20491, -32610, -56595, -41607, -40349, -51434, -46077, -37141, -33917, -35622, -48189, -57979, -38197, -13293, -12340, -6918, 24077, 47415, 49494, 49831, 50034, 52173, 56893, 44294, 20000, 17905, 26665, 8000, -19176, -15570, 116, -10077, -33287, -42143, -41119, -45193, -59250, -67199]
233f7199J9994L1873J0448J538K2571K3793p615j8111K272J0114R99J83L904O477
247D1241O218r327k4216j4545k355j2005j9580q594N71L4l43J47P064J8774J3741
262c175p148n105J2822Q198n998J150K0507K2194P698k663l67K266j0480k6811
276A3088j8197K516l44j4569o618P251J787r532p716q95K383K48m638k101J1857
291b5480J7455J0699R087J5350J3528Q61r139r553j136L491m020p711M193R392
305B7017q080j9508p601m54j0099j5086n449M571M978j647j025J0628J6544N980
319G69j335O292P680l449o084L165R982J0709P387K103p48k643j2228j9650j3341
334a1391k983j649k423J662M103K034l244p165n371L604N711j358Q07J0890R961
$$ y = [-67199, -47205, -15332, -4884, -3346, 19225, 43018, 35403, 17292, 19564, 29678, 30677, 30860, 34764, 41241, 47459, 38132, 13916, -629, -2984, -14989, -34569, -43163, -42592, -42558, -42901, -42754, -35690, -16916, -3175, -10323, -15428, -2606, 5592, -406, 744, 21251, 43445, 51143, 48480, 48113, 50379, 39899, 13088, -5109, -2593, -2937, -17506, -24124, -16873, -15086, -24618, -32334, -33229, -30846, -30598, -35236, -37337, -25480, -8025, 2674, 11761, 27111, 40639, 41500, 32361, 22808, 21672, 25163, 21143, 13432, 17625, 27017, 18937, -571, -8172, -8626, -18725, -33811, -39260, -34689, -29711, -31358, -32383, -21755, -5211, 769, -566, 5726, 13406, 9957, 3873, 7038, 17020, 27729, 35116, 37219, 36471, 33828, 21600, 1950, -11391, -14374, -16023, -18446, -16784, -12681, -10647, -13891, -21056, -26427, -22823, -17112, -18470, -17663, -6773, 3188]
349C188J466K803J1333J1388K360m976o795l843n998j0288n342P395P059k578
363G172m312l4n082j2751j0763m614k52M616O584P724R682Q454J262k458J112
378F340K571n14j024J146J741K220K114J14K12J844l106j0203r340m605m837n451
394b0778n1N502N427L180K451J913K142l89m709l016L822M781K528N505Q498L027
410A9833k594k335k252n488n178l784l878o77J933p60j519K007O96l982k299J385
426h892j284j370K256L679M811O414K610m5L392L329m116l887J804M16m697k674
442A746J664k96k105k584l102n93n65n713o203L220N931l04M23O728M512j589
458A170j094J198J329L076J726k75N138P048m356r500q20P26n756k893K724o31
$$ y = [3188, 4654, 7457, 18790, 30178, 32538, 27562, 20767, 16924, 10926, 638, -4704, 2691, 9750, 7172, 2860, 2826, -2256, -15007, -25770, -30384, -30636, -26020, -19436, -11712, -2030, 6424, 7686, 5228, 6340, 8911, 8397, 7373, 8519, 10260, 12480, 14594, 14708, 14920, 16764, 13658, 3455, -5885, -10490, -15327, -20778, -20829, -15327, -9900, -6720, -4269, -2356, -214, -603, -5312, -8328, -4506, 275, 2803, 8308, 16806, 19833, 17239, 14904, 12652, 7164, 1986, -1798, -5676, -6353, -4420, -5180, -6699, -4692, -3996, -7978, -10277, -8892, -10176, -11546, -9290, -5611, -800, 5614, 8224, 8179, 11571, 14900, 10784, 6897, 8701, 9117, 4420, 1746, 3410, 3114, 1009, -1575, -4677, -5270, -5835, -11548, -17751, -14531, -8600, -8904, -8481, -1753, 2759, 1170, 76, 1274, 2603, 5679, 7405, 7130, 12268, 19316, 14960, 5460, 4640, 5366, -390, -3283, -559, -1190]
474a190k416k220m712k434L403N47l470K911N856r56k353L455M134L655M961J406
490A0577l43M036Q31q203n828L269J118l648J873M832j262p406p368n085j056
505a3663J503j811O05Q072M397m089J08N441J58k273K839K169J467M399J12l490
521E944L577M677m393l996L675j588q425n996l841j426M014K437j472K935M717
536H39o024r351K264O462m48q48N474P816M652O22j513J762L332n221r657N42
552G03O340k846n343K617K744k520k629k617l412r77k172o878j028Q985N423l01
568c911L292M301M38O08j074l200L649M655n974m045R603P656m942l011K480k063
584H462q491p974l874K522M219k209k039O514M838o722n043M473K392l844k61
$$ y = [-1190, -3606, -5826, -10538, -12972, -9569, -9022, -12492, -9581, -3725, -4681, -7034, -3579, 555, 4210, 9171, 10577, 10234, 14270, 15101, 6898, 1070, 4339, 5457, 1809, 3682, 8514, 7252, -154, -7522, -12607, -13663, -12160, -13971, -13366, -5294, -897, -4986, -4878, 563, 721, -1552, 1287, 3456, 4923, 9322, 9434, 5944, 9521, 14198, 9805, 5809, 9484, 7896, -529, -6525, -10366, -11792, -7778, -5341, -6813, -3878, 839, -5185, -14536, -12272, -5810, -6258, -7106, -1632, 6184, 10836, 11458, 9945, 11707, 15039, 9818, 161, 703, 7043, 4197, -1146, 1471, 4215, 1695, -934, -3551, -6963, -7940, -10112, -16990, -18018, -9033, -3610, -3911, -619, 3682, 4120, 4728, 3654, 454, 4103, 8758, 2784, -1261, 8342, 15998, 11056, 8045, 10525, 8462, -29, -8003, -11877, -9355, -5136, -7345, -9384, -2870, 1968, -4754, -9797, -5324, -2932, -6776, -7037]
599g037M227M455M339K340k823N98N752j403p098M31L262m549n739J45J747K861
615A508J772m473k915M306l357j1731K82J0249J365l399M910P022R28k876l224
630C67m88L716M18m694K276Q167m84p042r31K773k418m183j029n56k33R27k452
647e866k570M546N785k180k411M256K177m172l027R01K819M666N15l011L987N380
663A1795o007j0163K241M236n209l914L637M465j46k241l203J247L619k788n260
678g691L001O400m59l158K644L615R37J18j664q90K536N18o678m260N153L772
694C894n668k669M644K155l682n054j282L699K229m529j609Q356N750n621l240
709b627O837L281m954k549K275K768j80k244j996L071K347n152m817K035J872
$$ y = [-7037, -2810, 1645, 5984, 8324, 5501, 6099, 11851, 10448, 3350, 3781, 7043, 2494, -3245, -3100, -1353, 1508, 3280, -1193, -4108, 198, -3159, -14890, -14608, -4359, -2994, -6393, -1483, 5539, 6467, 3591, 367, -121, 3595, 4013, -681, 1595, 9762, 9278, 2236, 1305, 4078, 1660, -2523, -3552, -4108, -4341, -3414, -5866, -8436, -3890, 1895, -285, -2696, 1560, 3737, -435, -3462, -2561, 258, 4924, 5439, 2428, 6415, 11795, 5788, -4375, -2134, 2102, -3107, -7021, -3384, 1081, 935, -1306, -4509, -3262, 357, -2431, -7691, -4690, 1710, 1251, -1907, 737, 4352, 5289, 5407, 3743, 2853, 5389, 5907, -771, -5031, 122, 3894, -1774, -4443, 201, 2356, -1326, -6380, -7662, -3963, -1734, -6263, -7872, 484, 6234, 613, -2627, 4210, 7491, 2537, -12, 2263, 5031, 4851, 2607, 611, 3682, 6029, 877, -3940, -1905, -33]
724c3l168k594M34J909J014j166k464O73O122N86m142J95O874J558n548o79N079
741D650K827k111l457J556L660k164p633j242N892m31o118l28M431n29n100k112
757h209J752L232J155m53N83M260R75l283j768L142L027j02p84N34J987Q58l120
774C786m092Q13L397k782n259Q16L898j878n527k51M705K058l345k019L256L389
790I65l486l679L634N930K03j996K554L782j199l582j915N18R25r09j966K01K292
807B272J26k845k553P1R09j214l101k39L736K192k722j115N043L955l146k835
823a466L334L219k478m182J472M567Q12l319m24L693K57n106l731J238R68k456
839c602j541J617K477N23o67j046M08J230p55k247M16L312K267o59l51K538K307
$$ y = [-33, -3201, -5795, -5361, -3452, -2438, -3604, -6068, -5395, 727, 1313, -2829, -2634, 4240, 5798, 250, -429, 4650, 7477, 5366, 1909, 3465, 7125, 4961, -2672, -3914, 1978, 1547, -4571, -4899, -468, -997, -6097, -8209, -6457, -3225, -2070, -2523, -1940, 2320, 3295, 12, -1756, 1386, 4413, 4311, 3527, 4061, 6048, 6906, 3786, -306, 507, 3904, 1122, -4137, -3321, 577, -1301, -6828, -7079, -2374, -316, -3661, -5680, -2424, 965, -2521, -6200, -2566, 3364, 3567, 1571, 4125, 7907, 6708, 3126, 1211, 1729, 2654, 1745, -221, -20, 2272, 2398, -447, -3000, -2929, -2020, -3234, -6335, -6574, -2838, -646, -3368, -4483, 560, 4515, 1369, -1466, 1868, 5087, 2609, -1573, -101, 4466, 5278, 1959, 1535, 5228, 5485, 379, -3352, -2114, -1146, -3602, -5143, -3526, -1049, -526, -1193, -2239, -1831, -601, -1356, -3603, -3187, 125, 2392, 1733, 1382, 3920, 6227]
856F227j946m219J22L235p59m782l14L913M30l839r53L342J773l407l303J361
872c119K400j364k728J845M274O96j520R21J562l74k000j116j28J159J388j29
888A767l79P40M21j682k343r14R36R70j486j050J598K075j717j983K554L148j595
905A060k470J824J986j282j989P9K090J088j619q25J961Q15l473j842J179R70
921d48j806P07J184R3L49k88j030o33K169L91l59N07P55L28r23j378j63K148J051
940B654k324r15K717J92m605j190K902P74k698j30K064O29q18j651M79K895L68
957A343k443O25L351m84k280N62J595j022K22J028j254p92J101j397k701Q37J002
974g07r51o25P08L34Q00q9j789NK797k42l331K133L673o07j977K406J350j794
$$ y = [6227, 4281, 62, 184, 3419, 2660, -2122, -2436, 1477, 1907, -1932, -2885, 457, 2230, -1177, -4480, -3119, -719, -2083, -4811, -2966, 1308, 2004, 484, 1405, 2967, 2593, 593, -523, -651, 508, 1896, 1767, 1388, 2128, 2549, 867, -1476, -2390, -1454, -484, -1970, -3020, -1422, 653, -1064, -3047, -493, 2655, 1060, -1410, 414, 2400, 1118, -871, -792, 1298, 2386, 767, -58, 1903, 2718, -755, -2597, -1418, -448, -2254, -1547, -363, -270, 79, -209, -1239, -1872, 297, 688, 329, 836, 1591, 1919, 996, -382, -545, 1603, 2654, 330, -585, 2132, 2324, -2281, -3471, -569, 205, -2493, -2623, -559, 70, -748, -2399, -1920, 975, 1343, -1100, -475, 2876, 2392, 112, 674, 2269, 1247, 1469, 2497, 1243, 451, 1552, 155, -2546, -1709, -707, -1658, -2283, -1575, -1241, -441, -530, -2319, -2314, 483, 241, -3090, -957, 2716, 2109, 132, 2538, 3888, 2094]
992B094p69M39l41Mk46j302J19J193j094k155J316J34j892m51J800j644j141K336
1010a600L26j583K445K874j117j006J788j94j377Q11r4K55J808M0k278Q00J033
1027B931l508k250K428K2k767O67K339j361j315J032j83o19J627N99m86J001P72
1044I29j223N01K450j48n17K066l22k916L16P34k445q50K258J50j887P98j11j790
1062b007m91J79j300N88J667j85N16K241j60k011J433J966j829n45K462m5j910
1079E69N99Q87p36j20L29o00o12l9j912j539J431O40j946J339K458p57r70P26
1097b53K09j880O58J239n88R70K391o58n36R75n00j537J75m58j232N34P76j519
1115a234j89K164n35j872J038J443j742j065M86P00L07O00k8O80J574l35k231
$$ y = [2094, 1325, 1764, 1423, 1427, 1181, -121, -2, 1191, 97, -2058, -742, -608, -2500, -2951, -1151, -2795, -3936, -1600, -1274, -2857, -412, 2462, 1345, 339, 2127, 1933, 556, 1367, 1273, 1528, 3336, 3376, 1098, 1898, 2931, -577, -2827, -399, -377, -3144, -2477, -138, -1499, -2814, -1782, -1965, -2584, -957, -358, -844, 157, 929, -294, 207, 2657, 2509, 1992, 4058, 3736, 820, 1136, 1870, -575, -1425, 833, 983, -904, -106, -217, -2007, -2498, -2319, -3619, -3031, -1364, -1549, -1033, 1208, 1048, -963, 470, 2436, 607, 62, 2524, 2479, 569, 1168, 2055, 1319, 1199, 1528, 928, 316, 277, -1635, -3174, -1743, -1103, -3049, -1710, 748, -9, -979, -253, -44, -1924, -1266, -27, -615, 355, 2746, 2088, 1552, 2527, 2027, 490, 665, 207, -1025, -491, 285, -1234, -1423, 741, 206, -1666, -628, 815, -927, -1992, -1506, -806, -499, 101, 73, 753, 2327, 1992, -239]
1132b39N85J378j685j438J086P78m55RR57m63j61j7j858m59J199K45j078R41J358
1151F83k79j59J75k99M88O88j347r49J723R88j961m36J765l09j079l51L20K85
1169e4K32j692j255J737J188j385M42K260N54j910l74K87K37M23lj52N84Q96q81
1188A134j496M30O44j075p34P2M73K04L1j614n6J537K06j801J122K380o09j576
1206g28NJ053K09OK88N77J387p9k574k91J712p51j686L95P17l08p97o95r2M76
1226a176N12j238m11K010P80j674m30J300R72k42N2O21J071R63j404j743J268
1243A231J090j669j361J124J185j102j649p4J107m8j305j477J747J015j543j323
1259c052J864J899o23q42J115J339J99r12q37N39J646q17j455N27J856m99j737
$$ y = [-239, 346, 1724, 39, -1399, -313, 465, 10, 19, 976, 513, 352, 335, -1523, -1982, -783, -538, -1616, -675, 683, 404, 245, 420, 121, 609, 1297, -50, -999, 724, 1712, -249, -685, 1080, 771, -308, -659, -339, -54, 178, -1514, -2769, -1032, 156, -1229, -787, 1473, 2027, 117, -257, 30, 267, 690, 687, 535, 1119, 2015, 1134, -362, 68, 712, -363, -1097, -1025, -552, -348, -317, -1931, -1987, -450, -244, -2045, -923, 1457, 848, -728, -723, 330, 539, 545, 833, 1410, 2797, 2718, 144, -147, 1565, 814, -872, -477, 240, -68, -865, -1560, -1652, -1176, -664, -1902, -2313, -303, 477, -1197, -1627, -327, 645, 403, 455, 1076, 2147, 3110, 1706, -37, 1231, 2321, 652, -709, 415, 1600, 498, -1151, -1225, -118, -166, -1471, -2948, -1201, -186, -1729, -3052, -1188, 711, 88, -754, 361, 1700, 1899, 987, 150, 689, 2335, 1518, 63, 590, 2446, 1947, 210]
1276B10o18O28q4j057j598L15J562K23j839K23K074O89j536p42J333J176q69r59
1294h69O23K220M86j889n3J490N19j826j144J165P56j394j711q0J562K14r53p16
1312a600J128J166j542j274M53J593j50o99L78J508J380j239j414N41J468o92
1328A005j542K36J751N8k152o79J284R26j193j439J321J272q28j871Q8J817J64
1345B18p09j16J391P86j132j298K29J412K32j369K32J199K25q94j362M57Q61r8
1363B64j206k5J375K15j354j158J369J169n13j321R56J545k85j733j03J348P16
1380A259j192p35J145J153j388j396N08Q83J23j425L08J013M56j259o76P46J009
1397E32l36n99J94J070J72q02p66Q37J135p82j274L29J441j35j519m56J131P21
$$ y = [210, -408, 220, 136, -921, -2519, -2204, -642, -419, -2258, -2035, 39, 728, -808, -1550, -217, 959, 90, -869, -246, 1974, 2460, 571, 518, 2008, 2527, 701, -443, 722, 1478, 84, -1627, -1707, -145, 69, -884, -1600, -472, 694, -848, -2122, -1669, -76, -226, -925, -547, 961, 2341, 1102, -312, 229, 1697, 1005, -537, -301, 1450, 1508, -644, -1323, -39, 887, -306, -1745, -424, 848, 20, -1851, -1763, 54, 218, -491, -607, 784, 1570, 438, -860, -631, 781, 1013, -356, -124, 1075, 1300, 406, -956, -499, 362, 264, -942, -967, 408, 623, -731, -1889, -520, 649, 136, -1185, -229, 1316, 1031, -702, -805, 543, 1259, 67, -668, 477, 1630, 242, -1154, -646, 237, 360, -1065, -757, 256, 712, -547, -1223, -477, 532, 196, -403, -209, 861, 1033, 231, -535, 302, 1437, 655, -619, -290, 1151, 1016, -503, -959, 172, 893]
1415H93j459j311R06J422n81j547N33J745o5j543J4J427N64j172m63J272J184
1432A819m95j201M14O96k02r35m78N78M21p55q67n9Q70L10q22o74P12Q09p67j221
1452a847N81J544K60j151N39J211N46j307p39J065R53r29r45P48J386p55j738
1469e78Q8Q29k02j182k43N82Q79j009r64K19J283K02n63J32M97O58l80p99L12
1488b39J071O10o16l15J199N58j466j372O29P98m00j556P67J010o44j524l32J040
1506g82J80q17k69J131P14k82r65R47R16k05j34K76K96J45k48n65j53P83M60j165
1526B63j7M10l22r80n75j09Q96L32j071j32J143P12j840k50J600L73j016r9J303
1545F21O25m86m23Q9R63K92j450k11R32j54j109q1O49l02m1J26o20n26O97J9q92
$$ y = [893, -566, -1877, -971, 451, -130, -1677, -1144, 601, 536, -1007, -993, 434, 998, -174, -637, 635, 1819, 1324, 123, 537, 1233, 1031, 96, -382, 196, 617, -138, -1005, -1064, -194, 116, -706, -1380, -668, 141, -626, -1847, -1266, 278, 538, -613, -74, 1137, 1683, 376, -363, 702, 1655, 726, -219, 529, 1915, 1160, -578, -490, 339, 137, -1045, -1288, -706, 173, -836, -1800, -1581, -298, -96, -659, -527, -30, 628, 248, -551, -239, 832, 1442, 826, 511, 1710, 2268, 802, -570, 59, 857, 457, -1099, -332, 678, 34, -1490, -1822, -782, -602, -1419, -1688, -557, 157, -125, -1090, -143, 773, 568, 434, 710, 1006, 1151, 903, 338, 185, 968, 1428, 263, 246, 656, 334, -646, -1221, -1330, -434, -102, -1173, -1305, -162, 550, -1290, -1540, 60, 433, -583, -682, 621, 1246, 760, 337, 426, 1389, 1681, 231, 20, 952, 798, -311, -392, 257, -45, -86, 40, -580, -1106, -409, -390, -1282]
1566a282L96J021m39m50M04N49N28l9m15R6N38k63j324M82J527p34q26K90J003
1585A062o20r65Q2R2J08l91j38M67Q37l64r59K45J043m15m62Q47J47r03O29l72
1605c0q41J017Q33q05l41Q89j64r07m26N10k18P76j38p69O38R42j033r96J251
1624A88M24q54k08J296l42p82K76k09j6L96j51l26O60L3r10n28O44L67n09M02
1644a49L14n49R6Q55p36n81J181L96j172L33N71j18l00k20J68L73J33o85k64P16
1664C62k49j017N3J104l15p67P20K74l24m02K24O6M66pk07K85N48l56j85O62j60
1685G75n93K8O74o39q57J157m60o76J82P46m24n97L66l19jJ74J42k0N47j36l60
1706b91M58O13m08l73P67J10r59K05L97J58m81K36J2j67n54k13l7P1m10j68M57
$$ y = [-1282, -886, 135, -304, -754, -350, 199, 727, 688, 273, 369, 907, 644, -680, -198, 1329, 595, -231, 59, 1062, 442, -523, -441, -349, -241, -632, -770, -303, 534, 170, -789, -544, 499, 84, -378, 469, 616, -287, 342, -30, -871, 146, 979, 174, -167, 722, 558, -349, -775, -265, -483, 293, 155, -614, 24, 966, -67, -1063, 188, 612, -242, -450, 846, 504, -278, -2, -211, -227, 169, 18, -308, 352, 385, -525, -1053, -409, -42, -551, -149, 165, -384, -288, 567, -169, -750, 431, 827, -345, -12, 559, 441, 141, -79, 89, 462, 595, -90, -354, 362, 113, -904, -851, 253, -62, -829, -109, 165, -159, -561, -337, -271, 195, 188, -19, 266, 814, 458, 273, 935, 775, 182, 210, 884, 245, -612, 545, 85, -591, -409, 337, -87, -684, -318, -637, -638, -464, -322, -342, 205, 69, -291, 167, 780, 372, -1, 766, 876, -83, 122, 519, 677, 196, 432, 444, 277, -277, -490, -527, -456, -866, -1034, -577]
1727e77L65m36K73L11j86k96K06N90k28k24O79K06l44Q7K56R6o3m58pJ05j57j030
1749h32M55M24k67m59P61J14n12p72J90N10j46l97P90O99k60J16m03K43M4k36
1769F2Q9N21R4n25L2J57j45m22M28L4k9k11r3l35l92j27N44J3K6J93K76k64k44
1792c18m53P35L74p41K86P48J48q18R8K73J39n46l9M68J00k75n79K45N13l00m82
1813d24M93j9l84j02L12J3L94l35q6J83k20L07N6k02p4L08j8k05k05K30J99k24
1835cm74M02Q20m45o97O17L67k28p30L24L15rk89l85M23M1m11k7L44N55m60l69
1857c19Q5M7j65K11r4L8L89Rp9k72N69p6k37n05K46P50m16l72%K61O31n19l97
1880b15M49K37r72l96L53L32j06k24N36O18m85o24P5J78K56m93K38M99M64l67
$$ y = [-577, -212, -648, -375, -64, -250, -546, -340, 250, 22, -202, 477, 683, 339, 426, 682, 778, 715, 257, 250, 355, 198, -832, -377, 47, -220, -679, 82, 196, -316, -1088, -898, -388, -534, -931, -141, 558, 298, 414, 11, 254, 298, 62, 151, 672, 766, 241, 273, 430, 285, -137, 291, 325, 296, 85, -8, -343, -735, -862, -318, -305, -279, -86, 190, -74, -318, -771, -36, 338, -403, -117, 631, 779, -39, 59, 332, 471, -75, -114, 354, 454, 179, -400, -155, 358, 58, -424, 69, 50, -334, -436, -124, -111, 283, -52, -138, 45, -175, 132, 188, -14, -88, 220, 202, -3, -208, 22, 221, -3, -477, -75, 745, 300, -397, 220, 587, 359, -371, -47, 268, 259, -30, -415, 8, 49, -362, -389, -45, 510, 50, -319, -234, -187, -352, -141, -235, -197, 192, 201, 122, -150, 419, 343, 106, -399, -153, 597, 181, -191, -191, 70, 701, 182, -215, 234, 471, -501, -897, -544, -212, -318, -542, -6, 612, 127, -497, -422, -244, 12, -481, -243, 256, 720, 353]
1900C53n1n1L10k35k83Rj41N45k88o13o1P01l36qj93K61L25o51o69L86J218l53
1922A75p62O19P26l08o75K26J95J08p0l94O91L15l02l81j89K07m4n73O3J15K82
1943B4m01L7k49M27K48k71n92O67O91q35n05Q25N09j68j03l63O70K21q71o2L78
1964B77M21n62o06L49N39j5r17K08L95k46l52j72j5N40K9k32K05N67p7n25n2K69
1986B8K79k97R7L9N19J65o21m39N05N45r41l14M95m7j32l99j93Q79L63p36m56
2007f61Q43K58r12l91N34N03k16K31m7L52J77o21r07Q91Q0j11k75M71M28k26k09
2028A92k33o8L53k24m70J85R82l34r62n9P36K58m81j07K79K27l53n54J39O76K10
2049C92m28j12R28j37p87j21L42O6J34o75N08L31j25o01J45M30om81j89K74K20
$$ y = [353, 302, 251, 561, 326, 43, 52, -89, 456, 168, -445, -506, 195, -141, -149, -342, -81, 244, -407, -1076, -690, 528, 175, -587, 32, 758, 450, -225, 1, 196, 304, 234, -160, 531, 846, 544, 163, -26, 181, 137, -436, -373, -258, 24, -377, -340, -589, -162, 86, -185, -777, -110, 581, -254, -759, 66, 575, 407, 304, -59, 611, 832, -39, -101, 277, 698, 136, -470, -121, 418, 403, -514, -306, 89, -157, -509, -681, -696, -156, -127, -359, -154, 413, 336, -189, -241, 28, 307, 10, 107, 146, 665, 830, 209, -230, 275, 820, -121, -435, 60, 13, -119, -518, -711, 168, 531, -205, -661, 182, 440, -472, -863, -329, 174, -42, 189, 142, 494, 671, 50, -857, 34, 114, 3, -272, 199, 627, 401, 192, -41, -109, 244, 20, -450, -265, 717, 383, -579, -638, 98, 356, -125, -232, 47, 274, -79, -633, -494, 182, 392, -36, -148, 780, 643, -144, -265, 77, 143, 277, -398, 110, 441, 316, -285, -140, 290, 284, -197, -386, -112, 108]
2070A08j19n56J40M05N75o21j83P2M45l14n29M62M65k2l44R9J07N52o45m78N06
2091A25M76j94o71K22O12l10k21k38J60K66j83o53L41M11k13m57J64P87j91n59
2111c26k71K76M27K53k85mN33m1o67j12M84K73o01J21j6K81O5o29k79N72K17o30
2133c59j04M32J92o97J8L17L14J07k26j7J94Kk84n72P65M03m14J57K93L4p4l65
2155A16k64OM30p7q21N48R5o6m10j37M02l1j5m05K09O15j50m47K9O89K57o33L65
2178C05J88k88jl78J09N82j76l44qL65k20k08l68M98l02k82K67n6K1J25K44k97
2200b24K81P8l31k06K07M05j85J71j05J47L13m50j37KL44l27l70K91L71k08j44
2221g7P3K62k83j60j24O9J19Mk6j96O19l43J03j31N2J99k87J96k73J82L06k77
$$ y = [108, -11, -567, -427, -22, 553, -68, -251, -179, 266, -48, -577, -115, 350, 328, -16, 83, 190, 742, 97, -381, 125, 601, 407, -264, -42, 570, 260, 39, -199, -39, 227, 44, -609, -268, 143, -70, -527, -363, 424, 233, -326, -597, -321, 106, 359, 74, 70, 603, 562, -105, -217, 267, 540, -61, 60, 44, 325, 390, -239, -518, 54, 271, -359, -463, -31, 161, -536, -518, -201, 113, 220, -6, -23, 171, 173, -111, -683, 82, 485, 71, 228, 521, 555, 481, 116, -148, -142, 288, 211, -610, -62, 33, -33, -443, -580, -178, -209, -224, -629, -420, 195, 45, -402, -373, 316, 573, -60, 305, 493, 205, 204, -174, -65, 517, 341, -3, -11, 354, 134, -74, -442, 56, -246, -528, -261, -317, -296, -171, 73, -224, 57, 135, -196, -402, -195, 210, 25, 196, 91, 238, 551, 101, -36, -34, 310, -17, -387, -96, 275, 67, -77, -4, 258, -25, -185, -309, -240, -121, -117, -143, -339, 280, -63, 40, -91, -39, 160, -127, 69, -204, -22, 284, 7]
2243Gk10M71J69l70k02J19p2P9m32K44M88j09l32K32K30j24l49J16L1j52O5k82
2265c83K60J23j39m7J55j27jJ18k20qK52J80r5R9k12P9N9m02L48J2J02Pk27K63
2289A96L7k81J34k95J93p3k77K46J2j34l2L0N26j26q9k4L5J1k46j5N37k05J15
2312B75m2j3j39j90m7N7r0L0l1J61j98l2K71m20J40J99M0K14k59j2J36J16j13
2335E3K5M90j47k49j34K56m0k65j47K78jo0J14l20K39l20m0K55j34p4K00r5L2
2358h4p5K7M05k85j78N0L31Jk9J02l6J56k99J79nj85l79J68J33n3k49K40L95l70
2382d0o1k8k02J42l64K05K39K2j29JM74k50r0J10M18k27j49K40j00l12J29L0l8
2405B0J29j67K1l58J38p8O2J71m8L8R1l9j51JL53l24k6J64R5o2l00M35n7P4q3
$$ y = [7, -203, 268, 437, 67, -135, -16, -88, -9, -441, -197, 291, 182, -150, 82, 312, 188, -161, -45, -14, -166, -101, -383, -123, 0, -139, -186, -31, -158, -159, -41, -261, -269, -17, 163, 68, 167, -45, 34, 93, -309, 39, 51, 153, 160, -67, 196, 233, -48, 86, -209, -16, -89, -366, -120, -108, -242, -274, -244, 282, 156, 67, 43, 78, 89, -157, -172, 365, 160, 275, 233, 220, 81, -109, -156, -99, -189, -159, -190, -29, -227, -259, 12, -408, -268, -69, -29, 185, -74, -86, 50, 166, 53, 78, 568, 421, 172, 38, 294, 254, -11, -158, 120, 119, 59, 173, -147, 92, -228, -268, -13, -147, -221, -21, -116, -84, -159, -132, 273, -12, -190, -140, 191, 192, 163, 265, 229, 385, 86, 265, 260, 75, -304, -136, -3, -56, -305, -65, 330, -40, -101, -129, -331, -189, -553, -348, -109, -87, -216, -215, 259, 9, -81, 29, 447, 220, 71, 311, 211, -101, 28, 58, 20, 149, -18, 3, -355, -217, -295, -233, -62, -110, -72, 19, -20, -171, -170, 183, -141, -167, -3, 92, 30, -270, 165, 108, 182, 99]
2430I9J84j19n3k15qK88k93J18j30M42k29k85K25P2j64nk54K88J0m8Q7K8P9j14
2454CL5J33j75J45n2l1N0LL5j05K6j33Njj95J20R0L60k76p6L70n5n18p7K03J91
2480G5o0j51K73J83l36L8%j19J21k63o1M44k7k69L23J46k26k5J91j70k8P3k50
2503a18J9J23L01q2P5k88r3K20j48J2j88J05j53L5L03N0J16m60R0K11l56J42j80
2526b64L13J62l27K06J19Q4k74J00M7r1r8nm9n3K19j82J02l18L03J77m22j23J44
2549b30M89p4j85j14O5K55q3j20P5RJ11k68Q1L54m57NK68k59J29q3k38J23K61
2572A14j48l34K68j5J91l89K73K20j72N5r7J85n00N85J3k93J48oK52k29j47J95
2594A69q2j74on6K66j95k63O38l78m0M8J7Lk25J03J14L07j45j93%o6K50J61l40
$$ y = [99, 283, 164, 111, -104, -112, 176, -117, 1, -129, 313, 84, -201, 24, 96, -68, -73, -327, -39, -29, -77, 10, 38, 117, 3, 38, 171, -4, 141, 89, 58, 108, 111, 146, 41, 67, -66, -61, -62, -257, -137, -47, 313, 37, -39, 331, 276, -242, -319, -116, 75, 15, -136, 137, 320, -16, 22, 22, -97, 24, -239, -300, 144, 117, -152, 171, 317, 91, 66, 257, 87, 59, 132, -118, -99, 24, 325, 243, 318, 30, -63, 157, 9, 21, -167, -62, -215, -180, 123, 173, 289, -171, -81, 130, -226, -84, -264, 49, 211, -116, 90, 209, 293, 19, 119, 166, 75, -23, -28, -77, -130, 89, -93, 9, -309, -6, 171, -251, -374, -230, 259, 185, 0, -114, -49, 206, 123, 3, 78, 87, 198, -70, 11, 365, -92, -87, 181, -78, 51, -32, -270, -147, 114, -34, -368, -100, -115, 76, -313, -40, 180, 8, 63, -34, 151, -349, 236, 249, -44, 104, 98, 350, 121, -26, 169, 87, -87, -93, -149, 117, -78, -341, 297, -81, -121, -73, -56, -53, -278, -175, -61, 246, 101, -92, -92, -158, 92, 253, -87]
2618h7K12k04L76l05j00K03L2J72l13k39M30q6j30j24q4K24r6l1M6R2q2pj49K19
2642c1j4J60M7j46J0q9L00J86l46J00J34j04K3L6j56l17k3L03J5l43K17J64j70
2665d4l07K88k0K26j54j39j12M43j57j08L2L00Q2k41o9K76j65k16j25J73K13l1
2687A45k49L1p2L16k5k28M4J75P2l56k4J75N5j43J20p0J72k50j79K60Rr0Q9j7
2711d0J29j4j16R6L1J29k37l32J75L26j45j00j22L57m03L2K74ok0l5l28K78K1
2734e0k7O6J46M8K5l59L27J8j30j5l4L5l8J20M3k82J53q0L36l33o0k3L79o23K68
2759i0K14K7k06l0P0J39l00O8%l6Q0r6j2K05Q7o9j6l3j11J34O5k48L18l8J11l76
2785a43K5K05j08m7j6J40Q1l06j40K25J15mj94Q0J22k04L12o0J4j56J22k72J65
$$ y = [-87, 125, -79, 297, -8, -108, 95, 127, 299, -14, -253, 177, 91, -39, -163, -247, -23, -119, -150, -104, -12, -94, -101, -250, -31, -45, 115, 162, 16, 26, -63, 237, 423, 77, 177, 311, 207, 230, 266, 110, -207, -230, 73, 88, -255, -38, 126, -44, -351, -63, -83, 143, -11, -150, -262, 181, 24, -84, -52, 248, 330, 89, 20, 296, 131, -85, -210, -37, 176, 145, -104, -73, -145, 171, 146, -82, -38, 137, 209, -147, -171, 4, 59, -84, 36, -34, 138, -112, -291, -31, -22, -112, -23, -40, 89, 75, -41, 55, 86, 215, -22, -354, -179, 147, 2, -98, -220, 137, -266, -234, 40, 34, 14, -21, -349, -71, -50, -77, -11, 135, 183, 208, -151, 176, 194, 64, 49, 15, 50, 12, 132, 175, -107, 46, -34, 302, -31, -91, -114, 265, -358, -90, 124, 151, -55, -85, -15, 124, -176, -108, -108, -144, -64, -160, -172, 33, 120, 51, 35, 2, -109, 25, 90, -158, 160, 122, 233, -143, -118, 87, -21, -68, -84, 56, 137, -169, -309, -84, 31, 27, -167, -87, 35, -169, 143, 83, 97, -59, 63, -209, -44]
2808d4K02k33N2k1L31l16kJ27K7j58K20l86j03K03K85l35k59M77k08n8J41J16
2830E8r5%L0m1K88k5R9k20L39j22k03p4j12K23q4j29m5P1J01j05p7q3J81O8m4
2855aj47J06P3l4k91J25K63j41N4M6J33r8o6J01j7k14L08J7j53N6p9N4j33J68
2879A30n4k43K19n9K5j49J33M0p1J1j48K27j41J3l1J70k14K31k2K7RN9k11J85
2903A36j09Qn5P5J62k81J6K8j7J85k30J23J32k46n1L3O8j19J29oM0J17j63R9j40
2928f6qJ19j75P1PK28q3j47K1J54j26J58k32J62p0R1m4q0k0J2k54K18J35l9j27
2953i5J91k00J15J44k73L3J70Q2k19K73N4m31L16J43k50l85K95o5%J21L2Q8j36
2976CpN9J13j36K38l55K56k50J2m7k7j36K15J85j84P3j54K29l15L38l32J64O6
$$ y = [-44, 158, -75, -23, -44, 287, -29, -31, 96, 123, -35, 185, -201, -304, -101, 184, -151, -410, 67, -141, -199, -58, 58, -37, -37, -7, -48, 240, 215, 314, 94, 433, 311, 108, 34, -78, 145, 61, -68, -113, -42, 59, -46, -123, -206, -25, 43, -1, -148, -42, 31, -3, -294, -169, 94, -47, 7, 53, 186, 88, 22, 123, 106, -108, 200, 217, 64, 120, 41, 95, -38, 130, 76, -167, 52, -7, 18, -131, 2, 42, -29, -18, -166, 61, -80, -67, -98, 72, -142, 89, 67, 94, 103, 162, -49, 136, 27, 35, -20, 55, 217, -64, -48, -20, -37, 148, -82, 41, 173, -73, -124, -91, -23, -142, -13, -19, 21, 138, -25, 74, -66, -74, 45, -130, -59, -52, 176, 93, -54, -33, 121, -5, 153, -79, 83, 13, 104, 60, -20, -40, -28, -282, -64, 71, 32, -95, 96, -104, 11, 155, -118, -85, 85, 167, -52, 221, 275, -156, 160, 303, 53, -332, -37, -102, -102, 19, 51, 139, 3, -4, 55, 168, 32, 270, -85, 171, -79, -67, -114, -141, -277, -62, 123, -61, 12, -142, 87, -228, 110, -222, -58, 8]
2999HJ97L5k37j16J42N7r6j17J62o6J16j77J77j66P0j1k81L43O4k03J9K3j18K14
3023C9N2O0j87J2k9j5%J96m4O0Pp3J1M1q3j13L5j68K36j61J25n7m9k09L57j12
3049f9o6N9J43Q7l21J40n4M3l6O8N4j38J38J76k56K4L58m26q7K46Q6k92q4K90
3073H3j89o8J26j58K89l79L47j83J92O8j51O9L00o6k91P7%j03N6K74k59j87J48
3096eo2lq6L05j99KJ79j70k71K25j03K72J20j82j7j12o5K41m3L8J05k14Q1L1j63
3121i6J13R8m5j56L3Q4p7j07N7q2L74j39j99J52M4m0M9qJ92n28K03K29l7j6k51
3146a53M6J35J97k17n0K53k39O8l2J14m1k00K64k58K06k12k01M00j97K20m5k07
3168a49K2N0J87j12q5J81l7K64l41R1k92L10k23Q4J13k8L14l47L5j26N2j04L04
$$ y = [8, 205, 240, 3, -113, 29, 86, -10, -127, 35, -31, 85, -92, 85, -81, -11, -22, -303, 40, 104, -99, -80, -57, -175, 39, 91, 151, -36, -24, -53, -68, -68, 128, 84, 144, 151, 78, 89, 130, 47, -66, -31, -199, 37, -124, 1, -56, -105, -314, 43, -69, -135, -76, 67, 154, -167, -27, -81, -38, -74, -6, 48, -90, 48, 224, -32, -8, 350, -76, -163, 83, 169, -123, -207, 83, -106, -174, -48, -206, 83, -296, 51, -132, 60, 128, -23, 46, 346, 280, -11, 66, 66, -37, 19, 293, 34, -153, -5, -67, -70, -156, 149, -50, -48, 131, -39, -310, -85, -188, 84, 204, 22, 5, -107, -172, 69, 26, 64, 169, -45, 36, 67, -96, 17, 115, 70, -86, -53, 31, -46, -153, -96, -178, 196, 57, -142, 10, 54, 14, 63, 55, 247, -281, -78, 151, 114, 98, -153, -107, 28, 225, 8, -42, 211, -28, 40, 8, 122, 81, -119, 145, -113, 93, -119, -320, 80, -117, 103, 58, -149, -127, -77, 110, -2, -87, 94, 57, 321, -20, 71, -221, 89, -134, -50, 63, 35, 349, 2, 37, -89, -37, -141, 163]
3191A63l5q1j73j4k0K89l08K06j34J13l62M43p4J15j42J57j69J25r9r3O9k74L37
3214C9Q1k83K33q8P5J74k41j09o5J72OJ88j95qj41K60K6j9p5l6j73L9Q6J62k32
3239a24J64Ql9J56j68J32k04k57N28j30l3K5j36J30j26K7K63l15J50m0j53K31
3261H9L3k62K1j44J45K38l62K00K27k16K23k35j39L11K1j26j24K12k50j75M72
3282A59j11N1j48R0L44n36J47o8n0K0n0KL2K1K00k05J02j51j13J92N5n0Ko5J66
3307C6j29p5K43J40j61j59N19m66P7J59m13J98J10k75J18q0J40Q5l3k00p9J74
3329g1K30n3J17k98Mp0Q6L49k99o1M9K2n2J29q6R9J59l58j4L82n6l91L13j72N7
3354A5M0k14P8j0J24j71o8K1L83R0m91M10k93J7K42k09q6R6K41j76j96M3J52k2
$$ y = [163, 128, 47, -126, -140, -160, 129, -179, 27, -107, 6, -356, 87, 13, 128, -14, 143, -26, 99, 0, -93, -24, -298, 39, 120, -163, 70, -18, 57, 231, -10, -119, -184, -12, -6, 182, -13, -21, -162, 98, 124, 105, 30, -6, -179, -140, -54, 108, -124, 40, 48, 9, 165, -3, 129, -75, -332, 196, 66, 33, 58, -78, 52, -74, -47, 216, -99, 51, 11, -142, 89, 122, -140, -119, -263, -118, 120, -242, -42, 185, -31, 192, -43, -182, 129, 150, 24, -100, 112, -138, -313, 159, 48, 99, -49, 41, 385, -151, -4, -72, -122, -102, -152, -150, -118, -97, 103, -102, 0, -151, -264, -72, -17, -67, -65, -130, 36, -93, -168, 75, 215, 54, -105, 414, -52, 25, 184, -229, -31, 79, -196, -78, -158, -18, 67, 34, -166, -245, -71, 159, 106, 223, -75, -71, -141, -55, 294, -5, -66, -17, 5, -47, 82, -4, 95, 254, -104, -118, 264, 208, -183, 130, -42, 15, 55, -159, -81, -91, 33, -138, -206, -185, 198, 288, -203, 207, -86, -69, 173, -36, -122, -26, 215, 39, -157, -114, 38, 16]
3378A6l7L2l4p4R4j40K31o7mL8J16p3j1j77M2J25M2j13J49l10J87j47L62l87J36
3403dP5j20J14O3n8k87O45l88QO1r4j24P8M5M6l4j19R7P1j63O0J14j6P7j87Rj47
3430a78J36L6J10M4j91n6l1J9J25L04k10k66N1J23j39N6n5Q3O8r7J51k9l8k9m8
3455f1M9K25l12P9j62J64j88J52P7Q3j11J48j06KJ21k45r8K21j12Q6L8K5j25K15
$$ y = [16, -21, 11, -23, -97, -3, -143, 88, 21, 17, 55, 171, 98, 87, -90, -48, 77, 119, 6, 155, -155, 32, -115, 247, -140, -4, 71, -49, 65, 128, 70, -217, 428, 40, 48, 109, 15, -109, -31, 14, 60, 26, -93, 4, 75, -88, -28, 86, 70, 147, -40, -31, -178, -42, -6, 104, 148, -43, -99, -130, -111, 14, 318, 108, -158, -107, 16, -123, -67, -122, -39, 29, -68, 83, 54, 16, -13, -61, -12, 213, -99, -20, -182, -18, -206, -54, 23, 106, -5, 143, 37, 39, 160, -85, -183, 38, -74, 12, 50, 75, -50, 165]
$$ [...]
8191G4
##END NTUPLES=NMR FID
##END=
