##TITLE=1H_LR-728-C1
 CDCl3, 8 sc, 
 26.11.2020
##JCAMPDX= 6.0         $$ Bruker NMR JCAMP-DX V2.0
##DATA TYPE= NMR FID
##DATA CLASS= NTUPLES
##ORIGIN= UXNMR, Bruker Analytische Messtechnik GmbH
##OWNER= root
$$ XWIN-NMR		Version 3.5
$$ Thu Nov 26 13:29:13 2020 Russian Standard Time (UT+4h)  she@DPX200
##.OBSERVE FREQUENCY= 200.1315066352
##.OBSERVE NUCLEUS= ^1H
##.DELAY= (6, 6)
##.ACQUISITION MODE= SIMULTANEOUS
##.ACQUISITION SCHEME= undefined
##.AVERAGES= 8
##.DIGITISER RES= 18
##SPECTROMETER/DATA SYSTEM= spect
##.PULSE SEQUENCE= zg30
##.SOLVENT NAME= CDCl3
##.SHIFT REFERENCE= (INTERNAL, CDCl3, 0, 15.7039)
##AUDIT TRAIL= $$ (NUMBER, WHEN, WHO, WHERE, WHAT)
$$ ##TITLE= Audit trail, XWIN-NMR		Version 3.5
$$ ##JCAMPDX= 5.01
$$ ##ORIGIN= Bruker BioSpin GmbH
$$ ##OWNER= she
$$ F:/spectra/data/she/nmr/H-F/1/audita.txt
$$ ##AUDIT TRAIL=  $$ (NUMBER, WHEN, WHO, WHERE, WHAT)
(   1,<2020-11-26 13:28:07.48 +0400>,<she>,<DPX200>,
      <created by zg, POWCHK disabled, PULCHK disabled
       configuration hash MD5:
       00 E9 B6 7A A2 85 ED C7 34 08 36 98 17 FE 4E 26
       data hash MD5: 16K
       94 36 C8 B0 BD B5 FC 05 73 58 6F 11 BB E4 91 7B>)
$$ ##END=
$$ 
$$ hash MD5
$$ 76 12 0A B6 81 C9 D5 CA 5D 23 4F 1A E2 8C 6D 19
##$RELAX= 
##$RELAX= 
##$RELAX= 
##$RELAX= 
##$RELAX= 
##$RELAX= 
$$ Bruker specific parameters
$$ --------------------------
##$DU= <F:/spectra>
##$EXPNO= 1
##$NAME= <H-F>
##$PROCNO= 1
##$TYPE= <nmr>
##$USER= <she>
##$AMP= (0..31)
100 100 100 100 100 100 100 100 100 100 100 100 100 100 100 100 100 100 
100 100 100 100 100 100 100 100 100 100 100 100 100 100 
##$AQSEQ= 0
##$AQ_mod= 1
##$AUNM= <au_zg>
##$AUTOPOS= <>
##$BF1= 200.13
##$BF2= 200.13
##$BF3= 200.13
##$BF4= 200.13
##$BF5= 200.13
##$BF6= 200.13
##$BF7= 200.13
##$BF8= 200.13
##$BYTORDA= 1
##$CFDGTYP= 0
##$CFRGTYP= 5
##$CHEMSTR= <none>
##$CNST= (0..31)
1 1 145 1 1 1 1 1 1 1 1 1 1 1 1 1 1 1 1 1 1 1 1 1 1 1 1 1 1 1 1 1 
##$CPDPRG= <>
##$CPDPRG1= <>
##$CPDPRG2= <>
##$CPDPRG3= <>
##$CPDPRG4= <mlev>
##$CPDPRG5= <mlev>
##$CPDPRG6= <mlev>
##$CPDPRG7= <mlev>
##$CPDPRG8= <mlev>
##$CPDPRGB= <>
##$CPDPRGT= <>
##$D= (0..31)
0 1.2 0 0 0 0 0 0 0 0.06 0 0.03 0 0 0 0 0.0002 0 0 0 0 0 0 0 0 0 0 0 0 
0 0 0 
##$DATE= 1606382886
##$DBL= (0..7)
120 120 120 120 120 120 120 120 
##$DBP= (0..7)
150 150 150 150 150 150 150 150 
##$DBP07= 0
##$DBPNAM0= <>
##$DBPNAM1= <>
##$DBPNAM2= <>
##$DBPNAM3= <>
##$DBPNAM4= <>
##$DBPNAM5= <>
##$DBPNAM6= <>
##$DBPNAM7= <>
##$DBPOAL= (0..7)
0.5 0.5 0.5 0.5 0.5 0.5 0.5 0.5 
##$DBPOFFS= (0..7)
0 0 0 0 0 0 0 0 
##$DE= 6
##$DECBNUC= <off>
##$DECIM= 32
##$DECNUC= <off>
##$DECSTAT= 4
##$DIGMOD= 1
##$DIGTYP= 9
##$DL= (0..7)
0 120 120 120 120 120 120 120 
##$DP= (0..7)
150 150 150 150 150 150 150 150 
##$DP07= 0
##$DPNAME0= <>
##$DPNAME1= <>
##$DPNAME2= <>
##$DPNAME3= <>
##$DPNAME4= <>
##$DPNAME5= <>
##$DPNAME6= <>
##$DPNAME7= <>
##$DPOAL= (0..7)
0.5 0.5 0.5 0.5 0.5 0.5 0.5 0.5 
##$DPOFFS= (0..7)
0 0 0 0 0 0 0 0 
##$DQDMODE= 0
##$DR= 18
##$DS= 0
##$DSLIST= <SSSSSSSSSSSSSSS>
$$ [...]
##$SUBNAM2= <"">
##$SUBNAM3= <"">
##$SUBNAM4= <"">
##$SUBNAM5= <"">
##$SUBNAM6= <"">
##$SUBNAM7= <"">
##$SUBNAM8= <"">
##$SUBNAM9= <"">
##$SW= 16.9725356469052
##$SWIBOX= (0..15)
0 0 2 0 0 0 0 0 0 0 0 0 0 0 0 0 
##$SW_h= 3396.73913043478
##$TD= 16384
##$TD0= 1
##$TE= 0
##$TE2= 300
##$TE3= 300
##$TEG= 300
##$TL= (0..7)
0 120 120 120 120 120 120 120 
##$TP= (0..7)
150 150 150 150 150 150 150 150 
##$TP07= 0
##$TPNAME0= <>
##$TPNAME1= <>
##$TPNAME2= <>
##$TPNAME3= <>
##$TPNAME4= <>
##$TPNAME5= <>
##$TPNAME6= <>
##$TPNAME7= <>
##$TPOAL= (0..7)
0.5 0.5 0.5 0.5 0.5 0.5 0.5 0.5 
##$TPOFFS= (0..7)
0 0 0 0 0 0 0 0 
##$TUNHIN= 0
##$TUNHOUT= 0
##$TUNXOUT= 0
##$USERA1= <user>
##$USERA2= <user>
##$USERA3= <user>
##$USERA4= <user>
##$USERA5= <user>
##$V9= 5
##$VALIST= <valist>
##$VCLIST= <CCCCCCCCCCCCCCC>
##$VD= 0
##$VDLIST= <DDDDDDDDDDDDDDD>
##$VPLIST= <PPPPPPPPPPPPPPP>
##$VTLIST= <TTTTTTTTTTTTTTT>
##$WBST= 1024
##$WBSW= 4
##$XGAIN= (0..3)
0 0 0 0 
##$XL= 0
##$YL= 0
##$YMAX_a= 725442
##$YMIN_a= -377428
##$ZGOPTNS= <>
##$ZL1= 120
##$ZL2= 120
##$ZL3= 120
##$ZL4= 120
##$ABSF1= 10
##$ABSF2= 0
##$ABSG= 5
##$ABSL= 3
##$ALPHA= 0
##$AQORDER= 0
##$ASSFAC= 0
##$ASSFACI= 0
##$ASSFACX= 0
##$ASSWID= 0
##$AUNMP= <proc_1d>
##$AZFE= 0.1
##$AZFW= 0.1
##$BCFW= 1
##$BC_mod= 2
##$BYTORDP= 1
##$COROFFS= 0
##$CY= 11.3945322036743
##$DATMOD= 1
##$DC= 2
##$DFILT= <>
##$DTYPP= 0
##$F1P= 15.9154993809931
##$F2P= -4.1035820241983
##$FCOR= 0.5
##$FTSIZE= 0
##$FT_mod= 4
##$GAMMA= 1
##$GB= 0.15
##$INTBC= 1
##$INTSCL= 1
##$ISEN= 128
##$LB= 0.24
##$LEV0= 0
##$LPBIN= 0
##$MAXI= 10000
##$MC2= 0
##$MEAN= 0
##$ME_mod= 0
##$MI= 1.114404
##$NCOEF= 0
##$NC_proc= 0
##$NLEV= 6
##$NOISF1= 3.799351
##$NOISF2= 2.8
##$NSP= 1
##$NTH_PI= 0
##$NZP= 0
##$OFFSET= 15.70392
##$PC= 1
##$PHC0= -11050.84
##$PHC1= 15.20088
##$PH_mod= 1
##$PKNL= yes
##$PPARMOD= 0
##$PSCAL= 0
##$PSIGN= 0
##$REVERSE= no
##$SF= 200.130013532006
##$SI= 16384
##$SIGF1= 3
##$SIGF2= 2
##$SINO= 400
##$SIOLD= 16384
##$SREGLST= <1H.CDCl3>
##$SSB= 0
##$STSI= 0
##$STSR= 0
##$SW_p= 3612.71676300578
##$SYMM= 0
##$S_DEV= 0
##$TDeff= 0
##$TDoff= 0
##$TI= <>
##$TILT= no
##$TM1= 0
##$TM2= 0
##$TOPLEV= 0
##$USERP1= <user>
##$USERP2= <user>
##$USERP3= <user>
##$USERP4= <user>
##$USERP5= <user>
##$WDW= 1
##$XDIM= 8192
##$YMAX_p= 0
##$YMIN_p= 0
$$ End of Bruker specific parameters
$$ ---------------------------------
##NTUPLES= NMR FID
##VAR_NAME=  TIME,          FID/REAL,        FID/IMAG
##SYMBOL=    X,             R,               I
##VAR_TYPE=  INDEPENDENT,   DEPENDENT,       DEPENDENT
##VAR_FORM=  AFFN,          ASDF,            ASDF
##VAR_DIM=   8192,          8192,            8192
##UNITS=     SECONDS,       ARBITRARY UNITS, ARBITRARY UNITS
##FACTOR=    0.0002944,     1,               1
##FIRST=     0,             0,               0
##LAST=      2.4114304,     0,               0
##MIN=       0,             -377428,         0
##MAX=       2.4114304,     725442,          0
$$ Real data points
##PAGE= N=1
##DATA TABLE= (X++(R..R)), XYDATA
$$ [...]
$$ plain form
2311 2189 1134 -1781 -540 -61 1180 3288 -77 -1114 -661 -805 2647 2351 144 477 -1540 80
2327 80 2339 1065 1178 -139 -1698 1622 1144 1587 1643 -2190 -31 1431 705 2509 -790 -1798 957
2344 957 -265 2105 1821 -2197 -905 -1196 444 3754 -577 -1619 -779 -1974 2024 912 -1247 654
2360 654 -2456 -1478 1376 -1054 903 -1106 -3932 494 65 -343 453 -4149 -1037 954 -1534 1094
2376 1094 -2142 -3182 21 -2160 694 1819 -3746 -1487 -2190 -1074 3291 -1128 -2172 -656 -3049
2391 -3049 1352 1135 -1737 1525 -2691 -1694 2460 -945 1031 -500 -3936 2165 1086 288 1933 -3026
2407 -3026 -251 2380 -522 3108 22 -2598 1589 -566 2456 4066 -2097 706 335 -407 5046
2422 5046 59 697 2413 -2260 2345 2938 -137 3311 -834 -885 4622 443 1986 894 -2101 3654
$$ packed form
2311B189j055k915J241M79J241K108l365j037M53j44L452k96k207L33k017J620
2327H0K259j274J13j317j559L320m78M43N6l833K159J462p26J804l299j008K755
2344I57j222K370k84m018J292k91J640L310m331j042Q40j195L998j112k159J901
2360F54l110R78K854k430J957k009k826M426m29m08P96m602L112J991k488K628
2376A094l236j040L203k181K854J125n565K259p03J116M365m419j044J516k393
2391c049M401k17k872L262m216R97M154l405J976j531l436O101j079p98J645m959
2407c026K775K631k902L630l086k620M187k155L022J610o163K803l71p42N453
2422E046m987O38J716m673M605N93l075L448m145n1N507m179J543j092k995N755
$$ plain form
2438 3654 2395 814 3715 -1516 227 3307 -448 4154 782 -2431 1870 -861 2113 4364 -2617
2453 -2617 668 570 -1032 4072 -286 -900 1900 -2810 963 2404 -1600 1729 -2332 -2504 3507 -1015
2469 -1015 -166 -204 -4243 1622 -7 -1872 1982 -3567 -2412 667 -2714 2089 -309 -4970 -344 -2693
2485 -2693 -627 2118 -4285 -1725 -1403 -3980 1821 -1537 -2891 -343 -4677 -773 721 -3480 -364
2500 -364 -3277 -3398 1718 -2058 -1328 -533 -5341 -336 -22 -2331 1416 -3767 -3036 376 -2374 1544
2516 1544 367 -3890 -123 -2158 -688 3270 -2208 -623 -753 -2012 3441 196 -1729 1271 -1460
2531 -1460 1410 3276 -706 2078 -346 -1563 4159 1556 2834 1376 -2514 2336 4128 1589 3608
2546 3608 -58 605 3751 679 3664 3597 -211 2078 543 2474 5599 661 787 2339 1284 4795
$$ packed form
2438C654j259j581K901n231J743L080l755M602l372l213M301k731K974K251o981
2453b617L285r8j602N104m358o14K800m710L773J441m004L329m061j72O011m522
2469a015Q49l8m039N865j629j865L854n549J155L079l381M803k398m661M626k349
2485b693K066K745o403K560L22k577N801l358j354K548m334L904J494m201L116
2500c64k913j21N116l776P30P95m808N005L14k309L747n183P31L412k750L918
2516A544j177m257L767k035J470L958n478J585j30j259N453l245j925L000k731
2531a460K870J866l982K784k424j217N722k603J278j458l890M850J792k539K019
2546C608l666O63L146l072K985o7l808K289j535J931L125m938J26J552j055L511
$$ plain form
2562 4795 2064 127 3335 610 2321 3876 1061 2867 349 -1349 3717 2821 2012 1347 -2448 1346
2578 1346 2382 654 2333 -509 -1054 1076 -789 1581 1748 -2315 -299 -925 -156 1958 -2087 -1743
2594 -1743 -529 -1847 982 -871 -2150 -692 -2706 -1465 515 -1553 -1288 -2998 -3798 -245 -519 -1060
2610 -1060 -1407 -4338 -2382 -986 -1815 -519 -2598 -3752 -1501 -1966 -710 -1020 -3466 -1657 -1946 -1356
2626 -1356 59 -2283 -2669 -1650 -1859 12 -62 -2346 -1789 -2402 -726 1001 -617 -699 -1747 -2319 318
2643 318 661 422 -85 -1971 -991 776 552 1436 -565 -928 411 273 1510 1125 -381 21 518 778
2661 778 2122 722 -65 300 515 2388 2242 748 295 -80 1011 2739 1889 1218 256 4 1774 2333
2679 2333 2029 1496 242 458 1769 1784 1939 1052 247 1103 1361 2188 1775 469 163 945 1914 2374 897
$$ packed form
2562D795k731j937L208k725J711J555k815J806k518j698N066q96q09o65l795L794
2578A346J036j728J679k842n45K130j865K370J67m063K016o26P69K114m045L44
2594a743J214j318K829j853j279J458k014J241J980k068K65j710q00L553k74n41
2610a060l47k931J956J396q29J296k079j154K251m65J256l10k446J809k89N90
2626a356J415k342l86J019k09J871p4k284N57o13J676J727j618q2j048n72K637
2643C18L43k39n07j886R80J767k24Q84k001l63J339j38J237l85j506M02M97K60
2661G78J344j400p87L65K15J873j46j494m53l75J091J728q50o71r62k52J770N59
2679B333l04n33j254K16J311J5J55q87q05Q56K58Q27m13j306l06P82R69M60j477
$$ plain form
2698 897 -264 63 398 2246 2015 585 -452 -478 699 1790 1510 393 -444 -756 185 1110 827 148
2716 148 -976 -958 12 172 248 -407 -1310 -534 22 232 -42 -1339 -1370 -810 -292 342 -906 -1830 -1718 -989
2736 -989 -110 21 -751 -1707 -2197 -1486 1 -437 -740 -1596 -2051 -948 -345 -725 -854 -1631 -1608 -550 -381
2755 -381 -233 -1225 -1705 -859 -322 189 93 -1469 -1532 -529 -213 998 -45 -1324 -1050 -961 791 1181 -48
2774 -48 -389 -1043 -577 548 775 688 226 -1083 418 834 732 1006 -613 -472 1093 1039 1483 362 -897
2793 -897 418 755 1722 1878 -485 -448 301 298 2264 808 -428 87 -598 1049 1789 438 397 -557 -568
2812 -568 1675 642 703 506 -1120 728 839 156 812 -1097 -578 1284 104 1180 -58 -1842 468
2829 468 185 443 1596 -1252 -832 -104 -641 1564 353 -772 232 -1726 -279 1548 -423 289 -1265
$$ packed form
2698H97j161L27L35J848k31j430j037k6J177J091k80j117q37l12R41R25k83o79
2716A48j124J8R70J60P6o55r03P76N56K10k74j297l1N60N18O34j248r24J12P29
2736i89Q79J31p72r56m90P11J487m38l03q56m55J103O03l80j29p77K3J058J69
2755c81J48r92m80Q46N37N11r6j562o3J003L16J211j043j279K74Q9J752L90j229
2774d8l41o54M66J125K27q7m62j309J501M16j02K74j619J41J565n4M44j121j259
2793h97J315L37R67J56k363L7P49lJ966j456j236N15o85J647P40j351m1r54j1
2812e68K243j033O1j97j626J848J11o83O56j909N19J862j180J076j238j784K310
2829D68k83K58J153k848M20P28n37K205j211j125J004j958J447J827j971P12j554
$$ plain form
2846 -1265 -1582 2000 -15 -277 181 -1757 521 643 -675 1213 -1386 -1395 994 -450 1287 180 -2454
2863 -2454 180 183 104 1486 -1686 -466 373 -1401 1201 440 -844 574 -1925 -246 2151 -751 126
2880 126 -860 -1785 2177 -267 -541 707 -1644 567 687 -869 1534 -935 -2029 1216 -281 1265
2896 1265 700 -2674 395 406 -240 1738 -1323 -258 811 -1851 1362 1164 -1102 690 -1682 95
2912 95 2367 -917 252 -206 -1036 2420 81 -377 1419 -1923 475 1364 -558 2152 -701 -1803
2928 -1803 1439 -304 1320 1716 -2270 423 -174 -146 2527 -828 -907 731 -1336 1475 798 -1531 1423
2945 1423 -982 -426 2264 -1220 488 -202 -2343 2153 839 -698 427 -2335 231 1391 -1550
2960 -1550 1145 -633 -1638 536 -1776 519 1510 -2924 -325 -11 -1085 2529 -1948 -1025 1279 -979
$$ packed form
2846a265l17L582k015k62M58j938K278J22j318J888k599rK389j444J737j107k634
2863b454K634Lp9J382l172J220Q39j774K602p61j284J418k499J679K397k902Q77
2880A26r86r25L962k444k74J248k351K211J20j556K403k469j094L245j497J546
2896A265n65l374L069J1o46J978l061J065J069k662L213j98k266J792k372J777
2912I5K272l284J169m58q30L456k339m58J796l342K398Q89j922K710k853j102
2928a803L242j743J624L96l986K693n97K8K673l355p9J638k067K811o77k329K954
2945A423k405N56K690l484J708o90k141M496j314j537J125k762K566J160k941
2960a550K695j778j005K174k312K295R91m434K599L14j074L614m477R23K304k258
$$ plain form
2976 -979 573 53 -1476 1219 -1270 -1455 1805 -522 118 -778 -2160 2109 770 -1009 273 -1977
2992 -1977 181 1330 -1430 1298 448 -1690 520 -548 1117 2088 -2324 -401 495 -67 1958 -1005
3008 -1005 -879 1441 -990 724 1143 -1031 628 -991 -851 2531 -59 -286 -99 -1901 1669 1100
3024 1100 -582 1159 -1406 -426 1024 -578 1595 265 -1796 805 -138 419 1302 -1688 -309 364
3040 364 -435 1561 -348 -1295 633 -799 695 1415 -1096 100 -827 -902 1564 -291 -191 -286 -1859
3057 -1859 711 819 -88 642 -1455 -999 1169 -75 838 -19 -1210 298 164 575 1302 -720 -351
3074 -351 158 -155 1754 330 -1161 362 -55 1178 1344 -598 171 -499 -293 1671 557 173 46
3091 46 -1004 601 871 328 651 -827 -525 1175 184 788 467 -793 382 154 101 599 -886 -462
$$ packed form
2976i79J552n20j529K695k489j85L260k327O40q96j382M269j339j779J282k250
2992a977K158J149k760K728q50k138K210j068J665R71m412J923Q96n62K025k963
3008a005J26K320k431J714M19k174J659j619J40L382k590k27J87j802L570n69
3024A100j682J741k565R80J450j602K173j330k061K601r43N57Q83k990J379O73
3040C64p99J996j909r47J928j432J494P20k511J196r27p5K466j855J00r5j573
3057a859K570J08r07P30k097M56K168j244R13q57j191J508j34M11P27k022L69
3074c51N09l13J909j424j491J523m17J233J66j942P69o70K06J964j114l84j27
3091D6j050J605K70n43L23j478L02J700r91O04l21j260J175k28n3M98j485M24
$$ plain form
3109 -462 188 189 821 221 -862 -31 -469 605 1106 -274 -225 -869 -428 907 402 -284 -560 -1108 -51
3128 -51 456 26 152 -777 -800 202 -96 136 -14 -1170 -202 -79 279 541 -913 -969 -120 -13 348 -141
3148 -141 -1114 -820 -550 48 692 -249 -792 -984 -608 318 248 12 -810 -988 -217 392 106 246 -666 -507
3168 -507 -13 25 90 -169 -855 -332 108 361 308 -641 -750 -341 109 815 310 -642 -466 -378 245 613 187
3189 187 -281 -572 -57 670 675 143 -239 -314 92 520 692 -27 -1023 -865 185 706 325 -280 -327 -271 254
3210 254 950 538 52 -770 -23 735 1262 736 38 -250 -21 871 1091 310 56 59 -90 826 862 167 66
3231 66 -337 207 820 488 173 -134 -151 381 687 501 256 -654 -168 95 315 831 -365 -873 -127 -24
3251 -24 631 549 -502 -210 -540 59 854 -93 -221 -279 -664 463 227 -215 -87 -864 -371 504 -182 -49
$$ packed form
3109d62O50JO32o00j083Q31m38J074N01j380M9o44M41J335n05o86k76n48J057
3128e1N07m30J26r29k3J002k98K32j50j156R68J23L58K62j454n6Q49J07L61m89
3148a41r73K94K70N98O44r41n43j92L76R26p0k36q22j78P71O09k86J40r12J59
3168e07M94L8O5k59o86N23M40K53n3r49j09M09M50P06n05r52J76Q8O23L68m26
3189A87m68k91N15P27Nn32l82p5M06M28J72p19r96J58J050N21l81o05m7N6N25
3210B54O96m12m86q22P47P58N27n26o98k88K29Q92K20p81k54Lj49R16L6o95j01
3231F6m03N44O13l32l15l07j7N32L06j86k45r10M86K63K20N16j196n08P46J03
3251b4O55q2j051K92l30N99P95r47j28n8l85J127k36m42J28p77M93Q75o86J33
$$ plain form
3271 -49 -647 -1191 52 141 164 -210 -1698 -503 -248 -159 446 -862 -996 -187 -597 280 302 -764 -539 -815
3291 -815 -158 998 -434 -611 -724 -905 378 16 -157 -88 -998 -282 585 97 299 -756 -1007 446 321
3310 321 458 190 -1112 -136 306 -159 841 -343 -419 159 -720 429 987 -644 -38 -251 40 1200
3328 1200 -155 -44 451 -481 1130 692 -315 775 -622 -363 880 58 917 -149 -1087 676 132
3345 132 368 1195 -952 145 533 -160 1592 256 -674 510 -373 480 1346 -554 604 -107 -364 1585
3363 1585 -31 -211 315 -947 745 908 -518 801 -550 -313 1094 -348 679 496 -1317 531
3379 531 132 325 1454 -1211 -667 891 -488 951 -198 -733 703 -662 -195 972 -1187 17
3395 17 -701 -879 1588 -334 -503 45 -1025 964 584 -1341 443 -650 -993 429 -718 709 332
$$ packed form
3271d9n98n44J243Q9K3l74j488J195K55Q9O05j308j34Q09m10Q77K2j066K25k76
3291h15O57J156j432j77j13j81J283l62j73O9r10P16Q67m88K02j055k51J453j25
3310C21J37k68j302R76M42m65J000j184p6N78q79J149N58j631O06k13K91J160
3328A200j355J11M95r32J611m38j007J090j397K59J243q22Q59j066r38J763n44
3345A32K36Q27k147J097L88o93J752j336r30J184q83Q53Q66j900J158p11k57J949
3363A585j616j80N26j262J692J63j426J319j351K37J407j442J027j83j813J848
3379E31l99J93J129k665N44J558j379J439j149n35J436j365M67J167k159J204
3395A7p18j78K467j922j69N48j070J989l80j925J784j093l43J422j147J427l77
$$ plain form
3412 332 -2030 -92 -142 -138 689 -1661 -803 396 -1137 716 -389 -1433 332 -1072 -301 911 -1193
3429 -1193 -473 -282 -846 1231 -497 -1110 210 -1117 402 716 -1118 578 -576 -1084 886 -331
3445 -331 351 286 -1572 407 304 -180 1518 -786 -247 470 -419 843 156 -980 805 -271 162 1051
3463 1051 -555 196 75 -551 1349 544 -298 700 -999 469 1305 -343 820 -382 -348 1205 179
3480 179 615 739 -943 575 796 -265 1164 -489 -308 899 -334 842 435 -922 587 -202 272
3497 272 1613 -642 65 170 -407 1464 115 -276 586 -920 151 1189 -330 698 -227 -690 834
3514 834 0 211 645 -1130 144 410 -169 944 -417 -394 336 -172 698 332 -930 139 -408 -31
3532 -31 1137 -586 -365 -52 -1407 580 447 -696 223 -866 -155 756 -138 -2 -449 -941 387 -10
$$ packed form
3412C32k362J938n0MQ27k350Q58J199j533J853j105j044J765j404P71J212k104
3429a193P20J91n64K077j728o13J320j327J519L14j834J696j154n08J970j217
3445c31O82o5j858J979j03m84J698k304N39P17q89J262o87j136J785j076M33Q89
3463A051j606P51j21o26J900q05q42R98j699J468Q36j648J163j202L4J553j026
3480A79M36J24j682J518K21j061J429j653J81J207j233J176m07j357J509p89M74
3497B72J341k255P07J05n77J871j349l91Q62j506J071J038j519J028r25m63J524
3514H34q34K11M34j775J274K66n79J113j361K3P30n08Q70l66j262J069n47L77
3532c1J168j723K21L13j355J987j33j143R19j089P11R11q94J36m47m92J328l97
$$ plain form
3550 -10 -97 -76 -1210 -559 190 -474 550 -836 -649 69 -500 277 104 -769 -394 -725 -419 531 -371 -677
3570 -677 -505 -863 385 239 -726 -99 -836 -323 521 -279 319 -370 -750 179 69 139 305 -823 -60 375
3590 375 36 511 -91 -379 251 -117 481 682 -197 -185 -96 71 926 254 19 29 -186 733 728 128 326 -3
3612 -3 236 931 476 449 103 -314 405 652 373 152 -355 -79 381 135 684 140 -340 -30 99 614 499
3633 499 -293 -81 99 -8 642 220 -230 43 -258 328 436 -124 -116 -369 -426 558 -42 -4 -153 -356 -39
3654 -39 99 57 -22 -536 -454 -217 95 357 -181 -768 -245 -369 57 100 -313 -477 -214 -297 14 62 -500 -147
3676 -147 -304 77 81 -154 194 -578 -149 -332 501 -88 -564 -598 359 500 542 -226 -479 -91 387 54 561
3697 561 163 -619 -183 103 111 226 -10 -197 -473 -118 499 1 8 -76 21 604 555 29 -69 -190 -165 551 310
$$ packed form
3550a0q7K1j134O51P49o64J024j386J87P18n69P77j73q73L75l31L06R50r02l06
3570f77J72l58J248j46r65O27p37N13Q44q00N98o89l80R29j10P0J66j128P63M35
3590C75l39M75o02k88O30l68N98K01q79J2Q9J67Q55o72k35J0k15R19no00J98l29
3612cK39O95m55k7l46m17P19K47k79k21n07K76M60k46N49n44m80L10J29N15j15
3633D99p92K12J80j07O50m22m50K73l01N86J08n60Qk53n7R84o00L8j49k03L17
3654c9J38m2p9n14Q2K37L12K62n38n87N23j24M26M3m13j64K63q3L11M8n62L53
3676a47j57L81Mk35L48p72M29j83Q33n89m76l4R57J41M2p68k53L88M78l33N07
3697E61l98p82M36K86QJ15k36j87k76L55O17m98Pq4R7N83m9n26r8j21K5P16k41
$$ plain form
3720 310 460 -385 -839 -369 234 510 816 18 -564 455 258 451 256 -594 -15 84 549 850 33 207
3740 207 -2 82 565 273 -295 270 -222 41 711 160 307 -509 270 889 158 382 55 -326 120 521
3760 521 -224 932 -330 376 -56 -271 1071 130 -802 47 360 -30 356 -262 -752 -134 -457 -737 245
3779 245 -505 -559 -719 -56 248 -128 -207 192 -637 -3 -154 -138 -384 -1258 -190 170 -171 -70 -656 -688 -153
3800 -153 -283 75 -95 -744 -30 -570 -110 427 -586 -583 -3 -355 678 85 -640 96 -551 119 728 -323
3820 -323 284 -244 -690 670 219 184 244 -546 336 496 232 498 15 -389 489 -146 663 579 -117 386 158
3841 158 261 1437 -79 73 672 27 1230 481 -321 302 119 498 1342 121 -50 118 -814 919
3859 919 -415 143 497 -416 12 712 -253 1002 129 -473 488 -156 388 430 -777 233 53 -279 898
$$ packed form
3720C10J50q45m54M70O03K76L06p98n82J019j97J93j95q50N79R9M65L01q17J74
3740B07k09Q4M83k92n68N65m92K63O70n51J47q16P79O19p31K24l27l81M46M01
3760E21p45J156j262P06m32k15J342r41r32Q49L13l90L86o18m90O18l23k80R82
3779B45p50n4j60O63L04l76p9L99q29O34j51J6k46q74J068L60l41J01n86l2N35
3800a53j30L58j70o49P14n40M60N37j013LN80l52J033n93p25P36o47O70O09j051
3820c23O07n28m46J360m51l5O0p90Q82J60k64K66m83m04Q78o35Q09q4o96N03k28
3841A58J03J176j516J52N99o45J203p49q02O23j83L79Q44j221j71J68r32J733
3859I19j334N58L54r13M28P00r65J255q73o02R61o44N44M2j207J010j80l32J177
$$ plain form
3878 898 -330 -153 -24 -614 518 214 -535 243 -551 -285 877 -317 100 -348 -1207 298 93 -298
3896 -298 182 -1070 -224 322 -661 255 -275 -995 202 -359 -199 357 -1370 -269 -194 -681 686 -122 -857
3915 -857 224 -1078 310 306 -577 -234 -753 -867 898 -330 111 3 -1235 699 -511 -459 -42 -860
3933 -860 -825 495 -522 342 -135 -688 302 -472 285 749 -938 -110 244 -242 1041 -52 -475 618
3951 618 -474 516 438 -471 350 -238 -229 1077 -241 -31 270 -436 610 415 -38 376 -253 144 761 -191
3971 -191 395 87 -403 543 192 480 783 -259 -81 299 -76 1006 256 -341 522 -240 178 725 -287
3990 -287 356 -50 -550 898 182 227 15 -621 517 408 -139 183 -641 -255 680 -314 230 196 -566 125
4010 125 -168 -7 606 -603 -335 -49 -400 625 -716 -637 292 -366 171 252 -555 197 -153 -564 372 -63
$$ packed form
3878H98j228J77J29n90J132l04p49P78p94K66J162j194M17m48q59J505k05l91
3896b98M80j252Q46N46r83R16n30p20J197n61J60N56j727J101P5m87J367q08p35
3915h57J081j302J388mq83L43n19j14J765j228M41j08j238J934j210N2M17q18
3933h60L5J320j017Q64m77n53R90p74P57M64j687Q28L54m86J283j093m23J093
3951F18j092R90p8r09Q21n88RJ306j318K10L01p06J046j95m53M14o29L97O17r52
3971a91N86l08m90R46l51K88L03j042J78L80l75J082p50n97Q63p62M18N47j012
3990b87O43m06n00J448p16M5k12o36J138j09n47L22q24L86R35r94N44l4p62O91
4010A25k93J61O13j209K68K86l51J025j341P9R29o58N37Q1q07P52l50m11R36m35
$$ plain form
4030 -63 -186 -120 -840 109 418 -279 130 -494 -166 243 -70 161 53 -408 76 -103 261 454 -386 -586 85
4051 85 -227 421 39 -354 -81 -376 36 329 -128 -39 -296 -407 643 71 -77 206 -552 141 217 -165 191
4072 191 -217 -228 208 -35 112 182 -457 -84 134 -2 430 64 -323 -138 -259 217 -185 -272 47 -303 176
4093 176 201 -149 -270 -327 -238 454 -118 8 13 -305 -44 308 39 118 -189 -497 189 164 303 162 -341 -66
4115 -66 -104 24 288 19 -368 203 351 432 223 -258 112 -24 323 612 262 92 -108 -11 509 234 171 135
4137 135 -209 103 391 317 412 -104 -209 272 319 369 211 -156 262 118 48 201 215 -68 -131 3 5 332 -203
4160 -203 -99 20 -308 193 172 -87 -143 -357 159 200 -32 89 -466 -239 277 251 -107 -391 -228 -217 -36 129
4182 129 6 -540 -372 -27 309 236 -269 -285 -238 -12 330 -5 -373 -469 -126 -60 397 143 -301 -282 -379 246
$$ packed form
4030f3j23O6p20R49L09o97M09o24L28M09l13K31j08m61M84j79L64J93q40k00O71
4051H5l12O48l82l93K73k95M12K93m57Q9k57j11J050n72j48K83p58O93P6l82L56
4072A91m08j1M36k43J47P0o39L73K18j36M32l66l87J85j21M76m02q7L19l50M79
4093A76K5l50j21n7Q9O92n72J26Nl18K61L52k69P9l07l08O86k5J39j41n03K75
4115f6l8J28K64k69l87N71J48Q1k09m81L70j36L47K89l50j70k00R7N20k75o3l6
4137A35l44L12K88p4R5n16j05M81M7N0j58l67M18j44p0J53J4k83o3J34KL27n35
4160b03J04J19l28N01k1k59n6k14N16M1k32J21n55K27N16k6l58k84J63J1J81J65
4182A29j23n46J68L45L36p3n05j6M7K26L42l35l68r6L43O6M57k54m44J9r7O25
$$ plain form
4204 246 186 107 -135 -686 -367 82 -5 146 -493 -280 -213 -150 220 56 -234 -26 81 -79 -3 -116 -330 -315
4226 -315 -146 111 282 -156 47 -270 53 309 -92 -164 -179 -330 349 425 -72 171 -165 -313 603 -98 188
4247 188 65 -273 200 204 351 344 -60 -28 138 -97 446 258 -228 260 -101 405 566 83 160 275 387 650
4269 650 -144 86 277 109 77 519 -298 117 -267 32 765 -33 304 321 -389 503 3 77 364 -236 -285
4290 -285 -47 78 412 -469 -489 340 -126 179 652 -546 -673 244 -773 251 -178 -438 295 -945 421
4309 421 664 -389 558 -501 -54 -85 112 -205 -117 -1168 439 -429 -630 175 -613 352 -204 -868 -274
4328 -274 -717 561 -197 -1010 696 404 379 23 -672 -713 835 -502 -371 146 -586 28 349 -535 118
4347 118 -225 -156 245 64 348 316 -647 277 390 314 661 -174 -216 417 -22 506 203 -527 367 135 148 802
$$ packed form
4204B46o0p9k42n51L19M49q7J51o39K13O7O3L70j64k90K08J07j60P6j13k14J5
4226c15J69K57J71m38K03l17L23K56m01p2j5j51O79P6m97K43l36j48R16p01K86
4247A88j23l38M73MJ47pm04L2J66k35N43j88m86M88l61N06J61m83P7J15J12K63
4269F50p94K30J91j68l2M42q17M15l84K99P33p98L37J7p10Q92n00P4K87o00m9
4290b85K38J25L34q81k0Q29m66L05M73j198j27R17j017J024m29k60P33j240J366
4309D21K43j053R47j059M47l1J97l17Q8j051J607q68k01Q05p88R65n56o64N94
4328b74m43J278p58q13J706k92k5l56o95m1J548j337J31N17p32O14L21q84O53
4347A18l43O9M01j81K84l2r63R24J13p6L47q35m2O33m39N28l03p30Q94k32J3O54
$$ plain form
4369 802 -260 22 195 -21 773 26 131 519 -246 315 449 -273 597 -321 -301 531 57 307 272 -571
4389 -571 142 277 123 388 -203 -131 221 -68 503 249 -403 307 -156 -3 404 -280 -23 -176 -320 545
4409 545 428 -139 34 -281 -63 549 -357 149 -165 -334 163 -234 -160 409 -488 -144 -14 -72 514 -328 -718
4430 -718 242 -20 273 -242 -337 169 -305 -211 636 -25 -30 -234 -695 539 -5 -483 -98 -484 -89 273 -715
4451 -715 48 -158 -466 302 -459 -175 531 -702 -41 32 -135 349 -254 -856 461 -605 132 94 -608 215
4471 215 -637 -318 422 182 -179 -551 -585 574 228 -342 432 162 310 197 -557 576 115 -312 -364 342
4491 342 756 435 -351 -35 363 8 506 -224 0 256 153 467 400 -172 263 -52 344 458 30 212
4511 212 305 -166 166 175 -150 202 -209 224 283 -8 -7 17 -211 190 204 14 352 -224 226 110 -93 463 75
$$ packed form
4369H02j062K82J73k16P94p47J05L88p65N61J34p22Q70r18K0Q32m74K50l5q43
4389e71P13J35j54K65n91P2L52k89N71k54o52P10m63J53M07o84K57j53j44Q65
4409E45j17n67J73l15K18O12r06N06l14j69M97l97P4N69q97L44J30n8N86q42l90
4430g18R60k62K93n15r5N06m74R4Q47o61nk04m61J234n44m78L85l86L95L62r88
4451g15P63k06l08P68p61K84P06j233O61P3j67M84o03o02J317j066P37l8p02Q23
4471B15q52L19P40k40l61l72l4J159l46n70P74k70J48j13p54J133m61m27n2P06
4491C42M14l21p86L16L98l55M98p30K24K56j03L14o7n72M35l15L96J14m28J82
4511B12R3m71L32Rl25L52m11M33N9k91JK4k28M01J4j90L38n76M50j16k03N56l88
$$ plain form
4534 75 -234 -97 -117 161 268 -94 -128 173 205 365 -8 -94 68 -140 70 310 -14 220 -152 -123 433 48
4556 48 127 -79 -203 30 118 -23 168 -415 -153 -20 265 250 111 -300 82 -17 112 174 71 -70 -1 -244
4578 -244 83 -70 -203 98 -45 350 137 -246 -12 -197 -53 124 5 -46 -127 -312 -19 13 257 128 -496
4599 -496 -110 114 257 165 -346 -411 93 -224 62 -23 -120 -178 -423 -69 176 113 -235 -122 -354 -24 65 138 -374
4622 -374 -360 -287 153 144 -119 -82 -155 -210 -78 12 219 -155 -86 64 95 369 212 -247 126 37 293 293 -39 90
4646 90 257 5 298 49 68 -238 103 264 351 159 167 9 -79 355 346 108 26 47 153 225 137 245 188 119 126
4671 126 -14 409 322 -132 -31 -74 475 167 -32 -220 45 -22 242 291 -75 -14 -47 72 88 84 112 -18 -371
4694 -371 354 -4 48 -54 -345 -143 -173 -108 245 -305 -337 35 -188 126 175 -178 -1 -218 -35 105 -73 -140
$$ packed form
4534G5l09J37k0K78J07l62l4L01L2J60l73q6J62k08K10K40l24K34l72K9N56l85
4556D8P9k06j24K33Q8j41J91n83K62J33K85j5j39m11L82r9J29O2j03j41O9k43
4578b44L27j53j33L01j43L95k13l83K34j85J44J77j19n1q1j85K93L2K44j29o24
4599d96L86K24J43r2n11o5N04l17K86q5r7n8k45L54K45o3l48J13k32L30Q9P3n12
4622c74J4P3M40rk63L7p3n5J32R0K07l74O9J50L1K74j57m59L73q9K56%l32J29
4646I0J67k52K93k49J9l06L41J61Q7j92Qj58q8M34rk38q2K1J06P2q8J08n7o9P
4671A26j40M23q7m54J01m3N49l08j99j88K65o7K64M9l66O1l3J19J6mK8j30l53
4694c71P25l58N2j02k91K02l0O5L53n50l2L72k23L14M9l53J77k17J83J40j78o7
$$ plain form
4716 -140 -204 -336 274 -22 -21 -71 -284 -165 130 127 -326 -111 -428 230 96 61 -31 -334 81 13 -53 209 -335
4739 -335 -350 115 -99 144 -31 -382 -170 131 89 222 -207 112 -67 -299 134 55 -214 134 -218 -144 492
4760 492 107 -111 -55 -247 57 -192 37 -6 -212 84 234 -102 213 -44 -86 100 -161 285 266 -578 57
4781 57 -125 -143 748 -348 78 328 32 460 356 -137 211 -74 -152 463 -56 26 166 -238 493 217 -95
4802 -95 521 -318 109 225 92 120 65 -125 257 -159 245 341 -386 253 -67 -185 598 160 -5 226 -274
4823 -274 228 228 -360 -35 -278 -297 165 -129 51 -205 -463 213 -5 -218 -56 -315 -123 -52 -431 15 -230
4844 -230 -290 253 -380 97 192 -426 -282 -265 -449 448 -251 -207 -88 -566 18 135 -429 53 -570 -278 44
4865 44 -298 -122 -7 -662 126 42 -314 292 -278 -86 573 -276 160 -20 -336 194 -102 -92 450 -204 88
$$ packed form
4716a40o4j32O10k96Jn0k13J19K95lm53K15l17O58j34l5r2l03M15o8o6K62n44
4739c35j5M65k14K43j75l51K12L01m2J33m29L19j79k32M33p9k69L48l52P4O36
4760D92l85k18N6j92L04k49K29m3k06K96J50l36L15k57m2J86k61M46j9q44O35
4781E7j82j8Q91j096M26K50k96M28j04m93L48k85p8O15n19Q2J40m04P31k76l12
4802i5O16q39M27J16j33K8n5j90L82m16M04R6p27O39l20j18P83m38j65K31n00
4823b74N02%n88L25k43j9M62k94J80k56k58O76k18k13J62k59J92P1l79M46k45
4844b30o0N43o33M77R5o18J44J7j84Q97o99M4J19m78N84J17n64M82o23K92L22
4865D4l42J76J15o55P88q4l56O06n70J92O59q49M36j80l16N30k96J0N42o54K92
$$ plain form
4886 88 137 -185 672 63 -216 -19 -154 -105 430 -221 273 -168 -66 354 15 286 111 -108 282 127 -14
4907 -14 554 -392 -74 407 -36 366 68 -267 224 160 -144 462 -280 -131 -68 -400 153 17 -13 221 -161
4928 -161 319 455 63 245 105 -58 243 110 183 81 -529 15 131 -87 135 -309 -450 441 -27 355
4948 355 45 -376 42 19 0 145 -194 -309 281 -493 128 -100 -415 45 -406 155 82 -204 57 -216 -502
4969 -502 237 -66 -256 -30 -455 -337 218 -400 151 -72 -235 223 -76 -112 -154 -326 -130 4 34 364 5
4990 5 -53 -68 -232 60 175 -110 -28 -95 88 84 22 14 -108 -114 353 -38 10 152 -94 28 316 8 76 -136 -101
5015 -101 136 101 279 236 -307 5 203 100 355 -1 -189 74 -23 28 211 71 59 315 -2 464 -96 187
5037 187 47 -227 353 434 33 113 -23 65 215 302 255 1 -222 -50 106 -58 306 -87 -212 44 74 442
$$ packed form
4886H8M9l22Q57o09k79J97j35M9N35o51M94m41J02M20l39K71j75k19L90j55j41
4907a4N68r46L18M81m43M02k98l35M91o4l04O06p42J49O3l32N53j36l0K34l82
4928a61M80J36l92J82j40j63L01j33P3j02o10N44J16k18K22m44j41Q91m68L82
4948C55l10m21M18k3j9J45l39j15N90p74O21k28l15M60m51N61p3k86K61k73k86
4969e02P39l03j90K26m25J18N55o18N51k23j63M58k99l6m2j72J96J34L0L30l59
4990En8j5j64K92J15k85Q2o7J83mo2qj22oM67l91M8J42k46J22K88l08O8k12L5
5015a01K37l5J78m3n43L12J98j03K55l56j88K63r7N1J83j40j2K56l17M66n60K83
5037A87j40k74N80Q1m01Q0j36Q8J50Q7m7k54k23J72J56j64L64l93j25K56L0L68
$$ plain form
5059 442 24 -97 24 -29 163 48 -137 23 139 -92 233 -251 -125 -305 -194 -140 123 -15 -136 -298 -224
5080 -224 49 -94 -164 -266 -362 -177 -72 -10 57 -323 33 -169 104 65 -196 -7 -19 -210 -73 84 20 -12 -60
5103 -60 327 121 -309 -96 -107 -343 320 58 -13 267 -217 -216 369 -10 -150 -396 -96 49 137 8 221 -67
5125 -67 -239 48 -149 211 83 -52 -102 149 181 36 -147 -113 58 31 114 132 -51 -79 -204 202 360 -219 152
5148 152 -260 0 -10 253 -107 5 -207 328 -54 369 -86 -433 -14 -69 -110 110 49 37 67 361 325 -2
5170 -2 260 165 -111 200 221 123 299 -115 113 178 238 168 178 -92 -57 86 -105 81 133 -358 45 -82 -87 264
5194 264 -227 -40 176 145 237 -60 -451 66 -267 -243 -77 -51 -306 -261 -241 -164 -172 -8 -90 -26 -1 -137 -78 122
5218 122 -184 -356 274 -615 -13 -53 -219 -335 -295 -767 549 -651 -363 171 -421 -72 266 -473 -597 -321
$$ packed form
5059D42m18j21J21n3J92j15j85J60J16k31L25m84J26j80J11N4K63j38j21j62P4
5080b24K73j43p0j02r6J85J05O2O7l80L56k02K73l9k61J89j2j91J37J57o4l2m8
5103f0L87k06m30K13j1k36O63k62p1K80m84JN85l79j40k46L00J45Q8j29K13k88
5125f7j72K87j97L60j28j35n0K51L2j45j83L4J71k7Q3J8j83k8j25M06J58n79L71
5148A52m12K60j0K63l60J12k12N35l82M23m55l47M19n5m1K20o1j2L0K94l6l27
5170bK62r5k76L11K1r8J76m14K28O5O0p0J0k70L5J43j91J86N2m91M03j27nL51
5194B64m91J87K16l1R2k97l91N17l33K4J66K6k55M5K0P7qJ64q2O4K5j36N9K00
5218A22l06j72O30q89O02m0j66j16M0m72J316j200K88N34n92L49L38p39j24K76
$$ plain form
5238 -321 -549 529 917 -204 184 -511 8 296 -399 467 -182 277 417 -20 -269 118 -346 214 -346
5257 -346 -372 47 -452 -214 -9 178 556 75 333 -31 -35 405 46 -621 48 -260 246 355 -365 124 -149
5278 -149 -36 181 -13 -262 86 -338 244 3 -118 83 -124 -356 -61 -48 -153 -43 -202 135 234 2 120
5299 120 -80 -157 44 -644 211 291 -127 -156 -283 -89 469 -18 235 -38 -298 74 267 -120 248 -122 114
5320 114 175 31 48 -193 -96 312 24 111 327 -169 -78 183 -48 511 -208 298 524 -148 618 448 -385 -3
5342 -3 -151 -175 437 -278 18 -297 605 -144 279 104 66 -280 45 431 -798 368 76 -414 44 -31 -183
5363 -183 359 -396 -45 -330 -95 447 -95 -758 -723 -923 692 537 -332 -78 -2 -137 360 -333 -442 -166
5383 -166 -373 30 -50 -202 44 -440 -240 185 -76 178 158 -526 -27 158 -419 381 -516 -280 -10 79 482
$$ packed form
5238c21k28J078L88j121L88o95N19K88o95Q66o49M59J40m37k49L87m64N60n60
5257c46k6M19m99K38K05J87L78m81K58l64mM40l59o67O69l08N06J09p20M89k73
5278a49J13K17j94k49L48m24N82k41j21K01k07k32K95J3j05J10j59L37R9k32J18
5299A20k00p7K01o88Q55Q0m18k9j27J94N58m87K53k73k60L72J93l87L68l70K36
5320A14O1j44J7k41R7M08k88Q7K16m96R1K61k31N59p19N06K26o72P66j70q33L82
5342cj48k4O12p15K96l15R02p49M23j75l8l46L25L86j229J166k92m90M58p5j52
5363a83N42p55L51k85K35N42n42o63L5k00J615j55q69K54P6j35M97o93j09K76
5383a66k07M03q0j52K46m84K00M25k61K54k0o84M99J85n77Q00q97K36K70Q9M03
$$ plain form
5404 482 -126 -246 -28 -181 -148 148 -34 39 -44 -172 341 -61 -294 68 -268 172 175 -106 355 -282 -258 156
5426 156 -150 68 -26 -38 5 -26 -82 89 -453 284 -18 -6 90 44 -421 -246 -402 40 240 -314 -51 -78 -298
5449 -298 409 61 -36 64 -242 109 59 -234 169 -58 -186 48 163 -75 137 -82 243 8 77 12 -117
5470 -117 -103 58 59 63 -17 -158 145 130 -155 184 69 -10 16 51 180 8 -99 339 -206 201 327 -129 65
5493 65 -88 -171 187 -79 39 446 -204 -72 159 -104 17 285 -174 432 220 537 -45 -226 -114 -272 -36
5514 -36 72 -269 51 150 -78 -69 -226 28 -185 -90 -96 11 -170 -226 13 -112 -98 -151 153 199 -555 129 196 116
5538 116 -18 -625 -250 135 147 611 620 247 -383 41 104 781 219 76 -202 225 270 207 26 -73 -7 145 96
5561 96 255 215 167 -62 224 156 -85 189 -96 52 -25 98 233 -76 112 -119 70 143 -64 64 -245 -180
$$ packed form
5404D82o08j20K18j53L3K96j82P3q3j28N13m02k33L62l36M40Lk81M61o37K4M14
5426A56l06K18r4j2M3l1n6J71n42P37l02J2R6m6m65J75j56M42K00n54K63k7k20
5449b98P07l48r7J00l06L51n0k93M03k27j28K34J15k38K12k19L25k35O9o5j29
5470a17J4J61JMq0j41L03j5k85L39j15p9K6L5J29j72j07M38n45M07J26m56J94
5493F5j53q3L58k66J18M07o50J32K31k63J21K68m59O06k12L17n82j81J12j58K36
5514c6J08l41L20R9k28Rj57K54k13R5oJ07j81n6K39j25J4n3L04M6p54O84O7q0
5538A16j34o07L75L85J2M64Rl73o30M24O3O77n62j43k78M27M5o3j81r9O6J52m9
5561I6J59m0m8k29K86o8k41K74k85J48p7J23J35l09J88k31J89P3k07J28l09O5
$$ plain form
5583 -180 -112 30 -81 25 -266 -222 -50 108 20 -116 -18 13 50 -114 27 -311 41 -273 139 -78 -11 -259
5605 -259 -328 87 -100 267 81 7 -50 -64 244 -185 -163 -164 40 44 -92 -102 -301 -219 -184 -50 -71 -74 -106 -103 -134 145
5631 145 98 -55 53 52 -89 11 77 -113 -241 -2 114 -9 253 -34 66 -102 -71 302 -39 -129 -238 155
5653 155 50 205 -165 -53 270 73 3 322 154 110 37 18 53 38 189 -181 170 30 54 -168 -103 -91 -59
5676 -59 -35 75 -27 26 -287 94 72 -134 339 9 205 -276 -28 297 199 -24 215 -252 90 189 182 -147 -169
5699 -169 -74 -91 131 150 10 -26 86 -101 55 204 -62 -156 -13 -97 205 -196 -236 138 -164 148 -11 -266
5721 -266 94 -99 -144 194 18 -82 123 -103 -44 -10 1 81 -341 -323 38 -1 -90 55 -243 34 44 -80 -16
5744 -16 -315 -95 -16 -202 126 -2 -212 68 -268 -37 166 6 -127 73 -367 18 -30 65 158 -253 -68 88
$$ packed form
5583a80O8J42j11J06k91M4J72J58q8j36R8L1L7j64J41l38L52l14M12k17O7k48
5605b59o9M15j87L67j86p4n7j4L08m29K2jK04Mj36j0j99Q2L5J34k1ll2Ll1K79
5631A45m7j53J08jj41J00O6j90j28K39J16j23K62k87J00j68L1L73l41r0j09L93
5653A55j05J55l70J12L23j97p0L19j68m4p3j9L5j5J51l70L51j40K4k22O5J2L2
5676e9K4J10j02N3l13L81k2k06M73l30J96m81K48L25r8k23K39m67L42R9pl29k2
5699a69R5j7K22J9j40l6J12j87J56J49k66r4J43q4L02m01m0L74l02L12j59k55
5721b66L60j93m5L38j76j00K05k26N9L4J1Q0m22J8L61l9q9J45k98K77J0j24O4
5744a6k99K20P9j86L28j28k10K80l36K31K03j60j33K00m40L85m8R5R3m11J85J56
$$ plain form
5766 88 -57 62 11 -470 -61 -164 -306 -12 -367 44 21 -135 54 167 49 215 17 113 92 -132 14 68
5788 68 -29 496 -108 65 -130 -157 137 23 187 0 -119 13 269 -240 169 -151 -78 393 -34 98 289
5809 289 -210 -81 -125 -41 413 -54 -87 117 -220 247 43 14 202 30 -238 149 -158 -41 151 156 179 90 -183
5832 -183 50 -150 -4 330 -53 87 -41 -128 59 204 366 465 -358 191 32 34 136 64 -224 90 57 200
5854 200 235 42 436 28 226 288 -194 -66 5 -111 233 59 -87 -55 -74 -26 70 86 37 2 -279 -55 1 -57
5878 -57 123 -104 21 -53 -348 85 -232 -169 -89 -305 90 30 -318 -206 -229 5 416 -44 -39 -151 -398 439 346
5901 346 -194 -135 10 556 -250 -142 226 -8 -275 -372 60 219 289 -235 91 114 191 414 -331 -197 195 82
5923 82 35 142 -77 75 160 -84 45 23 169 215 4 154 150 -14 451 -72 -70 253 98 210 3 -224 96
$$ packed form
5766H8j45J19n1m81M09j03j42K94l55M11k3j56J89J13j18J66j98R6k1k24J46N4
5788F8r7N25o04J73j95k7K94j14J64j87j19J32K56n09M09l20P3M71m27J32J91
5809B89m99J29m4Q4M54m67l3K04l37M67k04k9J88j72k68L87l07J17J92NK3q9k73
5832a83K33k00J46L34l83J40j28q7J87J45J62R9q23N49j59KJ02p2k88L14l3J43
5854B00L5j93L94m08J98O2m82J28P1j16L44j74j46L2j9M8R6J6m9l5k81K24N6n8
5878e7J80k27J25p4k95M33l17O3Q0k16L95o0l48J12k3K34M11m60Nj12k47Q37r3
5901C46n40N9J45N46q06J08L68k34k67r7M32J59P0n24L26K3P7K23p45J34L92j13
5923H2m7J07k19J52Q5k44J29k2J46M6k11J50mj64M65n23KL23j55J12k07k27L20
$$ plain form
5946 96 -165 151 -42 47 115 220 -72 101 -70 132 -31 17 -69 237 151 81 210 -23 343 157 20 -198
5968 -198 104 -55 301 -158 231 -237 -34 271 -126 94 25 -164 201 -216 -147 203 255 -98 4 -220 189
5989 189 -143 -50 18 -184 18 117 -260 -39 -99 -260 359 10 -223 -17 -458 -172 102 68 -223 -451 228 114
6011 114 -169 -394 -25 38 -237 73 95 -4 -183 -166 -172 -45 127 -142 -215 -180 -121 -257 118 25 -54 -160 -193 81
6035 81 -100 -215 -80 -261 -61 -254 -218 -115 125 -265 99 79 -50 -352 -112 -167 75 -103 -123 -201 -259 262
6057 262 -100 28 -76 -297 -99 178 239 122 116 92 322 233 168 203 -135 -61 -88 83 307 44 272 -40 -108
6080 -108 52 128 348 224 86 188 241 255 207 177 55 135 302 322 -79 -7 100 193 121 313 78 219 182 -78
6104 -78 213 -15 34 64 90 -78 124 167 -63 106 -3 302 102 115 -47 90 47 -109 -124 -48 -24 -64 73 -1
$$ packed form
5946I6k61L16j93Q9O8J05k92J73j71K02j63M8q6L06q6p0J29k33L66j86j37k18
5968a98L02j59L56m59L89m68K03L05l97K20o9j89L65m17O9L50N2l53J02k24M09
5989A89l32R3O8k02K02R9l77K21o0j61O19l49k33K06m41K86K74l4k91k28O79j14
6011A14k83k25L69O3k75L10K2r9j79J7oJ27J72k69p3L5N9j36L75r3p9j06l3K74
6035H1j81j15J35j81K00j93L6J03K40l90L64k0j29l02K40n5K42j78k0p8n8N21
6057B62l62J28j04k21J98K77O1j17ok4K30q9o5L5l38P4k7J71K24k63K28l12o8
6080a08J60P6K20j24j38J02N3J4m8l0j22Q0J67K0m01P2J07R3p2J92k35J41l7k60
6104g8K91k28M9L0K6j68K02M3k30J69j09L05k00J3j62J37m3j56j5P6K4m0J37p4
$$ plain form
6128 -1 256 -139 -8 -169 -10 -147 122 -16 -206 -283 -191 47 202 -18 -120 -345 92 93 -123 87 -46 -120
6150 -120 50 -65 135 -56 209 25 -58 95 9 -205 -68 46 -96 119 149 -140 -132 18 -71 272 449 -297
6172 -297 -106 -71 31 201 -29 21 -390 78 -53 107 13 -116 3 123 -221 15 6 -244 -64 170 165 -36
6194 -36 57 -264 88 -136 122 285 -348 -185 117 124 208 -25 -49 94 -46 244 77 -69 20 -74 167 217 -65
6217 -65 338 128 -202 205 244 85 -28 -227 -18 121 -200 -5 -240 -34 5 53 -52 0 -143 61 47 -144
6239 -144 349 -64 -73 45 -53 -29 -10 -121 -44 -83 -32 410 -190 -87 123 71 -78 -101 -171 34 127 -100 175 88
6263 88 250 18 -8 79 -235 81 186 -323 16 159 -101 292 82 -244 40 -215 -270 201 -97 13 82 -145
6285 -145 190 30 108 191 -420 -101 313 2 155 -107 -74 328 -35 172 121 -80 200 -123 -2 512 8
$$ packed form
6128aK57l95J31j61J59j37K69j38j90p7R2K38J55k20j02k25M37Jk16K10j33p4
6150a20J70j15K00j91K65j84q3J53q6k14J37J14j42K15L0k89QJ50q9L43J77p46
6172b97J91L5J02J70k30N0m11M68j31J60r4j29J19J20l44K36rk50J80K34nk01
6194c6R3l21L52k24K58J63o33J63L02PQ4k33k4J43j40K90j67j46Q9r4K41N0k82
6217f5M03k10l30M07L9j59j13j99K09J39l21J95k35K06L9M8j05N2j43K04j4j91
6239a44M93m13rJ18r8K4J9j11P7l9N1M42o00J03K10n2j49k3p0K05R3k27K75q7
6263H8J62k32k6Q7l14L16J05n09L39J43k60L93k10l26K84k55n5M71k98J10O9k27
6285a45L35j60P8Q3o11L19M14l11J53k62L3M02l63K07n1k01K80l23J21N14n04
$$ plain form
6306 8 36 -155 -250 111 -137 1 14 77 -132 208 -55 -95 76 228 163 -162 134 24 -62 160 23 -105 -15
6329 -15 -259 -19 344 129 -36 111 -150 -153 -63 -131 162 9 141 -135 -295 212 8 68 121 -218 7 95 -531
6352 -531 133 -547 -537 222 206 -177 -189 -256 -155 -236 -217 39 271 -185 156 -834 65 -25 -600 610 149 -293
6374 -293 -274 190 -128 -171 505 -20 -147 211 287 -290 -144 143 54 91 -122 -109 286 -183 -35 -278 -166 369
6396 369 116 122 22 -59 -129 -170 -83 94 -31 -48 -173 222 147 -41 -218 125 -208 -460 190 542 318 322 -224
6419 -224 -246 339 -355 356 220 -468 360 -184 -570 -347 -997 11 173 228 128 280 -394 281 72 103 124
6440 124 225 48 181 3 201 -142 -66 70 23 304 225 62 45 -193 150 -133 -23 -149 240 -158 147
6461 147 34 -33 19 124 395 48 263 -62 -15 -60 -45 106 95 -81 -91 -41 -138 -38 76 -179 -95 34 -199
$$ packed form
6306HK8j91r5L61k48J38J3O3k09L40k63m0J71J52o5l25K96j10q6K22j37j28R0
6329a5k44K40L63k15j65J47k61lR0o8K93j53J32k76j60N07k04O0N3l39K25Q8o26
6352e31O64o80J0P59j6l83j2o7J01q1J9K56K32m56L41r90Q99r0n75J210m61m42
6374b93J9M64l18m3O76n25j27L58P6n77J46K87q9L7k13J3L95m69J48k43J12N35
6396C69k53Oj00q1p0m1Q7J77j25j7j25L95p5j88j77L43l33k52O50L52k24Mn46
6419b24k2N85o94P11j36o88Q28n44l86K23o50J008J62N5j00J52o74O75k09L1K1
6440A24J01j77J33j78J98l43P6J36m7K81p9j63j7k38L43k83J10j26L89l98L05
6461A47j13o7N2J05K71l47K15l25M7m5J5J51j1j76j0N0r7J00J14k55Q4J29k33
$$ plain form
6484 -199 -172 34 -172 -13 -118 -32 66 -275 -225 -146 -35 -239 74 45 -18 -6 -113 -29 -49 207 22 -89 120
6507 120 -3 111 22 25 -8 8 -3 -67 -96 -181 28 63 -55 104 109 -335 226 41 -55 113 24 72 -341 132 204
6532 204 238 149 44 170 -39 51 164 -34 5 64 78 134 104 -165 28 -88 2 147 -126 -40 43 160 33 -155
6556 -155 -161 240 -69 -16 -57 117 26 -369 5 47 60 -87 -17 -172 -87 118 84 235 -318 85 96 189 36 -102
6580 -102 1 16 4 6 83 91 -9 -290 -135 56 241 105 -103 199 -127 127 66 182 -170 15 38 -28 112
6603 112 -166 -264 176 119 98 266 -21 -11 -9 104 48 -14 -96 -126 25 -195 229 -134 -20 -254 140 -124 -39 156
6627 156 55 -14 -194 -4 87 91 -229 74 -169 87 -41 201 -12 66 182 -4 -39 82 94 -18 -125 -35 191
6650 191 -424 -34 212 410 -286 195 208 -450 -548 240 -289 -182 -369 562 -275 -617 -62 -411 131 -145 133
$$ packed form
6484a99K7K06k06J59j05Q6R8l41N0P9J11k04L13k9o3J2j07Q4k0K56j85j11K09
6507A20j23J14q9Ll3J6j1o4k9q5K09L5j18J59Nm44N61j85r6J68q9M8m13M73P2
6532B04L4q9j05J26k09R0J13j98L9N9J4N6l0k69J93j16R0J45k73Q6Q3J17j27j88
6556a55oM01l09N3m1J74r1l95L74M2J3j47P0j55Q5K05l4J51n53M03J1R3j53j38
6580a02J03J5j2KP7Qj00k81J55J91J85j36k08L02l26K54o1J16l52J85K3o6J40
6603A12k78r8M40n7k1J68k87J0KJ13n6o2q2l0J51k20M24l63J14k34L94k64Q5J95
6627A56j01o9j80J90R1Ml20L03k43K56j28K42k13P8J16j86l5J21J2j12j07R0K26
6650A91o15L90K46J98o96M81J3o58r8P88n29J07j87R31q37l42N55l49N42k76K78
$$ plain form
6671 133 73 203 158 -3 -163 200 -104 126 67 24 66 49 230 -64 -30 -43 -8 -119 244 -191 112 48 -16 39
6695 39 -46 41 122 -8 -312 -36 132 -32 204 1 49 -26 17 50 -125 -96 -16 -151 -53 -11 -123 -145 -110 -15 37
6720 37 -75 -113 -63 -133 -8 -77 -399 90 -164 -61 18 -113 -76 -81 -113 121 25 148 59 -328 -135 91 11 296
6744 296 78 -123 104 123 -47 155 -37 -16 -36 -142 358 -69 113 198 -23 -39 100 -36 -71 157 -158 -64
6766 -64 -71 171 196 -231 23 44 -54 -247 -163 -17 -18 142 4 -162 -364 -175 -24 28 -7 -52 88 -79 98 -37
6790 -37 122 -51 204 -21 140 11 -189 120 -101 -50 -139 -94 32 -6 -144 367 160 -116 66 -168 -117 52
6812 52 -200 49 54 -133 195 141 -214 240 43 -337 43 0 80 181 -160 -156 31 -143 105 -19 35 -175 102
6835 102 213 -207 41 31 -250 26 208 105 -164 -39 31 170 -45 -75 175 -132 80 -152 -69 167 21
$$ packed form
6671A33o0J30m5j61j60L63l04K30n9m3M2j7J81k94L4j3L5j11L63m35L03o4o4N5
6695C9q5Q7Q1j30l04K76J68j64K36k03M8p5M3L3j75K9Q0j35R8M2j12k2L5R5N2
6720C7j12l8N0p0J25o9l22M89k54J03P9j31L7nl2K34r6J23q9l87J93K26q0K85
6744B96k18k01K27J9j70K02j92K1k0j06N00m27J82Q5k21j6J39j36l5K28l15R4
6766f4pK42K5m27K54K1r8j93Q4J46jJ60j38j66k02J89J51N2l5m5J40j67J77j35
6790c7J59j73K55k25J61j29k00L09k21N1q9M5J26l8j38N11k07k76J82k34N1J69
6812E2k52K49Nj87L28n4l55M54j97l80L80m3Q0J01l41MJ87j74K48j24N4k10K77
6835A02J11m20K48j0k81K76J82j03k69J25P0J39k15l0K50l07K12k32Q3K36j46
$$ plain form
6856 21 -31 111 -152 142 53 -175 103 -255 70 86 101 -107 42 -188 173 -109 106 223 -421 -221 -44 201
6878 201 79 -151 2 265 -118 89 164 181 -48 19 -76 82 -63 -329 105 -229 -4 40 -10 37 21 159 149
6901 149 -89 20 -34 -178 -26 -188 44 45 -148 -77 437 40 11 -159 -156 72 58 101 5 -139 3 100 -1 101
6925 101 -194 -166 24 35 -83 -43 -108 -15 65 143 99 -20 85 22 8 -16 -82 202 160 -48 20 -29 117 -60 132
6950 132 -45 -98 -48 -153 128 -9 -59 -65 139 164 -126 -72 13 71 213 -2 36 184 133 89 150 262 12 162
6974 162 -205 270 12 183 77 77 261 256 87 128 -87 -119 80 245 49 261 -148 50 -52 102 44 92 -117
6997 -117 -11 -75 -238 6 -183 -12 -153 33 93 -40 -268 -114 -165 64 104 34 -243 -12 159 -33 78 11
7019 11 -190 -113 14 -100 30 -147 -232 79 -93 143 91 -230 -53 -91 -116 42 -47 -51 54 -234 -13 -133 -7
$$ packed form
6856B1n2J42k63K94q9k28K78l58L25J6J5k08J49k30L61k82K15J17o44K00J77K45
6878B01j22k30J53K63l83K07P5J7k29O7r5J58j45k66M34l34K25M4n0M7j6J38j0
6901A49k38J09n4j44J52j62K32Jj93P1N14l97k9j70LK28j4M3r6j44J42R7j01J02
6925A01k95K8J90J1j18M0o5R3Q0P8m4j19J05o3j4k4o6K84m2k08O8m9J46j77J92
6950A32j77n3N0j05K81j37n0oK04K5k90N4Q5N8J42k15L8J48n1m4O1J12k50J50
6974A62l67M75k58J71j06%J84nj69M1k15l2J99J65j96K12m09J98j02J54n8M8k09
6997a17J06o4j63K44j89J71j41J86O0j33k28J54n1K29M0p0k77K31J71j92J11o7
7019A1k01P7J27j14J30j77q5L11j72K36n2l21J77l8k5J58q9mJ05k88K21j20J26
$$ plain form
7042 -7 -154 116 -179 156 -299 -280 127 30 -76 -11 239 46 10 -175 -44 -20 45 61 -94 -124 -106 -154 66 -66
7066 -66 15 -5 -91 178 -55 27 -28 -58 259 27 22 67 -219 -88 -28 66 185 -38 102 277 -39 211 59 183
7090 183 -31 70 223 -200 -1 -54 30 41 -108 -5 -135 -181 -115 88 165 285 289 -8 1 -71 102 -16 -88 140
7114 140 -154 129 184 -136 -118 -77 -151 -337 133 217 -119 -38 116 -17 -46 -118 -12 80 37 282 47 158 -1
7137 -1 -72 -220 -3 95 -52 52 -38 -175 -94 -5 -169 -81 -104 -318 76 -66 -21 18 -79 92 -23 16 -255 -205 154
7162 154 98 301 -77 -189 15 -65 38 -152 -172 -297 -223 178 -491 558 -810 -1121 727 -144 -32 306
7182 306 245 102 -139 -51 -53 -137 128 -227 -154 52 162 -95 -164 -183 112 92 -183 151 -238 97 -22 134 -138
7205 -138 188 -168 8 130 295 328 -620 -302 160 -36 412 677 -100 -555 -728 -34 137 98 -119 -121 25
$$ packed form
7042gj47K70k95L35m55J9M07r7j06O5K50j93l6j85J31K4O5J6j55l0J8m8K20j32
7066f6Q1k0q6K69k33Q2n5l0L17k32nM5k86J31O0R4J19k23J40J75l16K50j52J24
7090A83k14J01J53m23J99n3Q4J1j49J03j30m6O6K03P7J20Mk97Rp2J73j18p2K28
7114A40k94K83N5l20J8M1p4j86M70Q4l36Q1J54j33k9p2J06R2m3K45k35J11j59
7137ap1j48K17R8j47J04r0j37Q1Q9j64Q8k3k14L94j42M5L9r7J71j15L9k71N0L59
7162A54n6K03l78j12K04q0J03j90k0j25P4M01o69J049j368l11J848q71J12L38
7182C06o1j43k41Q8kq4K65l55P3K06J10k57o9j9K95k0k75L34l89L35j19J56k72
7205a38L26l56J76J22J65L3r48L18M62j96M48K65p77m55j73O94J71l9k17kJ46
$$ plain form
7226 25 252 -131 69 291 -333 -49 -140 -194 170 59 8 68 -39 -89 -142 -49 -85 21 218 51 -149 171 267
7249 267 -152 -24 279 -143 155 -90 -196 38 -86 -60 -153 -229 167 -24 209 23 -214 102 39 -18 362 -229
7271 -229 77 56 -91 209 29 44 -214 -24 -71 -88 58 -136 132 -156 181 -120 -233 12 -408 48 4 -79
7293 -79 -85 24 100 -83 -98 -21 -81 -166 12 16 -229 46 -104 130 81 -383 -35 193 -41 84 -5 107 153 -71
7317 -71 -27 -44 -265 242 -85 -225 -22 183 -19 -22 -154 23 119 -93 162 -88 -31 84 -164 -10 38 -51 246
7340 246 -65 81 -81 -46 156 -81 37 -55 196 -3 -147 79 -183 202 -29 -18 87 -58 -1 -82 78 324
7362 324 -188 -85 16 66 -134 -125 122 -200 28 -217 -16 -162 123 -113 -19 93 170 -64 106 45 -38 -22 -91
7385 -91 213 164 136 12 -82 58 57 -121 30 -175 -184 249 39 47 -23 -67 -63 90 -7 -113 30 -281 -15 94 59
$$ packed form
7226B5K27l83K00K22o24K84r1n4L64j11n1O0j07n0n3R3l6J06J97j67k00L20R6
7249B67m19J28L03m22K98k45j06K34j24K6r3p6L96j91K33j86k37L16o3n7L80n91
7271b29L06k1j47L00j80J5k58J90m7j7J46j94K68k88L37l01j13K45m20M56m4q3
7293g9oJ09P6j83j5P7o0q5J78Mk45K75j50K34m9m64L48K28k34J25q9J12M6k24
7317g1M4j7k21N07l27j40K03K05k02lj32J77R6k12K55k50N7J15k48J54M8q9K97
7340B46l11J46j62L5K02k37J18r2K51j99j44K26k62L85k31J1J05j45N7q1J60K46
7362C24n12J03J01N0k00RK47l22K28k45K01j46K85k36R4J12P7k34J70o1q3J6o9
7385i1L04m9k8j24r4J40jj78J51k05rM33k10Qp0m4MJ53r7j06J43l11K66J09l5
$$ plain form
7410 59 149 -226 4 7 -178 -43 -61 33 -44 -58 299 15 -31 -101 -163 17 -72 57 159 46 -78 -27 -72 -18 -196
7435 -196 -225 32 224 -50 187 19 46 -114 -265 -53 28 -198 139 62 -94 45 -55 -328 -100 108 -78
7456 -78 85 -73 111 -104 -307 14 93 87 -100 -72 -9 -2 77 34 -37 -110 306 -263 245 -36 -61 -161 -142 215 54
7481 54 -41 -131 79 103 364 -86 -38 130 60 152 47 97 -34 -108 144 71 -6 68 -41 120 81 151 304 178 -220
7506 -220 14 179 -190 105 125 -364 -243 -182 -1 -171 -65 77 -17 -142 -131 20 236 -80 77 147 -215 122
7528 122 159 -262 56 59 -51 187 -15 92 -214 124 319 -295 -6 119 -158 -142 110 65 26 -81 -166 168
7550 168 183 -72 -29 66 -60 58 -227 -135 -103 -36 -67 -262 -52 -70 -102 -8 136 97 -234 -300 104 42 -11 87 140
7575 140 -198 -222 146 37 -68 87 -14 -221 -59 -108 120 -53 240 149 -4 176 -44 -292 181 0 241
$$ packed form
7410E9R0l75K30Lj85J35j8R4p7j4L57k84m6p0o2J80q9J29J02j13j24N1m5N4j78
7435a96k9K57J92k74K37j68K7j60j51K12Q1k26L37p7j56J39j00k73K28K08j86
7456g8J63j58J84k15k03L21P9oj87K8O3PP9m3p1p3M16n69N08k81k5j00J9L57j61
7481E4r5r0K10K4K61m50M8J68p0R2j05N0j31p4K52p3p7P4j09J61l9P0J53j26l98
7506b20K34J65l69K95K0m89J21O1J81j70J06J42r4j25J1J51K16l16J57P0l62L37
7528A22L7m21L18Lj10K38k02J07l06L38J95o14K89J25k77J6K52m5l9j07q5L34
7550A68J5k55M3R5j26J18k85R2L2O7l1j95K10j8l2R4J44l9l31o6M04o2n3R8N3
7575A40l38k4L68j09j05J55j01k07J62m9K28j73K93r1j53J80k20k48M73j81K41
$$ plain form
7596 241 153 94 293 -69 43 146 92 173 -235 -54 -20 41 -55 68 -51 127 121 94 -30 118 199 -159 46 -200
7620 -200 -64 -147 -8 -270 -17 -82 133 10 55 15 -2 -122 183 41 7 -123 165 -147 151 -195 -267 133
7642 133 -33 -44 -9 67 -225 2 -139 176 105 -135 26 -37 -34 46 62 -198 -25 106 -159 36 61 -155 -124 -204
7666 -204 83 -113 -61 25 -296 -110 -86 20 -161 -341 35 5 -135 13 -109 -176 -156 -177 -188 -135 129 -35 -47
7689 -47 -255 44 36 -141 50 -47 259 42 123 -198 -195 94 232 -101 84 -395 -75 64 13 88 91 17 -216 -235
7713 -235 133 54 12 18 -100 117 -11 147 -223 -68 56 203 42 -122 -13 105 -143 109 111 143 49 -97 268
7736 268 165 90 82 -110 -173 123 225 119 61 -97 -212 70 96 115 -173 138 18 135 64 98 -8 -112 -22
7759 -22 -47 5 -148 -19 207 -51 -41 15 266 293 -20 -67 -61 492 111 -162 -162 163 -5 109 97 -57 119 -184
$$ packed form
7596B41q8n9J99l62J12J03n4Q1m08J81L4O1r6J23j19J78ok7j24J48Q1l58K05k46
7620b00J36q3J39k62K53o5K15j23M5m0j7j20L05j42l4j30K88l12K98l46p2M00
7642A33j66j1L5P6k92K27j41L15p1k40J61o3LQ0J6k60J73J31k65J95K5k16L1q0
7666b04K87j96N2Q6l21J86K4J06j81j80L76l0j40J48j22o7K0k1j1N3K64j64j2
7689d7k08K99qj77J91r7L06k17Q1l21LK89J38l33J85m79L20J39n1P5Lp4k33j9
7713b35L68p9m2Oj18K17j28J58l70J55J24J47j61j64J09J18k48K52KL2r4j46L65
7736B68j03p5qj92o3K96J02j06n8j58j15K82K6J9k88L11j20J17p1L4j06j04R0
7759b2k5N2j53J29K26k58J0N6K51K7l13m7ON53l81k73%L25j68J14j2j54J76l03
$$ plain form
7783 -184 178 -5 123 -156 10 -149 -20 -98 -89 -86 -54 223 -173 -27 -10 -72 -91 74 250 -31 -232 -25 8
7806 8 96 94 -95 116 -70 43 215 -171 -75 -19 -46 40 101 -16 212 1 -96 -153 -179 -1 -251 212 19 18 -9
7831 -9 -261 -154 184 -34 8 -65 -128 -203 -131 52 -14 -66 52 -84 -76 -82 -214 -78 -85 -77 -174 71 -182 -363 -210 -406
7857 -406 -106 -104 183 74 -45 -33 10 88 -88 -208 -99 54 46 174 119 -48 -46 15 33 -118 102 -172 -21 -125
7881 -125 52 -67 -281 180 -178 4 243 91 37 166 80 -7 -66 60 16 160 60 232 26 138 80 202
7903 202 102 -68 237 41 2 213 27 -179 -48 -46 -130 33 44 111 183 73 169 15 -164 -139 150 53 -41 -144
7927 -144 -351 -53 64 -82 67 21 -131 125 63 -9 -10 -103 -164 -89 -64 92 260 -13 -153 73 146 -116 -61 -35
7951 -35 -178 -17 156 -202 20 -52 -3 40 166 275 -123 66 -95 -50 37 -69 -352 96 -44 96 -56 47
$$ packed form
7783a84L62j83J28k79J66j59J29p8RLL2K77l96J46J7o2j9J65J76k81k01K07L3
7806HQ8kj89K11j86J13J72l86R6N6k7Q6O1j17K28k11r7n7k6J78k50M63j93jk7
7831ik52J07L38k18M2p3o3p5P2J83o6n2J18j36Qoj32J36pQr7K45k53j81J53j96
7857d06L00KK87j09j19J2M3P8j76j20J09J53qJ28n5j67KO1J8j51K20k74J51j04
7881a25J77j19k14M61l58J82K39j52n4J29q6q7n9J26m4J44j00J72k06J12n8J22
7903B02j00j70L05j96l9K11j86k06J31Kq4J63J1O7P2j10R6j54j79K5K89r7r4j03
7927a44k07K98J17j46J49m6j52K56o2p2jr3o1P5K5J56J68k73j40K26P3k62N5K6
7951c5j43J61J73l58K22p2M9M3J26J09l98J89j61M5Q7j06k83M48j40J40j52J03
$$ plain form
7973 47 -44 -245 100 -83 -177 -90 -102 32 -27 -83 -48 -261 -334 -1096 -245 182 -74 13 -26 198 -27 305 -203 -46
7997 -46 -5 -205 639 22 -83 -541 25 -247 540 140 316 125 601 273 514 249 150 137 -170 104 60 112
8019 112 34 32 -196 -53 259 -5 278 -136 57 50 -31 44 -192 190 25 -93 211 -153 276 32 38 103 146 243
8043 243 66 -11 192 80 -181 160 23 153 88 74 -23 -7 -187 57 84 66 66 -247 -17 56 -271 118 -27
8066 -27 57 -149 187 46 125 -118 32 26 27 -104 -40 -192 -2 -58 77 -26 240 -11 65 -172 -256 -195 -234 -32
8090 -32 -37 41 5 88 257 80 -8 -20 -73 278 18 30 -315 -269 71 148 54 -126 -182 69 31 45 298 86 -36
8115 -36 -170 8 -164 50 -61 -163 221 346 -298 -247 45 -9 192 -148 -50 66 -9 -22 23 -52 -3 51 -17 -83
8139 -83 -41 -19 -110 267 -130 -106 76 146 89 -40 -212 -242 -159 -99 -66 -45 110 -270 -9 49 78 35 24 -125 -27 -41
$$ packed form
7973D7r1k01L45j83r4Q7j2J34n9n6L5k13p3p62Q51M27k56Q7l9K24k25L32n08J57
7997d6M1k00Q44o17j05m58N66k72P87m00J76j91M76l28K41k65r9j3l07K74m4N2
8019A12p8kk28J43L12k64K83m14J93pq1P5k36L82j65j18L04l64M29k44OO5M3R7
8043B43j77p7K03j12k61L41j37J30o5j4r7J6j80K44K7j8%l13K30P3l27L89j45
8066b7Q4k06L36j41P9k43J50oJj31O4j52J90n6J35j03K66k51P6k37q4O1l9K02
8090c2nP8l6Q3J69j77q8j2n3L51k60J2l45M6L40P7r4j80n6K51l8J4K53k12j22
8115c6j34J78j72K14j11j02L84J25o44N1K92n4K01l40R8J16p5j3M5p5M9N4o8o6
8139h3M2K2r1L77l97K4J82P0n7j29j72l0Q3O0L3K1J55l80K61N8K9m3j1j49R8j4
$$ plain form
8165 -41 58 -163 176 -165 62 133 36 55 161 -268 369 525 -243 48 -24 90 37 -245 -54 2 -138 -44 -251
8188 -251 27 98 43
$$ packed form
8165d1R9k21L39l41K27P1r7J9J06m29O37J56p68K91p2J14n3k82J91N6j40R4k07
8188b51K78P1n5
8191D3
$$ Imaginary data points
##PAGE= N=2
##DATA TABLE= (X++(I..I)), XYDATA
$$ plain form
0 0 0 0 0 0 0 0 -8 8 -8 8 -16 16 -24 24 -32 40 -56 64 -80 96 -112 136 -160 192 -224 260 -304 349 -402 461
30 461 -527 599 -681 770 -869 976 -1096 1227 -1371 1528 -1702 1886 -2093 2317 -2561 2829
46 2829 -3120 3439 -3789 4173 -4596 5063 -5583 6163 -6812 7546 -8381 9345 -10465 11792
60 11792 -13391 15362 -17856 21131 -25629 32220 -42818 62603 -112062 494202 725442
71 725442 -55969 371165 120255 400418 550301 43405 395640 566203 104153 317503
81 317503 259134 327399 482752 138680 235223 431393 255960 299705 165958 199524 327292
92 327292 210763 261659 108085 -20316 175732 66300 245843 328624 -49620 98791
102 98791 32368 -134990 284746 80551 -56629 165378 -198117 -46855 125485 -244226
$$ packed form
0@%%%%%%qJ6j6J6k4L2m0M8n6P2r6J20j44J76k08K48k96L52m16M84n64O53p51Q63
30D61r88J126j280J451j639J845k072K323k598K899l230L588l979M410m878N390
46B829n949O559p228P962q769R659j0646J1746j2975J4358j5927J7726j9810K2257
60A1792k5183K8753l3218L8987m6760N7849p5038J05421j74665O06264K31240
71G25442p81411M27134k50910K80163J49883n06896L52235J70563m62050K13350
81C17503n8369O8265J55353l44072R6543J96170j75433M3745j33747L3566J27768
92C27292j16529N0896j53574j28401J96048j09432J79543Q2781l78244J48411
102I8791o6423j67358M19736k04195j37180K22007l63495J51262J72340l69711
$$ plain form
112 -244226 45140 24263 -258374 46815 -117758 -164204 58125 -231788 -84682 64172
122 64172 -239055 -165621 -199614 -226441 -19533 -166150 -158084 -89765 -256450 -229384 -229247 -132455
134 -132455 -20354 -202555 -167879 -173683 -263272 -98748 -200170 -200111 -55434 -280289 -195989
145 -195989 -95708 -272184 -84222 -94820 -198382 -41112 -231860 -199260 15867 -190603
155 -190603 -121693 -30591 -136149 6161 -152727 -278040 2667 1278 -28227 -5391 -117431
166 -117431 -14058 -12796 -94375 33162 44628 38415 3194 -95834 23205 71378 49111 82037
178 82037 -18438 26826 91060 25358 105019 62763 36849 175002 75166 51146 106692 -1733
190 -1733 98404 145572 69238 173605 86666 -5663 106336 84798 145233 190904 42743
$$ packed form
112b44226K89366k0877k82637L05189j64573m6446K22329k89913J47106J48854
122F4172l03227P3434l3993k6827K06908j46617Q066O8319j66685K7066J37R6792
134a32455J12101j82201L4676n804q9589J64524j01422N9J44677k24855Q4300
145a95989J00281j76476J87962j0598j03562J57270j90748L2600K15127k06470
155a90603O8910R1102j05558J42310j58888j25313K80707j389k9505K2836j12040
166a17431J03373J262q1579J27537J1466o213l5221r9028J19039M8173k2267L2926
178H2037j00475M5264O4234o5702P9661m2256k5914J38153r9836k4020N5546j08425
190a733J00137M7168p6334J04367q6939r2329J11999k1538O0435M5671j48161
$$ plain form
201 42743 58824 81584 60197 162066 130906 63344 68844 34179 82780 106710 64039 84326
213 84326 70737 73005 80290 38826 59243 41305 16590 73913 76028 75545 24520 -71914 6835
226 6835 68870 51417 67112 -27155 -57684 17283 -8634 27104 53152 -35773 -35519 -43611 -58952
239 -58952 13210 -403 -32981 -29386 -70784 -43642 -11704 -58515 -64439 -50131 -34877 -10567
251 -10567 -44481 -91777 -93322 -61703 -31171 -30297 -38467 -69065 -101529 -81642 -57015 -26190 -4811
264 -4811 -55215 -89315 -86022 -75159 -16269 -4912 -49388 -52747 -66023 -59086 -17978 -37597 -41126
277 -41126 -11689 -26590 -26206 -21466 -39279 -21227 -11539 -14922 11531 10296 -16525 -26066 -28297 -371
291 -371 44529 40876 5917 -15263 -21703 1406 45668 56361 34518 16694 -4535 -4990 31440
$$ packed form
201D2743J6081K2760k1387J01869l1160o7562N500l4665M8601K3930m2671K0287
213H4326j3589K268P285m1464K0417j7938k4715N7323K115m83n1025r6434P8749
226F835O2035j7453J5695r4267l0529P4967k5917L5738K6048q8925K54q092j5341
239e8952P2162j3613l2578L595m1398K7142L1938m6811n924J4308J5254K4310
251a0567l3914m7296j545L1619L0532Q74q170l0598l2464J9887K4627L0825K1379
264d811n0404l4100L293J0863N8890J1357m4476l359j3276O937M1108j9619l529
277d1126K9437j4901L84M740j7813J8052R688l383K6453j235k6821r541k231K7926
291c71M4900l653l4959k1180o440K3109M4262J0693k1843j7824k1229m55L6430
$$ plain form
304 31440 52681 50904 38324 13175 15897 37132 34558 34511 36067 33683 52982 46854 15968 17480
318 17480 22619 33950 64687 56227 26178 13152 -1747 13734 53082 61474 47213 15328 -15633
331 -15633 -3393 27114 47045 48067 17664 -9195 -4730 10045 18086 18492 11030 2574 7926 11200
345 11200 -8799 -15725 -7368 -2645 19210 18626 -14233 -28398 -38333 -23248 18576 17922 381 -25262
359 -25262 -59765 -34078 109 2459 10136 -19092 -48156 -33785 -28219 -10044 1685 -21086 -26728
372 -26728 -29419 -24743 -11335 -31937 -33014 -14368 -10992 -456 -22961 -47882 -35443 -28095 754
385 754 15079 -13967 -24092 -52919 -50781 11936 16420 7043 -8507 -55900 -27766 957 -5010
398 -5010 21691 -2977 -21339 -3987 -24000 5826 21215 -17698 5992 9545 5227 26416 -17154
$$ packed form
304C1440K1241j777j2580k5149K722K1235k574m7J556k384J9299o128l0886J512
318A7480N139J1331L0737q460l0049j3026j4899J5481L9348Q392j4261l1885l0961
331a5633J2240L0507J9931J022l0403k6859M465J4775Q041M06p462q456N352L274
345A1200j9999o926Q357M723K1855n84l2859j4165r935J5085M1824o54j7541k5643
359b5262l4503K5687L4187K350P677k9228k9064J4371N566J8175J1729k2771n642
372b6728k691M676J3408k0602j077J8646L376J0536k2505k4921J2439P348K8849
385G54J4325k9046j0125k8827K138O2717M484r377j5550m7393K8134K8723n967
398e010K6701k4668j8362J7352k0013K9826J5389l8913K3690L553m318K1189m3570
$$ plain form
411 -17154 -17427 19406 17110 43443 21232 -14012 5029 -11716 18553 60867 26504 25129 -3970
424 -3970 -27839 34001 38188 40299 43797 -18013 4731 25785 11573 53976 13743 -5479 42609
437 42609 7194 18764 27727 -16181 31267 26406 6275 44987 -7531 -12920 14164 -12362 46989
450 46989 39286 -21898 2714 -27825 -9907 44944 3514 18697 -4253 -55442 7035 4498
462 4498 7678 27786 -49401 -18976 14064 -29248 9261 -19228 -29474 25826 -33765 -21840
474 -21840 8481 -44042 -3531 -21168 -32882 46313 -23843 -60867 -22415 -40301 30853 16324
486 16324 -59429 -6333 -32704 -38735 10420 -28783 19944 6403 -84664 -15543 2744 -3419
498 -3419 17667 -60715 -16533 31414 -38634 -6806 -17573 -21669 40067 -30942 -13968 34621
$$ packed form
411a7154k73L6833k296K6333k2211l5244J9041j6745L0269M2314l4363j375k9099
424c970k3869O1840M187K111L498o1810K2744K1054j4212M2403m0233j9222M8088
437D2609l5415J1570Q963m3908M7448m861k0131L8712n2518n389K7084k6526N9351
450D6989p703o1184K4612l0539J7918N4851m1430J5183k2950n1189O2477k537
462D498L180K0108p7187L0425L3040m3312L8509k8489j0246N5300n9591J1925
474b1840L0321n2523M0511j7637j1714P9195p0156l7024L8452j7886P1154j4529
486A6324p5753N3096k6371o031M9155l9203M8727j3541r1067O9121J8287o163
498c419K1086p8382M4182M7947p0048L1828j0767m096O1736p1009J6974M8589
$$ plain form
510 34621 -40069 -8372 -4013 -11674 66547 -6287 -39190 9522 -26612 37063 43900 -20991 30091
523 30091 -14180 -23479 54424 6325 25320 31089 -33570 33389 22355 -5163 47894 -7641
535 -7641 16558 52145 -14844 32098 18545 -20582 49277 12544 22030 53836 -31476 1086
547 1086 21486 4760 72077 4460 -27554 28013 -18494 25883 44544 -16188 32480 -6783
559 -6783 -31657 39056 -3857 12011 25667 -36415 21292 9316 -27216 27723 -21951 -11176
571 -11176 36262 -16704 10405 -10865 -50806 24775 2539 -3351 23315 -45310 -15504 -3234
583 -3234 -35094 38364 9123 -35290 -9041 -48123 285 27907 -34946 2830 -12641 -36859
595 -36859 10217 -33944 -15638 17264 -40405 -4527 -943 -32514 5388 -35674 -29315 18556
$$ packed form
510C4621p4690L1697M359p661P8221p2834l2903M8712l6134O3675O837o4891N1082
523C0091m4271r299P7903m8099J8995N769o4659O6959j1034k7518N3057n5535
535g641K4199L5587o6989M6942j3553l9127O9859l6733R486L1806q5312L2562
547A086K0400j6726O7317o7617l2014N5567m6507M4377J8661o0732M8668l9263
559f783k4874P0713m2913J5868J3656o2082N7707j1976l6532N4939m9674J0775
571a1176M7438n2966K7109k1270l9941P5581k2236n890K6666o8625K9806J2270
583c234l1860P3458k9241m4413K6249l9082M8408K7622o2853L7776j5471k4218
595c6859M7076m4161J8306L2902n7669L5878L584l1571L7902m1062O359M7871
$$ plain form
607 18556 -20380 4488 -9104 -59641 -6860 -7177 913 27896 -40733 -30904 -8281 -27976 23424
620 23424 5927 -17716 6722 -39752 -13926 22880 -14897 13311 -2352 -26379 19919 -5755
632 -5755 -3816 16402 -23936 12345 26856 -2092 15741 -20352 -13697 40450 13921 18020 13361
645 13361 -20482 9618 6207 16092 53240 10253 -6020 -1782 -5196 44057 30812 750 21813
658 21813 2143 10919 26234 2196 24115 16927 850 32488 11805 6071 16930 -9357 21329
671 21329 36153 9552 16998 -11264 -15628 25919 20914 24928 13272 -21357 -438 3779 4422
684 4422 28093 5123 -4697 -702 -13514 6412 7342 -5083 5156 -7509 -5324 2550 -12218
697 -12218 -3395 -8609 -13671 10906 1712 -14429 -20339 -28349 1202 12253 -7723 -9798 -24550
$$ packed form
607A8556l8936K4868j3592n0537N2781l17Q090K6983o8629R829K2623j9695N1400
620B3424j7497k3643K4438m6474K5826L6806l7777K8208j5663k4027M6298k5674
632e755J939K0218m0338L6281J4511k8948J7833l6093O655N4147k6529M099m659
645A3361l3843L0100l411R885L7148m2987j6273M238l414M9253j3245l0062K1063
658B1813j9670Q776J5315k4038K1919p188j6077L1638k0683n734J0859k6287L0686
671B1329J4824k6601P446k8262m364M1547n005M014j1656l4629K0919M217O43
684D422K3671k2970r820L995j2812J9926R30j2425J0239j2665K185P874j4768
697a2218Q823n214n062K4577r194j6141n910q010K9551J1051j9976k075j4752
$$ plain form
710 -24550 -24449 -7530 -13315 1361 4913 -23753 -24242 -20056 -12941 4337 -9275 -17048 -13078 -19670
724 -19670 -8760 -7146 -16692 -9387 -10522 -8535 -2879 -14735 -16689 -11768 -8667 1957 1213 -5427
738 -5427 -13549 -22919 -9889 6464 9604 5644 -12610 -20036 -7846 2551 12321 9107 -4813 -7282
752 -7282 -7758 870 13003 6720 1289 692 -1655 7472 11064 1980 270 2158 10953 20083 9984
767 9984 -3578 -6287 2845 21018 23672 10756 672 -4329 -387 13327 22924 20146 7219 -4314
781 -4314 -3267 10256 23596 20046 4639 -2934 2439 13529 17726 8636 700 2379 11216 16113
795 16113 8778 -652 -1661 1767 11629 18659 8788 -2642 -8198 -6631 8790 19470 11730 -2483
809 -2483 -14115 -10247 5707 13393 9773 -2153 -13882 -9031 1348 5047 3406 -5218 -9654 -5006
$$ packed form
710b4550J01J6919n785J4676L552k8666m89M186P115J7278j3612p773L970o592
724a9670J0910J614r546P305j135J987N656j1856j954M921L101J0624p44o640
738e427q122r370J3030J6353L140l960j8254p426J2190J0397R770l214j3920k469
752g282m76Q628J2133o283n431n97k347R127L592r084j710J888Q795R130j0099
767I984j3562k709R132J8173K654j2916j0084n001L942J3714R597k778j2927j1533
781d314J047J3523J3340l550j5407p573N373J1090M197r090p936J679Q837M897
795A6113p335r430j009L428R862P030r871j1430n556J567J5421J0680p740j4213
809b483j1632L868J5954P686l620j1926j1729M851J0379L699j641q624m436M648
$$ plain form
823 -5006 -744 -1058 -6578 -8971 -7462 -3931 2880 -1256 -12857 -15841 -13473 -2290 7270 -1309 -12027
838 -12027 -19357 -19330 -2514 3536 -549 -4657 -19966 -19726 -6040 -2620 2467 -3443 -16878 -11956 -7131
853 -7131 -4169 -1849 -10864 -8081 -1894 -4291 -1229 -8039 -12604 -3250 -1654 3405 3909 -6675 -7332
868 -7332 -10562 -3668 13144 7578 2794 -5984 -16822 2976 12970 8767 10149 -6807 -6229 8090
882 8090 2811 11626 9308 -2263 9474 3601 3254 15543 54 2555 11395 6251 17584 6812
896 6812 -6287 6327 4789 15888 21098 1437 3426 -2306 -2527 22654 16385 9214 4145 -13095
910 -13095 7369 15961 6477 14377 -3072 -2276 12688 -3660 8511 10162 -8935 7850 2528
923 2528 852 13633 -12778 -8146 7241 -902 15811 -1122 -20546 -262 -9374 1598 16775
$$ packed form
823e006M262l14n520k393J509L531O811m136j1601k984K368J1183R560q579j0718
838a2027p330K7J6816O050m085m108j5309K40J3686L420N087n910j3435M922M825
853g131K962K320r015K783O187k397L062o810m565R354J596N059N04j0584o57
868g332l230O894J6812n566m784q778j0838J9798R994m203J382j6956N78J4319
882H090n279Q815k318j1571J1737n873l47J2289j5489K501Q840n144J1333j0772
896F812j3099J2614j538J1099N210j9661J989n732k21K5181o269p171n069j7240
910a3095K0464Q592r484P900j7449P96J4964j6348J2171J651j9097J6785n322
923B528j676J2781k6411M632J5387q143J6713j6933j9424K0284r112J0972J5177
$$ plain form
936 16775 -8540 -6096 -13667 -20123 11765 2954 -5096 -3110 -24766 -3467 3266 -14257 2497
949 2497 -11626 -14858 4851 -15090 -3768 -1396 -24584 -734 -3419 -7313 9079 -24258 -18583
962 -18583 2608 -11558 11089 -586 -24170 -2723 -16217 -5762 16200 -10360 -4046 -9034
974 -9034 -22414 13313 2566 -6687 6646 -17605 864 8920 -12359 9877 -2087 -9982 13433
987 13433 -5357 5882 10072 -20622 6135 9705 2517 22061 -11515 -9202 14196 -3478 19667
1000 19667 14398 -9373 12600 -7441 -171 29952 1939 8662 6502 -12564 21256 10134 -881
1013 -881 19932 -4088 7490 18371 -5868 17433 5731 -9094 19470 5677 10659 16145 -16814
1026 -16814 6444 14706 3865 23967 -4887 -7009 12386 -7971 15501 16977 -8935 9961
$$ packed form
936A6775k5315K444p571o456L1888q811q050J986k1656K1299O733j7523J6754
949B497j4123l232J9709j9941J1322K372k3188K3850k685l894J6392l3337N675
962a8583K1191j4166K2647j1675k3584K1447j3494J0455K1962k6560O314m988
974i034j3380L5727j0747r253J3333k4251J8469Q056k1279K2236j1964p895K3415
987A3433j8790J1239M190l0694K6757L570p188J9544l3576K313K3398j7674K3145
1000A9667n269k3771K1973k0041P270L0123k8013O723k160j9066L3820j1122j1015
1013h81K0813k4020J1578J0881k4239K3301j1702j4825K8564j3793M982N486l2959
1026a6814K3258Q262j0841K0102k8854k122J9395k0357K3472J476k5912J8896
$$ plain form
1038 9961 -8407 -5900 22518 -4499 2273 4920 -16102 13010 1364 -10409 11379 -14408 -4455
1051 -4455 12010 -13001 4007 -6039 -21444 9645 -5075 -4929 5740 -24530 -8771 -2466 -12244
1064 -12244 13607 -10336 -24134 -3758 -15737 2025 2375 -22939 -2244 -11437 -17129 3674 -13653
1077 -13653 -3687 -2488 -27444 758 1157 -13555 -1920 -20755 -5920 12074 -14657 -4671 -6849
1090 -6849 -16906 6938 -7086 -3242 12278 -18484 -10649 561 -3580 17845 -3271 -16065 5154
1103 5154 -4845 5598 9981 -8138 8524 160 -8202 14199 4227 4047 4947 -9019 14825 15646
1117 15646 -1699 5716 -4215 8106 21789 1029 9043 7753 -5500 11501 8085 12805 21064
1130 21064 -6106 -2120 10480 6996 21025 5156 -2878 12715 427 6813 15089 1713 8169
$$ packed form
1038I961j8368K507K8418k7017O772K647k1022K9112j1646j1773K1788k5787R953
1051d455J6465k5011J7008j0046j5405L1089j4720J46J0669l0270J5759O305r778
1064a2244K5851k3943j3798K0376j1979J7762L50k5314K0695r193n692K0803j7327
1077a3653R966J199k4956K8202L99j4712J1635j8835J4835J7994k6731R986k178
1090f849j0057K3844j4024L844J5520l0762P835J1210m141K1425k1116j2794K1219
1103E154r999J0443M383j8119J6662q364q362K2401r972j80R00j3966K3844Q21
1117A5646j7345P415r931J2321J3683k0760Q014j290j3253J7001l416M720Q259
1130B1064k7170L986J2600l484J4029j5869q034J5593j2288O386Q276j3376O456
$$ plain form
1143 8169 2169 -2687 16139 5919 -473 3328 -3650 10635 11319 -2207 1701 -5670 -2010 11294
1157 11294 3702 4129 -2992 -12509 1732 2840 2066 6626 -8195 -8463 -4388 -6167 7422 986 -9498
1172 -9498 -5192 -9989 -2074 4037 -9357 -5835 -6158 -7895 2743 -5174 -10426 -7165 -11767 -2228 2109
1187 2109 -6239 -7341 -14284 -12860 274 -225 -392 -7207 -16955 -9191 -3073 42 2016 -8261 -10252
1202 -10252 -7176 -5353 2234 -832 -6844 -5082 -6035 328 2982 -5450 -4872 -3885 -1468 5834 2157
1217 2157 -3529 -4914 -5869 3443 9597 3981 -145 -5863 -4573 6121 8045 6849 3207 -3307 -1362
1232 -1362 4458 8468 8486 3172 -458 2659 6081 9344 6086 1579 2587 6002 8746 8507 2639 -80
1248 -80 2742 8116 12592 7743 3355 338 85 6379 11852 9645 5182 -1475 -2317 5157 10614 9174
$$ packed form
1143H169o000m856J8826j0220o392L801o978J4285O84j3526L908p371L660J3304
1157A1294p592M27p121r517J4241J108p74M560j4821k68M075j779J3589o436j0484
1172i498M306m797P915O111j3394L522l23j737J0638p917n252L261m602R539M337
1187B109q348j102o943J424J3134m99j67o815r748P764O118L115J974j0277j991
1202a0252L076J823P587l066o012J762r53O363K654q432N78R87K417P302l677
1217B157n686j385r55R312O154n616m126n718J290J0694J924j196l642o514J945
1232a362N820M010J8n314l630L117L422L263l258m507J008L415K744k39n868k719
1248h0K822N374M476m849m388l017k53O294N473k207m463o657q42P474N457j440
$$ plain form
1264 9174 3112 -1776 699 5193 6155 5320 1035 -1370 2112 4567 3439 1258 -2342 -2102 1407 4781
1280 4781 3208 -1908 -5766 -5536 -783 4466 3223 -2851 -8065 -8661 -2634 2096 1485 -2582 -8962 -9953
1296 -9953 -4030 -1330 -684 -3856 -9925 -7733 -3755 -2915 -3459 -7772 -9456 -5683 -3979 -2281 -5171 -11138
1312 -11138 -9435 -5704 -2119 -377 -6295 -10517 -10018 -7093 -265 1018 -3823 -8157 -11823 -5982 1297
1327 1297 293 -1499 -7031 -9451 -1694 507 1319 -1073 -7036 -2996 1106 580 3041 -2568 -4698
1342 -4698 1119 1496 5984 4750 -4024 -2299 388 5159 11865 3593 -1877 -1904 -164 10563 10985 3847
1358 3847 3094 -2250 2234 10743 7536 8075 3094 -678 7624 7183 7944 8444 -1141 4632 9169 6252
1374 6252 10777 2332 -1412 7601 5886 10139 9855 -2374 1120 1827 4423 15169 4157 -1137 1204
$$ packed form
1264I174o062m888K475M494R62q35m285k405L482K455j128k181l600K40L509L374
1280D781j573n116l858K30M753N249j243o074n214n96O027M730o11m067o380r91
1296i953N923K700O46l172o069K192L978Q40n44m313j684L773J704J698k890n967
1312a1138J703L731L585J742n918m222M99K925O828J283m841m334l666N841P279
1327A297j004j792n532k420P757K201Q12k392n963M040M102n26K461n609k130
1342d698N817L77M488j234q774J725K687M771O706q272n470k7J740J0727M22p138
1358C847p53n344M484Q509l207N39m981l772Q302m41P61N00r585N773M537k917
1374F252M525q445l744R013j715M253k84j2229L494P07K596J0746j1012n294K341
$$ plain form
1389 1204 -2583 8937 9467 -75 3316 -2953 -1255 7630 331 3556 1531 -6355 4286 1308 731
1404 731 2702 -7770 -1411 4194 -3105 2590 -5053 -8858 2674 -5014 1769 5379 -9893 -5383
1418 -5383 -5751 -4844 9468 -3761 -10187 -3671 -9871 1247 697 -10047 539 -6690 -9167 1281
1432 1281 -6408 -85 -2084 -14351 -905 -216 -4698 307 -12782 -4121 4716 -6338 484 -4346
1446 -4346 -11676 249 -7464 740 7285 -9917 -5683 -4540 -6263 9493 -1994 -6122 2524 -9404
1460 -9404 1122 4553 -5652 5557 -3546 -6493 8725 -2511 1461 3029 -9287 6327 4697
1473 4697 -1539 8595 -6901 -3289 8567 402 10231 2214 -9871 5865 792 4346 12043 -4225
1487 -4225 2550 2378 -5986 12621 6289 -475 5276 -7436 6041 12759 -4158 4460 -35 -1249
$$ packed form
1389A204l787J1520N30r542L391o269J698Q885p299L225k025p886J0641k978n77
1404G31J971j0472O359N605p299N695p643l805J1532p688O783L610j5272M510
1418e383l68R07J4312j3229o426O516o200J1118n50j0744J0586p229k477J0448
1432A281p689O323j999j2267J3446O89m482N005j3089Q661Q837j1054O822m830
1446d346p330J1925p713Q204O545j7202M234J143j723J5756j1487m128Q646j1928
1460i404J0526L431j0205J1209r103k947J5218j1236L972J568j2316J5614j630
1473D697o236J0134j5496L612J1856q165R829q017j2085J5736n073L554P697j6268
1487d225O775j72q364J8607o332o764N751j2712J3477O718j6917Q618m495j214
$$ plain form
1501 -1249 12300 -2454 1276 8214 -7642 3642 5456 1962 11206 -8599 -8020 9719 2286 7576
1515 7576 -150 -11132 6917 -740 -3037 9182 -2531 1193 -2235 -11207 10160 5256 -6133
1528 -6133 -462 -8939 4210 8515 -10462 -221 -825 -5381 6325 -4618 -672 4355 -13223 -1859
1542 -1859 4701 -754 5950 -10807 -9522 7315 -2541 2264 1324 -8992 2979 -4083 -5322 8941
1556 8941 -2776 -2755 -1601 -8539 8085 3082 -7212 1901 -5319 1086 6884 -6176 1579 -1102
1570 -1102 -6670 7399 486 326 3389 -9740 997 5521 -1342 7176 -3386 -6352 4930 -2225
1584 -2225 5199 5873 -6955 1254 -768 -725 9249 -2114 -1335 2998 -4493 5727 4206 -2665 3095
1599 3095 -4169 403 8720 -1517 628 -1443 -4686 7347 2223 -446 3191 -6277 -723 3389
$$ packed form
1501a249J3549j4754L730O938j5856J1284J814l494R244j9805N79J7739p433N290
1515G576p726j0982J8049p657k297J2219j1713L724l428q972K1367m904j1389
1528f133N671q477J3149M305j8977J0241o04m556J1706j0943L946N027j7578J1364
1542a859O560n455O704j6757J285J6837r856M805r40j0316J1971p062j239J4263
1556H941j1717K1J154o938J6624n003j0294R113p220O405N798j3060P755k681
1570a102n568J4069o913j60L063j3129J0737M524o863Q518j0562k966J1282p155
1584b225P424O74j2828Q209k022M3R974j1363P79M333p491J0220j521o871N760
1599C095p264M572Q317j0237K145k071l243J2033n124k669L637r468N554M112
$$ plain form
1613 3389 -67 7186 -1507 -7143 1689 -893 4967 4538 -6767 -445 -115 -1150 5770 -1985 -2561
1628 -2561 850 -4166 3284 3338 -3627 -303 -4061 -338 6469 -1209 -1641 -2775 -4984 3367 1867 23
1644 23 1543 -6152 -3189 1654 1069 4294 -2746 -6881 -385 -432 3007 1823 -5179 -1797 -1056 -492 3811
1661 3811 -1448 -3323 -1022 -2644 2884 2803 -3157 -2298 -3078 -353 4084 352 -915 -3244 -4360 1968
1677 1968 3313 1255 259 -5006 -2990 1743 2170 3298 -1279 -4439 -681 847 3265 2282 -2606 -1678
1693 -1678 234 1248 3990 339 -2017 -940 -296 3587 3773 -478 -1823 -2587 475 4866 3191 571
1709 571 -1847 -3365 1510 4292 3281 1137 -3036 -2249 1484 3384 2993 -180 -2479 -354 1580 2772
1725 2772 2334 -1359 -1926 -172 1921 3125 590 -2178 -2383 -877 2637 3384 -46 -2681 -3508 -717
$$ packed form
1613C389l456P253q693n636Q832k582N860m29j1305O322L30j035O920p755n76
1628b561L411n016P450N4o965L324l758L723O807p678m32j134k209Q351j500j844
1644B3J520p695K963M843n85L225p040m135O496m7L439j184p002L382P41N64M303
1661C811n259j875K301j622N528q1n960Q59p80K725M437l732j267k329j116O328
1677A968J345k058r96n265K016M733M27J128m577l160L758J528K418r83m888R28
1693a678J912J014K742l651k356J077O44L883J86m251j345p64L062M391j675k620
1709E71k418j518M875K782j011k144m173P87L733J900l91l173k299K125J934J192
1725B772m38l693n67J754K093J204k535k768k05J506L514P47l430k635q27K791
$$ plain form
1741 -717 3449 2934 -107 -2854 -3468 -208 2197 2281 410 -2909 -2872 81 1674 1828 -525 -3077 -1806
1758 -1806 674 1872 1141 -2073 -2929 -1322 1208 2901 332 -3032 -3146 -1827 2445 3574 491 -2653
1774 -2653 -3735 -1152 2685 2922 810 -2077 -3424 -332 2206 1980 923 -2142 -2099 766 1713 1817
1790 1817 -288 -2728 -717 1459 2731 2481 -1493 -2860 -611 1673 4520 2011 -2230 -2688 -1496
1805 -1496 2817 4677 634 -1301 -2821 -1274 3424 2690 972 -736 -2955 474 2747 937 888 -2374
1821 -2374 -1770 1800 1036 1833 -15 -3588 -1028 524 1906 3046 -2808 -3260 -1034 303 4532 1010
1837 1010 -3298 -1706 -2322 963 3830 -461 -698 -2741 -3344 3068 1914 104 -638 -4446 733 2956
1853 2956 -293 823 -2384 -2448 2368 52 1625 777 -4450 -815 281 1834 4658 -2975 -3748 103
$$ packed form
1741g17M166n15l041k747o14L260K405Q4j871l319L7K953J593J54k353k552J271
1758a806K480J198p31l214q56J607K530J693k569l364j14J319M272J129l083l144
1774b653j082K583L837K37k112k887j347L092K538k26j057l065M3K865R47J04
1790A817k105k440K011K176J272k50l974j367K249K284K847k509m241m58J192
1805a496M313J860m043j935j520J547M698p34j718j708k219L429K273j810m9l262
1821b374O04L570p64P97j848l573K560J552J382J140n854m52K226J337M229l522
1837A010m308J592o16L285K867m291k37k043o03O412j154j810p42l808N179K223
1853B956l249J116l207o4M816k316J573q48n227L635J096J553K824p633p73L851
$$ plain form
1869 103 -690 4511 1717 -3277 -16 -2939 35 4446 -882 778 -1743 -4065 3710 1440 -694
1884 -694 570 -4660 242 3697 -1334 2378 -2647 -3488 2898 -384 1932 1077 -6389 -233 351 -516
1900 -516 4864 -2757 -3388 -250 -3474 4167 2805 -4489 -211 -3709 -329 4997 -3080 381 246 -4999
1916 -4999 2848 514 -281 3059 -6188 -1048 4739 -266 2899 -3525 -4982 5511 510 746 2602
1931 2602 -4718 1258 79 -1611 7648 129 -3405 102 -2694 6288 4592 -4797 1802 -512 354
1946 354 5647 -2488 2449 3074 -4880 3716 2576 800 3908 -6112 362 8033 -24 2750 -2271
1961 -2271 -3847 7031 128 847 4920 -4186 678 197 -1588 8415 -119 -4668 1536 -2814 4093
1976 4093 3614 -5073 2397 -1329 -2220 4972 -2556 391 1224 -6362 3549 2288 -2869 1524 -6264 -1391
$$ packed form
1869A03p93N201k794m994L261k923K974M411n328J660k521k322P775k270k134
1884f94J264n230M902L455n031L712n025q41O386l282K316q55p466O156N84q67
1900e16N380p621o31L138l224P641j362p294M278l498L380N326q077L461j35n245
1916d999P847k334p95L340r247N140N787n005L165o424j457J0493n001K36J856
1931B602p320N976j179j690R259p519l534L507k796Q982j696r389O599k314Q66
1946C54N293q135M937O25p954Q596j140j776L108j0020O474P671q057K774n021
1961b271j576J0878o903P19M073r106M864m81j785J0003q534m549O204m350O907
1976D093m79q687P470l726q91P192p528K947Q33p586R911j261n157M393p788M873
$$ plain form
1992 -1391 5094 -3122 1421 -2054 -6766 2747 -1534 -244 3722 -6748 -1849 -143 -3673 4827 -1746
2007 -1746 -5029 896 -5010 947 2822 -5382 579 -2676 -3594 4808 -3307 -2363 422 -5625 2611
2022 2611 1213 -3051 1570 -5680 -2700 3725 -2239 2609 -1001 -6662 2717 -397 795 4362 -4447
2037 -4447 -1291 2117 -2828 5243 502 -3412 1713 -3087 1769 4386 -3585 1029 164 -2134 5352
2052 5352 -1072 -593 1794 -3175 3187 3985 177 2766 -2616 -2059 5092 1057 3757 1760 -4662 2434
2068 2434 1538 1820 5846 -1935 -133 2064 -961 5462 2029 -2515 2504 -588 2611 4991 -1857
2083 -1857 940 569 -453 5589 1046 -588 1399 -3229 2342 4272 563 2706 -3317 -2418 3644
2098 3644 918 2508 916 -4031 686 279 606 3356 -2151 -1840 1173 -1475 3129 398 -3636 -344
$$ packed form
1992a391O485q216M543l475m712R513m281J290L966j0470M899J706l530Q500o573
2007a746l283N925n906N957J875q204N961l255r18Q402q115R44K785o047Q236
2022B611j398m264M621p250K980O425n964M848l610n661R379l114J192L567q809
2037d447L156L408m945Q071m741l914N125m800M856K617p971M614q65k298P486
2052E352o424M79K387m969O362P98l808K589n382N57P151m035K700j997o422P096
2068B434q96K82M026p781J802K197l025O423l433m544N019l092L199K380o848
2083a857K797l71j022O042m543j634J987m628N571J930l709K143o023Q99O062
2098C644k726J590j592m947M717m07L27K750n507L11L013k648M604k731m034L292
$$ plain form
2114 -344 -1683 810 2092 -3159 -1804 -1508 -2281 2315 153 -1816 -1468 -4847 -491 2291 -791 -272
2130 -272 -4173 -3943 1113 -420 -136 -593 -4090 -1179 -918 -830 1640 -2466 -2650 -710 -972 1623 -450
2147 -450 -3531 -1258 -1022 689 1691 -1586 -1535 -1572 -1731 2154 1383 -666 -1292 -3327 256 2591 1033
2164 1033 399 -1705 -2320 1439 1332 1267 727 -1785 -211 777 1216 1927 -363 -975 449 852 2367 1362
2182 1362 -1009 -578 -25 1805 2842 433 -825 -1231 -169 2798 2645 434 -622 -1734 365 2777
2198 2777 1729 1044 -955 -1349 1030 1591 1847 572 -1199 -498 893 1439 1329 -591 -1280 -267 1116
2215 1116 2226 1052 -1364 -1702 -689 1546 2929 332 -1504 -1864 -765 1790 2080 143 -1020 -2106
2231 -2106 -713 1639 1516 216 -1336 -1786 -20 985 814 -218 -1976 -1290 210 1136 877 -1233
$$ packed form
2114c44j339K493J282n251J355K96p73M596k162j969L48l379M356K782l082N19
2130b72l901K30N056j533K84m57l497K911K61Q8K470m106j84J940k62K595k073
2147d50l081K273K36J711J002l277N1l7j59L885p71k049o26k035L583K335j558
2164A033o34k104o15L759j07o5n40k512J574R88M39P11k290o12J424M03J515j005
2182A362k371M31N53J830J037k409j258m06J062K967j53k211j056j112K099K412
2198B777j048o85j999l94K379N61K56j275j771P01J391N46j10j920o89J013J383
2215A116J110j174k416l38J013K235J383k597j836l60J099K555K90j937j163j086
2231b106J393K352j23j300j552m50J766J005j71j032j758O86J500R26k59k110
$$ plain form
2247 -1233 -2116 -995 620 1777 853 -1966 -2563 -1377 1059 2011 323 -1666 -2358 -1494 1088 1525 -79
2264 -79 -1066 -2143 -609 1062 441 110 -1291 -1953 48 868 626 -53 -2075 -788 1016 1115 1357 -1097
2282 -1097 -2313 -605 637 1832 1516 -1557 -1311 -921 655 2888 856 -242 -795 -1234 1289 2057
2298 2057 486 237 -1279 -355 1782 995 1060 -291 -1577 1355 1766 1516 876 -1892 -804 1441 1322
2315 1322 2517 -460 -2160 -1 337 2256 1966 -1415 -861 -1149 -538 2573 168 -387 -553 -2506 761
2332 761 1422 -401 254 -2350 -1177 1909 -466 -51 -1273 -3023 586 101 -339 679 -3507 -2143
2348 -2143 438 -362 2123 -1111 -3507 -475 -1343 967 1358 -2887 -972 -1296 -2208 1913 -370 -927
2364 -927 -648 -3353 607 1781 -1152 -20 -2509 -1160 3096 -757 338 -204 -2791 1685 898 446
$$ packed form
2247a233q83J121J615J157r24k819n97J186K436R52j688j989o92Q64K582M37j604
2264g9r87j077J534J671o21l31j401o62K001Q20k42o79k022J287J804R9K42k454
2282a097j216J708J242J195l16l073K46L90J576K233k032j098n53m39K523P68
2298B057j571k49j516R24K137p87O5j351j286K932M11k50o40k768J088K245j19
2315A322J195k977j700K159L38J919k90l381N54k88O11L111k405n55j66j953L267
2332G61O61j823O55k604J173L086k375M15j222j750L609m85m40J018m186J364
2348b143K581q00K485l234k396L032q68K310L91m245J915l24r12M121k283n57
2364i27K79k705L960J174k933J132k489J349M256l853J095n42k587M476p87m52
$$ plain form
2380 446 2526 -2702 -1570 1666 216 3881 491 -2581 1450 -237 1937 3994 -1019 1128 398
2395 398 -970 4289 1182 243 1702 -2076 2898 3896 -668 1877 -693 -323 4632 439 1629 1397
2411 1397 -2698 2256 2019 856 3925 -1966 -1352 1974 -301 3890 1171 -2552 2020 -966 309
2426 309 3674 -1818 171 -120 -2432 3857 399 -1577 724 -3483 979 2538 -1999 865 -1929
2441 -1929 -2836 2330 -2064 225 871 -4742 287 255 -1057 2326 -3929 -3637 1271 -2658 1303 -449
2457 -449 -4393 121 -2773 -2038 2425 -3079 -1488 -1666 -3998 2555 -1194 -3556 -292 -3839 -86 1502
2473 1502 -3682 272 -2033 -4043 1651 -1410 34 960 -5271 -713 520 -1209 2507 -2957 -2942 1499
2489 1499 -2081 1592 997 -3240 975 -1088 -573 3725 -1821 -422 687 -1704 3680 1301 -1532
$$ packed form
2380D46K080n228J132L236j450L665l390l072M031j687K174K057n013K147p30
2395C98j368N259l107r39J459l778M974R98m564K545k570L70M955m193J190k32
2411A397m095M954k37j163L069n891O14L326k275M191k719l723M572k986J275
2426C09L365n492J989k91k312O289l458j976K301m207M462J559m537K864k794
2441a929r07N166m394K289O46n613N029l2j312L383o255K92M908l929L961j752
2457d49l944M514k894P35M463n504J591j78k332O553l749k362L264l547L753J588
2473A502n184L954k305k010N694l061J444R26o231M558J233j729L716n464J5M441
2489A499l580L673n95m237M215k063N15M298n546J399J109k391N384k379k833
$$ plain form
2504 -1532 1878 -1926 1512 4050 -484 1931 -76 -1696 4418 1617 1871 2900 -2019 2020 2803
2519 2803 633 5014 646 -950 3034 687 3934 3202 -916 3044 1818 1770 4248 84 1904 2357
2535 2357 -454 4550 3380 702 1958 -1810 1610 5186 654 1566 376 -1034 3529 852 582
2550 582 2504 -1824 -161 848 -82 3147 -1042 -3058 1054 -769 885 206 -3461 471 -620 -2011
2566 -2011 1206 -2267 -1836 -1391 -3784 664 666 -2892 -2190 -4170 -1731 1449 -2473 -1924 -2501 -4064 -833
2583 -833 -2097 -1969 -639 -4283 -3017 -1198 -2154 -100 -3120 -4250 -482 -2140 -895 -933 -3779 -1444
2599 -1444 -1702 -2085 736 -1522 -2295 -1652 -2811 948 891 -1550 -880 -2354 -1186 1519 204 127 -562
2616 -562 -1868 709 1031 380 937 -1388 -157 1430 744 1807 441 -561 1038 1198 1949 2150 -172
$$ packed form
2504a532L410l804L438K538m534K415k007j620O114k801K54J029m919M039P83
2519B803k170M381m368j596L984k347L247p32m118L960j226m8K478m164J820M53
2535B357k811N004j170k678J256l768L420L576m532R12j190j410M563k677k70
2550E82J922m328J663J009r30L229m189k016M112j823J654o79l667L932j091j391
2566b011L217l473M31M45k393M448Kl558P02j980K439L180l922N49n77j563L231
2583h33j264J28J330l644J266J819r56K054l020j130L768j658J245l8k846K335
2599a444k58l83K821k258p73O43j159L759n7k441O70j474J168K705j315p7o89
2616e62j306K577L22o51N57k325J231J587o86J063j366j002J599J60P51K01k322
$$ plain form
2633 -172 409 1151 1594 3372 1308 426 817 283 2579 3387 1481 1159 -74 857 2973 2315 2001 1125
2651 1125 -137 1727 2337 1732 1969 338 772 1978 1697 2230 913 -272 742 1457 2419 1968 16
2668 16 -166 322 1252 2634 1181 -145 -400 -456 1189 1901 449 -58 -1031 -441 908 800 -4 -512 -1045
2687 -1045 -137 307 284 -235 -1483 -1340 -230 481 155 -1050 -2274 -1497 -499 434 -92 -1727 -2219 -1745
2705 -1745 -688 506 -509 -1929 -2130 -1680 -723 25 -835 -1492 -2005 -1851 -643 -362 -958 -1509 -2159 -952
2723 -952 -503 -431 -993 -1983 -1753 -458 324 -81 -1073 -2195 -1610 -269 630 615 -1070 -1800 -1096 -199 873
2742 873 420 -609 -849 -953 569 1107 315 64 -514 -129 967 750 661 412 -627 681 1487 1251 888
2761 888 -292 -445 1104 1437 1980 833 -457 453 778 1650 1995 53 -138 293 435 2000 1535 -341
$$ packed form
2633a72N81P42M43J778k064q82L91n34K296Q08j906l22j233R31K116o58l14q76
2651A125j262J864O10o05K37j631M34J206k81N33j317j185J014P15R62m51j952
2668A6j82M88R30J382j453j326k55n6J645P12j452n07r73N90J349j08q04n08n33
2687a045R08M44k3n19j248J43J110P11l26j205j224P77R98R33n26j635m92M74
2705a745J057J194j015j420k01M50R57P48q60o57n13J54J208K81n96n51o50J207
2723i52M49P2n62r90K30J295P82m05r92j122N85J341Q99j5j685p30P04Q97J072
2742H73m53j029k40j04J522N38p92k51n78L85J096k17q9k49j039J308Q06k36l63
2761H88j180j53J549L33N43j147j290R10L25Q72L45j942j91M31J42J565m65j876
$$ plain form
2779 -341 -384 -570 1156 2171 676 880 23 -116 1476 1111 501 444 -1192 461 1370 700 1147 -1080
2797 -1080 -1078 922 538 1199 216 -1629 -307 -62 405 1634 -451 -752 -603 -881 1283 626 -887 -135
2815 -135 -1170 -204 1131 -917 -300 -799 -1309 1102 263 -341 -396 -2187 -34 943 -181 942 -1708
2832 -1708 -1782 462 -256 603 486 -1876 -377 -543 -505 1801 -593 -841 -296 -1347 1553 494 -1354
2849 -1354 14 -1249 -190 1196 -1094 108 -224 -1657 1349 349 -49 386 -2311 -17 1510 -185
2865 -185 1265 -925 -1513 1333 -364 690 1092 -1565 189 -537 -790 2542 -439 -895 187 -934
2881 -934 2093 959 -1770 645 -558 -442 1634 -929 742 54 -2057 1727 851 359 988 -2561
2897 -2561 135 1859 -404 1518 -570 -1635 1404 -842 706 2048 -1383 163 -213 -525 2750
$$ packed form
2779c41m3j86J726J015j495K04q57j39J592l65o10n7j636J653R09o70M47k227
2797a080KK000l84O61r83j845J322K45M67J229k085l01J49k78K164o57j513P52
2815a35j035R66J335k048O17m99n10K411q39o04n5j791K153R77j124J123k650
2832a708p4K244p18Q59j17k362J499j66L8K306k394k48N45j051K900j059j848
2849a354J368j263J059J386k290J202l32j433L006j000l98M35k697K294J527j695
2865a85J450k190n88K846j697J054M02k657J754p26k53L332k981m56J082j121
2881i34L027j134k729K415j203J16K076k563J671o88k111L784q76m92O29l549
2897b561K696J724k263J922k088j065L039k246J548J342l431J546l76l12L275
$$ plain form
2912 2750 -743 -1661 945 -1126 1723 863 -1773 1058 -1216 -643 2215 -886 181 -24 -2504 1652
2928 1652 694 -623 1335 -2294 -936 1248 -816 1535 -115 -2483 1089 -711 341 1117 -2209
2943 -2209 233 18 -1326 1914 -682 -1449 408 -2069 1054 1797 -2364 14 -984 -367 2318 -879
2959 -879 -623 -212 -2241 -71 514 -454 2024 -2241 -1521 1403 -47 1380 -462 -1800 2395 304
2975 304 -228 1228 -1519 989 237 -1514 1960 387 -1141 192 -1512 1964 2037 -1548 239 -121
2991 -121 -264 2410 -918 270 1437 -2288 633 897 324 2067 -1899 -1181 1931 96 1165 -269
3007 -269 -1596 1548 -1 -234 1498 -1361 36 174 -1142 2044 310 -1513 140 -904 992 1885
3023 1885 -1582 -68 -485 -1013 1854 -194 29 534 -2032 512 887 -567 976 -1386 -1047 1411
$$ packed form
2912B750l493r18K606k071K849q60k636K831k274N73K858l101J067k05k480M156
2928A652r58j317J958l629J358K184k064K351j650k368L572j800J052P76l326
2943b209K442k15j344L240k596p67J857k477L123P43m161K378r98O17K685l197
2959h79K56M11k029K170N85r68K478m265P20K924j450J427j842j338M195k091
2975C04n32J456k747K508p52j751L474j573j528J333j704L476P3l585J787l60
2991a21j43K674l328J188J167l725K921K64n73J743l966P18L112j835J069j434
3007b69j327L144j549k33J732k859J397J38j316L186j734j823J653j044J896Q93
3023A885l467J514m17n28K867k048K23N05k566K544L75j454J543k362L39K458
$$ plain form
3039 1411 -471 607 105 -1609 788 -409 57 1521 -1419 -408 357 -372 1453 454 -1012 328
3055 328 -934 380 1692 -721 0 -335 -954 1743 445 -331 444 -1158 538 924 -338 1148 -620
3072 -620 -841 863 37 774 249 -1607 278 312 -27 1209 -953 -696 -395 -402 1354 479 -872 -259 -1061
3091 -1061 492 1285 -407 -248 -762 -885 882 -15 -517 10 -1200 -126 586 -166 402 -731 -1078 254
3109 254 -80 191 -153 -1665 -512 -110 81 760 -1090 -1275 -133 -433 617 392 -1098 -716 -927 162
3127 162 628 -190 -453 -900 -777 463 171 -193 -47 -951 -47 727 -89 238 -560 -805 644 357 454 -58
3147 -58 -1015 -436 8 465 860 -449 -896 -177 209 847 628 -180 -351 -295 425 865 376 -42 -230 104
3167 104 678 767 364 170 -310 302 982 647 394 -429 -531 380 625 731 265 -442 -232 210 743 939
$$ packed form
3039A411j882J078n02j714K397j197M66J464k940J011P65p29J825r99j466J340
3055C28j262J314J312k413P21l35o19K697j298p76P75j602J696L86j262J486j768
3072f20k21J704q26P37n25j856J885L4l39J236k162K57L01pJ756q75j351O13q02
3091a061J553P93j692J59n14j23J767q97n02N27j210J074P12p52N68j133l47J332
3109B54l34K71l44j512J153M02J91O79j850j85J142l00J050k25j490L82k11J089
3127A62M66q18k63m47J23J240k92l64J46r04R04P74q16L27p98k45J449k87R7n12
3147e8r57N79M44M57L95j309m47P19L86O38k19q08j71N6P20M40m89m18j88L34
3167A04N74Q9m03j94m80O12O80l35k53q23j02R11K45J06m66p07K10M42N33J96
$$ plain form
3187 939 -3 -531 -377 -54 961 1203 203 2 -287 -276 707 996 185 15 -31 570 112 25 -110 -997
3207 -997 698 1205 347 339 -523 -586 150 589 655 431 -569 -741 51 402 504 -72 -690 -317 -154 516 609
3228 609 -492 -542 -633 174 463 -4 -480 -698 -804 158 403 -131 -315 -1100 -616 236 195 51 -562 -1210 -143
3249 -143 -307 286 322 -1044 -977 -418 -311 350 -397 -989 -464 -735 403 -18 -468 -550 -421 -544 588 -179
3269 -179 -487 -342 -826 391 686 -263 -361 -772 -399 663 129 110 -230 -1040 180 -137 518 873 -471
3288 -471 -317 128 109 1088 46 -384 373 22 723 669 -315 113 -30 -116 1182 245 -33 -31 -671 1202 1150
3309 1150 -50 493 -508 -277 1154 230 779 498 -579 423 138 389 1256 -436 -434 457 -110 1160
3327 1160 -90 -823 583 -55 448 932 -748 308 -142 -297 1082 411 -80 -22 -1172 497 995 -161
$$ packed form
3187I39r42n28J54L23J015K42j000k01k89J1R83K89q11j70m6O01m58q7j35q87
3207i97J695N07q58qq62o3P36M39O6k24j000j72P92L51J02n76o18L73J63O70R3
3228F09j101n0r1Q07K89m67m76k18j06R62K45n34j84p85M84Q52m1j44o13o48J067
3249a43j64N93L6j366O7N59J07O61p47n92N25k71J138m21m50q2J29j23J132p67
3269a79l08J45m84J217K95r49r8m11L73J062n34j9l40q10J220l17O55L55j344
3288d71J54M45j9R79j042m30P57l51P01n4r84M28j43q6J298r37k78Ko40J873n2
3309A150j200N43j001K31J431r24N49k81j077J002k85K51Q67j692KQ91n67J270
3327A160j250p33J406o38N03M84j680J056m50j55J379o71m91N8j150J669M98j156
$$ plain form
3345 -161 688 -663 -659 1069 -92 473 540 -963 285 16 -255 1122 -949 -381 471 -466 1207 184
3363 184 -1392 328 -421 244 921 -1037 -265 -136 -747 1272 162 -421 381 -1768 -85 641 -236 425
3381 425 -1287 -1185 937 -435 -112 212 -1577 29 -291 -916 897 -816 -1144 161 -973 911 -96
3398 -96 -1747 148 -474 171 947 -1513 -316 -12 -949 763 -122 -335 334 -1829 -237 1352 -163
3415 -163 699 -677 -1096 1378 -123 124 746 -1150 514 138 -393 1492 -524 -723 971 -322 1141
3432 1141 529 -1083 525 126 465 1614 -692 394 475 -1080 1493 602 -228 751 -1024 298 1817
3449 1817 -19 1108 73 -630 1341 26 392 879 -1170 570 670 -244 1423 -517 -410 596
3465 596 -393 1003 610 -1197 623 -302 -83 1662 -570 -98 70 -1080 1130 667 -556 449 -1118
$$ packed form
3345a61Q49j351MJ728j161N65O7j503J248k69k71J377k071N68Q52r37J673j023
3363A84j576J720p49O65O77j958P72J29o11K019j110n83Q02k149J683P26q77O61
3381D25j712J02K122j372L23L24j789J606l20o25J813j713l28J305j134J884j007
3398i6j651J895o22O45P76k460J197L04r37J712q85k13O69k163J592J589j515
3415a63Q62j376m19K474j501K47O22j896J664l76n31J885k016j99J694j293J463
3432A141o12j612J608l99L39J149k306J086Q1j555K573q91q30R79j775J322J519
3449A817j836J127j035p03J971j315L66M87k049J740J00r14J667j940J07J006
3465E96r89J396l93j807J820r25K19J745k232M72J68j150K210m63j223J005j567
$$ plain form
3482 -1118 17 1319 -481 845 -174 -1162 841 -175 -157 602 -1288 89 321 -425 858 -557
3498 -557 -1035 314 -653 592 649 -1133 -157 -504 -242 1217 -388 -618 9 -1241 532 227 -677 188
3516 188 -758 -569 872 -701 12 -522 -1052 272 -116 -255 392 -1048 -265 327 -280 479 -341 -781 119
3535 119 -531 121 547 -1153 -181 -395 -446 786 -242 -649 187 -800 401 359 -382 -82 -912 -368 549
3554 549 -266 11 -217 -1010 584 317 49 258 -915 -113 240 -112 982 -173 -451 183 -164 567 608
3573 608 -496 209 46 26 1176 57 76 367 -515 633 957 321 216 -166 35 1011 524 500 211 -191
3593 -191 810 633 299 792 -180 -119 527 292 790 459 -182 -118 198 574 873 -185 -136 -180 -63 558 287
3614 287 55 -230 -125 200 424 207 -220 -419 -214 607 222 -307 -444 -886 -302 243 79 -159 -468 -689
$$ packed form
3482a118J135J302j800J326j019r88K003j016J8P59j890J377K32p46J283j415
3498e57m78J349r67J245N7j782R76l47K62J459j605k30O27j250J773l05r04Q65
3516A88r46J89J441j573P13n34n30J324l88j39O47j440P83N92o07P59q20m40R00
3535A19o50O52M26j700R72k14n1J232j028m07Q36r87J201m2p41L00q30N44R17
3554E49q15K77k28p93J594k67k68K09j173Q02L53l52J094j155k78O34l47P31M1
3573F08j104P05j63k0J150j119J9K91q82J148L24o36j05l82K01R76m87k4k89m02
3593a91J001j77l34M93r72O1O46k35M98l31o41O4L16L76K99j058M9m4J17O21k71
3614B87k32k85J05L25K24k17m27j99K05Q21l85n29j37m42N84N45j64k38l09k21
$$ plain form
3634 -689 -56 -109 201 -283 -647 -390 -334 -9 127 -567 -431 -551 -173 477 85 -509 -768 -551 -188 448 -137
3655 -137 -286 -538 -258 404 370 -279 -154 -545 34 317 174 -33 -130 -557 87 -171 750 271 -368 -212 -238
3676 -238 -90 493 213 255 618 46 279 -116 -355 55 -955 -11 40 6 -651 -517 -342 402 635 353 289
3697 289 -329 245 103 355 344 196 -213 -59 285 295 215 -335 202 244 191 545 66 -220 -197 292 629 493
3719 493 -381 -254 139 370 878 -339 -507 -350 -631 29 550 -53 170 -659 274 480 8 277 -262 -485
3739 -485 175 130 -38 28 -437 289 -177 -250 272 -496 -42 -424 -262 184 13 -13 -8 -437 -359 276 -490 -344
3761 -344 -378 -1304 -428 -479 648 468 -1230 749 -18 -540 -227 -439 -1459 -464 -211 -66 740 -830 -734
3780 -734 -595 -290 821 -970 -814 -507 -531 490 448 198 -451 -610 234 168 527 -128 26 -509 508 167
$$ packed form
3634f89O33n3L10m84l64K57N6L25J36o94J36j20L78O50l92n94k59K17L63O36n85
3655a37j49k52K80O62l4o49J25l91N79K83j43k07r7m27O44k58R21m79o39J56k6
3676b38J48N83k80M2L63n72K33l95k39M10j010R44N1l4o57J34J75P44K33k82o4
3697B89o18N74j42K52j1j48m09J54L44J0q0n50N37M2n3L54m79k86K3M89L37j36
3719D93q74J27L93K31N08j217j68J57k81O60N21o03K23q29R33K06m72K69n39k23
3739d85O60m5j68O6m65P26m66p3N22p68M54l82J62M46j71k6Nm29P8O35p66J46
3761c44l4r26Q76n1J127j80j698J979p67n22L13k12j020R95K53J45Q06j570R6
3780g34J39L05J111j791J56L07k4J021m2k50o49j59Q44o6L59o55J54n35J017l41
$$ plain form
3800 167 84 516 -302 260 533 29 784 305 -401 756 301 650 797 -666 338 548 298 1101 93
3819 93 -5 386 -227 836 647 118 472 -344 163 1044 187 427 274 -334 926 255 63 821 -614 138
3839 138 729 -193 439 -245 -786 437 -29 74 369 -974 -551 84 -710 801 -491 -79 -41 -1107 499
3858 499 -77 -419 -177 -536 -876 785 -300 -233 -180 -921 386 -10 -184 483 -1287 -166 350 -582 102
3877 102 -623 -1142 358 -235 -126 379 -879 -79 -114 -752 332 -348 -608 -102 -902 367 415 -882 69
3896 69 -434 -403 667 -467 -198 -23 -813 122 227 -525 635 -725 -295 528 -242 477 127 -1037 690
3915 690 106 -437 630 -846 380 -408 -395 990 374 -453 -41 -864 -215 563 -704 504 176 -428
3933 -428 1338 -180 87 779 -882 538 354 87 595 -848 68 772 -27 596 -35 -444 620 9
$$ packed form
3800A67q3M32q18N62K73n04P55m79p06J157m55L49J47j463J004K10k50Q03j008
3819I3r8L91o13J063j89n29L54q16N07Q81q57K40j53o08J260o71j92P58j435P52
3839A38N91r22O32o84n41J223m66J03K95j343M23O35p94J511j292M12L8j066J606
3858D99n76l42K42l59l40J661j085O7N3p41J307l96j74O67j770J121N16r32O84
3877A02p25n19J500n93J09N05j258Q00l5o38J084o80k60N06q00J269M8j297R51
3896F9n03L1J070j134K69J75p90R35J05p52J160j360M30Q23p70P19l50j164J727
3915F90n84n43J067j476J226p88J3J385o16q27M12q23O49P78j267J208l28o04
3933d28J766j518K67O92j661J420j84k67N08j443R16P04p99O23o31m09J064o11
$$ plain form
3951 9 122 779 -422 -113 21 -624 932 576 -440 341 -247 325 936 -370 476 57 -201 896 57
3970 57 178 273 -967 404 550 -133 504 -521 -460 592 -109 339 97 -734 -216 -172 -172 433 -367 -397 -120
3991 -120 -197 496 66 -258 69 -626 -29 389 -653 125 -395 -540 428 -316 -485 241 -820 -207 280 -462
4011 -462 490 -566 -556 -34 -464 531 -6 -289 221 183 10 326 -590 -313 152 -503 193 83 -333 125
4031 125 -474 139 468 -237 -131 -155 -571 555 204 -54 86 -843 62 118 -78 468 -548 -486 440 297
4051 297 197 243 -609 -155 41 43 468 20 -528 14 -288 492 264 -257 46 -11 74 292 83 -49 -130 -292
4073 -292 464 236 191 88 -578 -51 267 139 328 -225 -958 451 226 348 445 -97 -78 105 -55 318 -116
4094 -116 -46 76 75 655 262 -17 110 -145 266 453 234 173 9 -62 654 138 -128 26 -454 46 535 414
$$ packed form
3951IJ13O57j201L09J34o45J556l56j016P81n88N72O11j306Q46m19k58J097q39
3970E7J21R5j240J371J46o83O37j025O1J052p01M48k42q31N18M4%O05q00l0K77
3991a20p7O93m30l24L27o95N97M18j042P78n20j45R68p44j69P26j061O13M87p42
4011d62R52j056J0N22m30R95n37k83N10l8j73L16r16K77M65o55O96j10m16M58
4031A25n99O13L29p05J06k4m16J126l51k58J40r29R05N6j96N46j016O2R26j43
4051B97j00M6q52M54J96KM25m48n48N42l02P80k28n21L03n7Q5K18k09j32q1j62
4073b92P56k28m5j03o66N27L18j28J89n53p33J409k25J22R7n42J9J83j60L73m34
4094a16P0J22jN80l93k79J27k55M11J87k19o1j64p1P16n16k66J54m80N00M89j21
$$ plain form
4116 414 317 -142 -173 -2 326 483 343 -69 -77 255 93 451 -132 -143 128 -197 218 55 -199 -303 -357 -132
4138 -132 74 -109 -296 14 -349 155 96 -136 -215 -585 -133 87 -109 -107 -333 -528 -283 38 136 -13 -323 -466
4160 -466 -303 -30 -8 -190 -309 -410 -101 169 36 -145 -120 -164 -363 372 90 -175 -132 -269 214 -128 153
4181 153 13 -229 -357 -131 18 55 -5 -389 20 -329 51 87 -295 -394 85 -117 533 118 -358 -49 106
4202 106 406 554 71 -204 -155 268 423 155 106 0 -242 279 497 61 3 -123 56 109 351 285 228 -341
4224 -341 194 277 254 218 -403 -89 350 139 531 69 -144 107 -73 334 329 -252 -62 84 -165 427 322 -266
4246 -266 -150 -291 253 275 -58 299 -84 -232 108 180 160 -85 -402 113 176 107 198 -172 -129 124 -225 413
4268 413 28 -239 -114 -144 106 266 -317 -229 -71 -301 174 44 -167 9 -318 -23 474 -133 260 -604 -504
$$ packed form
4116D14r7m59l1J71L28J57j40m12qL32j62L58n83j1K71l25M15j63k54j04n4K25
4138a32K06j83j87L10l63N04n9k32p9l70M52K20j96Kk26j95K45L21R8j49l10j43
4160d66J63K73K2j82j19j01L09K70j33j81K5m4j99P35k82k65M3j37M83l42K81
4181A53j40k42j28K26J49L7o0l84M09l49L80L6l82r9M79k02O50m15m76L09J55
4202A06L00J48m83k75M9M23J55k68m9j06k42N21K18m36n8j26J79N3K42o6n7n69
4224c41N35Q3k3l6o21L14M39k11L92m62k13K51j80M07nn81J90J46k49N92j05n88
4246b66J16j41N44K2l33L57l83j48L40P2k0k45l17N15O3o9R1l70M3K53l49O38
4268D13l85k67J25l0K50J60n83Q8J58k30M75j30k11J76l27K95M97o07L93q64J00
$$ plain form
4289 -504 355 -351 255 354 -818 147 43 -249 61 -382 -614 -594 206 881 101 -774 -159 -278 -129 66
4309 66 -602 97 -82 -517 275 -296 -197 -37 -524 105 667 -102 -417 -611 -318 869 22 481 -99 -559
4329 -559 543 205 308 -81 -589 51 712 -817 747 976 -178 375 198 360 434 -75 434 235 -117
4348 -117 425 476 -94 435 -381 266 494 -48 387 -336 -100 770 -88 184 202 -275 143 -37 -615 649
4368 649 -4 -558 111 -299 448 310 -510 191 -70 -142 547 -353 -200 -45 -606 182 173 -356 66 -745 -70
4389 -70 -118 -302 400 -102 -590 161 -405 11 -110 -665 -79 73 -527 403 -318 -499 12 -528 323 247 -718
4410 -718 -24 -291 -81 656 -401 -336 -75 -588 118 47 -342 372 -238 -275 430 -142 124 -421 -505 432 150
4431 150 34 83 -551 -73 227 -343 314 61 -318 221 -257 102 428 -448 -66 -103 -247 420 -557 -51 166
$$ packed form
4289e04Q59p06O06R9j172R65j04k92L10m43k32K0Q00O75p80q75O15j19J49J95
4309F6o68O99j79m35P92n71R9J60m87O29N62p69l15j94K93J187q47M59n80m60
4329e59J102l38J03l89n08O40O61j529J564K29j154N53j77J62P4n09N09j99l52
4348a17N42N1n70N29q16O47K28n42M35p23K36Q70q58K72J8m77M18j80n78J264
4368F49o53n54O69m10P47j38q20P01k61p2O89r00J53J55n61P88rn29M22q11O75
4389g0m8j84P02n02m88P51n66M16j21n55N86J52o00R30p21j81N11n40Q51p6r65
4410g18O94k67K10P37j057O5K61n13P06p1l89P14o10l7P05n72K66n45q4R37k82
4431A50j16M9o34M78L00n70O57k53l79N39m78L59L26q76L82l7j44O67r77N06K17
$$ plain form
4452 166 -148 268 45 -236 223 -253 -166 580 -191 -73 -186 -479 344 225 93 350 -349 -499 268 -123
4472 -123 608 228 -894 -3 187 724 96 -18 -473 -256 53 618 85 479 310 -317 166 436 144 646
4492 646 206 -124 497 153 318 42 -313 280 83 53 333 -157 -227 226 15 467 177 -371 277 5 109
4513 109 44 -467 46 -110 -35 270 70 -303 -241 -251 135 265 -251 131 -173 -164 307 -54 72 149 -489 -111
4535 -111 181 0 -34 -555 -305 274 -116 33 -196 -486 69 -219 -107 98 -91 -276 -216 -229 37 120 126 -179
4557 -179 -244 -22 22 -163 124 -358 -42 -235 -3 215 -72 -470 -105 108 -107 269 -442 -107 -41 -9 82 252
4579 252 -263 54 -291 -22 239 -314 -440 -261 -164 345 280 -250 -193 -369 26 72 -171 94 -88 -60 207 43
4601 43 -144 151 -213 1 216 71 258 -221 -496 158 -39 378 49 -289 -61 127 232 202 -89 110 189
$$ packed form
4452A66l14M16k23k81M59m76Q7P46p71J18j13k93Q23j19j32K57o99j50P67l91
4472a23P31l80j122Q91J90N37o28j14m55K17L09N65n33L94j69o27M83K70k92N02
4492F46m40l30O21l44J65k76l55N93j97l0K80m90p0M53k11M52k90n48O48k72J04
4513A09o5n11N13j56P5L05k00l73O2j0L86J30n16L82l04RM71l61J26P7o38L78
4535a11K92j81l4n21K50N79l90J49k29k90N55k88J12K05j89j85O0j3K66Q3Ol05
4557a79o5K22M4j85K87m82L16j93K32K18k87l98L65K13k15L76p11L35O6L2R1J70
4579B52n15L17l45K69K61n53j26J79R7N09o5n30N7j76L95M6k43K65j82K8K67j64
4601D3j87K95l64K14K15j45J87m79k75O54j97M17l29l38K28J88J05l0k91J99P9
$$ plain form
4622 189 -95 95 108 -94 -37 129 157 186 290 175 136 23 163 455 367 44 61 165 223 225 379 -16 73 280
4646 280 225 183 -31 -111 -142 223 143 199 -30 -12 -75 -380 104 249 -299 -6 -168 -41 16 -178 92 -184 -60
4669 -60 167 42 -45 19 -257 -410 -24 123 -150 -361 -134 -22 -16 -167 13 -322 -198 -73 184 215 -335 -282
4691 -282 -225 -300 43 -7 -194 -20 -74 55 210 -73 -19 -206 -297 -30 68 -137 -132 -302 -252 -91 54 2 -220 -202
4715 -202 -92 136 110 269 -432 16 118 -151 263 141 -175 284 -412 249 379 17 160 -16 -248 371
4735 371 56 77 144 -188 287 147 -48 307 -255 -165 139 67 277 120 -338 -140 150 79 239 -393 168 -37
4757 -37 -176 297 64 -122 -81 -308 233 324 114 133 -110 -92 743 219 -64 148 -163 394 102 120 215 -349
$$ packed form
4622A89k84J90J3k02N7J66K8K9J04j15l9j13J40K92q8l23J7J04N8KJ54l95Q9K07
4646B80n5m2k14q0l1L65q0N6k29J8o3l05M84J45n48K93j62J27N7j94K70k76J24
4669f0K27j25q7O4k76j53L86J47k73k11K27J12Oj51J80l35J24J25K57L1n50N3
4691b82N7p5L43n0j87J74n4J29J55k83N4j87r1K67R8k05Nj70N0J61J45n2k22J8
4715b02J10K28k6J59p01M48J02k69M14j22l16M59o96O61J30l62J43j76k32O19
4735C71l15K1O7l32M75j40j95L55n62R0L04p2K10j57m58J98K90p1J60o32N61k05
4757c7j39M73k33j86M1k27N41R1k10J9k43J8Q35n24k83K12l11N57k92J8R5n64
$$ [...]
8191i6
##END NTUPLES=NMR FID
##END=
