##TITLE=1H_LR-728-AM
 CDCl3, 8 sc, 
 26.11.2020
##JCAMPDX= 6.0         $$ Bruker NMR JCAMP-DX V2.0
##DATA TYPE= NMR FID
##DATA CLASS= NTUPLES
##ORIGIN= UXNMR, Bruker Analytische Messtechnik GmbH
##OWNER= root
$$ XWIN-NMR		Version 3.5
$$ Thu Nov 26 13:23:08 2020 Russian Standard Time (UT+4h)  she@DPX200
##.OBSERVE FREQUENCY= 200.1315066352
##.OBSERVE NUCLEUS= ^1H
##.DELAY= (6, 6)
##.ACQUISITION MODE= SIMULTANEOUS
##.ACQUISITION SCHEME= undefined
##.AVERAGES= 8
##.DIGITISER RES= 18
##SPECTROMETER/DATA SYSTEM= spect
##.PULSE SEQUENCE= zg30
##.SOLVENT NAME= CDCl3
##.SHIFT REFERENCE= (INTERNAL, CDCl3, 0, 15.7039)
##AUDIT TRAIL= $$ (NUMBER, WHEN, WHO, WHERE, WHAT)
$$ ##TITLE= Audit trail, XWIN-NMR		Version 3.5
$$ ##JCAMPDX= 5.01
$$ ##ORIGIN= Bruker BioSpin GmbH
$$ ##OWNER= she
$$ F:/spectra/data/she/nmr/H-F/1/audita.txt
$$ ##AUDIT TRAIL=  $$ (NUMBER, WHEN, WHO, WHERE, WHAT)
(   1,<2020-11-26 13:22:07.65 +0400>,<she>,<DPX200>,
      <created by zg, POWCHK disabled, PULCHK disabled
       configuration hash MD5:
       00 E9 B6 7A A2 85 ED C7 34 08 36 98 17 FE 4E 26
       data hash MD5: 16K
       56 3B AE A2 53 17 35 73 2B D0 45 4D B9 18 8C EC>)
$$ ##END=
$$ 
$$ hash MD5
$$ 97 80 85 FC 0B 40 34 59 93 C8 D2 D5 AF A0 6C DD
##$RELAX= 
##$RELAX= 
##$RELAX= 
##$RELAX= 
##$RELAX= 
##$RELAX= 
$$ Bruker specific parameters
$$ --------------------------
##$DU= <F:/spectra>
##$EXPNO= 1
##$NAME= <H-F>
##$PROCNO= 1
##$TYPE= <nmr>
##$USER= <she>
##$AMP= (0..31)
100 100 100 100 100 100 100 100 100 100 100 100 100 100 100 100 100 100 
100 100 100 100 100 100 100 100 100 100 100 100 100 100 
##$AQSEQ= 0
##$AQ_mod= 1
##$AUNM= <au_zg>
##$AUTOPOS= <>
##$BF1= 200.13
##$BF2= 200.13
##$BF3= 200.13
##$BF4= 200.13
##$BF5= 200.13
##$BF6= 200.13
##$BF7= 200.13
##$BF8= 200.13
##$BYTORDA= 1
##$CFDGTYP= 0
##$CFRGTYP= 5
##$CHEMSTR= <none>
##$CNST= (0..31)
1 1 145 1 1 1 1 1 1 1 1 1 1 1 1 1 1 1 1 1 1 1 1 1 1 1 1 1 1 1 1 1 
##$CPDPRG= <>
##$CPDPRG1= <>
##$CPDPRG2= <>
##$CPDPRG3= <>
##$CPDPRG4= <mlev>
##$CPDPRG5= <mlev>
##$CPDPRG6= <mlev>
##$CPDPRG7= <mlev>
##$CPDPRG8= <mlev>
##$CPDPRGB= <>
##$CPDPRGT= <>
##$D= (0..31)
0 1.2 0 0 0 0 0 0 0 0.06 0 0.03 0 0 0 0 0.0002 0 0 0 0 0 0 0 0 0 0 0 0 
0 0 0 
##$DATE= 1606382527
##$DBL= (0..7)
120 120 120 120 120 120 120 120 
##$DBP= (0..7)
150 150 150 150 150 150 150 150 
##$DBP07= 0
##$DBPNAM0= <>
##$DBPNAM1= <>
##$DBPNAM2= <>
##$DBPNAM3= <>
##$DBPNAM4= <>
##$DBPNAM5= <>
##$DBPNAM6= <>
##$DBPNAM7= <>
##$DBPOAL= (0..7)
0.5 0.5 0.5 0.5 0.5 0.5 0.5 0.5 
##$DBPOFFS= (0..7)
0 0 0 0 0 0 0 0 
##$DE= 6
##$DECBNUC= <off>
##$DECIM= 32
##$DECNUC= <off>
##$DECSTAT= 4
##$DIGMOD= 1
##$DIGTYP= 9
##$DL= (0..7)
0 120 120 120 120 120 120 120 
##$DP= (0..7)
150 150 150 150 150 150 150 150 
##$DP07= 0
##$DPNAME0= <>
##$DPNAME1= <>
##$DPNAME2= <>
##$DPNAME3= <>
##$DPNAME4= <>
##$DPNAME5= <>
##$DPNAME6= <>
##$DPNAME7= <>
##$DPOAL= (0..7)
0.5 0.5 0.5 0.5 0.5 0.5 0.5 0.5 
##$DPOFFS= (0..7)
0 0 0 0 0 0 0 0 
##$DQDMODE= 0
##$DR= 18
##$DS= 0
##$DSLIST= <SSSSSSSSSSSSSSS>
$$ [...]
##$SUBNAM2= <"">
##$SUBNAM3= <"">
##$SUBNAM4= <"">
##$SUBNAM5= <"">
##$SUBNAM6= <"">
##$SUBNAM7= <"">
##$SUBNAM8= <"">
##$SUBNAM9= <"">
##$SW= 16.9725356469052
##$SWIBOX= (0..15)
0 0 2 0 0 0 0 0 0 0 0 0 0 0 0 0 
##$SW_h= 3396.73913043478
##$TD= 16384
##$TD0= 1
##$TE= 0
##$TE2= 300
##$TE3= 300
##$TEG= 300
##$TL= (0..7)
0 120 120 120 120 120 120 120 
##$TP= (0..7)
150 150 150 150 150 150 150 150 
##$TP07= 0
##$TPNAME0= <>
##$TPNAME1= <>
##$TPNAME2= <>
##$TPNAME3= <>
##$TPNAME4= <>
##$TPNAME5= <>
##$TPNAME6= <>
##$TPNAME7= <>
##$TPOAL= (0..7)
0.5 0.5 0.5 0.5 0.5 0.5 0.5 0.5 
##$TPOFFS= (0..7)
0 0 0 0 0 0 0 0 
##$TUNHIN= 0
##$TUNHOUT= 0
##$TUNXOUT= 0
##$USERA1= <user>
##$USERA2= <user>
##$USERA3= <user>
##$USERA4= <user>
##$USERA5= <user>
##$V9= 5
##$VALIST= <valist>
##$VCLIST= <CCCCCCCCCCCCCCC>
##$VD= 0
##$VDLIST= <DDDDDDDDDDDDDDD>
##$VPLIST= <PPPPPPPPPPPPPPP>
##$VTLIST= <TTTTTTTTTTTTTTT>
##$WBST= 1024
##$WBSW= 4
##$XGAIN= (0..3)
0 0 0 0 
##$XL= 0
##$YL= 0
##$YMAX_a= 374633
##$YMIN_a= -205803
##$ZGOPTNS= <>
##$ZL1= 120
##$ZL2= 120
##$ZL3= 120
##$ZL4= 120
##$ABSF1= 10
##$ABSF2= 0
##$ABSG= 5
##$ABSL= 3
##$ALPHA= 0
##$AQORDER= 0
##$ASSFAC= 0
##$ASSFACI= 0
##$ASSFACX= 0
##$ASSWID= 0
##$AUNMP= <proc_1d>
##$AZFE= 0.1
##$AZFW= 0.1
##$BCFW= 1
##$BC_mod= 2
##$BYTORDP= 1
##$COROFFS= 0
##$CY= 11.3945322036743
##$DATMOD= 1
##$DC= 2
##$DFILT= <>
##$DTYPP= 0
##$F1P= 15.9154993809931
##$F2P= -4.1035820241983
##$FCOR= 0.5
##$FTSIZE= 0
##$FT_mod= 4
##$GAMMA= 1
##$GB= 0.15
##$INTBC= 1
##$INTSCL= 1
##$ISEN= 128
##$LB= 0.24
##$LEV0= 0
##$LPBIN= 0
##$MAXI= 10000
##$MC2= 0
##$MEAN= 0
##$ME_mod= 0
##$MI= 1.114404
##$NCOEF= 0
##$NC_proc= 0
##$NLEV= 6
##$NOISF1= 3.799351
##$NOISF2= 2.8
##$NSP= 1
##$NTH_PI= 0
##$NZP= 0
##$OFFSET= 15.70392
##$PC= 1
##$PHC0= -11052.14
##$PHC1= 18.80088
##$PH_mod= 1
##$PKNL= yes
##$PPARMOD= 0
##$PSCAL= 0
##$PSIGN= 0
##$REVERSE= no
##$SF= 200.130013532006
##$SI= 16384
##$SIGF1= 3
##$SIGF2= 2
##$SINO= 400
##$SIOLD= 16384
##$SREGLST= <1H.CDCl3>
##$SSB= 0
##$STSI= 0
##$STSR= 0
##$SW_p= 3612.71676300578
##$SYMM= 0
##$S_DEV= 0
##$TDeff= 0
##$TDoff= 0
##$TI= <>
##$TILT= no
##$TM1= 0
##$TM2= 0
##$TOPLEV= 0
##$USERP1= <user>
##$USERP2= <user>
##$USERP3= <user>
##$USERP4= <user>
##$USERP5= <user>
##$WDW= 1
##$XDIM= 8192
##$YMAX_p= 0
##$YMIN_p= 0
$$ End of Bruker specific parameters
$$ ---------------------------------
##NTUPLES= NMR FID
##VAR_NAME=  TIME,          FID/REAL,        FID/IMAG
##SYMBOL=    X,             R,               I
##VAR_TYPE=  INDEPENDENT,   DEPENDENT,       DEPENDENT
##VAR_FORM=  AFFN,          ASDF,            ASDF
##VAR_DIM=   8192,          8192,            8192
##UNITS=     SECONDS,       ARBITRARY UNITS, ARBITRARY UNITS
##FACTOR=    0.0002944,     1,               1
##FIRST=     0,             0,               0
##LAST=      2.4114304,     0,               0
##MIN=       0,             -205803,         0
##MAX=       2.4114304,     374633,          0
$$ Real data points
##PAGE= N=1
##DATA TABLE= (X++(R..R)), XYDATA
$$ [...]
2686A686l007j061K607K184j898k777J030K952K98l714o98L048J960k290k513
2701b193J136L194j63l293r96L146J979k833k235J293L030j48l210m19K678J762
2717B728k786k420J911K959o05l285n56K823J641k532k373J556L157o71l308m20
2733b181L264J193k619k181J914K781q60l246k22L046J399k733j960J880K630
2748B105j091l129r1L281J317k844k389K277K704j302k860r7L182R36k601k012
2764b614K226K558j339l028L34L252O38k420k013K269K628j438k898L95K912Q24
2780B286k669j982K253K583j471k873K11L377L70k905j277K269K498j549l239
2795b118R84L010K50k984j389K737J813j908k520O68L083J85k863j165K429K100
$$ y = [1686, -1321, -2382, 225, 2409, 511, -2266, -1236, 1716, 2014, -1700, -2398, 650, 2610, 320, -2193, -1057, 2137, 1974, -1319, -2315, 831, 2810, -23, -2258, -965, 2065, 1917, -1293, -1712, 966, 2728, -58, -2478, -567, 2392, 1787, -1498, -2054, 769, 2410, -122, -2495, -939, 2218, 1547, -1761, -2181, 1083, 2276, -343, -2524, -610, 2171, 1311, -1935, -2157, 889, 2288, -445, -2405, -525, 2105, 1014, -2115, -2206, 1075, 2392, -452, -2841, -564, 2140, 838, -2022, -2119, 1063, 1999, -602, -2614, -388, 2170, 831, -2197, -1863, 1389, 2027, -393, -2406, -137, 2491, 1053, -1845, -1450, 1462, 2286, -383, -2365, -112, 2471, 1000, -1873, -1662, 1715, 2085, -820, -2097, 172, 2670, 1121, -2118, -1134, 1876, 2126, -858, -2247, 490, 2303, 395, -2125, -1457, 1626, 1811, -1052, -2217, 212, 2312]
2811B312j815k741J020K918J07l046j113K485K172j618k869P56L291k84k806q57
2827b088K252K121k244k427J242K845l36k570j006K598J925k436k247J411K823
2842A863l68k869n72K596J628k286k178J251K880l40k899p08K722J755k256k378
2858b159J314K831l30k955o67K826J312k268k001J709K652p60l086k44K980J187
2874B341k530j850J805K021n42k827k88K882J327k864j745J838K358r21k761j32
2890a888K786J324k670j768J646K694j114l058L52K811P60k642j794K277K197
2905A913j065l024N86K873O43k547j881K128K583j416k671K37K876P65k868j412
2921b280K021K353j440k584P89K635M00k738j213K336J967j696k605P10K888M31
$$ y = [2312, 497, -2244, -1224, 1694, 1801, -1245, -2358, 127, 2299, 681, -2188, -1432, 1859, 1575, -1231, -2088, 164, 2285, 41, -2386, -1144, 1701, 1365, -1205, -2211, 387, 2312, -124, -2371, -960, 1863, 1495, -1374, -1946, 650, 2278, -8, -2186, -935, 1945, 1605, -1294, -2002, 720, 2475, 219, -2159, -845, 1986, 1656, -1299, -1966, 860, 2172, -96, -2097, -388, 2264, 1504, -1582, -1826, 1154, 2341, -189, -2039, -234, 1787, 1245, -1582, -1870, 1012, 2339, -525, -2270, -432, 1926, 1005, -1756, -1888, 898, 2222, -448, -2216, -570, 2124, 1010, -2048, -1696, 1115, 1875, -767, -2561, -284, 1913, 848, -2176, -1590, 1283, 1926, -621, -2502, -374, 2209, 793, -1878, -1641, 1235, 2000, -868, -2280, -259, 2094, 654, -1930, -1141, 1494, 1894, -844, -2057, 279, 2246, 550, -2055, -1345, 1543, 1974]
2937A974k536j350K475J717j533k572Q50K558J22k608r10K017J761j383k773J536
2953f55K463q1k739j137K680J513j543k379P23K661q0k820n16K372J370j759k287
2970b214J227K743k03k836n23K403J245j668k446J542K257n31k422n96K727J404
2986B109k237j908J431K314m80k842m27K914J110k212j181L85L214r38k626l58
3002a732K679P20j706j997J543K595r87k525O6K303R78k136j903J823K080o44
3018A157k862J80K583J022k551j617J543K559p08k824M9K554P33k183j445J528
3034b82K111r17k611J32K563P90k333j654K019K025r52k767K05K992K33k338j380
3051b164K030K019j539k073M87K501L57k420j288J672K639j581k620P06K575O55
$$ y = [1974, -562, -1912, 563, 2280, 747, -1825, -975, 1583, 1705, -903, -1813, 204, 1965, 582, -2191, -655, 1808, 1727, -1012, -2149, 531, 2044, 501, -1878, -1155, 1506, 1426, -1394, -1910, 462, 1832, 73, -2214, -987, 1756, 1553, -1283, -1806, 597, 1842, 174, -2272, -730, 1527, 996, -1426, -2022, 705, 2109, -128, -2036, -605, 1709, 1229, -1613, -2040, 874, 1984, -228, -1409, -1024, 2190, 1252, -1374, -1732, 947, 1667, -39, -2036, -493, 2102, 1115, -1410, -1344, 959, 1937, -199, -2102, -279, 1801, 1157, -1705, -1525, 1058, 2080, -471, -2088, -545, 2014, 1306, -1518, -1469, 1085, 1818, -365, -1810, -282, 1829, 912, -1699, -1567, 996, 1786, -547, -2201, -182, 1843, 891, -1876, -1671, 1321, 1554, -784, -2164, -134, 1885, 346, -1727, -1240, 1261, 1618, -802, -2090, -418, 2221, 640, -1980, -1274, 1301, 1956]
3067A956k678j281K130J862j481k256N72K741J04k404j164K296J664j687k040
3082a666O15K556M9k266q88K080J565j496k184Q55K304o0k316q95K376J410j654
3099C85k100R83K277l6k559o37K435J249k022j589P93K361j16k686m41J960J838
3116B095j824k210J085K342l26k640j42K118J597k227j618J361J760j58k631j40
3132a558K238J383k257j583J211K109n41k275k75K490P64j801j967J768K340r00
3148A146k456j08K545Q76k127j745J568J963p28k242J99K162R92k094j848J861
3164c6K001j062k496L04K212P00k007j513J669K108j430j670J0K329M00k056j431
3181a968J953J746j273j817L16J592J083k509j183J619K547j636k740J025K123
$$ y = [1956, -722, -2003, 127, 1989, 508, -1748, -1176, 1565, 1669, -735, -1899, 397, 2061, 374, -1666, -1051, 1505, 1554, -712, -1600, 480, 2045, 549, -1635, -780, 1524, 1464, -852, -1747, 629, 2039, 385, -1715, -732, 1545, 1509, -1050, -1687, 748, 1997, -25, -1614, -821, 1540, 1424, -1262, -1703, 257, 2095, 271, -1939, -854, 1488, 1162, -1478, -1620, 498, 2095, -132, -1750, -389, 1371, 1213, -1418, -1558, 680, 2063, -194, -1777, -566, 1543, 1002, -1273, -1548, 942, 1706, -95, -2062, -294, 2046, 1146, -1310, -1418, 1127, 2003, -124, -1869, -301, 1662, 934, -1308, -1109, 1053, 2045, -49, -1897, -36, 1965, 903, -1593, -1289, 923, 1623, -384, -1897, -228, 1880, 450, -1220, -1210, 1119, 1519, -537, -1968, -15, 1731, 458, -1359, -1043, 549, 1632, -877, -2060, -441, 2106, 470, -2270, -1245, 878]
3196H78K69k585K8J599J138j000j254R2K108l52j962r20J982J752j255k272O90
3213a064K235R5k264j016K342J404j263k434J265K012J58k394o78K108J183j509
3229A80j737Q50K202m5k230o16J985J211j475j828R83K233l36k405o05K290J231
3246A888j536j949R75K180l77k445k30K008J422j675j952P19K430l63k281o81
3262a867K530R67j703j429R80J880l42k344j2J836J070j747j881J495K071o47
3278H57k387J82K149R23k089j267J223K031p11k154j63K017J144j921j504J208
3294d62K315j210k190M85K053O93k004j401J644J594q95j944K42K166N59j859
3310b14j419J513J832j016k010K67J896O80j887j227J623J767j337j995M60K202
$$ y = [878, 1147, -1438, -1410, 189, 1327, 327, -927, -835, 1273, 921, -1041, -1961, 21, 1773, 518, -1754, -1064, 1171, 1266, -998, -2014, 328, 1732, 469, -1965, -700, 1312, 1470, -924, -1602, 506, 1689, 180, -1557, -707, 1495, 1450, -780, -1396, 589, 1800, 325, -1503, -520, 1713, 1377, -1028, -1633, 657, 1888, 352, -1597, -622, 1558, 1181, -1264, -1494, 514, 1936, 261, -1691, -972, 1458, 1095, -1186, -1867, 663, 1630, -73, -1502, -522, 1358, 1016, -1328, -1340, 496, 1566, -181, -2062, -567, 1504, 857, -1530, -1348, 801, 1724, -365, -1632, -409, 1622, 911, -1243, -1406, 611, 1755, -166, -1670, -462, 1853, 643, -1547, -1062, 991, 1684, -320, -1721, -77, 1517, 622, -1322, -1080, 1086, 1645, -214, -1633, -120, 1712, 696, -1314, -1047, 849, 1529, -358, -1585, 38, 1805, 468, -1527, -1067, 1135]
3326A135K81j800j264J765J944j560j883L02K238M74k271j182J880J672j160k031
3342a460L94J901N68k171j208K001J482j234k064Q37K010J88k067q82J990J149
3358A434j194j898Q16J919J19j970r62K035J327j383j775P43K098k05j921p64
3374a581K063J284j523j698Q35J930l57j933l82J826J464j756j749J198J790k48
3390A163k102l37J813J244j388j838J060J711l56k067k52K210Q64j748j566J126
3406d63J871k37k387r0J958R81j906j240R68J844k85k235j18K064M30j260j558
3423a663J302J693m98k127m13K338N52j522j165J179J681q73k105J57K347K98
3439A181j594j037J144J817r23j836J43K058M67j920q80J166J618p89j633j59
$$ y = [1135, 1416, -384, -1648, 117, 2061, 501, -1382, -1080, 1158, 1632, -639, -1821, 59, 1731, 571, -1460, -1066, 835, 1403, -768, -1976, 25, 1507, 273, -1791, -954, 1056, 1244, -823, -1705, 285, 1434, 240, -1658, -842, 1077, 1196, -774, -1736, 299, 1626, 243, -1532, -789, 1309, 1104, -817, -1581, 482, 1766, 243, -1455, -620, 1310, 953, -980, -1362, 464, 1928, 172, -1577, -379, 1411, 1163, -939, -1276, 537, 1781, 393, -1445, -385, 1326, 970, -1097, -1349, 861, 1725, -23, -1589, -463, 1408, 1171, -1216, -1306, 652, 1633, -273, -1513, -545, 1299, 1014, -1221, -1339, 725, 1155, -105, -1663, -361, 1332, 834, -1293, -1706, 632, 1184, -338, -1503, -324, 1357, 484, -1621, -1464, 883, 1181, -413, -1450, -306, 1511, 588, -1248, -1105, 953, 1420, -500, -1380, -214, 1404, 615, -1018, -1177]
3455a177K199N45j985j128J819J101p81j741K17J927L56j858q53J500J452j108
3471D85j663K17K029L00j875r32J686J345j308j646K69K281r5j598p32J375J450
3488A588j412j701P42J821K0j905p10J803J302j431j650R38J725l23j367q31J721
3505C30J143j287j694P65K042l60j700m42J501J136j277j682R33J756k02j842
3521h80k67J448J374j598j529J180J698n27j797l39J750J301j731j623J242J800
3537A502m31j997J9J640O20j096j541R85J745o65j756J5J531Q59j659j111R00
3554d40K085p96j888J14J414Q72j769j254J338J599n28j979k48K348L17j529j474
3571a818J469J812r08j669kJ723Q66k115q58J377J528r78j446R4J894L94j757
$$ y = [-1177, 1022, 1567, -418, -1546, 273, 1374, 593, -1148, -931, 996, 1352, -506, -1359, 141, 1593, 485, -1178, -961, 1068, 1368, -507, -1439, 247, 1592, 284, -1362, -1093, 1188, 1093, -505, -1237, 138, 1588, 176, -1525, -783, 1038, 1058, -847, -1557, 246, 1548, 117, -1533, -595, 1130, 807, -560, -1391, 330, 1473, 186, -1508, -743, 1299, 939, -761, -1203, 298, 1434, 157, -1525, -592, 1164, 962, -880, -1147, 301, 1675, 77, -1452, -272, 1426, 899, -898, -1237, 513, 1814, 83, -1540, -298, 1502, 1071, -926, -907, 733, 1353, 257, -1284, -299, 1446, 781, -975, -960, 571, 1430, -229, -1340, -440, 1645, 849, -1039, -925, 489, 1361, -408, -1662, -324, 1275, 747, -1232, -1480, 868, 1185, -344, -1818, -349, 1463, 555, -1114, -1116, 607, 1473, -642, -1500, -123, 1405, 427, -1019, -925, 969, 1363, -394]
3588c94j160J635J433j179j540K78J766L75j610r01J456J342r06j746K44J756
3604H49L50j711q63J520J250q74j863O41J821O2j781q57J787J137j064j574O80
3621d90J625k24j626o82J896Q31j093j694N21K175j61j903p19J840R68j069j630
3638a435Q73J604j53j474r63J532J567j556j519R70J574l04j592n99J888Q07j462
3655b42j256Q38K115o37j795j11J488Q09j174j368P07J659k7j734o49J875J007
3672A505j363j628J118J552j16j688n00K108M84j388j597J262J628n42j683k46
3688a094J984M34j299j235J140J163m49j773N5K087M19j459j186J085J636r43
3704E65j678J73J805N61j792o59Q95J403o50j674K48J702K30j618j052J459J514
$$ y = [-394, -1554, 81, 1514, 335, -1205, -927, 839, 1214, -396, -1297, 159, 1501, 595, -1151, -907, 849, 1199, -512, -1375, 145, 1395, 521, -1342, -701, 1120, 1182, -599, -1456, 331, 1468, 404, -1170, -490, 1135, 911, -715, -1397, 499, 1330, 237, -1457, -936, 1239, 1078, -825, -1544, 296, 1264, 195, -1435, -562, 1042, 889, -585, -1548, -16, 1551, -5, -1524, -554, 1020, 716, -876, -1475, 413, 1220, -242, -1498, -660, 1455, 818, -977, -1088, 400, 1209, 35, -1333, -626, 1033, 1006, -728, -1377, 498, 1505, 142, -1486, -368, 1184, 1068, -620, -1120, 988, 1472, 84, -1513, -251, 1377, 835, -848, -1094, 890, 1324, 25, -1210, -70, 1093, 644, -1129, -1074, 1013, 1432, -27, -1213, -128, 1508, 565, -1113, -940, 865, 1426, -366, -1025, -130, 1273, 623, -1051, -803, 899, 1129, -489, -1541, -82, 1432]
3721A432q58j690J00J933K55j590j135J308J575r42j596J36K226k87j447q33J366
3738d7J336j074j275N19J214O73j730r66J641J112j130j556P99J143K90j318p96
3755a165J509Q88j099j338N88J578M1j567o67J462Q41p61j398M97J697p9j738
3772g11l81J706O51j078j433P65J306j89j190o16J551J307j200k010J338R77o1
3789G32j453m48J693N51j114j135O40J741n44j752k26J748O49j105j429J155J441
3806A144n12j627l66K010M63j078j331J233J140l45j501k75J792N89j474j165
3822a303J085J383o28j647K54J609M67j360r21R52J360o98j465J38J457O67j436
3839h6j100R21J487o65j551J75J541P87j666r08R45J524p53j596P6J834J71j398
$$ y = [1432, 574, -1116, -1016, 917, 1172, -418, -1553, -245, 1330, 388, -1208, -1072, 1154, 867, -580, -1413, -47, 1289, 215, -1060, -541, 673, 1346, -384, -1350, 291, 1403, 273, -1283, -484, 659, 949, -369, -1165, 344, 1232, 133, -1205, -617, 961, 1002, -565, -1232, 230, 1071, 310, -1088, -591, 1106, 1027, -711, -1092, 614, 1265, 187, -1246, -481, 825, 636, -554, -1170, 381, 1688, 488, -1522, -184, 793, 732, -721, -1169, 524, 1075, -39, -1174, -534, 1207, 663, -1089, -1315, 433, 1082, -23, -1452, -297, 1144, 632, -995, -1361, 649, 1112, 34, -1297, -64, 1076, 731, -770, -1045, 747, 1336, -138, -1303, -218, 1165, 537, -1110, -856, 753, 1220, -140, -1061, -109, 1251, 553, -912, -774, 683, 1350, -86, -1186, -265, 1222, 557, -994, -819, 722, 1509, -157, -1065, -120, 1404, 651, -945, -869, 965, 1136, -262]
3857b62p58J210Q81q10j476N44J359N76j737q15J443P96m45j400lJ588M59j689
3875e39o78J220J219r27j547O31J483m2j457o87J347J035q80j504M02J844O4j641
3893f57o32J474Q37p90j469O72J428j45j190o98J087J136p93j725J043J531P0
3910A179k092k7J297R17j353r30P96J288k06j356m17J320R18j251j086N00J771
3927A268m78j621k93J538P51j234q14P54J157k98j505m3J081R54j257q82O88J119
3945H85P2j783j12J501L81j175j087J017J299m14j696mJ507Q00j476q75R29J266
3963A035m88j222l16J830M79j490q48J011J178o73j353L32Q67P79j400p63J127
3980H5J170n55j487J36J399L37j290j085J079J337p62r92K69J259K30j385q58
$$ y = [-262, -1020, 190, 1071, 261, -1215, -671, 688, 1264, -473, -1288, 155, 951, 506, -894, -897, 691, 1150, -539, -1217, 3, 1222, 295, -1252, -621, 862, 820, -637, -1324, 23, 1058, 178, -1326, -924, 920, 984, -657, -1289, 185, 1022, 232, -1237, -565, 863, 718, -472, -1170, -83, 1053, 260, -1465, -422, 1109, 1179, -913, -940, 357, 1274, -79, -1009, -213, 1075, 869, -487, -904, 416, 1334, 83, -1003, -503, 1268, 790, -831, -1124, 414, 1165, -69, -883, -129, 1028, 730, -775, -818, 263, 1217, -40, -922, -234, 885, 957, -826, -938, 563, 944, -231, -1318, -301, 998, 584, -1112, -1116, 391, 1191, -285, -1160, -231, 1035, 547, -675, -991, 839, 1318, -172, -1020, -9, 1169, 496, -857, -525, 342, 1121, -279, -1042, 85, 1255, 700, -787, -651, 748, 1085, -205, -1290, -211, 1126, 364, -628, -359, 900, 1130, -255, -1113]
3997a113J367R92j008j173K18J553R8j252o92R97R76r08j252N16J398J52j397
4014e28o67J253Q62p90j344K94J658J85j543m84J145J160j104j103m6J839Q2j588
4032g19m96J653L79o55j277K86J242N01j570n16J344Q78q29j486R28J111j09j256
4050e91r5J110Q65j211j084N15J392j25j359k43J415P55j224r04L94J539l74j398
4068f23k12J173P37j161r88J009Q98K78j678k31J240P41j181j038Q04J062J74
4085A004j710j05J184Q13j400p66N10J467m93j408j30J693L54j127j040J023J194
4102A063o46j232RJ290P47j696o36J175Q46m16j524J70J467K12j323m65P35J293
4120A069n85j254lJ217P10j753n24Q65J172m71j151J41R93K86j168o46J142J250
$$ y = [-1113, 254, 1246, 238, -935, -717, 836, 934, -318, -1010, -13, 963, 55, -1197, -681, 717, 869, -528, -1195, 58, 920, 130, -1214, -920, 738, 923, -620, -1104, 41, 1201, 97, -1006, -1052, 787, 869, -719, -1215, 438, 817, 162, -1115, -829, 413, 914, -656, -1172, 172, 1050, 221, -1265, -337, 774, 665, -591, -686, 424, 1289, 78, -1006, -491, 901, 776, -583, -826, 589, 1344, 120, -784, -390, 1149, 775, -623, -835, 338, 1075, -86, -1074, -65, 833, 1111, -567, -798, 442, 1183, 2, -1036, -232, 830, 1004, -706, -811, 373, 1186, -214, -980, -470, 997, 504, -904, -1034, 659, 1013, -114, -1154, -131, 1063, 417, -815, -806, 484, 1231, -465, -1101, 74, 920, 504, -1020, -850, 617, 829, -494, -959, -224, 1069, 484, -770, -773, 444, 1154, -599, -1123, -258, 914, 443, -708, -567, 426, 712, -456, -1102, 40, 1290]
4138A290r14j429M02J421N8j269j058J456J132j282q12L93J055K96j741J95J412
4155F05Q32q31k000O58J241K91j587k25J138Q78q24j041L49J239R1j396o16J437
4173B39O27p08j185N33J162Oj029o21J233P07p10j252K68J725r9j441l20J161
4191B96O21q28r81N45J336j82j613j75J233O88j034p47M95J628l84j396m30J311
4209C83O92p44j215O30J229p1j507m50J670K15p42q04L69J560o11j218k44J650
4227G92J13j048j107J159R74n55j415K5J350O64j168p75P50J329n46j488L75J117
4245E46J62q31j018Q42J487p14j428O9J376K65j072p11J168P41m89j098j92J336
4263D39K88r26p09Q44J055n77r38j41J206K62q67r39J177Q68n79j159j10J664
$$ y = [1290, 376, -1053, -651, 770, 828, -441, -1499, -43, 1089, -193, -1005, -612, 443, 739, -1002, -807, 605, 1437, 606, -1394, -736, 505, 796, -791, -1016, 122, 1000, 176, -865, -516, 723, 814, -582, -1198, 239, 866, 158, -1027, -494, 668, 674, -355, -976, 257, 964, 254, -998, -730, 995, 896, -545, -865, 296, 917, 89, -892, -347, 989, 807, -806, -981, 252, 940, -94, -841, -346, 1282, 898, -498, -928, 383, 1075, 331, -884, -254, 975, 904, -603, -1053, 617, 832, 90, -714, -345, 1215, 604, -614, -858, 792, 905, -143, -1250, -91, 883, 328, -1087, -1062, 288, 952, -216, -991, -241, 1088, 542, -946, -571, 546, 708, -123, -1141, -299, 1188, 474, -954, -885, 491, 756, -316, -1027, 141, 882, 393, -705, -897, 439, 727, -199, -908, -64, 991, 414, -524, -665, 541, 803, -64, -1003, 174, 1042, 463, -696, -806, 858]
4281H58N8j103q22J293R52j117r96M32J149J20r81r90J276Q08p52q78J37J927
4299A371o53j305m64J159J031j037j046L38J498j07j286o91J263R92r80j027K23
4316g21J482l1j582o6J067P74q99j115O66J035K68j686m7J208O30j012j244J056
4334b17R81j13j364j42J142O74p96j368J086J094m09j250k09J277O42j050q89
4351i11O50J166j39j538P6J253L98p37r82Q27J010l94j230k46J147P06j102o94
4369g40L88J193j47j636M16R06O47j018j101Q61J062l24j160r9J178M82j086p00
4387h78O99J055o29r71K59J105j10j001o41J044J001m97j222Q6R91O91j678l86
4405a082J330L43l32m73k08J420l38j338l78P38J309j206o22Q6J145p4q10n79
$$ y = [858, 916, -187, -1009, 284, 1236, 119, -877, -445, 704, 824, -157, -1147, 129, 937, 185, -693, -556, 1371, 718, -587, -1051, 108, 1139, 102, -944, -606, 892, 785, -501, -1192, 71, 1063, 83, -944, -721, 761, 730, -852, -918, 149, 923, 24, -1091, -425, 610, 878, -808, -855, 353, 983, -29, -1273, -217, 764, 651, -713, -855, 287, 961, 165, -1203, -117, 977, 568, -682, -891, 386, 1028, -22, -911, -261, 905, 766, -772, -696, 557, 955, 218, -764, 63, 1073, 679, -551, -797, 350, 1056, -46, -740, -352, 841, 694, -942, -526, 380, 1027, 9, -1092, -231, 831, 507, -653, -752, 426, 908, -178, -878, -179, 876, 247, -724, -465, 640, 530, -471, -1112, -68, 933, 436, -786, -700, 291, 982, -696, -1082, 248, 591, 259, -214, -422, 998, 660, -678, -1056, -318, 991, -215, -837, -751, 394, 320, -490, -1069]
4423a069P32J399j011j816J756J009m47o39m78R71J060j249p71J44N89P40q18
4440A02o01R00M20p48m82m6J479m00q32n42J195P56q74j505N88J099K20p50p29
4459g50R43O78j82k510J384O09O65j553j80J159N39q15q97M30J253%j452k02J074
4478A93M32o01r57N85J135k48j148Q4R35j41j35j151Q06J039l03j268PJ164P61
4497A189j144q99O55J524r68q66m14J429J19p53p77R03R96m65j037k64J132N22
4515H82j011n51L86J136n54o55l68J619m86r3j592R97J076k42n76m89J124j88
4533D15q21o62J110N46j31j239L08Q44L95j277j73M28R89n20r93K52J047J40j255
4552e97l64P66R30n06r11Q1R99K28j071o19J138O54n93p62O4J221L1j085q6O80
$$ y = [-1069, -337, 1062, 51, -1765, -9, 1000, 553, -86, -564, 407, 1467, 218, -553, -409, 180, 920, 102, -499, 401, 821, 73, -409, -455, 1024, 624, -208, -750, 445, 1201, 327, -1178, -590, 509, 729, -21, -750, 193, 871, 689, -1821, -437, 172, 837, -716, -896, 263, 802, -13, -910, -480, 773, 773, -679, -881, 193, 625, 24, -933, -348, 787, 539, -609, -525, 410, 269, 134, -1017, -211, 828, 525, -743, -736, 428, 1189, 45, -854, -199, 1325, 357, -509, -923, 506, 625, -128, -905, -2, 994, 529, -508, -772, 360, 882, -129, -680, -294, 842, 288, -367, -735, 884, 398, 305, -1287, -290, 786, 544, -32, -521, 603, 415, -406, -1068, 42, 588, 457, -782, -474, 370, 765, -512, -685, -257, 732, 212, -781, -529, 518, 658, -597, -961, -195, 735, 229, -682, -601, 398, 626, -445, -1064, 74, 728, 135, -627, -563, 658, 689, -396, -482, 198]
4572A98M78k96q84K92R16p6r81l59J028N38m93p95k9J512m27j052l21J134M73
4591H56j015n16N93Q02k39j087J11O95O77n14j233N44J253n02j104k53J506K73
4609H47q39r76O09J270n01j149j15J005N70q18r09O19J185k85j229j76J401M68
4627I77j056q44P62J036l05j338J74Q21M73p50q83O68J029k27j421M0J413K84
4645H53r42n06N81J137q05j119K4J272M47j183p13O85J185m84j159K49J052L77
4663I51j244n56O99R62o64r07L08Q92N88j254o93R69J195r00r29k12J395O2q71
4682b09p16R36O59l54j187K14J293j17o16q12J012Q08p30p43J78J001j0r46o14
4701i53J098Q30p53r18L36J121r9j278n6O35Q02q16o41M77P44k11p07l85Q09O76
$$ y = [198, 676, 380, -504, -212, 704, 628, -353, -712, 316, 854, 361, -434, -463, 1049, 622, -430, -751, 383, 856, -159, -675, -82, 720, 481, -606, -495, 200, 877, 363, -870, -326, 927, 425, -679, -932, 574, 847, 8, -968, -359, 911, 410, -739, -854, 151, 721, -97, -1006, -387, 798, 513, -716, -892, 509, 977, -79, -923, -161, 875, 570, -768, -594, 227, 700, -50, -933, -265, 764, 537, -884, -844, 569, 853, -89, -595, -14, 1123, 318, -801, -777, 495, 942, -241, -954, -269, 916, 432, -727, -478, 574, 951, -293, -849, -150, 812, 148, -759, -451, 441, 1029, -225, -918, 51, 1246, 346, -583, -795, 600, 662, -209, -925, 11, 670, 316, -871, -657, 636, 519, -97, -909, 103, 911, 181, -562, -384, 617, 607, -339, -953, 145, 975, 222, -696, -360, 761, 662, -616, -672, -37, 765, -51, -692, -215, 529, 318, -389, -774, 35, 711]
4721G11n51j055N38J020r0q06m04J049L41n37j107N57J031k35q88j62R80M28p80
4740D0q41M91R15r2j046N9Q61N55j005r08O93J188j81j502M54P92K39p64p60P33
4760g9Q19k65q86j44P45L77o37p15N61Q07l02r22Q9Q74L99q44r55R14P45j79j056
4781f54k6J091L76j156n91Q09P71k25q81j80R76M02q08n73N38Q00k65j111j13
4800h20J147L88p27p41Q85N81m59j172M58J018J75n43q90Q16O93m00j032L05R34
4819F16K60r94p64Q76L83k88o64J46J415k26j761j60R91R67k93j443L42J195L5
4838F33q41n09O93O81o66q57O17Q66j1r24n82R26Q80o53j140N94Q44N1j189j73
4858g60R50O36p70p17N84L69L58j123n47J296M73o12q23M39Q92j48p75m12J091
$$ y = [711, 160, -895, -357, 663, 573, -233, -637, 412, 753, 216, -891, -334, 697, 462, -426, -588, 392, 820, 40, -801, -310, 605, 513, -533, -474, 387, 942, -63, -971, -278, 910, 729, -773, -319, 473, 712, -52, -812, -79, 740, 475, -411, -555, 190, 567, -70, -785, -224, 583, 281, -641, -552, 322, 721, -123, -1078, -164, 581, 402, -654, -680, 411, 787, -369, -960, -151, 620, 395, -486, -666, 310, 712, -96, -669, -131, 669, 404, -707, -820, 327, 715, -12, -753, 132, 713, 254, -918, -460, 558, 733, 190, -700, 116, 809, 409, -623, -318, 616, 876, -118, -882, -6, 377, 89, -575, -429, 986, 760, -1001, -1161, -170, 797, 504, -939, -597, 598, 633, -208, -717, -24, 657, -9, -866, -249, 617, 606, -318, -900, 26, 906, 253, -887, -293, 551, 602, -587, -760, 190, 826, 56, -661, -77, 292, 650, -473, -1020, 276, 749, 137, -686, -247, 645, 497, -278, -690, 401]
4877D01L37o88p73M67R40j92r26oO10N87o56j125P81P90j80r13M4P74L32q30p78
4898a004R95Q38m37q06j37P76O58q37q71P96Q48m61q56j47Q38P41j019m41L62
4917a64Q41k64j095J30O70N12q89p93J146O62o43o38p6R17M34o63o82O21Q18o78
4937A66p44K01M88O29r40o29Q04P98k77j074J05P14L98q59n04O87P08o15n06K76
4957a74P27J30j079j95P34N07m06p62J88Q41j02r42j24O44N27k07j145M58Q53
4976D73Q2p92n60Q86P01l54j222L58Q29J14q29n57R91N56m18r11N45O14j37r19
4996e50j89R72L61n58n35J72P19O7q63k39O20Q82o74j118O80R12P1j366l74J082
5016G2M76l72q75L36P91K0p44l30P19L79l27p45K41J196l07r00j03M88P45q50
$$ y = [401, 738, 50, -723, -256, 684, 492, -434, -440, 170, 757, 101, -1024, -243, 547, 367, -546, -502, 272, 604, -226, -1004, -9, 829, 392, -414, -551, 225, 883, 46, -825, -29, 819, 358, -498, -645, 193, 934, -85, -526, -164, 677, 413, -682, -552, 118, 630, -259, -1052, 94, 756, 113, -525, -601, 316, 750, 87, -595, 26, 844, 166, -578, -377, 111, 740, -200, -829, -25, 773, 496, -578, -473, 241, 639, -220, -724, -37, 671, 56, -450, -174, 553, 683, -396, -591, 143, 650, 244, -518, -330, 511, 409, -533, -657, -13, 514, 307, -838, -380, 473, 555, -237, -797, 89, 790, 436, -786, -428, 401, 515, -314, -871, 120, 676, 258, -653, -108, 506, 369, -550, -739, 233, 594, 36, -499, -327, 392, 459, -404, -643, -23, 859, 185, -933, -253, 659, 730, -636, -1010, 72, 548, 176, -699, -363, 428, 448, -296, -626, 93, 472, 145, -600, -359, 837, 530, -370, -473, 15, 760, -90]
5036i0l98N56M88l18o20J09O90J76n81o18K40R15j47q55O1O05N25r94k07L60P78
5057F75n23n91N0O01M39q20n67P35O24l42r34J17R32K09r21m31N42P16k14r52
5077f55J58N61O83q10n19L03Q32n29q35L75R93m3k67j018R14R1M5p49N45N52l7
5098E90q71r1K48J437q54j362O83R57j25r30K11M5O78p44j82M07O81l88l71o95
5118f76P00N90o7j172L59O29K40r62k15M68O09l57p62J94P42J70p18r3P14K78
5138F71m78o72J55O93j42n30l23P11M80l76q04K62P60j28o88j49O50O97j006j88
5158d05K41O40l3p28m01Q26N22p92o26J60R78j1n24k16O83J08n21m61L00P49n2
5179D37q70p9Q43K76o04n60L70P62k88o36r7N26L30l56m98M47P29k45r47J23O38
$$ y = [-90, -488, 68, 556, 238, -382, -273, 417, 593, 12, -606, -366, 549, 402, -453, -392, 213, 738, -256, -463, -103, 675, 152, -439, -389, 212, 651, -169, -736, -1, 623, 281, -653, -536, 396, 605, -316, -747, -205, 511, 297, -655, -497, 64, 747, -63, -582, -279, 553, 24, -811, -436, 557, 514, 247, -771, 143, 234, 279, -470, 75, 627, 590, -281, -372, -124, 1313, 459, -903, -220, 737, 612, -318, -107, -62, 616, -128, -310, 97, 778, 390, 19, -676, 24, 614, 547, -625, -266, 363, 603, -359, -574, -106, 503, 146, -616, -422, 320, 490, -228, -321, 393, 671, 193, -479, -324, 369, 227, -303, -626, 85, 565, 189, -615, -353, 407, 279, -409, -558, 92, 789, -217, -405, -164, 476, 443, -285, -686, 140, 662, -130, -756, -596, 382, 371, -153, -369, 314, 422, -99, -560, -260, 489, 437, -433, -512, 331, 607, 3, -557, -187, 575, 287, -349, -446, 80, 410, 54, -444, 3, 732, 487, -460, -337, 301]
5200C01O2k30p15N22M97j50o84j21J093j11p98j86L84P30l12q63Q6P47J00m22
5220g0m45J47J099l66p62L0Q37j1q08k13P21L57l40q06K26P76K09q23m88R06M44
5241F20m93n58n1Q39L26j056k64N94P52n87o93L40P18m7n48n46Q74N18m50r57
5261f69K98N81M47q44m81Q09O70o26n96J28P60K06p84n29O15N83o71l57K41O85
5281D66Q8q19r7M04N76o75m04K02M70K53q07n7N48L27n60l80K21R33m83o55q7
5302e36O02N62m71q53K43R28k91o58k15R31J64l59n41J60P60Lo85j09N38M99n05
5323A67p65N35O75m12o96L45N42K96p99n87N22Q70m87p73K95O24M11p82n20L88
5343a51O42n56l98o8O56M22l70o83N96N23m70n60k11Q98R3o8r43N57N12k65q71
$$ y = [301, 363, 133, -582, -60, 437, 287, -397, -518, 575, 464, -334, -520, -136, 594, 282, -581, -495, 252, 352, -70, -515, -368, 731, 365, -397, -367, 470, 459, -349, -562, 159, 516, 176, -630, -404, 372, 581, -242, -730, 176, 620, 127, -431, -482, 357, 683, -373, -637, -43, 709, 122, -571, -231, 487, 440, -108, -654, 220, 738, 288, -669, -371, 210, 657, -187, -668, 141, 811, 185, -411, -283, 477, 683, -101, -630, -15, 568, -103, -460, -219, 466, 554, -265, -362, 42, 618, -57, -461, -259, 211, 464, -343, -400, 148, 475, -85, -465, -244, 689, 206, -449, -536, 66, 628, 157, -696, -453, 475, 184, -474, -689, 242, 406, 47, -494, -334, 426, 429, -256, -365, 173, 672, 167, -598, -63, 612, 200, -496, -151, 391, 687, -112, -699, -177, 693, 206, -567, -272, 352, 763, -19, -539, -151, 491, -65, -463, -531, 125, 547, 177, -506, 90, 613, 143, -417, -628, 270, 363, 295, -648, -91, 421, 156, -715]
5364g15O02K17K32m81m66Q19M81q01l24r7R77J89r15k69Q67K95l39n18n2Q34P1
5385F07j081k91P67N88n67m37K99P67k50p35k63O23L54l25o03K94P26M9o86n04
5405f68O16Q01n28q14L44R48j57o79j77M59L67l92l86j32O37J11o54j9O03R8m23
5426d5m62K03N43K82r70J37O35L74n78m30Q2P08j57n56j05M34L22k45r50M82N43
5447B47K02q72j01P60K03l38o86N83K99M1p59q7O58N31o60p74L48R43j25j068
5467f55L25P17J52m09o31M44O83m77n89r6P88L72q78j70J75Q71n05p16M24N10
5487C35N1m90l58N37M11j22m94j47O19J07m84l85M12M91k86q72K30O70L08m88
5507D5o47P86J26j16o79J27P07km84k41N20L93k78p13j9Q02P8p34j81N61L66l17
$$ y = [-715, -113, 104, 336, -145, -611, 208, 689, -112, -436, -533, 444, 633, -282, -551, 316, 611, 272, -246, -298, 536, 607, -474, -765, 2, 590, 23, -414, -115, 652, 402, -333, -596, 27, 381, 56, -547, -253, 473, 522, -164, -668, -52, 749, 221, -593, -249, 699, 542, -137, -314, 145, 512, 120, -266, -398, 239, 350, -304, -323, 280, 378, -45, -507, -304, 239, 521, -449, -312, 323, 697, 119, -311, -229, 479, 322, -234, -339, 95, 417, 172, -778, -296, 247, 449, -423, -524, 236, 439, 101, -585, -2, 297, 338, -421, -508, 150, 681, 21, -753, -405, 538, 413, -655, -330, 387, 539, 130, -501, -57, 626, 149, -440, -536, 252, 624, -254, -424, -249, 622, 117, -599, -175, 335, 386, -104, -462, 75, 486, 364, -130, -277, 342, 449, -35, -420, -8, 483, 197, -675, -445, 225, 533, 45, -602, 184, 310, 194, -485, -358, 349, 347, -137, -378, 142, 535, 257, -456, -475, 327, 405, -329, -510, 51, 417, 100]
5529A00p14J89P37j59o30n2O89L79m27n34J50O10J20n61o51Q78M80m94n10K56
5549a44P50l94l98l36N03O48o89k44Q4N55j8m49k80M12N02m94m40J25N99J77p29
5570b60n5P25J0m66l11L72N98j89p85J01M01O03r02m75K46O11J9n14k77O65L35
5591D52m48n07M62K86l3q35J46O79K04l84n87M74L62r7n19L5M24J79l53m46M19
5612h7K82K86p63m7O57Q9m97m61N53M80j66n98J6L76M13n46m27M12O53m59n24
5633c58L4N95L20q88o2O15M08m84q03J86M88M91n78o03L69J000m34p57J62O09
5653C10K11q15k11O88K71l20m77K6N90K01r10M3L72M21m41o87L57N18K11o83m16
5674g41Q18M49m79m63mQ04J18m31m21L59L95r6p53J40O42M5p38n2N02J62k56n45
$$ y = [100, -614, -425, 312, 153, -477, -529, 160, 539, 112, -422, -272, 338, 458, -103, -754, 124, 604, 110, -400, -144, 606, 212, -186, -522, -19, 629, -60, -304, -220, 335, 317, -132, -412, 0, 502, 8, -432, -307, 292, 469, -260, -315, 410, 420, -46, -357, 15, 613, 424, -361, -260, 141, 744, -158, -633, -387, 224, 243, -271, -548, 117, 452, 4, -503, -41, 245, 212, -623, -477, 202, 406, 22, -565, -91, 271, 174, -345, -310, 114, 293, -60, -506, -87, 195, 481, -282, -329, 328, 417, -80, -541, 12, 492, 326, -272, -256, 120, 533, -13, -440, -28, 625, 166, -358, -324, 271, 591, -297, -359, 256, 664, 180, -623, -437, 51, 542, -36, -639, -270, 730, 296, -461, -299, 310, 521, -294, -505, 183, 454, 134, -343, -317, 273, 474, -436, -393, -21, 400, -41, -728, -371, 147, 358, -325, -741, 77, 526, 47, -416, -420, 384, 502, 71, -350, 9, 404, 308, -445, -305, 337, 382, -356, -408, 94, 256, 0, -545]
5696e45M45N50M9o77l55O42L64m13m83K66O60p9p26j20Q11K30m06n94M32L77k30
5717A98m04k08N73K83m34j44K02N06k63p07N37J24j98r3k83J42L73K07p87LO14
5738B41J04l77m24K32L70m6l75J00M05K28n02p74Q05L55r5n15n45R89K18l44n06
5759d56M93L11L3q11j00J125l77o15l19M67Q63m55n65L66N2K20k72m30Q24o11
5779b57O42p10q2K26M89m01R4k19J710q66j549M26J325m54p54N84l81O72n58k86
5799c49m3Q14k16j84k50J51P07o14n63L69L80K15p16J01L05M63o93n73M90M26
5819B20K56p18M7K16P70n70m25j41Q67j08p35M22M86K9l99k90k98R42k32j074
5839g35O76K83J06K96q92J5R17k05n32j76M80J51k47m88k9Q30k43o38K97N46K
$$ y = [-545, -100, 450, 499, -178, -533, 109, 473, 60, -423, -157, 503, 424, -302, -422, 389, 619, 213, -381, 51, 428, 198, -206, -414, 159, 442, 8, -136, 66, 572, 309, -398, 139, 263, 65, -28, -311, -169, 204, 411, -376, -373, 241, 345, -32, -456, -224, 146, 100, -275, -175, 230, 458, -44, -818, -13, 342, 247, -268, -813, 176, 394, 50, -456, 37, 348, 381, -430, -530, 595, 218, -397, -716, -249, 614, 159, -406, -40, 12, 232, -40, -470, 354, -257, 385, -325, -407, -181, 308, -93, 1, -218, 1492, 626, -923, -497, 828, 374, -380, 204, -177, 495, -63, -349, -392, 422, 206, 22, -228, -77, 630, 16, -547, -178, 202, 417, -299, -198, 107, 570, -123, -696, -206, 220, 476, -242, -195, 21, 791, 221, -204, -345, 522, 414, -321, 101, 587, 616, 217, -73, -371, 571, 339, -735, -59, 224, 330, 626, -266, -251, 666, 461, -71, -247, 233, 384, 137, -351, -380, 450, 207, -431, -134, 412, 414]
5860D14k80o02K10P67n8n82l00M78L44o13k14K35P64n67j94k16N39R5j51m89L75
5881d5N09l35k16k80L35N01r07j57M87N97l41m24j35L97M32l98n26M66L36j61
5901A35n27K53O70N5o06m79N55L65m91j85k28P23R5n33j84M54K82l54k57k21O15
5922A37J19l39k67M25J90k05o93N68K05Q0k90o51P72j41J01j25M99k94K06l20
5942b3m60J095n45J77o95N13K73o0l02k76L40N65m91l40RM45K84p02m00O62M17
5963D86l34o02J11P28j34n22l28P08J84k61n47L43O38n9m43k72L59K69j94o80
5983e50Q9O99K12p21j61M62L03j68m12K30L69k28o01L21M25j57l75j57K89O01
6003D70q3p40J09N24J17n31m27L49O52m41m27J40P00R4m57j49K99K51l66m76j50
$$ y = [414, 134, -468, -258, 509, 451, -131, -431, 47, 391, -222, -436, -201, 563, -4, -198, -414, 125, 220, 69, -420, -45, 464, 129, -87, -367, -32, 469, -438, -595, -108, 489, 148, -276, -411, -14, 418, 20, -506, -40, 296, 135, -392, -139, 531, 586, -20, -499, 56, 421, -70, -255, -483, 240, 335, -198, -382, 72, 354, 0, -257, -478, 137, 256, -83, -350, 75, 265, 60, -633, -65, 140, 220, -70, -721, 51, -90, 11, -114, 385, 91, 297, -23, -483, 612, 67, 244, -451, 62, 335, 275, -27, -303, 37, 602, 111, -229, -220, 225, 509, -193, -593, 69, 486, 152, -450, -339, 389, 255, -267, -595, 113, 297, 36, -511, -168, 470, 411, -32, -304, 55, 324, 130, -550, -461, 238, 450, -271, -432, 30, 333, 165, -247, -17, 352, 124, -477, -156, 269, 112, -263, -420, -131, 470, 387, -353, -244, 280, 397, -134, -561, -212, 440, -1, -428, -288, 412, 506, 49, -100, 199, 450, 84, -392, -542]
6024e42N69N86n57m59J84N90l71k86K28N17j35l71m04N99J97j36n10o7O55J42
6044D29m79m68L06L28o4l36J20M60L9m47l36K56O09n7p75O3N53m7l87Lo8J034
6066G36n86n10J97P8N10n18j90K87N10m38l56Q5M36L65m42n91L90M19m40j74P8
6087a54O91k15m19j76J46N35l14l43L22J53J93m90k35K79O97m12q13L23O51k19
6107B00m60j22L13K89j09m73J72M97j5n60qK30M71l66m91L12L47j76l39k64P51
6128A99J87l60m42L22L57j39l26Q9Q0L12j80l59R1L46j2j97o4M26J36o68k48J16
6150c34P73k64m14k82R28N1m63k12M74L52m54n85O8O81M9m21k81Q2N58j38m05
6171b37j35P17P4m01k46J41N90l43m83j75P92J6k47m56K99O45l23p23K26N77L4
$$ y = [-542, 27, 613, 56, -403, -219, 371, 0, -286, -58, 459, 324, -47, -451, 148, 345, 209, -301, -368, 287, 429, -50, -518, -212, 116, 52, -284, -164, 296, 335, -112, -448, -192, 417, 360, -415, -352, 201, 154, -233, -230, -298, 736, 150, -360, -163, -85, 425, -93, -283, 4, 514, 76, -280, -195, 241, 606, 164, -427, -37, 382, -58, -232, -154, 537, 322, -97, -273, -127, 408, 94, -249, 73, 226, 419, -71, -306, -27, 670, 258, -555, -232, 419, 200, -260, -382, -69, 220, 111, -362, -190, 307, 292, -268, -276, -46, 425, 59, -432, -120, 227, 51, -288, -552, 199, 386, 26, -416, -94, 263, 124, -202, -113, -33, 279, 99, -260, -169, 177, 165, -32, -96, 330, 466, -202, -450, -334, 439, 175, -239, -521, 407, 458, -5, -217, 257, 609, 155, -430, -362, 319, 368, -53, -334, -252, 306, 168, -237, -372, 345, 419, 18, -228, -87, 503, 160, -323, -498, 294, 310, 63, -393, -94, 551, 228, -495, -269, 308, 342]
6192C42n24k3J53L61j76n35K00L44K33o17k41M74N69n65k28P4L31J46k53k40j3
6213a88N13l44l26K67M40J82o69j83J58M55j05o83M64J80L51n84l04M33K95l89
6233c7l69L52N92j50o05J40J77L69l15j64q4L75r3l30j89O27N2l38j98J05J83
6254A00K07n56K01m6L89k81m51M74L85m55r1qK94N6N9o90K3O76M3n95pL91L59
6277D77m34m94K70L67L55q21P7M48N5k25n24K10M23Mn34J07K26M48m48m08K93
6298a28M78j59m98J19K77K71k67n49L61L68K5q01L42M83mk43l39K29L62l0m35
6319a38R2J86J3p7j35o3N61m55m33K8Q32k0m41m50O35M85n79j00k13N93J8m36
6341i7k21L36K79p0n35O9L89L91p47lL31k0O3l64k73P63P7m65k14M55J06m5p25
$$ y = [342, -182, -205, -52, 309, 133, -402, -202, 142, 375, -242, -483, -9, 560, -5, -233, -159, 172, 318, 65, -175, -188, 325, -19, -345, -78, 362, 544, -125, -308, -150, 305, 200, -483, -19, 161, 512, -72, -376, 57, 352, -37, -406, -54, 538, 388, -217, -77, 100, 469, 154, -10, -94, 281, 188, -142, -331, 296, 348, 10, -188, -83, 100, 307, -249, -48, -94, 295, 14, -437, 37, 422, -33, -124, -132, 162, 218, 277, -413, -390, 286, 329, -266, -273, 118, 477, 43, -451, -181, 186, 541, -280, -203, 245, 300, 75, -449, -239, 184, 188, -346, -239, -13, 435, -13, -421, -128, 350, 191, -307, -188, 89, 360, 93, -456, -95, 273, 298, -503, -161, 322, 318, 75, -264, -35, 327, 297, -138, -46, 140, 153, 76, -59, -122, 439, -16, -449, -421, 411, 391, -50, -500, 135, 620, 41, -59, -272, 321, 339, -97, -318, 18, 297, 227, -308, -239, 150, 541, -206, -209, 122, 102, 165, -199, -472, 291, 368, -97, -311, 144, 250, 205, -520]
6364e20L59N74K0n87j46L25L38q5n78L6N75j0l00m98L27N21l76p3l3L27n0j73
6386b7m18N62L20m50m24K40M98j69l83L7L75K24l32nk05K14K40l73k62K07O65
6407E34m95n11M31L89j42k88n9L46J32k44m99L57K47J34l79k76M95L2m04l44M98
6428d6L56j47m35K01L49J99m89l98K9P02j45l59N0L92K18n20k29K48N16k91n06
6449c05QL73M37n91j79L07N43m49l11j04N44k10j38j13K44J85k01j67k20M62m7
6470F8R1m42J50M13J17p34L9O05K28o63k39M01K08J15n88J33L45l5k52n13P60
6491B07Ql57j81J04M20J53l52l18L31L38j07o26K84J9L19j58l26J13L05J74q89
6512e39L02M43J96l74l32M76K70l42k00n1J44K47k42l94L57L45l83k09O1O01q0
$$ y = [-520, -161, 413, 433, -154, -300, 25, 363, 278, -300, -264, 311, 301, 1, -497, -170, 351, -25, -98, -131, 196, 146, -27, -445, 117, 437, -13, -437, -197, 301, 132, -251, -214, 161, 385, 53, 48, -157, 57, 297, -76, -338, -131, 534, 39, -472, -41, 348, 206, -82, -141, 205, 337, 93, -406, -49, 198, 332, -47, -323, 172, 204, -200, -544, -46, 310, 163, -272, -71, 278, 477, -12, -410, -381, 321, 176, -183, -133, 259, 477, -43, -272, -24, 492, 201, -305, -297, 76, 513, -78, -257, 50, 593, 144, -167, -271, 273, 63, -75, -188, 56, 241, 40, -127, -347, 115, 68, 159, -283, -133, 280, 397, -337, -298, 307, 535, -128, -367, 34, 242, 357, -231, -98, 247, 212, -40, -553, 207, 215, -142, -323, -219, 201, 354, 2, -316, 15, 353, 246, -380, -96, -77, 242, 84, -242, -129, 176, 350, -539, -237, 206, 402, 28, -304, 172, 442, 100, -100, -151, -7, 240, -2, -396, -39, 306, -77, -286, -225, 376, 296]
6533B96n04Q4L90P8m92k63L05M71j99k26r6L22K27l87l51J35N63j67k19j08N19
6554C78p1k63k91K1M40o0m81J56J34K60k42l27K62M52l48l84M1L35M01n94M7j50
6576b84O30M1m02n7K68K04k65l35L15K22l05j88P6K3K57l61j2RN39m9l15r6L67
6599B82o6m51m58N78K20J39m64r2M58R9n10l13N85M37k69m07p7L80K46l44j62
6620a89J53N24o47O8k51N11J65n14k93O42J24M7p52L48K88M1k47l75L49L32J21
6641D45o42q1O34qm23k90L87K93k63m31J72L80O0l99m0K39K29Ln55K30K41n3M5
6664A73m55K12M27m07k74j07Q60k14m05l27O54L96l39p28L97M91m8o59K43K16
6684A06N1r2k08N4L09q0k81N3J10P5J59n20K09M94l93l37n7O08K4k65j71K20J43
$$ y = [296, -208, -124, 266, 344, -148, -411, -106, 365, 166, -60, -156, 166, 393, 6, -345, -210, 353, 186, -33, -141, 378, 307, 44, -247, -226, 214, 154, -327, -171, -37, 223, -19, -346, -84, 368, 20, -364, -323, 12, 413, -181, -134, -284, 346, 387, -15, -72, 196, 400, 135, -200, 115, 337, 32, -156, -80, -57, 200, -161, -173, -164, 375, 326, 11, -85, 282, 216, -235, -693, -115, 105, 244, -220, -312, 146, 245, -265, -578, 7, 444, 175, -232, -309, 71, 317, -27, -189, -36, 488, -159, -91, -342, 169, 334, -180, -473, 169, 293, 340, -412, -64, 224, 265, 18, -357, -8, 324, 445, -197, -278, 356, 348, -75, -365, 22, 315, 52, -379, -207, 173, 233, -166, -206, 33, 262, 265, -290, -60, 181, 128, 173, -282, -70, 357, -50, -324, -431, 429, 215, -190, -517, 137, 533, 194, -534, -137, 354, 306, -353, -110, 106, 157, 65, -143, -89, 220, 140, -141, -88, 22, 97, 256, -264, -55, 439, 46, -291, -348, 260, 284, 19, -152, 68, 211]
6707B11j6m55L8L47J74o62l8L41K79J41n92P8J69L82l65o11N34L52k36j64n4J92
6729D5M06m65l48K48L90q6n47L27K61M8l18m95M50L81l03k24o9N96M3l57q2j18
6751b17O64l22k99J6L38Q9j95m13L66L55l29j58J89K99l08k49k25N60J88k88m65
6772d04k20J114l20k94j82M59L44m57k22K8M61J49o73p0L51M70k70l07l55K58
6792a40N25m95l69N89J38k6l66L2K74k9l77j7M33Q4j39m72L39Q7N3k50k76M90
6814H8L74p59K00j83M77k11k33J91J63N8r3l07K75N15k17m65j54L48M01m64m87
6835d83L20M37Mm87j60M22J55k36k90L55K88l55j23j45L35K18l46rJ18J65j01
6856H2k84Q7K19L02n09j98J00N66l14l19n2M44J51l68l63K21K07J36l56L3L38
$$ y = [211, 195, -260, -222, 125, 299, -363, -401, -60, 219, 360, -232, -154, 15, 397, 32, -579, -45, 307, 71, -93, -147, 45, 451, -14, -362, -114, 276, 190, -357, -30, 231, 279, -39, -534, -84, 297, -6, -230, -299, 297, 340, -17, -99, -217, 447, 125, -174, -158, 180, 269, 74, -339, 27, 382, 53, -105, 84, 383, 75, -174, -399, 161, 349, 61, -404, -624, 490, 170, -124, -306, 153, 497, 40, -182, -154, 307, 456, -217, -287, 64, 534, 264, -43, -398, -140, 385, -110, -479, 110, 248, 222, -144, -112, 162, 133, -244, -261, 172, 256, 117, -355, -16, 71, 124, -126, -402, 88, 462, -297, -97, -280, 197, -14, -247, -56, 107, 165, 72, -235, 40, 555, 338, -127, -281, 67, 468, 4, -483, -163, 274, 278, -209, -369, 53, 208, -28, -318, 37, 325, -30, -153, -298, 37, 255, -91, -100, 18, 183, 82, -202, -115, 104, 406, -103, -301, -201, 365, 51, -268, -320, 124, 275, -93, -456, -235, -28, 108, -248, -215, 123]
6877A23J71m22K8%K47L01n46J22J94ll21j45L92J30j90k83j26M11J77j60j48j3
6899f1K81K8rl95K21J81k39j64K81P2j75m29M44J35K20m80n8j46N11Q2n62K47
6921a5m4N22o42J27qJ56J42j93m8O3m5j46k90P05j66K9m60K52M41l9J04n86N43
6944D02M9k77m76L68k86k39n4N05r9M19l55k28K58K52k8k39K2j4K43l09m16L84
6966a18L77K9m90j24M86R0q5n35K96K69j86j2n9r2M98m09k55L18J07R1l13k01
6988c18L90N07n40m12L55L20mm62M4M65K8j93m16J17L57j19m38L64Q3P3j90l44
7010c33L24M70n90k78J44M04P2J32p47K05L26n9k39MJ57M15l68l2O0O3l9n44M8
7033d05N58M38o05j48J26M20l98l47K68K45L83n72n58M65K91J96o17o4J063o24
$$ y = [123, 294, -128, -100, -100, 147, 448, -98, 24, 218, 215, -106, -251, 141, 271, 81, -202, -328, 83, 260, 100, -48, -61, 220, 248, 239, -156, 65, 246, 7, -157, 124, 196, 21, -408, 36, 171, 391, -89, -147, -293, 218, 300, -262, -15, -59, 463, -179, -52, -60, 96, 238, 45, -3, 60, 15, -131, -421, 284, 118, 147, -313, -61, 380, 341, 445, -141, 402, 451, 174, -302, 66, -220, -459, -513, -8, -107, 312, -43, -271, -13, 239, 211, -28, -6, -20, 223, -86, -502, -118, 259, 288, -202, -326, 160, 250, 165, -370, -74, 195, 9, -3, -62, -154, 344, -65, -320, -2, 105, 196, -117, -318, 72, 579, 39, -373, -18, 302, 298, -164, -120, 345, 373, 180, -236, -119, 238, 119, -319, 45, 128, 201, 11, -333, -9, 461, -129, -407, -263, 141, 213, 345, -402, -197, 129, 70, -169, -165, -8, 407, 39, 7, 67, 130, 91, -453, -405, 153, 591, -14, -162, -36, 384, -14, -361, -93, 152, 535, -37, -595, -130, 161, 357, -260, -324, 739, 115]
7053A15J25rl99L59j07m11J91K82M04m73l08M90j75L0j03k25P86j50n97k9J01
7074a03L95m7l70J42K69J0l93k10N09Q1l98j49j6N24j54l28j93M22K67k84L9k34
7096b21N18j46l85K29k00M97n06M8j00M83o1l92j21N13J34m15M1j77N42k38q9
7117d6p5Q0L22m0n73J68M20k54j56k9L82j07l32K25j9K10l8n88M44L70J94m86
7139G2j60K00p6N49n09m32L92L51m31k85J84K02J74m95K20J0M34l54q6J3K65L2
7161B70l62k06L89L37m70j60j2L33M2l70J36K31J90m28j60L17K23l87J16l00L45
7182G4N0j88k23Q7K28J93k91j15K00k51Q44j349N16J02P4K4r7L03k37L5p2k3M04
7205B88l37k14M6L95j2k19j8OL33j80k72K62J92j5k40k31K43P8n7l58J22M00J19
$$ y = [115, 240, 231, -168, 191, 84, -327, -136, 146, 550, 77, -231, 259, 84, 114, 11, -214, 572, 422, -175, -204, -103, 292, 245, -125, 17, 286, 296, -97, -307, 202, 283, -115, -264, -280, 244, 90, -238, -431, -9, 258, -26, 13, -221, 297, 151, -234, -5, -205, 292, -214, -166, -266, 217, 156, -236, -357, 156, 290, -125, -84, -261, 281, 43, -46, -121, -41, 281, 241, -332, -164, 256, 2, -154, -183, 199, 92, -240, -15, -34, 176, 138, -450, -6, 364, 558, 72, -88, 112, 36, 585, 76, -356, 36, 387, -44, -329, -145, 57, 231, -264, -44, -34, 400, 46, -40, -27, 238, 270, -92, -298, 91, 428, -42, -202, -214, 119, 161, -209, -73, 158, 348, -80, -240, 77, 300, -87, 29, -271, 74, 124, -64, -287, -200, 28, 221, -70, -185, 15, -236, 608, -741, -225, -123, -49, -25, -122, 181, -56, -21, -93, -116, 288, -49, -263, -217, 178, 166, -53, -71, -65, 268, 88, -184, 78, 270, 255, 15, -216, 27, 105, 48, -310, -188, 212, 331]
7228C31l92j20J92K79l41j19J45K82Q1n47M4j55O84k98k44K40j20K27j64m68M20
7249d3K49J7m62M63k2j38j16j95O14j5j92k74J71K19Qn43J86O9M28m92j12J6K90
7272A26J80n73L83j90L84k84p7j87M91o9k85j24M37J58n30N0J9K38J64l44k18
7293b51N00k8m02j70K43L72k30j30j71N38m7j69k27J79J27o6j55j01K41O1j0o07
7315e03N22L81k29m65q6L79L40l57j93M57j13k78J4J08J53j26q5q6N2J60K9n14
7337d40J89J75K41m08J40J39J91K53o26K21J27j11k7k97J12J58K48o50J98N16
7357C49j12l28mQ7K55J4l86J35K02k0k31k93N8N47K7n82L8K92k10P8j31M02R0
7380B77j28l66J03K30j44j34j80J81K29j77r7K28K76m5l96J23K8J57j55l44K58
$$ y = [331, -61, -181, 11, 290, -51, -170, -25, 257, 338, -209, -165, -320, 364, 66, -178, 62, -58, 169, 5, -463, -43, 206, 223, -239, 224, 202, 64, -52, -247, 367, 352, 160, -114, 57, 276, 284, -259, -73, -4, 424, -68, -180, -164, 126, 306, -267, 116, -74, 310, 26, -51, -238, 253, 184, -101, -225, 212, 370, -160, -110, -91, 147, 311, -33, -251, 249, 221, -181, -351, -108, 264, 34, -96, -267, 271, 224, 55, -172, 7, 134, 68, -87, -188, 53, 114, 104, -503, 19, 400, 171, -294, -380, -1, 339, -18, -211, 246, 133, -145, -131, -23, 130, 4, -81, -167, -115, 45, 74, -440, -251, -76, 165, -243, -103, 36, 227, 480, -146, 75, 202, 91, 64, -233, -121, 37, 285, -365, -167, 349, 237, -91, -95, -8, 247, 261, -125, 10, 212, 192, -39, -332, -274, 273, 300, -282, -244, 48, -162, -84, -215, 187, 277, 149, -217, -114, 116, -28, -162, -342, -161, 68, -109, -206, 22, 298, 253, -143, -20, 8, 165, 10, -334, -76]
7401g6N46l26k27m9N21l22J96o50M27K18k01k73j7L74R6j07l16K7M27rm66q0K71
7424a6K68Mm21K9K92j0k02k87L21J97l49k65K53N55k24n29K14J17J72l8l17J50
7446h6M36k52l99K93rK81k72k66K32J81o4o1j18J77L8Q0o11L97J90k07l57L38
7468e9K93k55j90j86N49J33j93j45p8L06j02k35N8J71R8j46q8j38N54j57k32k00
7490b42K13L66m75m16N02J00k3j1k13J69K20j81k92J71M61j50o18K55L64O8k25
7511D3j59n79J31R16K79j232O45J54K8m52K37J36j63K20l27K52J61l58j20J0K71
7532I3J04k68k38L69J96m3p06M61J2rp0k28M93r5O2m45J79M18j28m33J34JK24
7555H3k57k43L59K55q2q0l55M67m8n0k3j09L58j88m8k68K9N62m27k38J64L06j42
$$ y = [-76, 470, 144, -83, -132, 389, 67, 263, -387, 40, 258, 57, -216, -233, 141, 237, 130, -186, -159, 268, 259, -207, -287, -16, 252, 256, -165, -136, 156, 146, -56, -343, -22, 175, -174, -439, -186, 369, 145, -384, -170, -53, 119, 81, -236, -86, 350, 98, -301, -8, -17, 264, -8, -274, -42, 139, 75, 14, -104, 73, 111, 191, -420, -23, 167, -40, -397, -59, 234, -21, -211, -397, 152, 285, 92, -53, -131, 175, 73, -162, -104, 67, 165, 19, -69, -207, 347, 190, -42, -242, -29, 337, -138, -554, -52, 48, 25, 14, -199, -30, 190, 9, -283, -112, 349, 199, -419, -164, 200, 268, 43, -116, -695, -564, 352, 631, -601, 44, 198, 226, -226, 11, 147, -16, 204, -123, 129, 290, -68, -188, -178, 93, 197, -71, -309, 60, 256, 213, -493, -32, -20, -29, -99, -327, 166, 71, 133, -312, -133, 285, 157, -276, -142, -141, 83, -174, -417, -58, 197, 115, 35, -320, 147, 99, 49, 26, -83, 275, 87, 39, -229, -200, 362, -65, -303, -139, 167, 25]
7578B5p0k6L54m1n09R8J43Jkk73l7Q79l73m29Q4J39J41J3j66k83L67J77l42J17
7602a3J36J61k43j95J19K88O5k36l74L34j26K41m49J29K73J4k28j48L73J25k11
7623C5K8O5Nj12l32J38O1L41j74m46L60lK56m73L10R6j37L02m64q0N20k07o9j15
7647i5K98j57M3q6%K82j45k98K44M5p4J87m29J08L64k50k02J67k74N28n32J61
7669a15pK49K9l98K80j21J03j21j58J53M50k76k64J13K34r3j54j21q3L70J25l90
7691a95j24L98M8o3k38J69K05k54j25J50m0L48l43r5L42k19j27o5m3L37k1M4k07
7714a18J53K16Pm20m3K81Q7o30M65M2K70l00m34Q8M61K86n80j40L51K52k51k63
7736b20k03M81L30n47j83N34J4j42m51L67m7l7J08k73J22M33m34k03K58K42K8
$$ y = [25, -45, -71, 283, 242, -267, -169, -26, -25, -27, -300, -337, 542, 169, -260, -176, -37, 104, 117, -49, -332, 35, 212, -130, -13, 123, 284, 41, -154, -35, 253, 318, 82, -292, 42, -84, 157, -292, -163, 110, 124, -104, -252, 121, 246, 35, 63, 128, 133, 21, -311, -173, -112, 229, 55, -391, -31, -34, 222, -251, 59, 155, 18, 320, -144, -224, 296, 89, 20, -95, 203, 46, 89, 3, 3, 285, 140, -158, 86, 131, 57, 244, -185, -77, 287, 37, -165, 2, -272, 256, -276, -115, -122, 127, 156, -242, 38, -83, 20, -101, -259, -106, 344, 68, -196, -83, 151, 58, -96, -217, -300, 70, 195, -195, -319, 79, 127, 64, -174, -5, 200, -54, -179, -29, -69, 279, -64, -159, 183, -36, -163, -228, -271, 66, 45, 89, -118, 35, 251, 258, -162, -205, 76, 163, -467, -2, 40, 310, 10, -424, -336, 125, 411, -169, -309, 42, 294, 43, -220, -423, 58, 388, -159, -342, 192, 206, 64, -387, -20, -67, -104, 4, -269, -147, 286, -148, -351, -93, 149, 177]
7757A77j72q9r2L98l97m9L67j1J52j63j84j47K73J82n03J72J89j80k87L58K11
7778B05L9k53l00K22K41j62Rk65P7L47j23j99K31J11j49j77j12K10K19j13l15
7799b57J11K45n2L9k79P3K87P3k93J4J15R1l50p4L89O4J6j83j96N89m95l4M7P9
7823A9J48N9l67L12K77k52l32j54L22N6rl71J39K60J19k88k05K76n2J34l57J01
7845a65K03J55l96J8M55M9n39M11k32J67o6k31k7J46M1%k33J11M08k52k26o6M00
7868A31M3j73l81L23K44j22k28L9O2J05O3k32O4J81n0j45J15K22K4k12k06J42
7890IM36n52j0Q5J69j45p9Q6P0r4J6j91l1J10L06l54O9K47Q9j22l00L4K02lO0
7915A07o4J19j07K10n27k4M05j29P6j78J58k5O4p9l0J06J66k07k85L89O5l39k00
$$ y = [177, 5, -84, -176, 222, -175, -224, 143, 132, 284, 121, -63, -210, 63, 245, -258, -86, 103, -77, -364, -6, 205, 244, -9, -309, -87, 154, -8, 1, -264, -187, 160, 37, -162, 69, 180, 31, -146, -258, -48, 171, 58, -257, -146, 99, 47, 86, -193, -120, 167, 240, -53, -39, 76, 167, -183, -257, 132, 196, 212, 29, -167, 422, -73, -107, -60, 19, 167, 226, -141, 171, 448, 196, -136, -290, 32, 88, 79, -292, -153, 107, 226, -62, -267, 9, -43, 91, -266, -165, 38, 193, -203, -185, 270, 319, -220, 191, -41, 126, 60, -171, -198, -52, -11, -11, -244, -133, 275, 23, -203, -269, 131, 174, 1, -380, -57, 187, 65, -163, -124, -62, 43, 106, -126, -62, 119, 69, -76, 39, 261, 285, 73, -133, 9, 445, -107, -117, -32, 137, -8, -87, -1, 69, -25, -9, -200, -231, -121, 185, -169, -100, 147, 236, 114, -186, -152, 50, 47, 107, 43, 162, 55, 265, -262, -286, 119, -10, 66, -112, 46, 21, 85, 6, -24, 82, 248, 41, -244, 145, 210, -129, -329]
7938c29J0L75J13j78j64K04O2o2k39j52L86L7l80l7K79R0J37k81J45mK53l86K8
7961i3M9K07j14m05M43M9M3k67j08J14J99j67k55L0M05k06K43k41J69k2r1j52
7983a70J9L43J02m73j00K29K51j77l24L54O28n08l04P6O1K45m43mL38j9k28j1
8005a15j23M47J94l58j05r0J94J78m41Q0J62J55k65l9J14J89J32o61M8N00ml59
8027a67J4K44Q5j28j04r5M66j65l46J21j41M44k87J94l85K78k6Pj49K1L53j50
8049H4o7J9J11r0k01l7J84K40l25j88K37Q8J48l33PK69M7k30l78J65L73Q0l76
8072a73J8k3L25Q8n78J48L09j27k03J28r2J62L8J2P7k01K06k59j32L77j19L6k48
8095b31M17k01J66k72jR4L42J27n58L78l91K25j19l9J26jP1j98R3J3K16k72o8
$$ y = [-329, -319, 56, 169, -9, -173, 31, 93, 31, -208, -360, 26, 63, -317, -354, -75, 15, 152, -129, 16, 12, 265, -121, -93, -44, 163, 49, -356, 87, 136, 179, -88, -196, -82, 117, -50, -305, -275, 130, -76, 167, -74, 95, 73, -18, -170, -151, 192, 294, -179, -279, -50, 201, 24, -300, 54, 682, 174, -130, -54, 7, 252, -191, -195, 143, 124, -104, -115, -238, 209, 403, 45, -60, -150, 44, 222, -219, -139, 23, 178, -87, -126, -12, 177, 309, -352, -304, 196, 192, -167, -153, 91, 176, 48, -56, -151, 315, 150, -196, -75, -216, 228, -59, 135, -250, 28, 2, 9, -140, -119, 234, 84, 17, 36, 147, 57, -144, -181, 3, 243, -82, -270, -33, 55, 203, -130, -123, 146, 193, -37, -415, -250, 123, 203, -173, -155, -178, 147, 235, -343, -195, 114, -13, -216, -88, -180, -18, 20, 32, 109, -92, 114, -145, -277, 100, -19, 17, -231, 186, -15, 151, -121, -122, -28, 314, 441, -117, 261, -130, 95, -24, -63, 63, 62, 133, -65, 28, 41, 257, -15, -83]
8118h3K84j6q3j52n8L15j48j51M4J35P9l79j37O18j54J04m19K28M9L1l46J54R2
8141Gk6J00m02K9J67J84j03l27K77L17j48k43K19N4Kk59j17M38pP6k11j59J66
8164C4M4k06k52P19j35O8m98L39L1J48l97j91N99l41j10l07n0N66K20p11O12j1
8186A71o8j21N3l77N30
$$ y = [-83, 201, 185, 102, -50, -108, 207, 59, -92, -48, 87, 166, -213, -350, 268, 114, 218, -201, 27, 76, 107, -239, -85, 7, -19, 81, -321, -292, -125, 59, -44, -371, -94, 223, 75, -168, 51, 105, 107, -152, -269, 169, 162, 238, 27, -132, 34, 78, -128, -380, 339, 204, 272, -226, 113, 144, 292, -105, -296, 303, -38, -148, -455, -505, 61, 281, -430, 182, 171, 103, -18, 35, -342, 188]
8191A88
$$ Imaginary data points
##PAGE= N=2
##DATA TABLE= (X++(I..I)), XYDATA
0@%%%%%%%%%%qJ6j6K3l1L2m0N6p2Q0r6J20j36J60j92K24k59K99l44L96m55N19
32B76n89O67p54Q50r55J071j198J336j488J654j834K032k249K484k740L025l336
49a748L673m046M457m912N420n986O623p345Q176r139J0268j1620J3267j5330
63h242J8000k1602K6757l4785M9081q2097K94641J32880m52914K04597Q8714l0226
75A84804m226q6965P093J89543p3523j48710J4221J05228J1342o7742o9497L8662
87A00230M6442l4365o3408J9321M0248k734o3091n5294K1727O1508l4268n8010
99b1694K8958K2464m6542l3666q402K2676L2102j5743n2534j5901M4139O644n9872
112i7371Q354M4540q480j9149l5469r99O5044L963m3390o186J1524K2894p342
$$ y = [0, 0, 0, 0, 0, 0, 0, 0, 0, 0, 0, -8, 8, -8, 15, -16, 16, -24, 32, -40, 40, -56, 64, -72, 88, -104, 120, -139, 160, -184, 212, -243, 276, -313, 354, -400, 450, -505, 566, -632, 704, -784, 870, -964, 1068, -1181, 1303, -1437, 1588, -1748, 1925, -2121, 2336, -2576, 2844, -3142, 3481, -3864, 4312, -4827, 5441, -6179, 7088, -8242, 9758, -11844, 14913, -19872, 29209, -52888, 241753, 374633, -78281, 126316, 215030, 184804, 180578, 93613, 100706, 290249, 216726, 68016, 82237, 187465, 198807, 131065, 61568, 100230, 146672, 112307, 48899, 68220, 108468, 105734, 42643, -12651, 9076, 70584, 36316, -21694, 7264, 29728, -16814, -50480, -58882, -36206, -4104, -19847, -72381, -88282, -44143, -37499, -97371, -89017, -44477, -52957, -72106, -107575, -108574, -43530, -39567, -82957, -89143, -77619, -54725, -62067]
125f2067l9359K2933N3360o024l6245j7462J7093M0770P892l7936q084M5234J6185
138c710m3444j8269L8448L6059k640l9788k5790M7566L9541l9224k7875L2603
150f523L5415j7479n0307N644N7198K1777l5642m2631K1878M7654k0514l7491
162b1021J7025M1455R236m9441l1673M3250L5425j8986k6478J528L3625N620m8669
175i104j2022N0779K4078l2840l1773J4205L5136j098l3523q841L4850K0207l9001
188A1053l3134L2701M0383n294l8413j7569L1132J8532k8872k0271J8640L6064
200D4952n8m8981j6908L8660K1795k1694k8723Q886L2700m216l5100r427L0295
213A2181K5942k5807l7499J2523K9461N8k2812j2052K4061J9206k8892k9990J3845
$$ y = [-62067, -101426, -78493, -25133, -31157, -67402, -84864, -67771, -27001, -19109, -57045, -65129, -19895, -3710, -47154, -65423, -26975, 9084, 6444, -33344, -59134, -11568, 27973, -11251, -39126, -6523, 28892, 11413, -38894, -33250, 23948, 45725, 10083, -32548, -10670, 36984, 16470, -21021, -3996, 37459, 46695, -2746, -34419, 8831, 44256, 25270, -1208, 320, 33945, 39565, -9104, -21126, 29653, 53731, 20891, -10882, 3323, 38459, 37361, 3838, -5003, 29847, 50054, 11053, -22081, 10620, 51003, 45709, 7296, -10273, 20859, 39391, 10519, -9752, 8888, 44952, 44894, -4087, -20995, 17665, 39460, 17766, -10957, -2071, 30629, 26413, -8687, -18114, 12181, 38123, 12316, -25183, -12660, 16801, 16859, -5953, -18005, 6056, 25262, -3630, -33620, -19775]
226a9775L3990O129l2948j7597K6773J7131k2868k3137J4610L2444n725l6572
238b7545p845K9320K3110k0266l1859J4553K8940r058k7518m617L3907K3282l3855
251i451l2443K1292L1468n510l1148k601L7691J0828l6359k4114K5180L7153q876
264A3110l8607j006L2642J1975k6691k3870K6481L4257j9746l7073L955L5856
276A1283J6018l0773k4691K5657K6415j7266l0297O964L6886P473l3349j8653
288b4333K0975K7147j1701k9633Q658L0364K9k7761j5537K2729K8965j6264k8149
301a4511Q692K3335Q84k3833r926K6324J8908k0032k6555P980K9543K302k6657
314c546p926K1106J5217j6366k6375J1619L2082l544k7533r180J9474J9284j6130
$$ y = [-19775, 14215, 20344, -12604, -30201, -3428, 13703, -9165, -32302, -17692, 14752, 9027, -27545, -35390, -6070, 17040, -3226, -35085, -20532, 8408, -650, -28168, -32785, 1122, 24404, -9451, -41894, -20602, 10866, 5356, -25792, -28393, 9298, 20126, -16233, -40347, -15167, 21986, 13110, -25497, -26503, 6139, 18114, -8577, -32447, -5966, 28291, 8545, -28528, -24573, 11283, 27301, -3472, -28163, -2506, 23909, 6643, -23654, -16690, 20196, 27669, -5680, -24333, -3358, 23789, 12088, -17545, -8887, 21477, 21506, -6255, -21792, 937, 29902, 13638, -14511, -5819, 17516, 18400, -5433, -15359, 10965, 29873, 9841, -16714, -8734, 20809, 23111, -3546, -11472, 9634, 24851, 8485, -17890, -6271, 25811, 22267, -5266, -14446, 5028, 24312, 8182]
327H182k4468J1871K5924l056k6952r976K4640J8265j7554k2539O437K3757J059
340A5590k6980o658K5954J3876j7771k5876P166L0838p99k7338o093K0956J4542
353A7407j8504k3616J4041K7849m423k7265q327K4332J5335j8977j9002J1201
365i949K3770k294k9140n840K8078J3112j8480j9333Q643K4545l897k6840p71
378a8396K5695J1336k0362k2131J3289K5387m781k3164l362K2901J0748k3764
390f604j5670J7169K2610m733k7542m530K6825R508k2513j3848J6062K2114q742
403A0106k7349P1K5733J0072k0212j7726J6351K1717j1868k3726L061K5484R420
416B1134k3745j7747J8043K0038r001k1426J941K4991L636k5146j0198J9368J9158
$$ y = [8182, -16286, -4415, 21509, 18453, -8499, -18475, 6165, 24430, 6876, -15663, -9226, 14531, 15590, -11390, -18048, 7906, 21782, 4011, -21865, -14699, 16139, 15340, -11998, -18091, 2865, 17407, -1097, -24713, -10672, 17177, 12754, -14511, -22838, 1494, 16829, -2148, -21150, -9949, 13821, 11527, -17613, -23453, 4625, 17737, -743, -20076, -11433, 13112, 9215, -17625, -18396, 7299, 18635, -1727, -23858, -10569, 14818, 10037, -13127, -16489, 6412, 17160, -6604, -22274, -5105, 17505, 12772, -14770, -19300, 7525, 17033, -5480, -19328, -3266, 18848, 10106, -17243, -17172, 8561, 18633, -1579, -19305, -2954, 18763, 6895, -16831, -13770, 11714, 21134, -2611, -20358, -2315, 17723, 8722, -12704, -10763, 14228, 17864, -7282, -17480, 1888, 21046]
429B1046j0263k3713K448K3431L327k0153j1283J8923J9207j4772k2845N853K2530
442A3736M661k0559j1719J7843J6045j3463k0295N731K4492L049k4362j0044J7599
455B714J4793r865j9176M468K2053K6k2516q753J9504J7205j4665k0777P000J8801
469A0812Q70j8967q732J9280J3865j6241j8486P525K0696J477k1518p489J8146
482A238J0824j3363j7085Q475K1168R14k2932q959J9111J3902j4631j6739J0901
495g176J7591j876k0486r263K1915J7278j7804j8992J0147J9405j613k0875m381
508a6130K1997J0616j7672j7412R789K3201k190k3426k431K1101P921j8826j5126
521a8588J5051K0570o160k1141m464K0692J1013j9756j3660J6308J7093r293k2014
$$ y = [21046, 10783, -12930, -10482, 12949, 16276, -3877, -15160, 3763, 22970, 8198, -14647, -8794, 13736, 18397, -2162, -13881, 3962, 20007, 6544, -13751, -8020, 16472, 19521, -4841, -14885, 2714, 17507, 7642, -11534, -7066, 14987, 15013, -7503, -16256, 3248, 20453, 5788, -14989, -7989, 10812, 11682, -7285, -16017, 3263, 17128, 887, -17599, -10074, 10622, 12099, -9419, -16908, 1238, 12062, -1301, -18386, -9911, 11257, 12171, -10761, -19720, -609, 13293, -1338, -18077, -7176, 10415, 8539, -11947, -21210, 705, 17983, 179, -18813, -8666, 10739, 9126, -11749, -16130, 5867, 16483, -1189, -18601, -8812, 14389, 12199, -11227, -13658, 7443, 15364, -3462, -18588, -3537, 17033, 10873, -10268, -14732, 5960, 16973, -2783, -16443, -135, 16958, 7665, -14349]
534a4349J92K3569O792j7602j2618J0751J6956o642k0761L454K1732K877k0032
547e681r951J4300J4861p340j6311J95J7694N455j9692r669J7480J4027r902j7340
561a1874J950J8096L672j7143p259J3671J3457q784j9880M312K1373J876j6848
574c381q142J1794J1978o911j5040K626J8490L796j9967r392J5708J2870p690
587F739j4430J011J6221L052j7372p737J4821J3993q725j8929K433J9719J136
600A1932j6849n906J3496J1908j0136j8413M409K0652K743j9284q145J5455R892
613A1754j1221j3166N656J8016J222k0816p994J7231J2493j0991j5941O607J7804
626A0654k838j8444l727J6907J1399j2800j7213Q144J8185k873j7636k299J7550
$$ y = [-14349, -14157, 9412, 16204, -1398, -14016, -3265, 13691, 7049, -13712, -10258, 11474, 14351, -5681, -15632, -1332, 13529, 6189, -10122, -9927, 7767, 13222, -6470, -16139, 1341, 15368, 5466, -11874, -9924, 8172, 11844, -5299, -12558, 1113, 14570, 5786, -14094, -9782, 11591, 13467, -3381, -11523, 271, 12249, 5338, -9702, -7076, 11414, 15210, -4757, -14149, 1559, 14429, 6739, -7691, -6680, 9541, 12593, -4779, -12516, 2305, 16298, 7573, -11356, -8923, 10796, 11932, -4917, -10823, 2673, 14581, 4445, -13968, -9559, 11093, 13836, -5448, -13593, 1862, 11754, 533, -12633, -6977, 11039, 12261, -8555, -16549, 682, 13175, 2184, -13757, -7150, 10654, 7816, -10628, -14355, 2552, 13951, 1151, -16062, -7918, 10267, 7394, -10242, -12541, 5009]
639E009P606j5271j2400R352J6598k762j7019k999J6162O831j4250j1075J1399
652b819J6447p040j7251j029J5842Q326j1809j3348R977J5279o725j6211O31J6597
666F867O499j3989j1539R340J3841l600j5641k48J5849M967j4916j0094J0658
679b006J5181n518j5727J65J3599M912j2413j0238J0833J5563p441j7001J13J5202
693E224O430j2568j0471R838J2309n466j5663N28J7273N358j5460j0306J0104
706b870J3480n787j5283K555J5963K430j4970r949J2626J4762p556j5844K649
719g794J5045K428j5208p631J4449J2852r326j6763K537J8185K538j6293n949
732a0930J3612R449r566j5205O463J7832k47j6324o361J3356J0723r217j3887
$$ y = [5009, 12615, -2656, -15056, -5704, 10894, 8132, -8887, -11886, 4276, 11107, -3143, -14218, -2819, 13628, 6588, -10663, -11692, 4150, 12476, 667, -12681, -2704, 12575, 5850, -10361, -9730, 6867, 13366, -623, -12162, -2822, 11019, 7419, -8222, -8470, 7379, 12346, -2570, -12664, -2006, 13175, 7657, -8070, -7905, 5694, 10606, -1807, -12045, -1212, 14351, 6910, -10091, -9978, 5224, 11654, -914, -11385, -1547, 10762, 5296, -10367, -9839, 7434, 12792, -2668, -12974, -2870, 10610, 4823, -10460, -7905, 8058, 10488, -4482, -14431, -1805, 12957, 5401, -10443, -7794, 7251, 9679, -5529, -13160, 1289, 14141, 4815, -11948, -9411, 8774, 11312, -4981, -10930, 2682, 12131, 2565, -12640, -6177, 11655, 11408, -4916, -11277, 2079, 12802, 3585, -10302]
745a0302O213J5790j031j6436n476J4502J0652j0654j2690M967J4723j657j5751
758g150k541J5080P447j1294j2574N909J4604j645j4026k412J2492O238j1556
771a428j0915Q450J3805k625j4637l689J2951P116j0407r523P182J1668k877j4433
785i362k229J4074O158r960r845N861J1987k632j3037j233J2478O915j0978j0953
799a2756P551J2248k364j1693k380J2163O052j2068q841Q956J2715k739j4355
812g511k813J4042O062j0949q774Q468J2432m456j5600k21J5308O325j2265j0171
826a0123R139J2422n804j3061N33J4096N585j3707r652J0072J1852m784j2833
839f265M31J3400L228j3353q113J1129J2432o785j4136J567J3449K387j1976o272
$$ y = [-10302, -4089, 11701, 10670, -5766, -11242, 3260, 13912, 3258, -9432, -4465, 10258, 8601, -7150, -9691, 5389, 12836, 1542, -11032, -5123, 9481, 7836, -6190, -8602, 3890, 10128, -1428, -12343, -3893, 9912, 7287, -7350, -11039, 1912, 9028, -1379, -10902, -3720, 7948, 5071, -9362, -11591, 2483, 8641, -1319, -11164, -5303, 6684, 4052, -8985, -10218, 2260, 9175, -1803, -12756, -5205, 7043, 4679, -7014, -9394, 2769, 8821, -3247, -12088, -3132, 9583, 6844, -7511, -10324, 3718, 9780, -1169, -9943, -1475, 10957, 6501, -9099, -9320, 5988, 12313, 48, -10123, -984, 11438, 5634, -7427, -6894, 7202, 12787, -920, -10572, -500, 11352, 6568, -6265, -5834, 7566, 10794, -2559, -10672, 457, 12889, 6104, -8032, -6465, 6984, 9371, -2605, -8877]
853h877J0733R783q713j2205L591J3248K019j2592o548J0769Q445p898j1052M433
867d864J3138L92j3961m976J1004R042p779j0811M316J2554j008j2625m470J1142
881A094R582q227j1315L587J1537L33j1352m471J1388P466q765j0976M727J2587
895G195L16j1883m118R209O991p009j0015M651J2312r28j2113m129R262Q545p164
910A122j0257M732J1580j479j2832k879J1900P250r084r690M832J0947j504j1718
924g080j252J1626M642r077r722N861J2886j978j2572j914J0666N655r554q870
938a0683Q346J1467l797j2858j590J2476N844j0221p971P127J0624m135j2181
951g552j3J2973M800j0121r133P071J1447m413j1627J637J1809K994j1033q034
$$ y = [-8877, 1856, 11639, 2926, -9279, -5688, 7560, 9579, -3013, -9561, 1208, 9653, 1755, -9297, -4864, 8274, 8666, -5295, -10271, 733, 9775, 1996, -8815, -4499, 8055, 7047, -5578, -10048, 1094, 10676, 2449, -8866, -5279, 6258, 6591, -4761, -9232, 2156, 9622, 857, -10119, -5392, 7195, 7511, -4372, -8490, 719, 7710, 701, -9314, -4663, 7649, 6721, -5392, -9521, -259, 8286, 1122, -9135, -4403, 7177, 5698, -7134, -10013, 1887, 9137, 53, -9637, -4805, 6142, 4638, -7080, -8332, 3294, 7936, -1141, -10863, -5002, 7884, 5906, -6666, -8580, 2086, 7741, -1813, -10683, -2337, 9130, 5333, -7525, -9115, 3361, 9205, -1016, -8987, -1860, 8764, 4629, -7552, -7565, 5408, 10208, 87, -9046, -1975, 9472, 5059, -6568, -4931, 6878, 9872, -1161, -9195]
965i195Q828J1116m508j1258M82J0617K753r914n928Q887Q708n648j1039J040
979e059J1529K502j0137n070P827P776o017j0572L650J1428M60j0051o112Q158
993C12Q022n910r057K944R838J425j1203n849R433Q045n450r701K167R660R87
1008E663j0307m113Q999Q335p113j0937L108J1053R91r646m363Q212P329p202
1022Ir404L395J0920J782j1227n464R762P043o821q863M139J0210J0j1222l954
1037i685J0169P359o620r773M025R688o96r920k844J0079O857q356r507M832J0365
1052E973L4j0668l011J0378N438q892p706N878R955j424j0760k472J0130N472
1066H325q461p540O255R888l300j0803j072J0916M908q925p472O315Q847l238
$$ y = [-9195, -367, 10749, 6241, -5017, -4535, 6082, 8835, -1079, -7007, 1880, 10588, 4940, -6099, -5059, 6470, 8972, -1165, -6235, 1592, 9368, 3351, -7221, -3571, 7857, 8317, -1734, -7846, 312, 8334, 2424, -6633, -3689, 6149, 7574, -3629, -9478, -45, 8000, 2550, -7151, -4984, 4676, 5663, -4644, -8757, 242, 8577, 1464, -9473, -6365, 4688, 5679, -3967, -8330, -118, 7211, 9, -9395, -6000, 4920, 6702, -4525, -9989, -227, 6816, -5, -8868, -4729, 5481, 5491, -5731, -9685, 484, 7843, 1223, -8550, -4525, 5163, 4467, -5453, -8297, 1782, 8639, 283, -9224, -4392, 5973, 6007, -4661, -7672, 2706, 8144, -748, -8454, -2576, 7379, 5955, -4805, -7277, 2853, 8325, -136, -7676, -1421, 8467, 5167, -5636, -6708, 4208, 9116, 191, -7281, -966, 7881, 4643]
1080D643r894n08J1315L794r905o887O368Q639k188r802o98R931L663r409o326
1095g264O884R240l976r573j66R319L293q416n791O706Q218m362r611K59R942
1110D702L229q664n389O494O809l714q959P11J0143K681r308o418O863Q279m126
1125C333q904J019R153J428q724n278P562Q362n587r571J593R312J884q726m543
1140g687P575O895n467r569K027J0104J672r751l883P530O354n580r009L137J0308
1155D656J39r289m422P818P341n541q643L195R225n17r486k823Q905O525o537
1170E46q588L083J0011n25r455k244Q672N667o559q210M198R353j072q835j928
1185e886Q324N133o996p346N101R125j790r591j689Q474N207p007o239M337Q011
$$ y = [4643, -5251, -5759, 5556, 9350, -555, -7442, -1074, 7565, 5377, -4425, -5123, 4808, 8471, -938, -7264, -380, 8860, 4884, -4689, -4855, 4464, 7757, -659, -6450, 256, 8474, 4112, -5499, -5240, 4702, 7931, -733, -6122, 372, 7181, 3467, -5492, -4781, 5362, 8043, -1265, -7683, -820, 7459, 3333, -5571, -4552, 4601, 6029, -2695, -7973, -411, 7951, 2364, -7207, -5614, 3698, 5582, -3144, -7687, -112, 6783, 1316, -8253, -6226, 3878, 5550, -4201, -8084, -554, 5800, 220, -8789, -5652, 4656, 4795, -4494, -8916, -1098, 6243, 702, -7941, -4746, 4479, 3962, -5524, -8347, 558, 7083, 546, -8042, -4959, 5052, 4527, -4928, -7172, 1500, 7167, 608, -7602, -3404, 5949, 4877, -3958, -5886, 2438, 7571, 575, -6771, -1670, 7455, 5665, -3926, -5615, 2859, 8066, 1059, -5180, -843, 7168]
1200G168j624r744n90R127L958o684p080M328Q262j789q916l87Q185L636p347
1215E03o854N376Q269k557q614l85P648L044p253n139N320P404k435r354l96Q515
1231C092L055o992n398N539O771l482q449K42Q817L055p622n516N587O656l039
1246B316p882Q99Q217K123p749n303O125P514l219q616N15Q484K020p818m704
1261g078O512P168l909q975J214Q360K248p816m250O566O445m624q211J523Q717
1276C890J801q354m194O544O259m533p529K331Q562K29q921l152P621N652n018
1291A188p496K465Q184n0q191k993P393N640n574p065K915P579L82q338k336P873
1307A576M703o238o710L157Q567m21q467j828P228M078n438o006L598P948j553
$$ y = [7168, 5544, -4200, -4790, 4337, 8295, 1611, -5469, -1141, 7121, 5332, -3584, -3971, 4214, 7850, 503, -6351, -975, 7294, 4737, -3877, -4262, 3386, 6430, -823, -5962, -642, 6762, 4327, -5027, -5423, 3092, 6147, -845, -6243, -704, 6067, 2585, -5864, -5622, 3195, 6250, -1372, -6888, -1301, 5355, 2316, -5566, -4667, 3550, 5673, -2076, -7379, -1254, 6260, 3041, -5575, -5060, 3424, 5444, -2374, -7078, -566, 6602, 2693, -6282, -5068, 3292, 5540, -2276, -6526, 40, 6485, 1861, -6350, -4827, 3890, 5691, -2663, -6857, -313, 5946, 1413, -6116, -3785, 4777, 5006, -3915, -7067, 554, 6206, 1188, -6308, -3843, 4341, 4291, -3900, -6893, 500, 6140, 566, -6499, -3584, 3995, 4377, -3961, -6297, 1576, 6279, 41, -6669, -3512, 5055, 4634, -3833, -5661, 1567, 5645, 207, -5799, -2201, 5747, 4194]
1322D194q129j778P885M446n697o447L880P232j271p635j673Q223M150o412o097
1337e129M031O922j111p635j211P567L465o086o048M005P587j488p646j509O822
1352B536L874o266n216M580O896k430p872r64P453L524o118n577M326O479k190
1367C035p713k62P708K810o606n776N035P045k623p918N8P928K189o948n265N648
1383a655P218l499p594N56P176K285o961m039N530O650l684p889P94P983J622
1398D493o759l754N209O390l694p266J338P954J326p363m052O258N824m000o720
1413d816J809P425P23p439l237O682N283m201o585J707P037M27p144k342O043
1428A372M949m734o378K241O900L19o687k115N414M301m665n749K407O919J87
$$ y = [4194, -3935, -5713, 2172, 6618, 921, -5526, -1646, 5586, 4315, -3320, -4993, 3230, 7380, 968, -5129, -1098, 5824, 4713, -2922, -4133, 3434, 6899, 813, -5235, -1230, 6357, 4869, -2777, -4286, 2536, 6410, 144, -5072, -492, 6404, 3974, -3898, -4862, 2591, 6115, -3, -5580, -1254, 5225, 3035, -4678, -4940, 2768, 5578, -1028, -6804, -1769, 5276, 2653, -5265, -5207, 2721, 4910, -2038, -7303, -1655, 5563, 2064, -5530, -4974, 2202, 4487, -2474, -6513, -983, 5667, 1983, -5906, -5112, 2871, 4493, -2266, -6020, -811, 5579, 1885, -5381, -4043, 3911, 5237, -2126, -6178, 80, 5904, 1904, -4816, -3007, 4418, 5141, -2298, -5535, 1147, 6430, 2229, -4356, -2649, 4388, 4815, -2329, -4671, 1372, 6321, 1587, -4791, -2550, 4350, 4669, -2018, -4133, 1281, 5582, 917, -4832, -2425, 4494, 4681]
1443D681p332k324O090M167m623n606K770O374k14p220k120O162M600m774n978
1458e347K663O643o80o766k017O280M240m860o425L060P175j75p291j776O624
1473A348L453n155n192L028P179j068p079j485N842M394m646o135L292P196j602
1488C370p256r40O972L664n686n538M226O304j777o905o30P429K446o087m898
1503e306M399O478k147o931o9O913J990o348m456N421O136l143o837M32O469K062
1519E063o054m075M953N563l247p026J216O829J463o136l892M977N040l069o321
1534d716R06P146R65o334l847N359N174l433n665J125O175N48n837l084N377N110
1550D969l715o158J443O303M61n375k781N152M277l498n796J397P024M51o015
$$ y = [4681, -2651, -4975, 1115, 5282, 659, -4947, -2177, 4197, 3983, -3237, -5357, 805, 5405, 631, -5347, -2684, 3959, 3279, -3487, -5504, 776, 5016, 156, -6269, -3209, 3966, 3791, -3500, -5276, 1348, 4801, -354, -5546, -2518, 4661, 3593, -3486, -4971, 871, 5265, 619, -5516, -2224, 4972, 3370, -3886, -4826, 2146, 5810, 124, -5414, -1188, 5116, 3339, -3566, -4196, 3233, 5679, -408, -5306, -907, 5571, 3424, -3507, -3576, 3337, 5327, -1021, -5477, -56, 6080, 2937, -3900, -3468, 3001, 5063, -991, -5066, -113, 5450, 2203, -4823, -3607, 3222, 4685, -1451, -5343, -366, 4674, 1605, -4716, -3810, 3336, 4301, -2033, -5880, -521, 4653, 1220, -4445, -3320, 2855, 3403, -2434, -5518, -141, 4969, 1254, -4904, -3461, 2842, 3303, -2072, -4853, 299, 4576, 1078, -4718, -3321, 3703, 4154, -1861]
1565a861k839M976M195l589n354K085O223L00n909k932N254M753m049n349J983
1580b113O038K18o555k380O139M152m066n871J974O505O5o610j820O007L894m753
1596H24n918L004O709o56o334k210O016L754m978n329L414O031q04p016j321O282
1612A468L426m972m472K861N993j254o987n00O285L102n253m966L627N730j471
1627B617n960n44O329K216n690m329M174N758j941n969m04O060J921n362l680
1642d804M194N257k137o313K2O518J648n257l554L939N224k410o336M65O308J717
1658D481n390m077M686M187k261m926n25O070J909n452l157L930N166k546o017
1673c922M16N892J403n431l022M226M967l226n614J163N947R19n342l032M284
$$ y = [-1861, -4700, 276, 4471, 882, -4472, -2387, 3836, 4136, -1773, -4705, 549, 5302, 1253, -4096, -2113, 3925, 4143, -2412, -4792, 1347, 5499, 1433, -4438, -2464, 4041, 4106, -2504, -4324, 1683, 5577, 824, -5094, -2090, 4619, 3963, -2371, -4581, 1435, 5189, 211, -5118, -1704, 4327, 3523, -3493, -4814, 1468, 4894, -78, -4550, -1689, 4304, 3050, -3937, -4437, 1848, 4950, -303, -5269, -1642, 4088, 2617, -3343, -3887, 2442, 4658, -1032, -5361, -1187, 4571, 2630, -3339, -3743, 2317, 4238, -1124, -4804, -610, 4647, 2510, -3803, -3781, 2737, 4385, -872, -4426, -487, 4737, 2327, -4009, -3544, 2764, 4481, -909, -4986, -300, 3887, 1626, -3300, -3825, 2245, 4154, -1298, -4455, -525, 4641, 2095, -3922, -3506, 2386, 3789, -1642, -4664, -438, 4529, 1303, -4311, -3148, 2799, 3718, -1624, -4656, -372]
1688c72M926l292n610J675N658R83o012k523M545M650l233n480J492O148M53o180
1704b172k445N114M608l239n799J608N727M28n906k088N358M158m242n293K024
1719b159O024K91o127j775N043L645m312m839K262O218q68o001j453N612L080
1734D641m448m186K629N363r99o059j133M945L767l858m569K112N213j081n782
1749c445N4M803K915m557m572L314N364j490n605o61N479K291m937l619L318M865
1765C517j436n383m09N342K416m700m083L653N230j773n394o83N670K058m619
1780e94l879L647M707j700n603r9O026J723m972l700M010M788k099n398J6N609
1796B482J649n134l331L849M686j872n912L89N705J537n191k972L907M691k853
$$ y = [-372, 4554, 1262, -4348, -2673, 2985, 3968, -2044, -4567, -22, 4628, 1395, -4085, -2593, 3555, 4008, -2172, -4617, 497, 5105, 1866, -3933, -2325, 3402, 3830, -2076, -4164, 1194, 5352, 1110, -4183, -2159, 3865, 4156, -1971, -3746, 1297, 4942, 630, -4209, -1947, 4271, 3403, -2598, -4051, 1561, 4641, 193, -3993, -1364, 3999, 3000, -3059, -4192, 753, 4520, 662, -3907, -1795, 3418, 2337, -3445, -3391, 1412, 4327, -230, -4802, -1488, 3876, 2386, -3219, -3880, 1599, 3890, -1047, -4666, -1348, 3517, 2081, -3302, -3711, 1631, 4047, -653, -4736, -1083, 4147, 2374, -3020, -3703, 1967, 4025, -594, -4473, -826, 3881, 2181, -3422, -3521, 2505, 4228, -744, -4444, -434, 4354, 2255, -3143, -3127, 2482, 4131, -1003, -4334, -485, 4201, 2329, -3583, -3194, 2511, 4048, -1143, -4115, -208, 4483, 1630]
1811A630n489R10N720J077n245k800M154M188l073n227J163N792J054n761k954
1826d861M832M315l008n272J519N319N93n666k248N145L764l379n097J750N413
1841C119K95n299j932M664L735l427n251K113N410j54m899j956M725L484m144
1856D83m188K276N066l60n373j543M775L053l147m464J986N136m21n391j357M554
1872A085L755m336m084K410M610m63n886r08N442K236l010m544K384M157o51m883
1888b686j149M920K723m278l413K293L443M41n239l71M688J595k881m542K846
1903a610M308j222m756j106O177J532m502l097L082M363j377n147j21N128K008
1918C660m754l483L458M615j581n207L2N095J752m542l498L668M767k223n309
$$ y = [1630, -3859, -2949, 2771, 3848, -1397, -4197, -43, 4145, 1072, -4155, -2992, 2800, 3854, -1907, -4861, -29, 4286, 1278, -3994, -2475, 2844, 3437, -2229, -4477, 668, 4432, 1053, -4044, -2294, 3119, 3414, -1885, -3817, 847, 4582, 1155, -4096, -1983, 3427, 3273, -1626, -3582, 1143, 4627, 483, -3705, -1429, 3637, 3277, -2096, -3639, 1136, 4189, 1042, -3422, -1436, 3700, 3279, -2112, -3469, 1085, 4840, 504, -3580, -1170, 3440, 2977, -2909, -3817, 1625, 3861, 851, -3693, -1309, 2848, 2197, -2686, -3835, 1085, 3808, -470, -3883, -1590, 1853, 2294, -2945, -3316, 1372, 2967, 86, -4456, -1610, 2698, 1476, -3280, -4386, 1791, 3323, -1179, -4276, -1194, 3169, 1792, -3355, -3476, 1652, 3660, -1094, -4577, -1119, 3496, 1915, -3292, -3260, 1835, 3587, -955, -4453, -785, 3982, 1759, -3550]
1933c550N80N205J447m491l165M212M043k713n158J001N625J157m936k993M016
1948B80M043k627m786R23N180O67m768k815M373L879k860m515J092M976O79n247
1964a526k166M348L056k710l846K37N456O92n664j390L685M057l236n250K063
1979b194N004k43m091k070M351K974l627l718J943M499J01n200j619M376K957
1994C443k881m524K115N014m40n112j168M345K718k718m544K114M741o11n194
2009b702r12M969K323l959l527K395M859o91m945j234M699K603m055l432K153
2024a456N205j388n114n30M605K494l867l729K580M577j134m933k67M536K454
2039D033m736l749L601L955j235m974k82N116J790m511l435L486M181j265n274
$$ y = [-3550, -2970, 2235, 3682, -809, -3974, 238, 4281, 1568, -3590, -2589, 3036, 4193, -743, -3736, 280, 4323, 1696, -3090, -2167, 3013, 3680, -1088, -3903, 470, 4349, 1489, -3026, -1934, 3042, 3721, -1526, -3692, 656, 3712, 1002, -2844, -2607, 2849, 3541, -2123, -3513, 172, 4229, 993, -4257, -2194, 2810, 2567, -1524, -3594, 757, 3731, 104, -3614, -1671, 2828, 2929, -2271, -3890, 486, 3443, 562, -3962, -1847, 3167, 2727, -2385, -3553, 792, 3510, 792, -3752, -1638, 3103, 2492, -2702, -3614, 1355, 3678, -281, -3808, -1413, 3446, 2755, -2190, -3424, 1275, 3878, -177, -3609, -1456, 3749, 2361, -2753, -3283, 1322, 3816, -51, -3780, -1200, 3377, 2243, -2690, -2957, 1579, 4033, -703, -4452, -851, 3104, 1869, -3105, -3387, 1729, 3519, -992, -4427, -941, 3240, 1975, -3299]
2054c299P08L873J255k865l843L699L891k212m871P39N019P19m083k187K999L889
2070C431j931m867O16N042R04m180k643L583L829k274m613J100M531R04m481k429
2086c478L720L427k272l984N98M756O81m405j908L500L310k426m070Q57M606N68
2102C480m240k463M126K901k628m360J655M456L5m452j730M047K998k973m117
2117c265J348M706om354j858L768K957l065l611J372M395K48m772j463M143K787
2133C330l523l836J949M390k21m502j212M144K428l079l767J873M796p04m648
2148b582p46L902K550l100l991K620M489j156m719q87M968K278l622l692K616
2163a072L981o84m671m74M561J765l466l582K499M405j100m574l20M366J739l817
$$ y = [-3299, -2591, 1282, 2537, -328, -4171, -472, 3419, 1207, -3664, -2925, 2094, 2813, -1270, -3457, -458, 3431, 1500, -3367, -2751, 2291, 3195, -985, -3628, -45, 3784, 1510, -3103, -2003, 2528, 3432, -1049, -3478, 242, 3669, 1397, -2587, -1989, 2767, 3448, -957, -2865, 635, 3945, 1519, -2551, -1694, 2912, 3480, -760, -3223, 903, 3804, 1176, -3184, -1529, 2927, 2962, -1490, -3220, 827, 3825, 852, -3265, -1917, 2789, 2783, -1571, -3429, 339, 3296, 231, -3380, -2008, 2387, 2635, -2137, -3600, 543, 3330, -193, -4029, -2080, 2310, 2089, -2413, -3625, 519, 2947, -132, -3899, -2026, 2770, 2066, -2582, -3328, 574, 3124, 24, -3967, -1347, 3142, 1986, -2733, -3620, 1348, 3626, 4, -3688, -1072, 2909, 2225, -2446, -2920, 1641, 3406, -60, -3642, -1143, 3262, 2162, -2412, -2732, 1634, 3373, -444]
2179d44l093L365L557j173m437m9M154J550m163k572L219K928j444m067K12M478
2195B021J327m585k184L125L486j751m167J42M639J199l898k449L000L364j981
2210A288l807L28M224J130m194k347L329L345k058m171N60M522P28m032k108L098
2226a65L383k154l693N74M381N56m081k082L338L245k307l973J031M419L78m389
2242a539j628L461L472k867l862J005M416N05m736j258L561K873k608l986J169
2257b022M789j13m245j602L846K491k531l184J73M675L0l854j279K983L222l368
2273A1l448J652M350k75m349j096L852K376k964l431K087L705l99m615o26M215
2289A045J865k929l499K400L671o27m319m15L758J913l364k836K482L606j154
$$ y = [-444, -3537, -172, 3385, 2212, -2225, -2274, 1880, 3430, -733, -3305, -86, 2842, 1398, -2669, -2457, 2021, 3348, -1237, -3421, -296, 3190, 1439, -2728, -2586, 2053, 3252, -646, -3095, -95, 3269, 1288, -2519, -2191, 2033, 3163, -1031, -3378, -49, 3296, 1238, -2933, -2373, 2149, 2877, -1155, -3263, -165, 3218, 1064, -2629, -2055, 2326, 2882, -1199, -3281, 57, 3302, 995, -2978, -1947, 2472, 2850, -1539, -3167, 294, 3766, 899, -2963, -1958, 2458, 2963, -1773, -3031, 530, 3403, 795, -3191, -2022, 2767, 2654, -1591, -3193, 653, 3144, 613, -2571, -2398, 2277, 2307, -1547, -2826, 157, 3379, 11, -3437, -1785, 2565, 2290, -2059, -3155, 697, 3073, 109, -3322, -1235, 2470, 2071, -2544, -3170, 1045, 2910, -19, -3518, -1118, 2553, 1926, -2393, -2808, 950, 2863, -501, -3337, -855, 2751, 1597]
2304A597l873l47L881J597l216l030K653L859j143m071r0L923J525l616k556K629
2320b78L569j198m159m9L972R06k839k520K358L590j168l960o7M095J537l917
2336a28k533K700L193j530m740J877L177O92l729j106J927L470j921l945K66L962
2352A632J039l481k237K688L490k117m129R12L998R24l964k138L156L090k235
2367F28l727R14M243L69l849j747L268K755k102l566Q55L925L11l754j658L454
2383C19K835k525l527J105L891J16l767j263L619K432k958l275J490M072j43l855
2399a434j356L618K369k690l227J483L889k75m145r26L698K131k850l154J576
2414a293L968p19l960n38L606J817k576l148J968L454p65l858n86L495K143l005
$$ y = [1597, -2276, -2623, 1258, 2855, -361, -3391, -738, 3121, 1978, -2093, -2183, 1740, 3265, -351, -2907, -278, 3291, 2093, -2066, -2115, 1857, 2763, -76, -2596, -238, 3352, 2184, -1776, -1843, 2252, 3789, -128, -2661, 39, 3232, 1702, -3038, -1161, 2016, 2708, -1021, -2127, -200, 3270, 1349, -2596, -2330, 1632, 2671, -810, -3047, -359, 3131, 1014, -3115, -2203, 1795, 2719, -1245, -3383, -227, 2863, 628, -3099, -2185, 2058, 2427, -1422, -3169, 99, 2854, 752, -2814, -1959, 1966, 2277, -1477, -3135, 319, 3154, 629, -2898, -1793, 2098, 2214, -1553, -2816, 803, 3235, 277, -2998, -1508, 2564, 2421, -1434, -2790, 828, 3197, 507, -2720, -1237, 2652, 2377, -1768, -2694, 1004, 3135, 285, -2869, -1293, 2675, 1956, -2004, -2542, 1064, 2881, 305, -2843, -875, 2579, 1814, -2044, -2630, 865, 3008, 3]
2430Cl211K590L108p77l654n10L620J556k948k696K155L523j067m144K55L573
2446A376J442l255k682K675K991j113l531j46L716J443l226k982K439L468j370
2461A245l582M23L480J392l223k530K885L033j891l562M38L603P40k894k428K659
2477b12K988j297l938O52L848M24l307j703K632K870j817l529N09L899L99l326
2493i08k012K933K787k173l140M58L736P02l862j759L092L074k344l165O59L654
2509A732M67l795j253L072K343k009l463J121L750o1l262j316L299K243k347l321
2525b800J396L692l05l469j035L357K085k208l181J396L570l01l606r22L383J942
2541B994k538k894J433L551l90l565p72L184K185k885k987J778L559o73l438o34
$$ y = [3, -3208, -618, 2490, 1713, -1941, -2451, 1169, 2725, -223, -2919, -764, 2759, 1692, -2452, -2197, 1376, 2818, -437, -3119, -444, 2547, 1434, -2097, -2243, 1473, 2916, -310, -3292, -853, 2615, 1245, -2337, -1914, 1566, 2958, -265, -2795, 90, 3123, 1232, -2330, -1892, 1711, 2451, -443, -2871, -212, 2776, 1479, -2459, -1807, 2041, 2465, -842, -2545, 87, 2957, 1140, -2389, -1880, 2019, 2418, -908, -2920, 13, 2800, 627, -2513, -2055, 1681, 2383, -1479, -3238, -146, 2928, 584, -2581, -1922, 1732, 2199, -1596, -2849, 223, 2566, 557, -2906, -1785, 1965, 1904, -1358, -2674, 625, 2868, 521, -2800, -1404, 2288, 1983, -1486, -2521, 836, 2921, 713, -2468, -1072, 2498, 2197, -1409, -2331, 1052, 2994, 456, -2438, -1005, 2546, 2156, -1409, -2181, 1003, 3188, 303, -2684, -906, 2653, 1980, -1458, -2092]
2557b092L038J816k992k533J855L379n68l531m35K985J410k245k635J671L142
2572B265n32l828l30L599J343k799k492K035L012j077l480Q1L414J236l300k222
2588c075K438L083j043l679o1L467J085k988k154K591K838j379l406J63L619Q14
2604B313l351j638K682K840j655l523N84L587L74k903j851K459K757j471l402
2619b198N99L524N35l048j843K706K449j655l195L90L612L44k919j790K741K514
2635B766j975k939L26L680K04k956j456K805K181k162l041J327L083K8l131j522
2651b782L034K461k488k748R88L492k75l350q27K713K463k397k931J214L571m44
2667A694l349p65K860K265k467k920J239L298j86l180o78L014J672k455k717J576
$$ y = [-2092, 946, 2762, -230, -2763, -908, 2471, 1903, -1628, -2063, 922, 2332, 87, -2548, -877, 2265, 1733, -2095, -2425, 1174, 2517, -282, -2774, -739, 2273, 1196, -2284, -2203, 1211, 2447, -853, -3075, -637, 2446, 1403, -2276, -2337, 1130, 2215, -773, -2927, -336, 2502, 1123, -2283, -2120, 1499, 2313, -1038, -2676, 6, 2846, 1191, -2332, -1748, 1839, 2213, -690, -2541, -82, 2675, 1204, -2198, -1599, 1925, 2460, -588, -2431, 275, 2724, 1069, -2126, -1736, 1876, 2220, -699, -2489, 252, 2766, 791, -2148, -1822, 1858, 2062, -894, -2350, 455, 2636, 474, -2567, -1240, 1843, 1871, -1260, -2782, 252, 2713, 225, -2523, -1535, 1957, 1682, -1668, -2495, 218, 2681, 284, -2647, -1433, 2138, 1694, -1655, -2420, 440, 2705, 238, -2682, -1443, 1855, 1669, -1511, -2189, 825, 2497, 42, -2675, -1099]
2683a099L555p63l388l17K971J481k305k766J777L135n33l255p32L218J764k979
2699b36k201K061K828p57l466l75L383J202k528k290J667K794n40l638J66L308
2715A378J204l143j998J941K913j140l016j85L086J062k816j837K270K696j347
2730A068k901p1L095J175k993j722J863K779j507k960L43L103O77k784j673K326
2746a82K653j749k923N83L233M08k825j654K525K566j910k829N34L242O88l126
2762g66j479K661K217j907k763Q42L104J54k933j124K345K231j889k730Q66L218
2778B047n3k931j201K424K226k093k530R56K856Kk926j220K726K106k072k541
2794b224R68L160j0l225p48K210K234k306k617J306L302l67l085o92K365J738
$$ y = [-1099, 2456, 1693, -1695, -2012, 959, 2440, 135, -2631, -854, 2281, 1748, -1507, -2239, 979, 2743, -236, -2437, -376, 2452, 1695, -1771, -2146, 1237, 2439, -89, -2379, -712, 2082, 1542, -2096, -1930, 1378, 2582, -561, -2559, -618, 2295, 1155, -1861, -2046, 1040, 2102, -714, -2551, -281, 2415, 1068, -1833, -1904, 1191, 2366, -627, -2349, -486, 2293, 786, -2174, -1831, 1272, 1949, -835, -2508, -182, 2471, 722, -2201, -1618, 1615, 2023, -802, -2456, 69, 2635, 725, -2104, -1570, 1672, 2360, -766, -2245, 416, 2633, 726, -2037, -1195, 1909, 2063, -870, -1994, 351, 2582, 693, -2037, -1171, 2047, 1994, -937, -2138, 286, 2512, 419, -2111, -1155, 1701, 1703, -1223, -2443, 283, 2389, 317, -2224, -1256, 1904, 1894, -1331, -2079, 131, 2365, 59, -2558, -1252, 2050, 1683, -1402, -2094, 271, 2009]
2810B009k113k457J633K754k63l006n30K594J613k308k236J323K957o72l084j52
2826a938K777J395k415k053J533K752m99l091m98L240J084k332k109J762K583
2841B191p47l110j21K919J199k490k103J815K823j076l003J60K729J198k651j941
2857b208J784K396j078k641K3L078P92k638j667J893K420j034k857O1K857Q07
2873A988k569j730K396J929j160k893M27K769N17k580j270J949K487j693k424
2888a857J75K838N87k807j380K299K276j534k589N73K918L73k710j506K443K018
2904B117j679k418N46L209L28l102p33J895K193j717k452Q09K808P2k608j409
2920b141K564J953j987k378J222K598k73k622q48K691J421j902k053M92K914N2
$$ y = [2009, -104, -2561, -928, 1826, 1563, -1443, -1973, 621, 2234, -74, -2310, -987, 1970, 1298, -1786, -1938, 839, 2234, -181, -2234, -701, 2051, 1552, -1539, -2037, 1203, 2287, -45, -2154, -392, 2191, 1444, -1666, -1787, 1132, 2331, -159, -2262, -447, 2376, 1300, -1703, -1543, 1186, 2384, -267, -2208, -424, 1972, 894, -1747, -1724, 1354, 2146, -492, -2159, -266, 2154, 1120, -1737, -1676, 1181, 1988, -581, -2311, 85, 2014, 854, -2039, -1612, 1157, 1674, -906, -2176, -227, 2260, 567, -1857, -1682, 1156, 1743, -1064, -2444, -145, 2131, 597, -1992, -1419, 1499, 1872, -838, -2344, 99, 2117, 438, -1980, -1434, 1775, 2103, -999, -1732, 163, 2356, 639, -1813, -1004, 1804, 1876, -732, -2141, 423, 2376, 389, -1989, -767, 1831, 1558, -1064, -1912, 779, 2200, 298, -1755, -1263, 1651, 1703]
2936A703k874q30K658J558j985k241J060K885m87k815o87K742J047j809k075J436
2952g14K460m79k572q31K673J339k162j787J392K428p22k617k85K661J246k150
2968a20k091J694K529q62k667m42L020Q48k065j971J576K270m71k737j08K595
2984I98J082k110j975J846K376j056k654m17L357O93k451j171J392K356j295k343
3000a372k31K601J035k301j683J695K303j279k164J52K537P93k627j515J804K157
3016A905j330k308K60K660M90k307j348J854K111j313k574K77K886L91k454j264
3032b064K033K004j592k293N61K963M2k516j286K384J607j529k363O77K697K30
3048A555k666p86K191J681j446k276P64K541j11k553o86K104J776j723k269J013
$$ y = [1703, -1171, -2001, 657, 2215, 230, -2011, -951, 1934, 1447, -1368, -2055, 687, 1734, -75, -2150, -714, 1746, 1267, -1305, -2136, 537, 1876, -286, -2073, -681, 1747, 1025, -1592, -1877, 784, 2030, -120, -2211, -517, 2012, 1150, -1517, -1959, 1061, 1909, -156, -2127, -551, 1719, 1248, -1489, -1597, 998, 2080, -30, -2005, -159, 2217, 1161, -1493, -1910, 1447, 2140, -311, -1482, -90, 2266, 971, -1372, -1603, 998, 2033, -268, -1951, -256, 2047, 768, -1396, -1244, 1293, 2086, -541, -2056, -252, 1905, 575, -1733, -1473, 1187, 1677, -630, -1978, -124, 1987, 674, -1900, -1623, 1263, 1654, -800, -2064, -31, 1973, 381, -1912, -1351, 1612, 1654, -862, -2148, 236, 1843, 314, -2049, -1372, 1325, 1555, -1111, -1897, 294, 1975, 529, -1747, -983, 1558, 1447, -1106, -1792, 312, 2088, 365, -1904, -891]
3064h91K532K8k801l51K012J606j913k001J107K474m61k459m98K027J523j430
3080E04k425J465K293o84k411m38K240J405j629j952Q88K490n76k268l54K074
3096F22J365k143j935J312K414p11k396P1J971J517k489j435J027K447o42k250
3112a255j19K215J035k103j928J510K399o62k645j8K530J188k255j944J427K559
3128A934p81k902Q24K073Q97k952j226J886K183r51k431K92K203R16k509j462
3144b006K010K348j326k389K7K432Q24k243j421J769J917j253k002K79K208O96
3160A870k610j303K216J733j623j912K67K329O82k417j296J967K174j668k132
3175a723Q54K023J62k258j138K431J275j007k505J006J619N28k178o72K219J172
$$ y = [-891, 1641, 1669, -1132, -1483, 529, 2135, 222, -1779, -672, 1802, 1341, -1118, -1616, 411, 1934, 504, -1921, -456, 1837, 1153, -1258, -1696, 544, 1949, 320, -1632, -744, 1746, 1170, -1098, -1452, 622, 1987, -156, -2091, -779, 1635, 924, -1472, -1401, 570, 2087, -402, -1837, -810, 1637, 995, -1255, -1374, 841, 1876, -227, -2155, -645, 1754, 1092, -1553, -1571, 959, 2147, -108, -2052, -625, 1934, 1153, -1749, -925, 1148, 2045, -907, -2133, -247, 1936, 985, -1446, -1154, 1049, 1965, -544, -2006, 4, 2352, 1026, -1363, -1336, 1096, 1920, -323, -1744, 25, 1942, 689, -1313, -1034, 1174, 1870, -740, -2043, 173, 1906, 283, -1629, -1362, 967, 1649, -768, -2064, -97, 2077, 409, -1723, -869, 1154, 1316, -942, -2080, 351, 1626, 619, -1886, -880, 739, 1267, -911, -1583, 636, 1808]
3191A808j512k233J047K220O07l355m99L554N5j466j620R82J809l79k145o92K404
3208E85J423j736j680R27K105j41k565m65K268J149j715j674O96K514l79k364
3224a052n80K259J359j929j852J090K195m03k368k92K326R91j814j322P87K194
3240A589p35k177k49K137J410k057j942J385K192o88k273pK087P95j966j292J288
3257e03K139r86k071p7K475P18k175j471J393K172q29k186K7K088J055k188j468
3274a887J715J805q02k434L79K214O23k324o34J294J855r31k350O43K116K93k048
3291d73j235J663J904j120k255Q12J786N63k311r46J893J578j569j837O58K193
3307A304J46k305o52J750J293j007k155P30K230R5k429n95J779J457j134k066
$$ y = [1808, 296, -1937, -890, 1330, 1937, -1418, -1917, 1637, 1692, 226, -1394, -412, 1397, 1018, -1127, -1819, 585, 2008, 272, -1408, -481, 1624, 1483, -1082, -1547, 721, 1870, 155, -1519, -823, 1691, 1312, -1052, -1632, 627, 1986, 57, -1795, -705, 1490, 1087, -1281, -1573, 753, 1744, -70, -1392, -605, 1589, 854, -1323, -1572, 565, 1975, -82, -2024, -639, 1553, 865, -1408, -1415, 672, 1467, -499, -1791, -503, 1636, 650, -1421, -1498, 977, 1695, -480, -1951, -558, 1614, 785, -1401, -1374, 714, 1769, -419, -1887, -172, 1633, 831, -1603, -1224, 990, 1613, -711, -1345, -51, 1804, 873, -1477, -834, 1282, 1575, -473, -1708, -45, 1859, 739, -1516, -704, 1082, 1645, -666, -1612, 281, 1859, 290, -1547, -889, 1304, 1450, -855, -1507, 243, 1536, 529, -1626, -896, 1334, 1429, -1000, -1595, 184, 1641, 507, -1559]
3323a559N78K285L9k543l22J580J402r64k168N61K488l16j883r91K029J376j463
3340A29j949R67K024k67j973o37K119J064j372j590P52K252l81k338k02J943J338
3357A879j766j795J164K029m29k169l43K162R76j776j208Q26J974n73j981j02
3373a132J582J354j729j426Q31J985k35k154j03J622Q29j726j110J126J786p34
3389G66j764k81K046Q41j843j592J452J956j085j899K90K004N44j678j377J307
3405c13J594o23k086N2K113N93j832j343J511J853p68k305K93K109O91k096j060
3422a617J564J761j346j593K45J924N12k038j100J443J811j001j685L3K219M12
3438A544k073q23J450J775j248j843L00K241nk163n71J748J363j336j662O32K042
$$ y = [-1559, -981, 1304, 1343, -1200, -1522, 58, 1460, 496, -1672, -1111, 1377, 1061, -822, -1813, 216, 1592, 129, -1820, -853, 1171, 904, -1069, -1706, 413, 1477, 105, -1485, -733, 1519, 1138, -1200, -1402, 541, 1879, 113, -1682, -518, 1511, 1082, -1087, -1430, 732, 1708, -68, -1276, -450, 1524, 951, -1030, -1132, 450, 1804, 75, -1351, -520, 1465, 1230, -924, -1027, 595, 1424, -302, -1412, -286, 1500, 766, -998, -1279, 767, 1608, -235, -1827, -375, 1581, 496, -1403, -1113, 891, 1435, -243, -1620, -313, 1281, 658, -1428, -1376, 737, 1330, -502, -1845, -334, 1519, 751, -1554, -1261, 848, 1539, -557, -1617, -53, 1708, 362, -1231, -986, 938, 1450, -588, -1688, -245, 1566, 565, -1120, -1087, 1132, 1544, -529, -1352, 98, 1873, 625, -1218, -918, 1323, 1318, -845, -1416, 332, 1695, 359, -1303, -671, 1371]
3455A371J36k306o62J913J142j365j482N33J950J5j995n27J328J514j510j241
3471a186L64K095l28j626o16J669J040j194j492M22J782r4j755m52J490J334j372
3488H1j717J073K146m96j987m82J817R57j630j317J005J983m78j878m49J965J074
3505A667k009j193J409J421m23j712l73J955O00j372j382J090J762n80j742k37
3521a119J554J156j738j194J395J479p48j828L3J707Q13j736j117J055J492o79
3537E25j955K47K062L04j468q83J163J320n43j969J64K075M07j836j263J653J520
3554A523j161j548j41K201M28j776j050J477J534j098j893N01K070L59j978j075
3570a627J509J380o68j810M09J821J27j651j054J647J361j190j440L75J625M38
$$ y = [1371, 1507, -799, -1461, 452, 1594, 229, -1253, -720, 1230, 1245, -750, -1277, 51, 1565, 55, -1186, -822, 1273, 945, -681, -1297, 372, 1412, 218, -1274, -852, 930, 836, -919, -1371, 119, 1453, 81, -1636, -563, 1583, 1087, -900, -1382, 435, 1392, -238, -1555, -550, 1433, 955, -923, -1372, 593, 1667, -342, -1535, -126, 1295, 872, -840, -1213, 742, 1342, -30, -1412, -322, 1440, 860, -882, -1119, 435, 1591, -147, -1341, 54, 1533, 785, -1043, -1010, 697, 1510, -226, -1343, -288, 1204, 525, -1430, -1183, 879, 1183, -285, -1168, -5, 1315, 772, -1197, -1033, 1042, 1449, -387, -1650, 3, 1523, 362, -1186, -1327, 874, 1302, -474, -1524, -47, 1487, 389, -1504, -1003, 1067, 1426, -552, -1627, -118, 1262, 594, -1216, -807, 1014, 1141, -510, -1564, 83, 1444, 254, -1186, -811, 814, 1252]
3586A252j820o96J310J691j567j610O87J817L41j985p96J654J196j148j479N89
3602e64J514J36j822j80J137J085j062j583Q69J484O5j734n04J605R74j191j653
3619a424O24K145l88k143k2J384J111j620j263R62J586k39j732k66J837O82j515
3636b81j042N92J622j8j966k37J942O55j480j253Q05J912l95j776j66J810M72
3653A196j651j088J291J739n17k141K24J843N42j698j362J635J387o41j646K1
3669h66J758L61j462j124J154J604p38j871K45J791O18j969p90J312J407p15j819
3686a104N2K047J57j854p15J293J404j028j405L43J878r2j442j042J619J067q28
3703C50j447K05J819p9j491n35P44J140k51j972N24J717L05j518p29J410J158
$$ y = [1252, -568, -1264, 46, 1737, 170, -1440, -753, 1064, 1405, -580, -1376, 278, 1474, 326, -1153, -564, 950, 1086, -736, -916, 221, 1306, 244, -1339, -470, 1014, 1079, -655, -1159, 446, 1420, 229, -1424, -800, 1345, 957, -1186, -1208, 176, 1287, -333, -1596, -634, 952, 713, -1019, -1285, 552, 1234, -281, -1323, -731, 891, 873, -1093, -1330, 612, 1267, -213, -1466, -661, 1251, 856, -920, -1086, 724, 1196, -455, -1543, -252, 1487, 970, -1171, -947, 896, 1438, -260, -1622, 13, 1400, 759, -887, -866, 892, 1253, -209, -1333, -179, 1425, 687, -1184, -939, 852, 1470, -499, -1289, 23, 1430, 715, -1104, -1052, 995, 1152, -702, -1417, -124, 1280, 252, -1153, -810, 1068, 976, -466, -1508, 111, 1178, 350, -1097, -892, 927, 848, -643, -1178, -434, 706, 455, -1517, -993, 724, 1029, -489, -1218, 192, 1350]
3720A350j135j573N81J874R1j579n59R67J428j073j500N37J719k37j574o03J605
3737C19R16j005j444P37J599m45j243m52J481Q88j171j714J007J853m51j513l51
3754i89J280J222j370j180O11J566m28j478o20J643J060j299j103M62J715k67
3770H25j749k89J608Q31j576p88L76J376K17j836J82J612j66o44j593J690J036
3787A112m96j433j72J808L38j135j427J086J481n08j473j02J659O31j583j354
3803a568J161J665q04j580K10J817O06j642j120J340J276p35j598L12J691K37
3819A268j508p69O74J845r85j626M89J468K88j485q31J166J289p45j620J74J889
3836I81J95j486r61J458J234j085j594L93J806j45j238q58J117J341q69j721N46
$$ y = [1350, 215, -1358, -777, 1097, 1188, -391, -950, 17, 1445, 372, -1128, -591, 1128, 891, -683, -1286, 319, 1235, 230, -1214, -477, 1122, 677, -566, -1018, 463, 1351, 180, -1534, -527, 1326, 875, -638, -989, 291, 1513, 143, -1037, -426, 1140, 712, -766, -1386, 257, 1317, 18, -1085, -623, 1092, 825, -924, -1213, 395, 1226, -350, -1138, -762, 614, 831, -1005, -823, 789, 623, -21, -1614, 76, 1112, 616, -817, -989, 819, 1157, 22, -1405, -319, 1162, 654, -819, -921, 738, 1369, -214, -1568, -407, 1258, 454, -1126, -916, 901, 1507, -135, -1255, 85, 1361, 626, -972, -660, 1031, 1268, -240, -1009, -335, 1510, 525, -1101, -612, 856, 1144, -341, -1172, -6, 1283, 538, -1082, -908, 981, 1176, -310, -1271, 187, 1421, 336, -1258, -865, 941, 796, -442, -1300, -183, 1158, 289, -1432, -886]
3853h86J956l31j535k94J202J029r58j350M12J601K14j661o72J387J097j195j222
3870a206L67J503K07j654n44J642Q45j108j377Q50J311L76j794o20J675M66q13
3887A26j146O33J576k31j936k14J618O23q87j261P49J781o13j437m65K111L79
3904A406j134j308P41J342n19j522j73J774P03j329r90P01J336l73j508k53J819
3921G13M86j558r97J148J233m03j522q6J348P28j503r50J056J554n42j745K40
3938h00J290M72j610n65R96J350o62j507P5J519N98j257r70R38J333p89j536N16
3956f09J090N50j163q84J344R58p52j487K14J284N16j470o38J141J025n55j519
3973i55N15J193L44j479o57J056J155p30j593N50J260N0j212p66J403J122r73
$$ y = [-886, 1070, 739, -796, -1090, 112, 1141, 183, -1167, -755, 846, 1060, -601, -1273, 114, 1211, 16, -1206, -839, 664, 871, -783, -1327, 315, 1160, 52, -1325, -475, 836, 1212, -582, -1202, 473, 939, 126, -1020, -387, 1189, 958, -978, -1192, 426, 1049, 162, -1099, -350, 1431, 818, -619, -1084, 1027, 1406, 272, -1036, -295, 1047, 528, -994, -1167, 607, 1310, -19, -1009, -308, 1028, 655, -853, -1106, 713, 1199, -359, -1356, -208, 1025, 622, -900, -986, 362, 1090, -413, -1363, -307, 1247, 705, -1040, -800, 490, 962, -648, -1213, -217, 1133, 471, -1036, -961, 558, 1156, -101, -1071, -133, 1200, 411, -1125, -609, 481, 1031, -132, -1016, 328, 1286, 534, -953, -739, 545, 1061, -409, -1047, 94, 1119, 564, -955, -440, 753, 1097, -382, -1039, 17, 1172, 442, -1151, -601, 659, 709, -503, -1269, 134, 1256, 283]
3990B83j365N53J393m7j431n87J431P14o02j406M08J181K01j208n78J174J217
4007A331j015j608O73J326K0j256p00J509P72j007j270P83J301j51j284l45J230
4024C09R87j462j055M71J914m31j227o47J449O83o15j280L54K407j239j527J6
4041h93J404N13p43j561J102J057j0j511j93J262R43j479r90Q91J347m38j354
4058f53n66K031Q7j021r20P25J338o47j474J78J405M66j273q18J172J104p15j174
4076g55j06J560K31j219r58Q50J642q25j451L92J008M31j063r78J220Q14m87j236
4094i30J18J512L45j425p24J073J056n45j576L15J538J78j379q04J265J218q51
4111C84j277L57J650l29j298n26J230J028r91j176K46J403L45j437m83J081R48
$$ y = [283, -1082, -529, 864, 817, -614, -1201, 230, 944, 342, -1064, -656, 525, 726, -482, -1060, 114, 1331, 316, -1292, -619, 707, 727, -529, -1229, 280, 1052, 45, -1225, -442, 859, 708, -576, -921, 309, 1296, -166, -1221, -750, 1164, 733, -494, -1141, 308, 991, 376, -904, -550, 1857, 618, -909, -893, 511, 1024, 281, -1280, -178, 879, 869, -642, -835, 427, 1370, -109, -1099, -208, 1139, 701, -653, -1219, 812, 899, -122, -1042, -317, 1021, 374, -1100, -922, 483, 949, -324, -1142, 30, 1134, 419, -755, -861, 699, 930, -289, -1247, -397, 1245, 420, -1031, -639, 369, 800, -263, -1241, -21, 793, 306, -930, -812, 700, 1045, -380, -1104, -31, 1025, 480, -1096, -781, 757, 935, -444, -1248, 17, 1235, 384, -893, -536, 1114, 785, -513, -1039, 191, 1219, 228, -948, -702, 701, 1046, -391, -874, 207, 1155]
4128A155j344n48J54J658l00j241m43J515O35j118m59k46J695k07r58p50J052
4145B50O94j059r31J98J499N50j014j201R64J465r43j601O67J297jj628j87J178
4163A97J017j135j129O36J142J4j231o43J491P86j282r06Q02J148k18j374k53
4180i38J402O79j211q98M89J174J81j404m35J136P88j085r13Q83Q91l15r34k17
4198g27J151Q01j363r26R76J261l91j438k49J474K97j230p33Q66J248n57j273
4215h13J89J170K59q90p22M47J468o83j425R9J662J83j270o31R05P86m35j120
4233h21j09J427L28j106p34J097Q26n84j200J92J392J95j172q65J151R27m99j330
4251h85J87J300L42j257l86Q16J025r28j302N56J091K96j157p26J338R79r54j244
$$ y = [1155, -189, -737, -583, 1075, 775, -466, -909, 606, 1241, 123, -336, -582, 1113, 906, -52, -802, 250, 944, -115, -1046, -848, 651, 1201, 187, -1014, -50, 1415, 472, -1129, -462, 835, 834, -794, -981, 197, 1214, 79, -1050, -414, 728, 742, -489, -1132, 359, 1145, -137, -1043, -241, 907, 689, -685, -938, 464, 1143, -68, -966, -477, 697, 878, -526, -961, 175, 963, -122, -1035, -152, 739, 424, -510, -727, 424, 1225, -138, -1064, -88, 1173, 782, -656, -905, 569, 866, -364, -1097, -231, 1017, 460, -813, -624, 546, 805, -85, -807, -360, 1108, 425, -1000, -901, 761, 944, -326, -957, -52, 734, 299, -821, -930, 497, 825, -281, -1015, 82, 908, 324, -876, -684, 708, 903, -269, -1134, 17, 944, 445, -885, -698, 602, 944, -313, -699, 117, 1142, 214, -1088, -532, 559, 855, -302, -1028, 310, 1289, 335, -909]
4269i09N78J261j51r68n95R75Q50r17j049M43J443j40j460k90R46Q98r30q97M83
4288d29J228j31j407j65J190Q52j015j232O56J024kj202m7J129J76o03j052N43
4306d87J189l0j322l51J149R66j222q10N94J027k27j319N9J090Q30j327o67N30
4324c28J441q02r83m7R57O09r33j041Q59J138m15r27k33J379L44r85j152J249
4342A30Q63n70j019j17J392K15r78r50J027Q90l48j495O00J078K26j166p89J208
4360A97R00p75j149N1J351K28j229n03Q08J077p48r27M6J502j56r00q39J308Q38
4379A080j003p25j19J323N83j558l93Q68P63o25r79M13P68J51r29m90Q54P74o60
4398I6j001K58J484k12r63o00J313R80j337m35L00Q99N1j159q03J166Q14o44j514
$$ y = [-909, -331, 930, 779, -189, -784, 191, 1041, 124, -925, -482, 961, 821, -639, -929, 17, 915, -15, -912, -429, 799, 668, -739, -904, 286, 1138, 123, -1109, -453, 571, 569, -633, -680, 449, 625, 22, -1030, -487, 702, 672, -650, -1001, 148, 1114, -108, -918, -324, 703, 476, -843, -784, 306, 1136, -191, -858, -328, 1113, 311, -672, -719, 238, 847, -86, -1127, -268, 870, 455, -472, -705, 674, 1018, 33, -1119, 130, 993, 423, -596, -713, 679, 894, -84, -1034, -7, 883, 535, -960, -360, 718, 944, -222, -1011, 197, 1097, 322, -827, -776, 575, 803, -426, -929, -121, 956, 208, -719, -673, 829, 673, -227, -1066, 242, 1080, 77, -648, -767, 556, 1139, -419, -812, 56, 819, 194, -785, -372, 396, 547, -382, -872, -18, 756, 96, -905, -647, 837, 625, -338, -938, 375, 1355, 18, -417, -117, 782, 833, -326, -1129, 37, 851, 207, -1307]
4417a307Q78J124j8j148J29M79O31n85j118Q64O20L55j124p06J319L75o17q01
4435f50K4J754j96k008K62O84J014j035j11k95J106m18j091M48J188J61r84q59
4453a006J347N69j44j059p79J536K32n29j203R6J612k79r40k49J381L44r33q34
4471h38P69O85M9j110l64J271P08j310p86Q71P67m08q07k13J116N74r13q17P01
4490e5P69j66j385K32J081M66j129p40J045O08j86j169P7J187N7j012m17P09R71
4509I43m93j129K46R81M33j293p53J169Q88q58r69M41R70J82j220k02P57N33o72
4528d6j875M52J981J0r68n01R41R91r00q66J52J243O9j105n69J128Q92q37j176
4547i84P08J171k36j141k88R94P38p26q93K09Q99N60j352k55J049J83m64r76O24
$$ y = [-1307, -429, 695, 677, -471, -342, 137, 768, 183, -935, -71, 549, 904, -220, -926, 393, 768, 151, -650, -626, 1128, 932, -1076, -814, -130, 884, -151, -262, -557, 549, 131, -960, -512, 676, 837, -147, -1006, 341, 910, 766, -293, -1072, 464, 696, 167, -1036, -940, 672, 393, -547, -796, 585, 929, -4, -838, -69, 616, 665, -445, -809, 462, 1170, -140, -926, -55, 712, 304, -503, -716, 400, 974, 61, -756, -55, 714, 548, -837, -605, 476, 942, -187, -927, 118, 726, 540, -629, -552, 635, 692, -320, -737, -28, 943, 450, -679, -433, 548, 981, -312, -1065, 104, 992, 134, -835, -394, 576, 758, -462, -664, 93, 626, -46, -1921, -1469, 512, 522, -446, -947, -6, 985, 85, -781, -629, 614, 683, -422, -991, 137, 1029, 192, -984, -276, 895, 659, -482, -770, 224, 962, 236, -657, -448, 451, 1011, -341, -596, 453, 636, 172, -804, -180]
4566a80R78K1j381q6J007P71j128j034Q61J012o46p98L1R45O17r86r55N97J101
$$ y = [-180, 798, 819, -562, -648, 359, 1130, 2, -1032, -171, 841, 195, -603, -572, 373, 990, 4, -951, -354, 747]
$$ [...]
8191A91
##END NTUPLES=NMR FID
##END=
