##TITLE=1H_LR-726-C1
 CDCl3, 8 sc, 
 27.11.2020
##JCAMPDX= 6.0         $$ Bruker NMR JCAMP-DX V2.0
##DATA TYPE= NMR FID
##DATA CLASS= NTUPLES
##ORIGIN= UXNMR, Bruker Analytische Messtechnik GmbH
##OWNER= root
$$ XWIN-NMR		Version 3.5
$$ Fri Nov 27 10:03:15 2020 Russian Standard Time (UT+4h)  she@DPX200
##.OBSERVE FREQUENCY= 200.1315066352
##.OBSERVE NUCLEUS= ^1H
##.DELAY= (6, 6)
##.ACQUISITION MODE= SIMULTANEOUS
##.ACQUISITION SCHEME= undefined
##.AVERAGES= 8
##.DIGITISER RES= 18
##SPECTROMETER/DATA SYSTEM= spect
##.PULSE SEQUENCE= zg30
##.SOLVENT NAME= CDCl3
##.SHIFT REFERENCE= (INTERNAL, CDCl3, 0, 15.7039)
##AUDIT TRAIL= $$ (NUMBER, WHEN, WHO, WHERE, WHAT)
$$ ##TITLE= Audit trail, XWIN-NMR		Version 3.5
$$ ##JCAMPDX= 5.01
$$ ##ORIGIN= Bruker BioSpin GmbH
$$ ##OWNER= she
$$ F:/spectra/data/she/nmr/H-F/1/audita.txt
$$ ##AUDIT TRAIL=  $$ (NUMBER, WHEN, WHO, WHERE, WHAT)
(   1,<2020-11-27 10:01:55.51 +0400>,<she>,<DPX200>,
      <created by zg, POWCHK disabled, PULCHK disabled
       configuration hash MD5:
       00 E9 B6 7A A2 85 ED C7 34 08 36 98 17 FE 4E 26
       data hash MD5: 16K
       A4 3F 86 4B 6A B7 3A 19 9D 26 C1 C3 62 EC BF 9E>)
$$ ##END=
$$ 
$$ hash MD5
$$ B7 CD D9 84 69 D0 18 5A E3 05 69 65 A4 AE 22 2B
##$RELAX= 
##$RELAX= 
##$RELAX= 
##$RELAX= 
##$RELAX= 
##$RELAX= 
$$ Bruker specific parameters
$$ --------------------------
##$DU= <F:/spectra>
##$EXPNO= 1
##$NAME= <H-F>
##$PROCNO= 1
##$TYPE= <nmr>
##$USER= <she>
##$AMP= (0..31)
100 100 100 100 100 100 100 100 100 100 100 100 100 100 100 100 100 100 
100 100 100 100 100 100 100 100 100 100 100 100 100 100 
##$AQSEQ= 0
##$AQ_mod= 1
##$AUNM= <au_zg>
##$AUTOPOS= <>
##$BF1= 200.13
##$BF2= 200.13
##$BF3= 200.13
##$BF4= 200.13
##$BF5= 200.13
##$BF6= 200.13
##$BF7= 200.13
##$BF8= 200.13
##$BYTORDA= 1
##$CFDGTYP= 0
##$CFRGTYP= 5
##$CHEMSTR= <none>
##$CNST= (0..31)
1 1 145 1 1 1 1 1 1 1 1 1 1 1 1 1 1 1 1 1 1 1 1 1 1 1 1 1 1 1 1 1 
##$CPDPRG= <>
##$CPDPRG1= <>
##$CPDPRG2= <>
##$CPDPRG3= <>
##$CPDPRG4= <mlev>
##$CPDPRG5= <mlev>
##$CPDPRG6= <mlev>
##$CPDPRG7= <mlev>
##$CPDPRG8= <mlev>
##$CPDPRGB= <>
##$CPDPRGT= <>
##$D= (0..31)
0 1.2 0 0 0 0 0 0 0 0.06 0 0.03 0 0 0 0 0.0002 0 0 0 0 0 0 0 0 0 0 0 0 
0 0 0 
##$DATE= 1606456914
##$DBL= (0..7)
120 120 120 120 120 120 120 120 
##$DBP= (0..7)
150 150 150 150 150 150 150 150 
##$DBP07= 0
##$DBPNAM0= <>
##$DBPNAM1= <>
##$DBPNAM2= <>
##$DBPNAM3= <>
##$DBPNAM4= <>
##$DBPNAM5= <>
##$DBPNAM6= <>
##$DBPNAM7= <>
##$DBPOAL= (0..7)
0.5 0.5 0.5 0.5 0.5 0.5 0.5 0.5 
##$DBPOFFS= (0..7)
0 0 0 0 0 0 0 0 
##$DE= 6
##$DECBNUC= <off>
##$DECIM= 32
##$DECNUC= <off>
##$DECSTAT= 4
##$DIGMOD= 1
##$DIGTYP= 9
##$DL= (0..7)
0 120 120 120 120 120 120 120 
##$DP= (0..7)
150 150 150 150 150 150 150 150 
##$DP07= 0
##$DPNAME0= <>
##$DPNAME1= <>
##$DPNAME2= <>
##$DPNAME3= <>
##$DPNAME4= <>
##$DPNAME5= <>
##$DPNAME6= <>
##$DPNAME7= <>
##$DPOAL= (0..7)
0.5 0.5 0.5 0.5 0.5 0.5 0.5 0.5 
##$DPOFFS= (0..7)
0 0 0 0 0 0 0 0 
##$DQDMODE= 0
##$DR= 18
##$DS= 0
##$DSLIST= <SSSSSSSSSSSSSSS>
$$ [...]
##$SUBNAM2= <"">
##$SUBNAM3= <"">
##$SUBNAM4= <"">
##$SUBNAM5= <"">
##$SUBNAM6= <"">
##$SUBNAM7= <"">
##$SUBNAM8= <"">
##$SUBNAM9= <"">
##$SW= 16.9725356469052
##$SWIBOX= (0..15)
0 0 2 0 0 0 0 0 0 0 0 0 0 0 0 0 
##$SW_h= 3396.73913043478
##$TD= 16384
##$TD0= 1
##$TE= 0
##$TE2= 300
##$TE3= 300
##$TEG= 300
##$TL= (0..7)
0 120 120 120 120 120 120 120 
##$TP= (0..7)
150 150 150 150 150 150 150 150 
##$TP07= 0
##$TPNAME0= <>
##$TPNAME1= <>
##$TPNAME2= <>
##$TPNAME3= <>
##$TPNAME4= <>
##$TPNAME5= <>
##$TPNAME6= <>
##$TPNAME7= <>
##$TPOAL= (0..7)
0.5 0.5 0.5 0.5 0.5 0.5 0.5 0.5 
##$TPOFFS= (0..7)
0 0 0 0 0 0 0 0 
##$TUNHIN= 0
##$TUNHOUT= 0
##$TUNXOUT= 0
##$USERA1= <user>
##$USERA2= <user>
##$USERA3= <user>
##$USERA4= <user>
##$USERA5= <user>
##$V9= 5
##$VALIST= <valist>
##$VCLIST= <CCCCCCCCCCCCCCC>
##$VD= 0
##$VDLIST= <DDDDDDDDDDDDDDD>
##$VPLIST= <PPPPPPPPPPPPPPP>
##$VTLIST= <TTTTTTTTTTTTTTT>
##$WBST= 1024
##$WBSW= 4
##$XGAIN= (0..3)
0 0 0 0 
##$XL= 0
##$YL= 0
##$YMAX_a= 594785
##$YMIN_a= -327116
##$ZGOPTNS= <>
##$ZL1= 120
##$ZL2= 120
##$ZL3= 120
##$ZL4= 120
##$ABSF1= 10
##$ABSF2= 0
##$ABSG= 5
##$ABSL= 3
##$ALPHA= 0
##$AQORDER= 0
##$ASSFAC= 0
##$ASSFACI= 0
##$ASSFACX= 0
##$ASSWID= 0
##$AUNMP= <proc_1d>
##$AZFE= 0.1
##$AZFW= 0.1
##$BCFW= 1
##$BC_mod= 2
##$BYTORDP= 1
##$COROFFS= 0
##$CY= 11.3945322036743
##$DATMOD= 1
##$DC= 2
##$DFILT= <>
##$DTYPP= 0
##$F1P= 15.9154993809931
##$F2P= -4.1035820241983
##$FCOR= 0.5
##$FTSIZE= 0
##$FT_mod= 4
##$GAMMA= 1
##$GB= 0.15
##$INTBC= 1
##$INTSCL= 1
##$ISEN= 128
##$LB= 0.24
##$LEV0= 0
##$LPBIN= 0
##$MAXI= 10000
##$MC2= 0
##$MEAN= 0
##$ME_mod= 0
##$MI= 1.114404
##$NCOEF= 0
##$NC_proc= 0
##$NLEV= 6
##$NOISF1= 3.799351
##$NOISF2= 2.8
##$NSP= 1
##$NTH_PI= 0
##$NZP= 0
##$OFFSET= 15.70392
##$PC= 1
##$PHC0= -10691.13
##$PHC1= 12.40088
##$PH_mod= 1
##$PKNL= yes
##$PPARMOD= 0
##$PSCAL= 0
##$PSIGN= 0
##$REVERSE= no
##$SF= 200.130013532006
##$SI= 16384
##$SIGF1= 3
##$SIGF2= 2
##$SINO= 400
##$SIOLD= 16384
##$SREGLST= <1H.CDCl3>
##$SSB= 0
##$STSI= 0
##$STSR= 0
##$SW_p= 3612.71676300578
##$SYMM= 0
##$S_DEV= 0
##$TDeff= 0
##$TDoff= 0
##$TI= <>
##$TILT= no
##$TM1= 0
##$TM2= 0
##$TOPLEV= 0
##$USERP1= <user>
##$USERP2= <user>
##$USERP3= <user>
##$USERP4= <user>
##$USERP5= <user>
##$WDW= 1
##$XDIM= 8192
##$YMAX_p= 0
##$YMIN_p= 0
$$ End of Bruker specific parameters
$$ ---------------------------------
##NTUPLES= NMR FID
##VAR_NAME=  TIME,          FID/REAL,        FID/IMAG
##SYMBOL=    X,             R,               I
##VAR_TYPE=  INDEPENDENT,   DEPENDENT,       DEPENDENT
##VAR_FORM=  AFFN,          ASDF,            ASDF
##VAR_DIM=   8192,          8192,            8192
##UNITS=     SECONDS,       ARBITRARY UNITS, ARBITRARY UNITS
##FACTOR=    0.0002944,     1,               1
##FIRST=     0,             0,               0
##LAST=      2.4114304,     0,               0
##MIN=       0,             -327116,         0
##MAX=       2.4114304,     594785,          0
$$ Real data points
##PAGE= N=1
##DATA TABLE= (X++(R..R)), XYDATA
$$ [...]
2338B219j695k316L139j992m25L754k797p39O58j463K944j064p27K359m311J023
$$ 2219 524 -1792 1347 -645 -1070 2684 -113 -852 -194 -1657 1287 223 -504 1855 -2456 -1433
2354a433L580l398J589P82l420J673J45O98J480l511J907M93l522N091n77l756
$$ -1433 2147 -1251 338 1120 -2300 -627 -482 216 1696 -1815 92 585 -2937 2154 1577 -2179
2370b179L441k026j100L356j103J395l162j783N305j673L26K373o887J092N550
$$ -2179 1262 -764 -1864 1492 389 1784 -1378 -3161 2144 471 797 3170 -3717 -2625 2925
2385B925j340M53k507k047K498l2L722j057o727M027J191j775L765k688l183L081
$$ 2925 1585 2038 -469 -2516 -18 -50 3672 2615 -4112 -85 1106 -669 3096 408 -2775 306
2401C06P59J189k497j717L364k456P93L145n484J479L777l423M8J49J48K318k179
$$ 306 1065 2254 -243 -1960 1404 -1052 -259 2886 -2598 -1119 2658 -765 -717 -568 -420 1898 -281
2418b81M55j355k979O925n9n032J986k703J013N853k782j537k648j60O348k067
$$ -281 174 -1181 -4160 2765 2706 -2326 -340 -3043 -2030 3823 1041 -496 -3144 -3304 3044 977
2434I77j255L94n476M486M685m226J008k966q93N646j484M7j187m904N801J496
$$ 977 -278 116 -5360 -874 3811 -415 593 -2373 -3266 2380 896 943 -244 -5148 653 2149
2450B149l773M157m804j56M170k790K775j948l704O099k473j088M934n917J360
$$ 2149 -1624 2533 -2271 -2427 1743 -1047 1728 -220 -3924 2175 -298 -1386 3548 -2369 -1009
2465a009L557m396K311j246r21M374l556J000J489n913O582J648o530L433j973
$$ -1009 2548 -1848 463 -783 -1704 2670 -886 114 1603 -4310 2272 3920 -2610 823 -1150
2480a150p00O634l848j758j54k112P122j113m394K955n201K943P088o906K40J06
$$ -1150 -1850 4784 936 -822 -976 -3088 4034 2921 -1473 1482 -3719 -776 6312 -594 -354 -248
2496b48l061O937p12l992J478l531M564L414o005J608j778r19P515m336l297L023
$$ -248 -3309 3628 2916 -1076 402 -3129 1435 4849 -1156 452 -1326 -2245 5270 934 -2363 660
2512F60l215M948J367p088K418J68R84M130o312o88K571j570N524k475n680L816
$$ 660 -2555 2393 3760 -3328 -910 -742 242 4372 -1940 -2628 -57 -1627 3897 1422 -4258 -442
2528d42j214K058L599o623l6J760l21M854l328l910K954r51L267J208n920J247
$$ -442 -1656 402 4001 -2622 -2658 -898 -1219 3635 307 -3603 -649 -1600 1667 2875 -3045 -1798
2544a798J708MK729l764r70K965j853K457m46l937L427J45r29J688k849J63K676
$$ -1798 -90 -86 2643 -1121 -2091 874 -979 1478 1032 -2905 522 667 -262 1426 -1423 -1260 1416
2561A416j140J281k548j582L763o54P86J14m680J848L085o42M45l091r27K656
$$ 1416 276 1557 -991 -2573 1190 536 1322 1436 -3244 -1396 1689 1047 1492 -1599 -2526 130
2577A30O20J495k291l401K400J589O78O09l891n98K258N83K050k053k735J704
$$ 130 750 2245 -46 -3447 -1047 542 1220 1829 -2062 -2660 -402 181 2231 178 -2557 -853
2593h53j9J367J185l012J8Q14R4J638j838j58J168j276J526J01k029J861K41j365
$$ -853 -872 495 1680 -1332 -1314 -500 -406 1232 -606 -764 404 -872 654 755 -1274 587 828 -537
2611e37O88n69P18J103j061R8j727P96K935q97j086n06j472K065K408j462j277
$$ -537 151 -418 300 1403 342 440 -1287 -491 2444 1547 461 -45 -1517 548 2956 1494 217
2628B17j405M68K682L93m96j912j980K975J279o64m32k277j98K581J30n2j214
$$ 217 -1188 -720 1962 2355 1859 -53 -2033 942 2221 1557 1125 -1152 -1350 1231 1361 1309 95
2645I5j795J660P33K77R7j869nJ123n47J083p41r94N46j77p7R30n08k22k20j101
$$ 95 -1700 -40 693 970 1067 -802 -807 316 -231 852 111 -883 -337 -514 -591 339 -169 -391 -611 -1712
2665a712Q81N51L93j52j498j24J129J26J103j073q30n11O46J010k79p25R6o2N5
$$ -1712 -831 -280 113 -39 -1537 -1661 -532 -406 697 -376 -1206 -1717 -1071 -61 -340 -1065 -969 -1031 -976
2684i76J551m22j286J2M15O12J64k37K07r86N44J291p69n00J063r64n34J382K71
$$ -976 575 153 -1133 -1121 -706 -94 70 -167 40 -946 -402 889 120 -380 683 -281 -815 567 838
2703H38l20k11M64p48l56J633r3j007P30M0j107J220N67j154m67N27J39j19K44
$$ 838 518 307 771 23 -333 1300 1207 200 930 970 -137 1083 1650 496 29 556 695 576 820
2722H20N75j891K77J690q45n45R55q66k72L64P82k82j186R36p5j504J289O31j404
$$ 820 1395 -496 -219 1471 626 81 1036 170 -102 262 1044 762 -424 512 437 -1067 222 853 -551
2741e51N41M37j250j84J561j58j259r6P40r74O76J896k276j282J878P6n57J376
$$ -551 -10 427 -823 -1007 554 396 -863 -959 -219 -1193 -517 1379 -897 -2179 -301 -225 -782 594
2759E94q84j582K77K196J24j839Q77o68j061K466Q47j947J11k38J92M37Q44M98
$$ 594 -290 -1872 -1595 601 725 -1114 -237 -905 -1966 500 1347 -600 -489 -727 -535 -98 746 1244
2777A244k113l75K084q26J44J261j863j94J041M30K69j414P81K78k224K944O18
$$ 1244 -869 -1244 840 14 158 1419 -444 -638 403 833 1102 -312 469 747 -1477 1467 2085
2794B085k603Q10L05q97P02J128j66j976j49K347j689K48K706l315j236K845n13
$$ 2085 -518 292 597 -300 402 1530 1364 -612 -761 1586 -103 145 2851 -464 -1700 1145 632
2811F32J38O07j353j422K64K843L93l205Q42j17k111M309M80l761M45L9J25J808
$$ 632 770 1377 24 -1398 -1134 1709 2102 -1103 -261 -378 -2489 1820 2300 -1461 -1016 -977 -852 956
2829I56n48l24k235j24M000j620j000K023l189O23K777j560R7m75K5J216j928
$$ 956 408 84 -2151 -2275 1725 105 -895 1128 -2061 -1438 1339 -221 -124 -599 -574 642 -1286
2846a286J617J223l958K161Q43k620K978k73j941J158o05Q60M45j734K333j941
$$ -1286 331 1554 -2404 -243 600 -2020 958 685 -1256 -98 -703 157 602 -1132 1201 -740
2862g40j212L669j653l72J819k930L75J635p72J880j957o80J414k457K910J693
$$ -740 -1952 1717 64 -308 1511 -1419 -1044 591 -181 1699 -258 -938 476 -1981 929 2622
2878B622m011R09L75p75L061j245j853K49p98L674nl723J897j162k85L638j477
$$ 2622 -1389 -480 -105 -880 2181 936 -917 -668 -1466 2208 2203 -1520 377 -785 -1070 2568 1091
2895A091j934M43p58K315L72j571L48k342J899L165m284L86J748j877K546m76
$$ 1091 -843 -400 -1158 1157 1529 -42 306 -2036 -137 3028 -1256 -870 878 -999 1547 1071
2911A071k570M43J095J926j200k685J845L62l13K381l077j786L229K74q1l27j881
$$ 1071 -1499 -1056 39 1965 765 -1920 -75 287 -26 2355 -722 -2508 721 995 914 587 -1294
2928a294M33Q95J907Jl697K73J740N9K019j647l240J848J305P13p29j921Q13O38
$$ -1294 -861 34 1941 1942 -1755 -1482 258 317 2336 689 -2551 -703 602 1315 586 -1335 -522 116
2946A16N99N06k543j81J993l97P05n30j797J211R94k06J68k586R49J641n14N13
$$ 116 715 1221 -1322 -1503 490 93 798 268 -1529 -318 676 470 638 -1948 -999 642 128 641
2964F41j756r30K324L31K82j172k262J768J382k01R63k827q78K119N48J016j510
$$ 641 -1115 -2045 279 610 892 -280 -2542 -774 608 407 1370 -1457 -2335 -216 332 1348 -162
2981a62j976J410O64Q73M61l186J74J855j99J420j542j986K084L97L83L93k310
$$ -162 -2138 -728 -64 809 1270 -1916 -1742 113 -86 1334 -208 -2194 -110 287 670 1063 -1247
2998a247Q54O37J33R57j738p81K153n07J01j21j911K105J305j307k09j834Q11
$$ -1247 -393 244 377 1334 -404 -1185 968 461 562 441 -1470 635 1940 633 424 -1410 -599
3015e99K928q39j267r88p76L030P95j522q36j818J927K606j456q29j323p73L473
$$ -599 2329 1490 223 -765 -1541 1489 2284 762 -74 -1892 35 2641 1185 356 -967 -1740 1733
3032A733M78j546r41j742J889K650j352o87j824l06L007k99q84q86p24J696Q59
$$ 1733 2211 665 -276 -2018 -129 2521 1169 482 -1342 -1648 1359 1060 176 -710 -1434 262 1121
3049A121j504K87q10o5J918j283m60J48j75J156j8j231O75n23R49O45k150J75
$$ 1121 -383 -96 -906 -971 947 -336 -796 -648 -823 333 315 -916 -241 -764 185 830 -1320 -1145
3067a145Q26j98J051k27j688K37O03J333j22j587q6J7Q38J698j382j639Q68K71
$$ -1145 -319 -517 534 307 -1381 -1144 -541 792 670 -917 -1003 -986 -148 1550 168 -1471 -603 -332
3085c32J012M23j157j143Q72J214J43r35m12M0n37J735N01k334O60M23j40K85
$$ -332 680 1103 -54 -1197 -325 889 1032 97 -315 -275 -812 923 1424 -910 -250 173 33 318
3103C18q0o6p50N93J436k081P94P06o36J120j234K30j455J502M39q46q6M90n50
$$ 318 238 172 -578 15 1451 -630 164 870 234 1354 120 350 -1105 397 836 -10 -96 394 -156
3122a56L51J084j151j053R79R8j50O43n98r40O67R19m8q87J82O4k13J015k03o58
$$ -156 195 1279 128 -925 54 152 2 645 47 -893 -226 693 645 -242 -60 4 -209 806 603 -55
3142e5l41O86k70L24j91P2R1n12J74K88m51J79O25r09Q0J28K26q5M54J37j645
$$ -55 -396 290 20 344 153 225 316 -196 -22 266 -185 -6 619 -290 -210 -82 144 59 513 650 -995
3163i95L87J599q87o36Q04m97p51J524K4j273k42Q63l73k33J502p65j612J467
$$ -995 -608 991 104 -532 272 -225 -976 548 572 -701 -943 -80 -453 -686 816 51 -1561 -94
3181i4K99j168J030M26j684M4J345p7j001R94p2j624J250J179j348m9O00q99K32
$$ -94 205 -963 67 493 -1191 -1147 198 121 -880 114 42 -1582 -332 847 -501 -550 50 -849 -617
3200f17J436l01j057r5O57k19K04J025r20j338J148N68j62J62n9q08J49O95P02
$$ -617 819 518 -539 -634 23 -196 8 1033 113 -1225 -77 491 329 491 432 -376 -227 468 1170
3219A170j132n18J210r86K78J327r38p12N26M34m43r6J019p26j228J473M56j784
$$ 1170 38 -480 730 -256 22 1349 411 -301 225 659 216 120 1139 413 -815 658 1114 -670
3237f70J389M10j861N07J203o05j51K00j7j379J166J665j658q39J469j440M9K071
$$ -670 719 1129 -732 -225 978 373 222 422 405 -974 192 1857 199 -640 829 -611 -562 1509
3255A509j179j049K46L77J6N3R18j170j301J849M01j369N88k72q78P84J113o29
$$ 1509 330 -719 -473 -96 -80 -27 891 -279 -1580 269 670 -699 -111 -383 -1261 -477 636 7
3273Gq56K00N47p89K79J437j490k84Q46l88o8P23j69k30p72J221j8j198J288K07
$$ 7 -849 -649 -102 -891 -612 825 -665 -949 -103 -491 -559 164 -5 -235 -1007 214 196 -1002 286 493
3293D93j942J478M21p70L17K36k00n39L52J210j200K5J121j437K93J397r13p56
$$ 493 -1449 29 450 -320 -3 233 33 -506 -154 1056 -144 -119 1002 -435 -142 1255 342 -414
3311d14M12J8K50J02P13r19j205J574M70j469J490o75j234J038N95K65r49m55
$$ -414 -2 16 266 368 1081 162 -1043 531 1001 -468 1022 347 -887 151 746 1011 62 -393
3329c93O39p43O92J225j983j86J623j082m3N95m83l6m46O94j0j174J620J31k354
$$ -393 246 -497 195 1420 -563 -749 874 -208 -251 344 -139 -175 -621 73 63 -1111 509 640 -1714
3348a714K098j28j484J624l01o30Q4j2P88m86J08R93k722Q75K793k347L41P34
$$ -1714 384 256 -1228 396 95 -535 -451 -463 325 -161 -53 940 -1782 -907 1886 -461 -120 614
3366F14k333J884Q25q20k06j064J113M74r98J952j503j832K857n11k91J116k330
$$ 614 -1719 165 990 170 -36 -1100 13 487 -511 1441 -62 -1894 963 452 161 1277 -1053
3383a053M64J681j087J542j980r26K193r33N62M89k000J457J72j002J318j408
$$ -1053 -589 1092 5 1547 -433 -1359 834 -99 463 952 -1048 409 581 -421 897 -511
3399e11K38J668j948P01K32j898K349K25j796P91r59J053J069j836L77p34l15
$$ -511 -273 1395 -553 148 380 -1518 831 1056 -740 51 -908 145 1214 -622 -245 -979 -1294
3416a294L218j615j398Q78j643J935J717j989l63j169O51K690j424m64n76j534
$$ -1294 1924 309 -1089 -211 -1854 81 1798 -191 -554 -1723 -1072 1618 194 -270 -846 -2380
3432b380L705J6k048P18j299O08K144j209n04l88m15K132m64r79Q06j689J379
$$ -2380 1325 1341 -707 11 -1288 -680 1464 255 -249 -637 -1052 1080 616 -363 443 -1246 133
3449A33J368k154N06L88r10J868q76j015P82l05J120L03j793m0M80P23R55j930
$$ 133 1501 -653 -147 241 -669 1199 323 -692 90 -215 905 1208 -585 -625 -145 578 1533 -397
3467c97n06R48k29J517n13j992J039k41J229P75k111o05O65N47J539j375n30l06
$$ -397 -903 45 -184 1333 820 -1172 -133 -374 855 1630 -481 -1086 -421 126 1665 290 -240 -546
3485e46l77K158k27j990N49j55Q8K210j903o43M17L04P85k01j181M83m95J485
$$ -546 -923 1235 1008 -982 -433 -588 -500 1710 -193 -836 -419 -115 670 469 -712 -229 -724 761
3503G61Q3k135J053Q5n22J608q17j628J285Q95j56k37j201O58l50J457N96k977
$$ 761 844 -1291 -238 -153 -675 933 116 -1512 -227 668 512 275 -926 -268 -618 839 1435 -1542
3521a542O83J044m02J174J35k466O46J238O80m34j491M56l7N78J510j616j233
$$ -1542 -859 185 -217 957 1092 -1374 -728 510 1190 756 -735 -279 -316 262 1772 156 -1077
3538a077J615j35l8Q01j630j44R13L3M90j063K43O24o18P99n11j494J726J38p19
$$ -1077 538 403 365 1166 -464 -608 305 338 828 -235 8 632 14 813 302 -1192 534 672 -47
3557d7N49j074r5J168j2j31j070n49J502j0K60o18j330J226M37m65J028j543o18
$$ -47 502 -572 -667 501 489 358 -712 -1261 241 231 491 -127 -1457 -231 206 -259 769 -774 -1392
3576a392J619L9j58J20j588O26K61O22K79j438O6R70l76O67l20j347J456R4p28
$$ -1392 227 266 108 228 -1360 -734 -473 149 428 -1010 -944 26 -350 317 -3 -1350 106 200 -528
3595e28J70O23q57J83O57j22q36O16R88j325N96N71j183P82J234j115j928J951
$$ -528 -358 265 -592 -409 248 126 -710 -94 894 -431 165 736 -447 335 1569 454 -1474 477
3613D77klL08l47j402J006J289r45J67m93l1M21P45m64j107N90P0J90J34L69q75
$$ 477 475 472 780 433 -969 37 1326 381 548 55 24 445 1190 726 -381 209 279 469 603 972 97
3634I7o44J053j33k59M83p25m63O71J91J69k65m33K9J38N6K62k73k46K62j57p7
$$ 97 -547 506 373 114 597 -128 -591 80 271 440 175 -258 -229 -91 -35 227 -46 -292 -30 -187 -264
3655b64K92J34m12k20Q1O46n25L01j2q90L94M21j92l09M65j52m35O71N78j159
$$ -264 28 162 -250 -470 -389 257 -268 33 21 -869 -475 -54 -246 -555 -90 -242 -677 -6 572 -587
3675e87r7J024q79K65L88R3r82Q88J78n58J21O34n71m59P93o6r88J310o5j292
$$ -587 -684 340 -539 -274 114 207 -775 113 291 -267 -146 488 -83 -542 251 185 -803 507 442 -850
3695h50P82M32l21j81P42m30n73N07N46r30PO62p09J77N94p8p77M28L08l01K8
$$ -850 -68 364 43 -138 604 174 -399 108 654 -276 -269 393 -316 -139 455 377 -400 28 336 35 63
3716F3M39m70n67Q24j00r36P24M91n14p7K49l9l60L52O06r15n24J285m45j19P14
$$ 63 502 32 -535 289 189 -747 -23 468 -46 -123 126 87 -273 79 685 -230 -754 531 86 -33 681
3737F81p12o50R35N93o43o60N51p2l88J328n05j194O56N30o88P42J05q99m14O58
$$ 681 -31 -681 254 847 204 -456 95 23 -365 963 458 -736 -80 450 -238 504 609 -290 -704 -46
3757d6P01n63k1P82j289q0J466o57p17N03l0l01K86O38l08r10O73J91n38O48J16
$$ -46 655 92 71 853 -436 -516 950 293 -424 79 49 -252 34 672 364 -546 127 318 -220 428 544
3778E44j089NP20k53k74L56K09o13J9R58q29o7P03p89l09P80M57j226L50nl05
$$ 544 -545 -540 180 -73 -347 9 218 -395 -376 582 -247 -314 389 -400 -709 71 528 -698 -348 -353 -658
3799f58L09Q43m58j282Q49K55k65N95J23j189j55R46L24l43J75n77n08J084K89
$$ -658 -349 494 36 -1246 -397 -142 -407 188 311 -878 -1033 -87 237 -106 69 -508 -1016 68 357
3818C57m11j72r9K2M67K25j34n52k61Q86J41m3l32j89L2k5L71M32p78J7P26o34
$$ 357 -54 -226 -325 -303 164 389 255 -297 -558 328 469 426 94 -95 -63 -88 283 715 -63 -46 680 46
3840D6mP39o19k4J43j71j10N74Jj62l81L27m3n92J431p05o86L80j34m5P80l40
$$ 46 42 781 162 138 281 110 0 574 575 413 32 359 316 -276 1155 450 -236 144 10 -35 745 405
3862D05q22N9L62M43j11m30k02n17J228K76q04J27m90k88J197K97j184J9m05P50
$$ 405 -417 -358 4 447 336 -94 -296 -813 415 691 -113 14 -476 -764 433 730 -454 -435 -840 -90
3882i0L33k10l62n13M98Q68n22o71P78p24R90J09r74L70l04P16K82p00K3M1q9
$$ -90 243 33 -329 -842 -344 524 2 -669 109 -615 375 484 -490 -120 -424 292 574 -126 -103 -62 -151
3903a51Q34o53r77R4Q02L62O46j416l4K05O40R24j260l44J27J31O93J04r49l06
$$ -151 683 30 -947 -853 -51 311 957 -459 -493 -288 352 1276 16 -328 -201 -70 623 727 -222 -528
3923e28K38R81K49p48n53K0J27R55N5j480M06O52k12r3N7p42Q7R01k32p85j00
$$ -528 -290 691 940 192 -361 -341 -214 741 796 -684 -278 374 162 69 126 -616 -529 372 140 -645 -745
3944g45O56J87K91Q5j503J58J119L51q68l82L43J84N47R7r69m01P30J63P01j4
$$ -745 -89 98 389 474 -1029 -871 248 599 -269 -651 -308 -124 423 520 -449 -850 -120 43 744 730
3964G30j259l06N02R52p6j075O97p62J187l27K26p62O61l83K00P77n89p40K9J382
$$ 730 -529 -835 -333 619 543 -532 165 -597 590 263 489 -273 388 5 205 982 393 -347 -318 1064
3984A064n14m78J7J6K74L97m81l8n58L75o04k11J072j599J835k04j03J2q40J167
$$ 1064 550 72 89 105 379 776 295 257 -301 74 -530 -741 331 -1268 567 363 260 272 -568 599
4004E99M20l56k91j151R70K19L87p54j372L52P45J421j723O71J00p69O30K91Q52
$$ 599 1019 663 372 -779 191 410 797 43 -1329 -977 -232 1189 -534 137 237 -532 98 389 1241
4023A241k519K78L73J9J708j85k265J242J088r93L29n97l33Q74R4J33l69K86j65
$$ 1241 -1278 -1000 -627 -608 1100 915 -1350 -108 980 -13 316 -281 -614 260 354 487 118 404 239
4042B39l40K45J28l42k91J123q00M16m04j02K28N75k9j326K13Q22K36n34L80o46
$$ 239 -101 144 272 -70 -361 762 -38 378 -26 -128 100 675 646 -680 -467 355 591 57 437 -209
4062b09K25N66L74j388l26P15j3O22l60l50n43J093Mk32qr64L62P81J97m00n89
$$ -209 16 582 956 -432 -758 -43 -56 566 206 -144 -687 406 410 178 170 -794 -432 349 546 146 -443
4083d43M00k03M50J75k75n78L74K30R0j77K3j80j24L72l38J21k15M64l5k28k41
$$ -443 -43 -246 204 379 104 -474 -100 130 220 43 66 -114 -238 134 -204 -83 -298 166 131 -97 -338
4104c38J58L02r9RK20o24Q7O24k68m24N44k86j85M78J28m58q2M62m01K86K30k42
$$ -338 -180 122 23 32 252 -372 -285 339 71 -353 191 -95 -280 198 326 -132 -214 248 -153 133 363 121
4126A21m61O77J30m07L11M3m05j47O43l10n9K28k43j67J72L15n33k09N18J90m07
$$ 121 -340 337 467 60 371 414 9 -138 505 195 136 364 121 -46 126 441 -92 -301 217 407 0
4147@J78N28o63k00P64k66n52M41J98o11k7O11l63k15L53k80m03M00L24o51J86
$$ 0 178 706 43 -157 607 341 -211 230 428 -183 -210 401 38 -177 176 -104 -507 -107 217 -434 -248
4168b48L42m50o6O02k5m93%K43k90R1J33o08m67J332L58j715J767j41j192N19
$$ -248 94 -356 -422 180 155 -338 -338 -95 -385 -294 -161 -769 -1236 96 454 -1261 506 365 -827 -308
4188c08L30p0o9m22L54k41M57L50j68n88L89k94J47L66oo02L53J98N1Q2j55J51
$$ -308 22 -48 -117 -539 -185 -426 31 381 213 -375 14 -280 -133 233 227 -375 -22 176 227 309 154 305
4210C05q21O23K84n94L38N83n56l21O65l15j83J12K06k17k35N70j19n33M85k33
$$ 305 -516 107 391 -203 135 718 162 -159 506 191 8 120 326 109 -126 444 325 -208 277 44
4230D4j12K42N45p80J55k34K34P7J89m56n84O13L51k93R6M52o35K71J1m4j8n00
$$ 44 -68 174 719 -61 94 -140 94 171 360 -96 -680 -67 284 -9 87 539 -96 175 186 142 124 -376
4252c76K59k39L34P92r38l35N54k36j67K58J6J6l37L79M11m14o3J23k14N3L8R5
$$ -376 -117 -356 -22 770 -168 -503 51 -185 -352 -94 -78 -62 -399 -20 391 -23 -86 37 -177 -124 -86 9
4274Il7k90M03j3j36O45p32j4j25L80k49L59k12k61L35K33l55k15K89K12o26N94
$$ 9 -28 -318 85 72 -64 581 -151 -165 -290 90 -159 200 -12 -273 62 295 -60 -275 14 226 -400 194
4296A94k55k67M14Q2m38R3K25j48j8N1K23n37L92L10l23rj47l6K07N22n88m67
$$ 194 -61 -328 86 168 -270 -177 48 -100 -118 -67 156 -381 11 321 -2 -11 -158 -194 13 535 -53 -520
4318e20L34L30o7l2M09p46K01O16n08k77N85k65J6P4k8j17k47O35o8l55k11M94
$$ -520 -186 144 77 45 454 -292 -91 525 17 -260 325 60 76 150 122 5 -242 393 325 -30 -241 253
4340B53l01K74J21n33K7M56K07r5o56J57J62P9M87k98q32N58R7k19K38Q7n72q5
$$ 253 -48 226 347 -186 -159 297 504 409 -247 -90 72 151 638 340 -492 66 163 -56 182 269 -303 -388
4362c88O59K70n17k71N44o23N82M58q15k75O25k02o6pl3l2L9L06l0m85K89j78
$$ -388 271 541 24 -247 297 -326 256 714 -101 -376 249 47 -19 -26 -59 -91 -52 254 224 -261 28 -150
4384a50k83N07k08k45J89J86J21l79l03M39j53LL72p75k00R85Q6j17l13l98M70
$$ -150 -433 74 -134 -379 -190 -4 117 -262 -565 -126 -279 -276 96 -679 -879 106 192 75 -238 -636 -166
4405a66J84O72n64q98J29R07j64r8m0q83N53J028l7r02k26L99K51k0M76p78o26
$$ -166 18 690 126 -772 -643 264 100 2 -38 -921 -368 660 623 -279 -505 -106 145 125 601 -177 -803
4426h03Q03N88o20q2n2O5K29L68l52n79M46N91j96l10N9m94N84L84m15l85Q0O22
$$ -803 0 588 -32 -114 -166 -101 128 496 144 -435 11 602 406 96 155 -339 245 629 214 -171 -91 531
4448E31J56l19m46RN47k00L1m75n2K84j07P52j43p80m26N22P47n14l32K42l39
$$ 531 687 368 -78 -69 478 278 309 -166 -218 66 -41 711 568 -212 -638 -116 631 117 -215 27 -312
4469c12L90N07n91m78J09L98J60M7j20j94l23M03L21q4n39L2J46L50k31k99j13
$$ -312 78 585 -6 -484 -375 23 183 230 110 -84 -407 -4 317 233 -306 -274 -128 222 -9 -308 -421
4490d21K12N84k82n46J35pM08K03m50k99j06O27N31l77o44J88PM28L29q72k35
$$ -421 -209 375 93 -453 -318 -325 83 286 -164 -463 -569 58 589 212 -432 -244 -237 191 520 -352 -587
4511e87P54L02l81j08q2m57N87N93o6q30K4K29m1L24J80o35k25O02Q7k80QP3l02
$$ -587 167 469 88 -20 -102 -559 28 621 555 -275 -251 -22 -63 261 441 -194 -419 183 270 -10 -2 71 -231
4534b31L16K45o51O6K50J42K4j29k81J89J44L00l93j54l5N18k23r2Nk91L09J36
$$ -231 85 330 -321 -255 -5 137 161 32 -249 -60 84 384 -9 -163 -198 320 97 5 10 -281 28 164
4556A64m3j56n29J50N06Q2R0k68l73P7O31r6m37Qn0L1O12K66j046N4M29j88k68
$$ 164 121 -35 -564 -414 92 174 264 -4 -377 -300 331 235 -202 -194 -244 -213 399 665 -381 -327 102 -86 -354
4579c54N16k81l4K74L16m23m19J016m87k07M29j54o34N23K53k66r8L48r5o46P43
$$ -354 162 -119 -153 121 437 14 -405 611 124 -83 346 192 -442 81 334 68 -30 318 223 -423 320
4600C20k56l33K42K89m81K27Mj38j11N52j07o23N30J30k51J46J82n45l3J21K01
$$ 320 64 -269 -27 262 -219 8 12 -126 -237 315 208 -415 115 245 -6 140 322 -223 -256 -135 66
4621F6j50J73m48O4L66k29J89k96L15n6K1j8L36l51k31Q8J29J04l33M59j11j29
$$ 66 -84 89 -359 -295 71 -158 31 -265 50 -6 15 -3 333 -18 -249 -161 -32 72 -261 198 87 -42
4643d2J22J51ol10NJ19j94M30O3n11M10K5k74n7N14m73q7L32j23k76L12K00o97
$$ -42 80 231 225 -85 -80 39 -155 275 338 -173 237 262 -12 -69 445 -28 -115 217 94 -182 130 330 -367
4666c67K98L98m72J47M21o24k17Q09m68O4L23l23l81M08J48l84n2K74j85k22K92
$$ -367 -69 329 -143 4 425 -199 -416 393 -75 -11 312 -11 -392 16 164 -220 -272 2 -183 -405 -113
4687a13R7m39L53j93N2N54l60o1KM1Mk84J67Q5m78M05r1j16K95k5J6J14j72L59
$$ -113 -16 -455 -102 -295 -243 311 -49 -110 -108 -67 -63 -347 -180 -95 -573 -168 -259 -375 -80 -105 -89 25 -147 212
4711B12o6l56J75k40k4M08k28J22M4j58M69m53m3L26m16J03M27k04j42O12n81
$$ 212 146 -210 -35 -275 -299 109 -119 3 47 -111 358 -95 -138 188 -228 -125 302 98 -44 568 -13
4732a3j58O4J49J75j15M29n19k52N94p1n58O09k64k63N38L8l56l7j37M37l04J2
$$ -13 -171 -107 42 217 102 531 12 -240 354 283 -275 334 70 -193 345 383 27 -10 -147 290 -14 -2
4754bO66q23J73L47l64J50J98o9l23o3K12%k62K70n2o20Q66l27m11L95j36j59
$$ -2 664 -159 14 361 -3 147 345 276 -47 -110 102 102 -160 110 58 -562 304 -23 -434 -39 -175 -334
4776c34J05K25K96o69LO95m84Q9O09p49J88M7k5J87k01k03R6k9L58Q5m95K59J30
$$ -334 -229 -4 292 -377 -374 321 -163 -74 535 -214 -26 21 -4 183 -18 -221 -125 -154 204 289 -206 53 183
4799A83p87P77K13m96J00J9j83K19J17P5l09m51P38L3k76K25l58l2M91n4j2o42
$$ 183 -604 173 386 -110 -10 9 -174 45 162 237 -72 -523 215 248 -28 197 -161 -193 298 244 232 -410
4821d10L54L19m69N66k93j56K31J06m58P6J86M4j35M3L78m28k94Q81p15l58O95
$$ -410 -56 263 -206 360 67 -89 142 248 -210 -134 52 96 -39 4 382 -46 -340 541 -174 -532 163
4842A63k94J8K64l84L60n96O48K61m58j36J46m47R17j42m69j36J47K49L8l07J43
$$ 163 -131 -113 151 -233 127 -469 179 440 -18 -154 -8 -455 462 320 -149 -285 -138 111 149 -158 -15
4863a5k62q1J039r40j43L63j07L35J53l35J25l98K90O99n99j09L64o41O17j76
$$ -15 -277 -358 681 -259 -402 -39 -146 189 342 7 132 -266 24 723 124 15 379 -262 355 179
4883A79l97J35J07Q2O0j36R4l08J86O58l24q06P71l53q3N13m47p7j50K91L81n68
$$ 179 -218 -83 24 106 166 30 124 -184 2 660 336 -470 301 -52 -135 378 -69 -146 -296 -5 376 -192
4905a92J3J75n90Q55R2n96j8j32L40M05n49j36L57m62P96j27q16O84j50M5N4m89
$$ -192 -179 -4 -594 261 353 -243 -261 -393 -53 352 -197 -333 24 -438 358 231 -585 99 -51 -6 48 -441
4927d41K48J88j81P03p83j64M99n2J03K43r52M17J57L15l00m76K54K17J8M78j27
$$ -441 -193 -5 -186 517 -266 -430 69 17 120 363 -589 -172 -15 300 0 -476 -222 -5 13 491 364
4948C64j043N96N72m73L49n55k8J97L97J24n28j22K65j55K96K46q16K31M79k22
$$ 364 -679 -83 489 16 365 -190 -218 -21 376 500 -28 -150 115 -40 256 502 -314 -83 396 174
4968A74N3k07k02K05o4M23l03n56P37k21O0J33l68j69M15k3J47r2l33M25j23p1
$$ 174 227 20 -182 23 -41 382 79 -477 260 39 99 232 -136 -305 110 87 234 142 -191 234 111 40
4990D0o8k46J83K71P3j34o29j58J040l25Rp4l54p6P24l70L0l14L09J48o2K66o18
$$ 40 -28 -274 -91 180 253 119 -510 -668 372 47 56 -18 -372 -448 276 -94 -64 -378 -69 79 17 283 -335
5013c35k91O12M5j68J44r0k56L15K23k07k99K15Q1K57J56j69o87M94L99n49R5
$$ -335 -626 -14 31 -137 7 -83 -339 -24 199 -8 -307 -92 -11 246 402 233 -454 40 439 -110 -15
5034a5M14m54K22l0K29o36n3O13k6k16O7j97R5L75l83p3J36M2l4J03j50j07J08
$$ -15 399 -55 167 137 366 -270 -323 290 264 48 115 -82 13 388 5 -68 68 110 76 179 29 -78 30
5057C0j2J29M7l42J59k66J26m5K93l36K66J6k30j68K57j16k9K59j21K47j34k05
$$ 30 18 147 194 -148 11 -255 -129 -174 119 -217 49 65 -165 -333 -76 -192 -221 38 -83 164 30 -175
5079a75K87k20M6J80j85j02K89k91L1j95N51p04k8O23m60p0P99j47k56K88l65
$$ -175 112 -108 -62 118 -67 -169 120 -171 -140 -335 216 -488 -516 107 -353 -423 376 229 -27 261 -104
5100a04j89K46K67m89R4J87n8P9J61j84k35M23K26m87M9K91l41N4R7k71PKL35
$$ -104 -293 -47 220 -269 -175 12 -46 33 194 10 -225 198 424 -63 -14 277 -64 -10 87 -184 -177 -175 160
5123A60k32J70mn9n9K41j51j86O8J16M7o0K5K6p3qj37J26j39M4K25j93q1RK32
$$ 160 -72 98 94 35 -24 217 66 -120 -52 64 111 51 76 102 29 21 -116 10 -129 -85 140 -53 -134 -125 107
5148A07l59J34K82l36M25j00k53J08l09L37k61j24K33L33j09k1n40M58J57l63
$$ 107 -252 -118 164 -172 253 153 -100 8 -301 36 -225 -349 -116 217 108 87 -453 5 162 -201
5168b01K88J73p82P26k38j0J02l73M55o3j27L36m14L6L45n6k24J09K5p26R30m71
$$ -201 87 260 -522 204 -34 -44 58 -315 140 77 -50 286 -128 -92 253 197 -27 82 107 -619 311 -160
5190a60k30K77l89R02K05o0o22j89K98j34J69M14m97O3Q8j70r2j26P5K30p9l12
$$ -160 -390 -113 -502 400 605 545 -77 -266 32 -102 67 481 -16 47 135 -35 -127 -253 -178 52 -27 -339
5212c39N83k30J46J15p22P25k14k08N23r53K33J29J73J77P6m7r0m72M63q3m02
$$ -339 244 14 160 275 -447 278 64 -144 379 -574 -341 -212 -39 138 214 167 77 -395 68 -15 -417
5233d17O73k81l00N25J55o83P08m26j29K12L8l6K2k35L09n06N04L41q32L64K52
$$ -417 256 -25 -325 200 355 -328 380 -46 -175 37 75 39 61 -174 135 -371 133 474 -358 6 258
5254B58l94J01K32k28j75Q1O22j95m23M03k04l32M18j37m23N36j24M7J64r3J54
$$ 258 -136 -35 197 -31 -206 -125 497 302 -121 282 78 -254 164 27 -396 140 16 63 227 134 288
5275B88k49j2K34l81K78K04o83N52j68k35L33l66J89M33m67J41m8j74P1L9j03
$$ 288 39 27 261 -120 158 362 -321 231 63 -172 161 -205 -16 417 -50 91 43 -131 -60 -21 -124
5296a24L64l90r7K55l90N92l06j53M95p00K15L91o17N12q5j14p3R9K49O0m38Q0
$$ -124 240 -150 -247 8 -382 210 -96 -249 246 -454 -239 152 -465 47 -38 -152 -225 -126 123 183 -255 -175
5318a75J29l96O18j00n98N94K00m47L36m43L16l6p9N13o55k00O67l81K45J25o21
$$ -175 -46 -442 176 76 -522 72 272 -175 161 -282 34 -2 -81 432 -223 -423 244 -137 108 233 -388
5339c88M64R2n8J94n71R4J41j82M85k83l25L93J12J21K9m15r5K40K60P4l83l46
$$ -388 76 168 110 304 -267 -173 -32 -214 271 -12 -337 56 168 289 318 -97 -192 48 308 382 -1 -347
5361c47N03l31J99L22j83l69L75J78l28k92K00K20O7J51k65k66J58L80o23R9M
$$ -347 156 -175 24 346 163 -206 169 347 19 -273 -73 147 214 365 100 -166 -8 372 -251 -152 -148
5382a48l9K01J45q9j73j76M42k86R1O7m27J16M14N4k55P6k72J98N7J45l66j69
$$ -148 -187 14 159 70 -103 -279 163 -123 -32 35 -392 -276 138 192 -63 13 -259 -61 -4 141 -225 -394
5404c94M25Q7Qj39p5j1P7P4K2j12k05L70J26l21m3m5rL68j04k61r4J37K88l08
$$ -394 31 118 126 -13 -88 -99 -22 52 74 -38 -243 127 253 -68 -111 -156 -165 203 99 -162 -256 -119 169 -139
5428a39K99q2m94P21k74J50j11M9k22L39l7j12p3q8K8m4k04M24l71J52L42jl36
$$ -139 160 78 -416 305 31 181 70 119 -103 236 199 87 14 -74 -46 -90 -294 130 -241 -89 253 252 -84
5451h4j38K39j16L89j55l63o0M75J16j09m28L19n5K15k59j99J55j00K10O4k22
$$ -84 -222 17 -99 290 135 -228 -288 187 303 194 -234 85 30 245 -14 -213 -58 -158 52 116 -106
5472a06O4j74R8R5K54m02p1O14m27Q1O5j65o0J71M21m08l04P33p97P16O1l17n01
$$ -106 -42 -216 -118 -23 231 -171 -242 372 -55 26 91 -74 -134 37 458 50 -254 479 -318 398 459 142 -359
5495c59M52r0J27q1L5p9PL8J39m41J25M01j35L72k34l88R0K23J54n86J4L99k27
$$ -359 93 3 130 49 84 5 12 50 189 -252 -127 274 139 511 277 -111 -21 202 356 -230 -216 183 -44
5518d4J55M2l55L33j50q8K45l52J40m7o4J29N3m24M60K64r7O95p73l68m63N06
$$ -44 111 153 -202 131 -19 -107 138 -214 -74 -121 -185 -56 -3 -427 33 297 200 895 122 -246 -709 -203
5540b03M12n11N1L40q9O0lr5j45K61M5jk34L33k89K5J89k66p6o6J39K82j22o0
$$ -203 209 -302 -251 89 0 60 57 -38 -183 78 123 122 -112 221 -68 -43 146 -120 -196 -262 -123 159 37 -23
5564b3K58j62p1J64r8Jj5lj23k61K76J77R7k29PL1J2p2l4J80K2j82K62j48j34
$$ -23 235 73 2 166 68 69 54 51 -72 -333 -57 120 217 -12 -5 26 38 -34 -68 112 134 -48 214 66 -68
5589f8J64l38M66k63RJ12k10j84N38k96K9K70j48k31K44j89K73m22K20N1j55L52
$$ -68 96 -242 224 -39 -30 82 -128 -312 226 -70 -41 229 81 -150 94 -95 178 -244 -24 27 -128 224
5611B24m00j03L10k09K72k22N8j01k9q0L70j43m7K52l28R3L14l29r6K23RL34j99
$$ 224 -176 -279 31 -178 94 -128 -70 -171 -200 -280 90 -53 -100 152 -176 -83 231 -98 -194 29 38 372 173
5634A73j70N7J9K03M3k61J42j08m7m8L58m93J26L6j38k46K60O7j24K8J91L2j24
$$ 173 3 60 79 282 325 64 206 98 51 3 361 -132 -6 30 -108 -354 -94 -27 -151 -123 68 100 -24
5657b4J55j16k06K28j81j37J15J01K99n68K4J72J52J16l3r7J54J76m16JJ08j07
$$ -24 131 15 -191 37 -144 -281 -166 -65 234 -334 -310 -138 14 130 97 0 154 330 -86 -85 23 -84
5679h4M8rQ0qL7k36J21K7K69n39J43J11O2J24l67O0K32m33K92K11k14M1k4O6N4
$$ -84 -36 -45 35 27 64 -172 -51 -24 245 -294 -151 -40 22 146 -221 -161 71 -362 -70 141 -73 -32 -56 10 64
5704F4j81M01k69J9K20l34J50J53l5m02L69m9J15j58jL57m34l11N33k43J72l5
$$ 64 -117 284 15 34 254 -80 70 223 188 -214 155 106 221 63 62 419 -15 -326 207 -36 136 101
5726A01l5J4K7K77n1m43l8K40m69P18l15p5L27k02j89j35K31J15j07j73L09l35
$$ 101 66 80 107 384 333 -110 -148 92 -377 341 26 -49 278 76 -113 -248 -17 98 -9 -182 127 -208
5748b08N82n19LK19K38m92N0P5j20K07J13j02j17O6K11k6m05M34k15j08K68k40
$$ -208 374 -145 -142 77 315 -177 -127 -52 -172 35 148 46 -71 -5 206 180 -225 209 -6 -114 154 -86
5770h6J24k02J03M5m7N2J6J7K5K17m98J10R0j63M42k41J12n9j87J04Kp1J31j75
$$ -86 38 -164 -61 -16 -63 -11 5 22 47 264 -234 -124 -34 -197 245 4 116 57 -130 -26 -24 -95 36 -139
5794a39M2M2K45l30j4j96O05k55J46o2n69L45P69o53r5K07j12p2K48o4k28m16
$$ -139 -97 -55 190 -140 -154 -350 255 0 146 84 -485 -140 629 -24 -119 88 -24 -96 152 88 -140 -556
5816e56P57nj77J24l04l6L37p9j13JP8k20M16j63q4j73K39r9J51J71m41L34p5
$$ -556 201 196 19 143 -161 -197 140 61 -52 -51 27 -193 223 60 -24 -197 42 -57 94 265 -176 158 83
5839H3k12j2Q5k40O63N4o26J22j67M53L7l3k21j37K55M5m14L13K35k95p6K63L2
$$ 83 -129 -141 -56 -296 367 421 -205 -83 -250 203 240 207 -14 -151 104 149 -265 48 283 -12 -88 175 207
5862B07k87L77l02P8Q9l2l12K30N37j12n55M01k75j45N29O8p19K06L49k58lK54
$$ 207 -80 297 -5 73 162 130 -182 48 585 473 -82 319 44 -101 428 496 -223 -17 332 74 71 325
5884C25l08n9K30J6k19r3K97j71J29k34L8j97J66J25J5k10k32N29m23M28J3l85
$$ 325 17 -42 188 204 -15 -108 189 18 147 -87 -49 -246 -80 45 60 -150 -382 147 -276 152 165 -220
5906b20j53J77J45N7l35K39K12j27J62k51o43N32L01m72M94k70QN1J11j01oL2
$$ -220 -373 -196 -51 6 -329 -90 122 -5 157 -94 -737 -205 96 -376 118 -152 -144 -93 18 -83 -89 -57
5928e7J35j31J32M30q84M38L20l03N3P6P1k48P4k1k65Q9M29k67l59O22l12l48
$$ -57 78 -53 79 509 -375 63 383 80 133 209 280 32 106 85 -180 -91 338 71 -288 334 22 -326
5950c26N16j67%m2J48n2N08n93j01J79L45m34j01j77J05j79K72M46j28j22k93
$$ -326 190 23 23 -19 129 77 585 -8 -109 70 415 -19 -120 -297 -192 -371 -99 347 219 97 -196
5971a96K98m4K04l44k5M2k01j2M07l02J12L05j36j68R0k9J72p5k44J50r5kR4J91
$$ -196 102 58 262 -82 -107 -65 -266 -278 129 -173 -61 244 108 -60 30 1 173 98 -146 4 -91 -93 1 192
5995A92k16o2J8M21k50n8n4j71l4K70%n8j28J64J58j0k9l06L03k88L31k46K05
$$ 192 -24 -86 -68 353 103 45 -9 -180 -214 56 56 -2 -130 34 192 182 153 -153 150 -138 193 -53 152
6018A52l67J99J43r1k8J19l87M3L36q7J24n14J16K42J10j88j4k01J90J77q2r0
$$ 152 -215 -16 127 36 8 127 -260 -217 119 32 156 -358 -242 0 110 -78 -92 -293 -103 74 -8 -98
6040i8j51J52m0j08J56j40J08O7K67k64j45j98L94k99n3L83l69M1L29Q1m04j49
$$ -98 -249 -97 -137 -245 -89 -229 -121 -54 213 -51 -196 -394 0 -299 -352 31 -338 -297 32 113 -291 -440
6062d40K00m6K48J7J51r3l9K05J30k95J58o8j5p0l4J36j44K34m45L86k3j89J13
$$ -440 -240 -286 -38 -21 130 37 -2 203 333 38 196 128 113 43 9 145 1 235 -210 176 153 -36 77
6085G7Q2Q2k78J83rp1J38J61k93O1%j12J18j82J06j15K26m4K4J58r5O8l31P5K46
$$ 77 159 241 -37 146 137 66 204 365 72 133 133 21 139 -43 63 -52 174 130 154 312 217 285 -46 29 275
6110B75k23K1R1q2K70l61k8J43L66n55J41k0l9L9j20K57j02j92k40J435j059l41
$$ 275 52 73 164 82 352 -9 -37 106 472 -83 58 38 -1 38 -82 175 73 -119 -359 1076 17 -324
6132c24J211q41M24o67O04l68l36j5K55Pj92L10j87k21J91K47l89L13j8O0j83
$$ -324 887 46 470 -197 407 39 -297 -312 -57 -50 -242 68 -119 -340 -149 98 -291 22 4 64 -119
6153a19M13l32O2J6o4pj67J67J98k57J22q2k28N37k75J09L0j10K56o46O02J41
$$ -119 294 -38 24 40 -24 -31 -198 -31 167 -90 32 -50 -278 259 -16 93 123 13 269 -377 225 366
6175C66m31Q4J65M1m31N21n83K30K99k75N4j8q7L47l55L5Q6j3P9p1j57qJ74K45
$$ 366 -65 19 184 225 -206 315 -268 -38 261 -14 40 22 -65 282 -73 -38 48 35 114 43 -114 -122 52 297
6199B97m97L94k25l03M35l70M38L9Rq92J09J87P14Q0r50P08k55o7J32j55o9K59
$$ 297 -200 194 -31 -334 101 -269 169 208 217 -675 -566 -379 335 415 -535 173 -82 -149 -17 -172 -241 18
6221A8L89l65jJ47j41j38K32K9j02j59L52k49M3K28l00k08L87J3l08K21K9k37
$$ 18 407 42 41 188 47 -91 141 170 68 -91 261 12 55 283 -17 -225 162 175 -133 88 117 -120
6243a20P7K97J33o72L22J46l89K70J26m83J84K52J0j24j16K08l08j6K20L3l85
$$ -120 -43 254 387 -285 37 183 -206 64 190 -293 -109 143 153 29 -87 121 -187 -203 17 50 -335
6264c35M54N5k29J80j32j10k21L75k3q2l69M36k48Q6J51j10rK1J30J9k04J34j99
$$ -335 119 174 -55 125 -7 -117 -338 37 14 -68 -437 -1 -249 -163 -12 -122 -131 -110 20 39 -165 -31 -230
6287b30j64N62l17k19K49L82l38j54K00r2k03O60M6p97L68k7J9K20p1l67J25K63
$$ -230 -394 168 -149 -368 -119 263 -75 -229 -29 -121 -324 336 382 -415 -47 -74 -55 165 94 -273 -148 115
6309A15J18q2j09j03K27L9j9l80J66L26j9r3q4j16J53P9n9j71k3J64k0J66j78
$$ 115 233 151 42 -61 166 205 186 -194 -28 298 279 186 102 -14 139 218 159 -12 -35 129 109 275 97
6332I7O7j55K17J6jj93m26M00J64n4l42N1p1K93J16k75j96M79j62j8L10j77m04
$$ 97 164 9 226 242 241 48 -378 22 186 132 -210 -159 -230 63 179 -96 -292 187 25 7 317 140 -264
6355b64K3K96j22k27O51m48j71L66j15j67J45P0ok90O06o42L3J77J50k17J92j46
$$ -264 -241 55 -67 -294 357 -91 -262 104 -11 -178 -33 37 31 -259 347 -295 -262 -85 65 -152 40 -106
6377a06m7L94l28o2j6N7j8L61k76l4O0K58j46k00o8J83n8J81L0q8l67K1M28M3
$$ -106 -153 241 -87 -149 -165 -108 -126 235 -41 -75 -15 243 97 -103 -171 12 -46 135 165 77 -290 -269 159 202
6401B02P2l16j49J11J53K7%J4k3J8k52J10m2q9K63J34m33J50l8pJ13J56q4k76
$$ 202 274 -42 -191 -80 73 100 100 114 91 109 -143 -33 -75 -164 99 233 -200 -50 -88 -95 18 174 90 -186
6425a86l1N19j45j93L9K84l52K67j18J7j59M81K1m70K41p9j44j46K2J42j12O7
$$ -186 -217 302 157 -36 3 287 -65 202 84 101 -58 423 444 -26 215 136 -8 -154 -132 10 -102 -35
6447c5L76k73J38j11m66K42M32j5l36J14J89l08K76K53o31Q2L9j44K99L85n48
$$ -35 341 68 206 95 -371 -129 303 288 -48 66 255 -53 223 476 -155 -73 -34 -178 121 506 -42
6468d2j48J65L84m10O7J80p9nj66J18j45J71J42l51J92l6k55J43Q3Qj08R3p7J34
$$ -42 -190 -25 359 -51 16 196 117 112 -54 64 -81 90 232 -119 73 37 -218 -75 8 16 -92 1 -76 58
6492E8j69J57j61m7K25L5k56L32k78k80M02j90J11j22K38j59J31j74P0j1L68j87
$$ 58 -111 46 -115 -162 63 98 -158 174 -104 -384 18 -172 -61 -183 55 -104 27 -147 -77 -88 280 93
6514I3j47k21L43K5k93J62m8k0j65J82K63k56o2r5K32N9j60M6l4O8K12k29j02
$$ 93 -54 -275 68 93 -200 -38 -86 -106 -271 -89 174 -82 -144 -239 -7 52 -108 -62 -96 -28 184 -45 -147
6537a47K06J23j50J15j83Mj51K46qJ90j11l2j7J80J60l30N2k02L18k45K67l52
$$ -147 59 182 32 147 -36 -32 -183 63 55 245 134 102 85 265 425 95 147 -55 263 18 285 -67
6559f7J96j62K60j20r3J73l02o6L95J23l19m3o4j96J07K12j83p0J10K81k11m7
$$ -67 129 -33 227 107 14 187 -115 -181 214 337 18 -25 -89 -285 -178 34 -149 -219 -109 172 -39 -86
6581h6M20l90l34L13J36l36K57J88j87L7r0j87K04n4K73l05l2p4K0J22l30N77
$$ -86 334 -56 -390 -77 59 -277 -20 168 -19 18 -72 -259 -55 -109 164 -141 -173 -247 -227 -105 -435 142
6603A42m72K61M9J52k53rJ07M1j84k9lj3L58j41l3p1l5M9J73K96j65o25K71K85
$$ 142 -330 -69 -20 132 -121 -130 -23 18 -166 -195 -198 -211 147 6 -27 -98 -133 -84 89 385 220 -405 -134 151
6627A51j64j02L96m19l7J79L3lm4N99m50j27j27K14r7J08m1k2l19K58k24K33j16
$$ 151 -13 -115 281 -138 -175 4 37 34 -10 589 139 12 -115 99 2 110 69 47 -272 -14 -238 -5 -121
6650a21R2j23M33k45k1m7l4J75j5J56l42k13L08M9l10M05J57m18p6K05q2k1K3
$$ -121 -29 -152 281 36 15 -32 -66 109 94 250 -92 -305 3 52 -258 147 304 -114 -190 15 -67 -88 -65
6673f5J79n9j60K79l06j57K83N7r6K2q6M38o51J027q40M8J74K14K55o34m02J54
$$ -65 114 55 -105 174 -132 -289 -6 51 -45 -23 -109 329 -322 705 -135 -87 87 301 556 -78 -480 -326
6695c26L83l73O95q49O07J07l00J07k00J08l16M68j97j81L63k33l22M24P9k48
$$ -326 57 -316 379 -470 137 244 -56 51 -149 -41 -357 111 -86 -267 96 -137 -459 -35 44 -204
6715b04P2K7J02j07M3L73j71k84J21K59l27j2j07j22K19j1LJ17L8J9p1m5J48k96
$$ -204 -132 -105 -3 -110 -67 306 135 -149 -28 231 -96 -108 -215 -337 -118 -129 -126 -9 29 48 -23 -68 80 -216
6739b16J0M43r6j93kK45l56J70L2k05K89K6k54K9J78j07m6K66J94m30Kj44K18
$$ -216 -206 237 141 -52 -54 191 -165 5 37 -168 121 147 -107 -78 100 -7 -53 213 407 -23 -21 -165 53
6762E3p6o9K05l7j94K39q0L8Pj02K4R7J22j94k28K54K6O9o7K5k93J66L43l22r3
$$ 53 -23 -92 113 76 -118 121 41 79 86 -16 8 105 227 33 -195 59 85 154 87 112 -181 -15 328 6 -87
6787h7Mj37K74R7J38k33n19K66K50L0j01l36L9L42Q4l17L3K14j6j9M5J08k74K34
$$ -87 -83 -220 54 151 289 56 -463 -197 53 83 -18 -354 -315 27 111 -206 -173 41 25 6 51 159 -115 119
6811A19j5k25q3J39j98K18J8j42m3K32J20p5M9k10j03M02j21M8k94J34J80J26
$$ 119 104 -121 -204 -65 -263 -45 -27 -169 -212 20 140 65 114 -96 -199 203 82 130 -164 -30 150 276
6833B76P2l22l16L29K0J33Q9l53P3j05J80J41k76k07L01%J20O1j18j06K16k33
$$ 276 348 26 -290 39 59 192 281 -72 1 -104 76 217 -59 -266 35 35 155 216 98 -8 208 -25
6855b5L44k29l42J59L9O8P0k82K93P9j61O6j46k0O5K94q1j13l64J65M09j77k31
$$ -25 319 90 -252 -93 -54 14 84 -198 95 174 13 79 -67 -87 -22 272 191 78 -286 -121 288 111 -120
6878a20m2Q8j3N25j85l21N44m03m0J5j74K4p5J14o5o9P8M5l4J5K75j84j61J71
$$ -120 -162 -74 -87 438 253 -68 476 73 33 48 -126 -102 -177 -63 -128 -197 -119 -74 -108 -93 182 -2 -163 8
6902HK21n5k30n2j54J58J80l10m1J39L85l29K67l88K18k9O1j0k33J04L3K39P6
$$ 8 229 174 -56 -108 -262 -104 76 -234 -275 -136 249 -80 187 -201 17 -12 49 39 -194 -90 -57 182 258
6925B58m04M0L55k38J52o0l3j98K14L71m60p9N3j48K24J57k7j23J5J65m17L62
$$ 258 -146 -106 249 11 163 103 70 -128 86 457 -3 -82 -29 -177 47 204 177 54 69 234 -183 179
6947A79k27k33M18j44j29mj3K32j58j03M28Q1l39m62O38j63M3m07M77j43J8k68
$$ 179 -48 -281 137 -7 -136 -140 -153 79 -79 -182 246 327 -12 -474 164 1 44 -363 114 -29 -11 -279
6969b79L84J81l14K07l09MJ34K61k81J4K2j1O5J22J0j3k25R5J94j23j18J98l75
$$ -279 105 286 -28 179 -130 -126 8 269 -12 2 24 13 78 200 210 197 -28 67 261 138 20 218 -157
6992a57k46M92J79l81J56Nl4m9M13k48l71K51L97k23j28l01M5N2k0K65n9k16J87
$$ -157 -403 89 268 -113 43 48 14 -35 378 130 -241 10 407 184 56 -245 -200 -148 -168 97 38 -178 9
7015Io9j9K30j04j41m5L87l35j1k00L16k39n0m0J69J94l3j67k10J76J40M2j9k1
$$ 9 -60 -79 151 47 -94 -139 248 -87 -98 -298 18 -221 -271 -311 -142 52 19 -148 -358 -182 -42 0 -19 -40
7039d0o3L1J21O3k73L53j62j82J17J10j39j1K54l82J04L51K9m55L03N1k71L26
$$ -40 -103 -72 49 112 -161 192 30 -152 -35 75 -64 -75 179 -203 -99 252 281 -174 129 180 -91 235
7061B35P6k07k24N23n56K19Nll02M97r1l5M7q3j73l6J23J29k52J67K45m15K72
$$ 235 311 104 -120 403 -153 66 71 68 -234 263 172 137 184 101 -72 -108 15 144 -108 59 304 -111 161
7084A61J29k34Q6J52r6j78J63m08L08k74rJ72Q2o0k24O56m82l18K93K1j21M06
$$ 161 290 56 142 294 198 20 183 -225 83 -191 -200 -28 54 -6 -230 426 -56 -374 -81 -60 -181 225
7106B25k91k6R0l1l30K91K83l25K55k66qmQ9P5k71J77J95m30J03M53n33K33K6
$$ 225 -66 -92 -2 -33 -363 -72 211 -114 141 -125 -133 -137 -48 27 -244 -67 128 -302 -199 254 -279 -46 -20
7129b0jK9k23R2J80J97m32l1J7M95k70k77L44K6K0Pl49J81R4J58o4m92N24k20
$$ -20 -21 8 -215 -123 57 254 -178 -209 -192 303 33 -244 100 126 146 153 -196 -15 79 237 173 -319 205 -15
7153a5k09J30K16J1j39K6N7k67J4K20J10K8l70OJ01K88j06J67l67j53M72q8j14
$$ -15 -224 -94 122 133 -6 20 77 -190 -176 44 154 182 -188 -182 -81 207 101 268 -99 -252 220 132 18
7176A8Q9l95J73L68l26J60m2q0M8K57n26J14k8J60R0k34K88m45L81L1J39k02j05
$$ 18 107 -288 -115 253 -73 87 45 -35 13 270 -256 -142 -170 -10 80 -154 134 -311 70 101 240 38 -67
7199f7J31m6k49L35j8j60Q6K7o1M2O4l0k6m5J10j13K61l68L91o31M09j6m7K84
$$ -67 64 18 -231 104 86 -74 12 39 -22 20 84 54 28 -17 93 -20 241 -127 264 -367 42 26 -21 263
7223B63m7j58j27J89Q5J01m77J80N9o9J9m7J74l51N5M04k31r4N6j24J30p6J70
$$ 263 216 58 -69 120 205 306 -171 9 68 -1 18 -29 145 -206 -151 253 22 -72 -16 -140 -10 -86 84
7246H4k2j91j45K12j1j7K23k40qJ94l2Q2q5P7n4j85q0M06k37L02l00l16K79R9
$$ 84 62 -129 -274 -62 -73 -90 133 -107 -115 79 47 129 44 121 67 -118 -198 208 -29 273 -27 -343 -64 35
7270C5j2K56l28n1K92j25j34Q9k85K63J95j74L81j59m43K27O2K92k93k7J75k92
$$ 35 23 279 -49 -100 192 67 -67 22 -263 0 195 21 402 243 -200 27 89 381 88 61 236 -56
7292e6J91J71k61n3pJ4J38n5l00M13j15J3j77p4L93l38N03k26m08R5J46k79L21
$$ -56 135 306 45 -8 -15 -1 137 82 -218 195 80 93 -84 -158 235 -103 400 174 -234 -139 7 -272 49
7315D9J48j67j16l4L43k59j68m8N24n12k1K3J23O47o48M71p18L02J29j38n3K8
$$ 49 197 30 -86 -120 223 -36 -204 -252 272 -240 -261 -238 -115 532 -116 355 -363 -61 68 -70 -123 -95
7337i5K86kj46m2l5k39K25R5n2j47n5j46N35l22M25l21L84n69J08K82q8j44K72
$$ -95 191 189 43 1 -34 -273 -48 47 -5 -152 -207 -353 182 -140 285 -36 348 -221 -113 169 81 -63 209
7360B09k04k50O53m83K62m43L66Q4l23K68m04P16j645Q17K19o73J450O53j340
$$ 209 5 -245 408 -75 187 -256 110 194 -129 139 -265 451 -1194 -377 -158 -831 619 1272 -68
7379f8J78j13J63J04j87k67N15n53J27K23k04No29K43k0K84L86K54J16r42O8L15
$$ -68 110 -3 160 264 77 -190 325 -228 -101 122 -82 -77 -706 -463 -483 -199 187 441 557 -385 -317 -2
7401bln8N2j27o6L22q0j21Q7m5Qj4j04K95l9k74L08j60ok12J96J71k73R6j9K01
$$ -2 -5 -63 -11 -138 -204 118 38 -83 4 -41 -33 -47 -151 144 105 -169 139 -21 -27 -239 -43 128 -145 -49 -68 133
7427A33K38n71j10M89P6J4O6p22K93L09k26J09l0n8j44J78k50J04L01k82J97j6
$$ 133 371 -200 -310 179 255 269 335 -387 -94 215 -11 98 68 10 -134 44 -206 -102 199 -83 114 98
7449I8l7Nj95J79R9l7k13Q6J95p7k31K64j79J21R4j64k64L70P8k65J17k6l6J20
$$ 98 61 66 -129 50 149 112 -101 -15 180 103 -128 136 -43 78 172 8 -256 114 192 -73 44 18 -18 102
7473A02k46K66k48K5q8o9O30l42k48J39R1J18j74or0K7k80L82m3K96l27k44J37
$$ 102 -144 122 -126 -101 -189 -258 372 30 -218 -79 12 130 -44 -50 -140 -113 -393 -11 -54 242 -85 -329 -192
7496a92P94n22l45J68q07J60K49M59k31q2L21J07n1J2N9l30J35P7k0K91l36n3
$$ -192 602 80 -265 -97 -904 -744 -495 -36 -267 -349 -28 79 28 40 99 -231 -96 -19 -39 252 -84 -137
7518a37K79j21J46k18k9J95k64K03k45O30k72j80q2j37J64J81%O3k34n0j76K58
$$ -137 142 21 167 -51 -80 115 -149 54 -191 439 167 -13 -95 -232 -68 113 113 176 -58 -108 -284 -26
7540b6J93j87L52n05J05J4J77j25j57j43K31k65K92J38j18k52J55k7J17j18L73
$$ -26 167 -20 332 -173 -68 -54 123 -2 -159 -302 -71 -336 -44 94 -24 -276 -121 -148 -31 -149 224
7561B24k44M9K3K54k15j64m4pJ91J32j5l33m3P4NP6J10k19K6Q0k8k20L20j12K60
$$ 224 -20 29 52 306 91 -73 -117 -124 67 199 184 -149 -192 -118 -113 -37 73 -146 -120 -40 -68 -288 32 -80 180
7586A80l21M36l86O28N3o93j82P0N97m13o0MJ31R1N2k31J67n89N21JkK76o05K95
$$ 180 -141 295 -91 537 590 -103 -285 -215 382 -31 -91 -87 44 135 187 -44 123 -466 55 56 54 330 -275 20
7610B0J63m5J3k58j77M03j47J14r8O1M6j86k62M39j2J75k91k27M90l27N3K56r3
$$ 20 183 138 151 -107 -284 119 -28 86 -12 49 95 -91 -353 86 74 249 -42 -269 221 -106 -53 203 110
7633A10k47L62k68N8q0q4K80k14n1K54l75L11m5q8j64M26n94K12K57j01N3K11
$$ 110 -137 225 -43 15 -65 -149 131 -83 -134 120 -255 56 11 -77 -241 185 -409 -197 60 -41 12 223
7655B23l31K81j57j57J73R4K37n24K06J36j62K87l2l74J53j18R3L34k29k29J65
$$ 223 -108 173 16 -141 32 126 363 -161 45 181 19 306 274 -100 53 -65 28 362 133 -96 69
7676F9K68k19o9j42L09j41L9J24l17r4m9J58K65j49m42L50J2K34mm18L61k9k70
$$ 69 337 118 49 -93 216 75 114 238 -79 -173 -222 -64 201 52 -390 -40 -28 206 202 -216 145 116 -154
7699a54m7%J92O4k57K77j29j65J13J59k14j17P4J09J74O2k56N4m1q3K53q9j22
$$ -154 -201 -201 -9 55 -202 75 -54 -219 -106 53 -161 -278 -204 -95 79 141 -115 -61 -102 -185 68 -21 -143
7722a43j00J26K51j85l2K06l27L40j21j53K52J07l66J27o6P9J7j33M24m72J59
$$ -143 -243 -117 134 -51 -83 123 -204 136 15 -138 114 221 -145 -18 -84 -5 12 -121 303 -169 -10
7743a0O5o2K80l60L30l86J09p7K51m31L95j04q4K34k57J26j65R5K66%k05Q4j88
$$ -10 55 -7 273 -87 243 -143 -34 -111 140 -291 104 0 -84 150 -107 19 -146 -51 215 215 10 94 -94
7766i4j81M08q2o5j95p6L67J7O9qm87L67j27r6K68k01j68K40J00j06K06p2k81
$$ -94 -275 133 51 -14 -209 -285 82 99 168 160 -327 40 -87 -183 85 -116 -284 -44 56 -50 156 84 -197
7789a97qL55j64k13K02J47k88J07J98q9j68J51k12n2J8r6M83m59K21L35k88L64
$$ -197 -205 150 -14 -227 -25 122 -166 -59 139 50 -118 33 -179 -231 -213 -309 174 -285 -64 271 -17 347
7811C47n56J84r0j5r5M84l35r4J73j02M80k25l48J83l67K57J23l8k28k44L01P00
$$ 347 -209 -25 -115 -130 -225 259 -76 -170 3 -99 381 156 -192 -9 -376 -119 4 -34 -262 -506 -205 495
7833D95m09J8o1l47N86np95P86l37mK9j09K98j20JK20o15L42k0j27L54j84k10
$$ 495 86 104 43 -304 282 277 -518 268 -69 -73 -44 -153 145 25 26 246 -369 -27 -47 -174 180 -4 -214
7856b14K22R0o5j5j50L17l03r7K20j18j60K38J44j27j0K97m23J85J27J31l08j08
$$ -214 8 98 33 18 -132 185 -118 -215 5 -113 -273 -35 109 -18 -28 269 -154 31 158 289 -19 -127
7878a27K46l41O7M17l88R5O4j15L0J57n2k4j89L32k00J13j3p8N2j18j05J99J06
$$ -127 119 -222 -155 262 -126 -31 33 -82 -52 105 53 29 -160 172 -28 85 72 -6 46 -72 -177 22 128
7901A28k56J17j8J66j13K39l73K07l17J59O3n2J4q5Q1j68k2L67k5m26M02k49p9
$$ 128 -128 -11 -29 137 24 263 -110 97 -220 -61 2 -50 -36 -121 -40 -208 -230 137 112 -314 88 -161 -240
7924b40J97J40m41J2J67r4K98P6j54l05N58j7k16Q5l34R0J35M4n2J58n3j4j00
$$ -240 -43 97 -344 -332 -165 -259 39 115 -39 -344 214 197 -19 66 -268 -178 -43 1 -51 107 54 40 -60
7947f0j93L33j77kJ1K22p2j0J3P2K36m43J0n7K40Q5l93K88K9Kl49L56l37J03K20
$$ -60 -253 80 -97 -99 -88 134 62 52 65 137 373 -70 -60 -117 123 208 -185 103 132 134 -215 141 -196 -93 127
7972A27p0J04j67K98l66j37O24j83m46O5K9K87n7o3p9j61J6K18o8m9n1K19k32
$$ 127 57 161 -6 292 -74 -211 413 230 -216 -151 -122 165 108 45 -34 -195 -179 39 -29 -78 -129 90 -142
7995a42L29l78K13mjJ46k00m2K31m32J83K05k06J41m4k12J13j55L74k43M3K15
$$ -142 187 -191 22 18 17 163 -37 -79 152 -280 -97 108 -98 43 -1 -213 -100 -255 119 -124 -81 134
8017A34n51L57J7M0p7L5L0j05J95L1j66j70J78k80N18k5k49j59L38L5j16K91k08
$$ 134 -417 -60 -43 -3 -80 -45 -15 -120 75 106 -60 -230 -52 -332 186 161 -88 -247 91 126 10 301 93
8040I3p1K79k09J44j56k40K19m39L26J77k50J01k31M70M6l75J95J10m08L10J12
$$ 93 22 301 92 236 80 -160 59 -380 -54 123 -127 -26 -257 213 259 -116 79 189 -219 91 203
8061B03k04j78K69k0k0k61J55o2K54j41j94K38J38j08j92M37k26k71O8K80O9n22
$$ 203 -1 -179 90 70 50 -211 -56 -118 136 -5 -199 39 177 69 -123 314 88 -183 -115 165 234 -288
8083b88K53k19K14J42M41o62k5k35K77O41o26K0j91O52n80k15L11M14k02o0m6
$$ -288 -35 -254 -40 102 543 -119 -144 -379 -102 539 -87 -67 -258 394 -186 -401 -90 324 122 62 16
8104A6j49K08pm7o9m8O9K87o53L76K20j93q0L77k87k20K2J54J91k59R6k0k04L94
$$ 16 -133 75 68 21 -48 -96 -27 260 -393 -17 203 10 -70 307 20 -200 -178 -24 167 -92 4 -16 -220 174
8128A74k40j68L55k64J85j24K32P4l70K31k00j13L30M7m48J88N3j11K24j59K45
$$ 174 -66 -234 121 -143 42 -82 150 224 -146 85 -115 -228 102 149 -299 -111 -58 -169 55 -104 141
8149A41k39r9R7L22r5l00P6Rj8K37k15j55K44r7JK08k90P8K2k4K70j08m2k66R
$$ 141 -98 -197 -100 222 127 -173 -97 -88 -106 131 -84 -239 5 -92 -91 117 -173 -95 -73 -97 173 65 23 -243 -234
8174b34L94o8p9K8m99O82l11M27m34m9O63n76M73r83O54j66K75
$$ -234 160 92 13 41 -458 224 -87 340 -94 -143 520 -56 417 -566 88 -78 197
8191A97
$$ Imaginary data points
##PAGE= N=2
##DATA TABLE= (X++(I..I)), XYDATA
0@%%%%%%pJ4j5J6k3L0l8M7n5P0r3J16j40J71k04K45k92L46m07M72n49O36p34Q44
$$ 0 0 0 0 0 0 0 -7 7 -8 8 -15 15 -23 24 -31 39 -54 62 -78 93 -111 134 -158 188 -219 253 -296 340 -394 450
30D50r64J098j250J417j600J804k028K272k540K836l158L508l892M313m769N270
$$ 450 -514 584 -666 751 -849 955 -1073 1199 -1341 1495 -1663 1845 -2047 2266 -2503 2767
46B767n817O414p068P785q576R449j0414J1488j2689J4041j5575J7334j9371K1764
$$ 2767 -3050 3364 -3704 4081 -4495 4954 -5460 6028 -6661 7380 -8195 9139 -10232 11532
60A1532k4626K8114l2474L8103m5686N6496p3225J02712j69548N81930J21457
$$ 11532 -13094 15020 -17454 20649 -25037 31459 -41766 60946 -108602 473328 594785
71E94785q30089N38093j79160J37007K55021k94546m1859k2005N9016K51236m00154
$$ 594785 -235304 302789 123629 260636 515657 221111 179252 157247 216263 467499 67345
82F7345J39448J75251l90736K50172J15941l29128J84133q0543m8522J61502j82866
$$ 67345 206793 382044 -8692 241480 357421 28293 212426 131883 83361 244863 61997
93F1997L8943L3872j38918J80599j63036j16532K61653j22123k9599N0199k74550
$$ 61997 100940 134812 -4106 176493 13457 -103075 158578 36455 6856 57055 -217495
104b17495J53288J74655j39938K1264j57569l7454K21115j05719L4945J9660k27603
$$ -217495 -64207 110448 -29490 -8226 -165795 -203249 17866 -87853 -52908 -33248 -260851
115b60851J43083N2675o8341J11395j69970J8316J21319j59432J64701M567k18282
$$ -260851 -117768 -65093 -133434 -22039 -192009 -173693 -52374 -211806 -47105 -42538 -260820
126b60820J83542k9976p9004J71438p3165m9307k0450K151J66443j09120j7107
$$ -260820 -77278 -107254 -186258 -14820 -87985 -137292 -157742 -155591 10852 -98268 -115375
137a15375J11254k03197Q7008J71492j50382K8557K2867m1748M8765l7215O6124
$$ -115375 -4121 -207318 -120310 51182 -99200 -70643 -47776 -89524 -40759 -77974 -11850
148a1850m773p8579J29934p1438p7128J70460o1848n0986R5124o5823n041M2849
$$ -11850 -16623 -95202 34732 -36706 -113834 56626 -5222 -56208 38916 -26907 -31948 10901
160A0901M635L8979p5077j7300O6813j9625P3009j3190j46888O8470P6443j4798
$$ 10901 15536 54515 -20562 -37862 28951 9326 82335 69145 -77743 -9273 67170 52372
172E2372L7848o7591n0199N5317K2994N2913l5380q0539O0860j719j454O1708
$$ 52372 90220 22629 -27570 27747 50741 103654 68274 -12265 48595 46876 45422 107130
184A07130p0244j0087M3677l4872L8132j1469k5907N1625n3256L768M3158o0126
$$ 107130 36886 26799 70476 35604 73736 62267 36360 87985 34729 38497 81655 21529
196B1529M7524J8741o3410K0841k3393K0516N3718o0922J249j7776l7723R6801
$$ 21529 69053 87794 24384 45225 21832 42348 96066 35144 36393 18617 -19106 77695
208G7695n392o3197Q626m1518L0854N1611l3911m491m3993j6154O3045j3419M998
$$ 77695 72303 9106 17732 -23786 7068 58679 24768 20277 -23716 -39870 23175 9756 14754
221A4754Q12p4799K1694M1904r786J5579l5830k9976K3295M79K4446M069m0090
$$ 14754 15566 -59233 -37539 4365 -5421 10158 -25672 -55648 -32353 -31874 -7428 -3359 -43449
234d3449K141j2983J121N4993j3624l5624K93j5496J9879L1610r835r068k3640
$$ -43449 -41308 -54291 -53170 1823 -11801 -47425 -47132 -62628 -42749 -11139 -20974 -30042 -53682
247e3682q007K5402R767K0494q588n5421R270L8922R588R744k5201k9504J3249
$$ -53682 -61689 -36287 -26520 -6026 -14614 -70035 -60765 -21843 -12255 -2511 -27712 -57216 -43967
260d3967K0372K3015L444k4218j8784j2714L0066N0135j4405l8206j3158M812
$$ -43967 -23595 -580 2864 -21354 -40138 -52852 -22786 27349 12944 -25262 -38420 -33608
272c3608L2751K1889j1503j6309j4830J457K0835K3035Q367k7906l0334J6069
$$ -33608 -857 21032 9529 -6780 -21610 -20153 682 23717 32084 4178 -26156 -10087
284a0087L3273J3089p662k2103j4119R633K0709J7135j891j9848j8977j281K6772
$$ -10087 23186 36275 28613 6510 -7609 2024 22733 39868 37977 18129 -848 -2129 24643
297B4643K7644r271l0072j0854R369K0803J6243o937k2936j2882P830J7703J4016
$$ 24643 52287 43016 12944 2090 11459 32262 48505 41568 18632 5750 13580 31283 45299
310D5299q00k4675k3078J2204K4506P644o610k0952j7966Q490J9905N853o361
$$ 45299 44499 19824 -3254 8950 33456 41100 34490 13538 -4428 4062 23967 29820 23459
323B3459j2779j8147j683K4434J1166j5406j2659r712l182J9364J3985j4032j8975
$$ 23459 10680 -7467 -9150 15284 26450 11044 -1615 -11327 -14509 4855 18840 4808 -14167
336a4167n471K985R845J5808o281k5872m225Q423L433J3848L975k2151j6956Q866
$$ -14167 -19638 -16653 -6808 9000 2719 -23153 -27378 -18955 -15522 -1674 2301 -19850 -36806 -27940
350b7940J7264P133m802r103j4339N58J9818O303l157l542j6519p418K2287K0080
$$ -27940 -10676 -3543 -8345 -17448 -31787 -31229 -11411 -5108 -8265 -11807 -28326 -35744 -13457 6623
364F623p041k3050m177J2050L253J3168N662k4611l479J3274o51J2701N722j7686
$$ 6623 -418 -23468 -27645 -15595 -12342 826 6488 -18123 -21602 -8328 -8979 3722 9444 -8242
378h242j2122O404K5593M77j9329J1479q479j4149K9519J908q177R267j8327o925
$$ -8242 -20364 -13960 11633 12110 -7219 4260 -4219 -18368 11151 13059 4882 14149 -4178 -11103
392a1103R867J6514J8933l3174j0784K1690k1647J9165K8364l2845p667R79M29
$$ -11103 -1236 15278 34211 1037 -9747 11943 -9704 9461 37825 4980 -2687 -1708 -1279
405a279K1622j667J226k1322k7072N0321R629l1632K3391k3696l0069M3583J9852
$$ -1279 20343 18676 19902 -1420 -28492 21829 31458 -174 23217 -479 -30548 13035 32887
418C2887j2418k1379j3739J2907j887K3861J8758n8761m262M1561k7018J2340
$$ 32887 20469 -910 -14649 -1742 -3629 20232 38990 -19771 -24033 17528 -9490 2850
430B850L1832m4474j5194K4130O449J868r082O841q717k4563L8386R01l3748M1739
$$ 2850 34682 -9792 -24986 -856 5593 7461 -1621 5220 -3497 -28060 10326 11227 -22521 19218
444A9218j3860m5018L4689Q638L803O922l7464m74N104J8779M1083m8783l0260
$$ 19218 5358 -39660 -4971 3667 7470 14392 -23072 -23546 -18442 337 41420 -7363 -37623
457c7623K3916p345L9398J5348m4953j3551j6224L9928N3382m9891k1346L431
$$ -37623 -13707 -21052 18346 33694 -11259 -24810 -41034 -1106 52276 2385 -18961 -15530
469a5530j4433M9649J6803m1578j4964P147K2016m127q3K3429m4834j4150N8524
$$ -15530 -29963 19686 36489 -5089 -20053 -12906 9110 4983 4900 28329 -16505 -30655 27869
482B7869j4074k4460L0048j1622k7653K4097J7009k8811Q184L7972l8126m0454
$$ 27869 13795 -10665 19383 7761 -19892 4205 21214 -7597 587 38559 433 -40021
494d0021M9600K1027k9773J5941o534n1126L3555N6706l6645l0702J8384r577
$$ -40021 9579 30606 833 16774 10240 -40886 -7331 49375 12730 -17972 412 -9165
506i165j0292M3241J4723o2396r521L7581j5717K1827K9734o2324k5724M0605
$$ -9165 -19457 23784 38507 -23889 -33410 4171 -11546 10281 40015 -22309 -48033 -7428
518g428K2618j010j6832p219j7160J880N1841j5845l1871J9440k1693P902L2833
$$ -7428 15190 14180 -2652 -9871 -27031 -25151 26690 10845 -21026 -1586 -23279 -15377 17456
531A7456j8065l944j5135k529L4414j4148m159K664j6987K4777o108j3311J9565
$$ 17456 -609 -4553 -19688 -22217 12197 -1951 -6110 -3446 -20433 4344 -1764 -15075 4490
544D490j4948J9254L615m9720K9670K7313j8320J3941j9806k6890K2766K9087
$$ 4490 -10458 8796 12411 -37309 -7639 19674 1354 15295 -4511 -31401 -8635 20452
556B0452J4688l3642k8735J7874J921L1743K7909o9785k5782N4649O579J945N747
$$ 20452 35140 1498 -27237 -9363 -7442 24301 52210 -17575 -43357 11292 17871 19816 25563
569B5563m2308r038L7331K1688j1030l4726M771J4629p451L6493j3034n4630M2059
$$ 25563 -16745 -25783 11548 33236 22206 -12520 -7749 6880 -571 35922 22888 -31742 10317
582A0317J4431k8800K0475j1887j431K0032j9840J757j2355N051M5616l5031j6491
$$ 10317 24748 -4052 16423 4536 3105 23137 3297 5054 -7301 -2250 43366 8335 -8156
595h156J8196l3950L4270L3651m0647p103j5237Q372M6424j6606j7911j5545j4428
$$ -8156 10040 -23910 10360 44011 3364 -3739 -18976 -10604 35820 19214 1303 -14242 -28670
608b8670M9953Q794l0807O17k2033N578L7118p096p591j4138k2577K4134J7935
$$ -28670 21283 30077 -730 -113 -22146 -16568 20550 13454 5863 -8275 -30852 -6718 11217
621A1217n240o62k3584n312K2099k674N346J4k1707R398K604p500K1309j0471
$$ 11217 5977 5315 -18269 -23581 -1482 -4156 1190 1204 -20503 -11105 -8501 -16001 5308 -5163
635e163j3029J2595j3911N281J6905j0951K417j1141o977K0162l329Q809R38l4176
$$ -5163 -18192 -5597 -19508 -14227 2678 -8273 -5856 -16997 -23974 -3812 -7141 1668 2606 -31570
649c1570J0952J8039N39J7818k0583k6657J2226J6133K1317m316k6506o259j099
$$ -31570 -20618 -2579 -2040 15778 -4805 -31462 -19236 -3103 18214 13898 -12608 -18867 -19966
662a9966K3565K6251k3380j9369R10L130K2474R446j7856j4258O52J5131J0707
$$ -19966 3599 29850 6470 -12899 -11989 -8859 13615 23061 5205 -9053 -8401 6730 17437
675A7437k778o546j2289j00J7283M839o402k128n535l625O664O845J955j375o090
$$ 17437 14659 8113 -4176 -4276 13007 17846 11444 9316 3781 156 6820 13665 15620 14245 8155
690H155p910r83R996J0646k507j0043r009l171J2576J3669m522j4633j0309N236
$$ 8155 245 -738 9258 19904 17397 7354 -1655 -4826 7750 21419 16897 2264 -8045 -2809
704b809J4618O417n607j5964q523J1630J2665L613p586j6079m363J0800J2985
$$ -2809 11809 18226 12619 -3345 -11868 -238 12427 16040 8454 -7625 -11988 -1188 11797
717A1797K241j2411r955j225N513J1984Q23r315o248m097N581Q415R11l283r183
$$ 11797 14038 1627 -8328 -9553 -4040 7944 8767 -548 -6796 -10893 -5312 3103 4014 731 -8452
732h452l961O578N068L319k647q660j614J295N539P711m062r471m129J780J0998
$$ -8452 -12413 -5835 -767 2552 -95 -8755 -10369 -9074 -3535 4176 114 -9357 -13486 -11706 -708
747g08N611o989r942l476O092Q787J836j502q944r234O104J2250M593n746q711
$$ -708 4903 -2086 -12028 -15504 -9412 -625 1211 -291 -9235 -18469 -12365 -115 4478 -1268 -9979
762i979o015N791J0788K546n788l969k099k098O542J0340m241j0216j098K752
$$ -9979 -15994 -10203 585 3131 -2657 -6626 -8725 -10823 -4281 6059 1818 -8398 -9496 -6744
776f744O590O728m018r600j798O442M189L957K711q478j0998N313J2947M907l996
$$ -6744 -154 6574 2556 -7044 -8842 -2400 1789 5746 8457 -21 -11019 -5706 7241 12148 8152
791H152q946o179M281J1223M936n833n785k514j415P670J1317l504j3588m019
$$ 8152 -794 -6973 -2692 8531 13467 7634 1849 -665 -2080 5590 16907 13403 -185 -4204
805d204P527P371L006j718q657o480O107Q729P43m59m857j1823K514J5774K750
$$ -4204 3323 10694 13700 11982 3325 -3155 2952 11681 12424 11965 7108 -4715 -2201 13573 16323
820A6323q068n558k974q72Q247R766o153j3269Q69K176K582J1838l298j6383l349
$$ 16323 8255 2697 -277 -1149 7098 16864 10711 -2558 -1689 487 3069 14907 11609 -4774 -8123
835h123O781O770K678j234p650j2666O572J5234k930m944k614j0390K229J2401
$$ -8123 -1342 5428 8106 6872 -778 -13444 -6872 8362 5432 488 -2126 -12516 -10287 2114
849B114N799p794j2142L85K181M727J3461q509j8701L576Q243L022M800k268j1776
$$ 2114 7913 119 -12023 -11638 -9457 -4730 8731 222 -18479 -14903 -6660 -3638 1162 -1106 -12882
864a2882p020J2202J0260p140m31j914j1847Q891J4815o306p471J418j238p80
$$ -12882 -19902 -7700 2560 -4580 -5011 -6925 -18772 -9881 4934 -1372 -8843 -7425 -8663 -9443
878i443Q698N531r491m940N680k210J745J2541m901j1239K402K883L491N159N47
$$ -9443 -745 4786 -4705 -9645 -3965 -6175 -4430 8111 3210 -8029 -5627 -2744 747 5906 6453
893F453m705j0367M054J3569m66j867m870r347P765R731L100m156j4014N112N395
$$ 6453 1748 -8619 -4565 9004 8538 6671 1801 -7546 219 9950 13050 8894 -5120 -8 5387
908E387l660J7760o202k3578J0155N940L090N666j0533l361o012R001J6583k1157
$$ 5387 1727 19487 13285 -10293 -138 5802 8892 14558 4025 664 -5348 3653 20236 -921
922i21N28J3666k3113J0746J6444j9015K741K879m847K133k460J0572o830j1650
$$ -921 -393 13273 -9840 906 17350 -1665 1076 3955 -892 1241 -1219 9353 2523 -9127
936i127K0307j4219j2357K9532q665j2951J0591j3019J815J6007j243m920j6767
$$ -9127 11180 -3039 -15396 14136 5471 -7480 3111 -9908 -8093 7914 6671 1751 -15016
949a5016L400J9161q310P096j233l0875J7535K1259j1903N712j5251j1946K2276
$$ -15016 -11616 7545 -765 6331 5098 -25777 -8242 13017 1114 6826 -8425 -20371 1905
962A905J032N514n715k4436J9921L984q274J9755k1401o897K1064j3726J0731
$$ 1905 2937 8451 2736 -21700 -1779 2205 -6069 13686 -7715 -14612 6452 -7274 3457
975C457K22j8867K3323r137r500J9023j9100J0103J5256k6161O503R69J78K1077
$$ 3457 3679 -15188 8135 -1002 -10502 8521 -10579 -476 14780 -11381 -4878 -3909 -3731 17346
989A7346k0183n090O791j5577K8535P680l0791N914m055K105K8055r854j7095
$$ 17346 -2837 -7927 -1136 -16713 11822 19502 -11289 -5375 -9430 -7325 20730 10876 -6219
1002f219q516J199K8936j145j4875K167j9873R103L2008j5352r807K013j2902
$$ -6219 -14735 -13536 15400 14255 -620 1547 -18326 -9223 22785 7433 -2374 -361 -13263
1015a3263J3569J3874o890q111j0772J2743R076j2466R970n660j4593K1406l641
$$ -13263 306 14180 7290 -821 -11593 1150 10226 -2240 7730 2070 -12523 8883 5242
1028E242j2078J4304m491l417R14m978P195k091N905N875k4904M248J3997n470
$$ 5242 -6836 7468 2977 -440 474 -4504 2691 600 6505 12380 -12524 -8276 5721 251
1042B51J4537o994k2400M590J0042J6124k669k1660k327j669J8055J9533k6411
$$ 251 14788 7794 -14606 -10016 26 16150 13481 -8179 -10506 -12175 5880 25413 -998
1055i98j3653N844M261J9715l499j7431m057j816J6389P905j1018o33j2953P19
$$ -998 -14651 -8807 -4546 15169 11670 -5761 -9818 -11634 4755 12660 1642 1009 -11944 -11225
1069a1225K2344n578m167l074j0965J4084M691r045L267l393L978K951j2407N915
$$ -11225 11119 5541 1374 -1700 -12665 1419 6110 -2935 332 -3061 917 3868 -8539 -2624
1083b624N893k284O170j2917o578J7291k858K038J225j8390O392J2279r47L689
$$ -2624 3269 985 7155 -5762 -12340 4951 2093 4131 5356 -13034 -6642 5637 4690 8379
1097H379j4681o405J2214K383J1551p573k3057J2092L788K812J8380k1403j4429
$$ 8379 -6302 -12707 -493 1890 13441 5868 -17189 -5097 -1309 1503 19883 -1520 -15949
1110a5949J2726J480J2814k127j7090M022k089R915Q878k0522O200N560j2110
$$ -15949 -3223 -1743 11071 8944 -8146 -4124 -6213 3702 12580 -7942 -1742 3818 -8292
1123h292J5037k300j1227J0637n493K3N422p761P793k678m957Q801j1726J772
$$ -8292 6745 4445 -6782 3855 -1638 -1615 3807 -3954 3839 1161 -3796 5005 -6721 -4949
1137d949J5463r452j254j020j0287J2958P167m597l036j1931M424J2944j785K231
$$ -4949 10514 1062 -192 -1212 -11499 1459 8626 4029 993 -10938 -6514 6430 4645 6876
1151F876q963j1870J3487P568k177q67j1580J76R414K166K125p323o825Q203m09
$$ 6876 -2087 -13957 -470 7098 4921 4054 -7526 -7350 2064 4230 6355 -968 -7793 410 1
1166AK573M946j0359j221M821k246N497J06l697O33n067L488K389j475O326n244
$$ 1 2574 7520 -2839 -4060 761 -1485 4012 4118 421 1054 -4013 -525 1864 389 6715 1471
1182A471p718M032J508N579L186q176n095n0O054Q275m677o999l164P06R397M662
$$ 1471 -6247 -2215 -707 4872 8058 -118 -5213 -5263 791 9066 4389 -2610 -5774 -5068 4329 8991
1198H991o612o432l925M908R547M92m600p873l197P282P126Q5l912p270j460M557
$$ 8991 2379 -4053 -7978 -3070 6477 6969 2369 -5504 -8701 -1419 5707 5792 1880 -5390 -6850 -2293
1214b293O987J795o596m640O52J348N553L122n657m480r3J653M991L923m144p724
$$ -2293 4694 6489 -107 -4747 -4095 -2747 2806 5928 271 -4209 -4302 -2649 2342 6265 2121 -5603
1230e603j011N719M164K053k080q739l119Q141N542J57k868p361l414O962P450
$$ -5603 -6614 -895 3269 5322 3242 -5497 -8616 -475 5067 5224 2356 -5005 -8419 -1457 5993
1245E993n5o456m476j592L988R257M73r193l816J312L652N993K02o026n012J221
$$ 5993 5938 -518 -4994 -6586 -2598 6659 7132 -2061 -5877 -4565 -913 5080 5282 -744 -5756 -4535
1261d535N247L115M46l461p081O82O919L640j114m816m184j13N559N469j067n280
$$ -4535 712 3827 4273 812 -6269 -5587 1332 4972 3858 -958 -5142 -5255 304 5773 4706 -574
1277e74l568p27L717P304O18p369n017J878N295L329M6m870m410J906M659K027
$$ -574 -4142 -4869 -1152 6152 6770 -599 -5616 -3738 1557 4886 4932 62 -4348 -2442 2217 4244
1293D244l69k529n924O33Q057K432m012l864k009J805L674L264j816n421r6n9
$$ 4244 3875 1346 -4578 -3945 4112 6544 2532 -1332 -3341 -1536 2138 5402 3586 -1835 -1931 -1990
1309a990J136O468q22p432o59J749K345K140r99j641l720R72L473o86J557n69
$$ -1990 -854 5614 4792 -2640 -3299 -1550 795 2935 1936 295 -3425 -2453 1020 334 1891 1322
1325A322n886J351L721L09P21k386j867k03O18L680M10k883q06j687P97M839N04
$$ 1322 -4564 -3213 508 817 1538 -848 -2715 -2918 -2300 1380 1790 -1093 -1899 -3586 -2789 2050 2554
1342B554k776l519k44L918K081q8n69n176p57N786J485j222m21l182j709L983
$$ 2554 -222 -3741 -3985 -67 2014 1926 1357 -3819 -4576 1210 2695 1473 1052 -2130 -3839 144
1358A44L649j723l205J877r25k358O033k0n381K991O09m684K831M705k059m595
$$ 144 3793 2070 -1135 742 -183 -2541 3492 3472 -1909 1082 1691 -2993 -162 4543 2484 -2111
1374b111J780M03l092P741K263j1558P75M620j672M764J203o295n344L144Q687
$$ -2111 -331 72 -3020 4721 6984 -4574 -3799 821 -851 3913 5116 -1179 -6523 -3379 5308
1389E308k549j438P98j1069M259J1953m094k177l127m332N388L600L709m685r469
$$ 5308 2759 1321 2119 -8950 -4691 7262 3168 991 -2136 -6468 -1080 2520 6229 1544 -7925
1404g925N899K616q40P335p143o354N888o97N129J133p384J104k506K320R880
$$ -7925 -2026 590 -250 7085 -58 -6412 -524 -1221 3908 5041 -2343 -1239 -3745 -1425 8455
1419H455p918l442M158n041M588K655l832L558m683k348M989n285Q227M744j5837
$$ 8455 537 -2905 1253 -3788 800 3455 -377 3181 -1502 -3850 1139 -4146 4081 8825 -7012
1434g012K308L975k198J0051l329q417n30k409J2714J940j0977M440j0311n66
$$ -7012 -4704 -729 -2927 7124 3795 -4622 -5152 -7561 5153 7093 -3884 556 -9755 -10321
1448a0321K4021q088j1604J302n795J1638P918o792m313j1955J0583J3729j2775
$$ -10321 13700 5612 -5992 -4690 -10485 1153 9071 2279 -2034 -13989 -3406 10323 -2452
1461b452M981k051j4953J7250N317j0169L294m656J586N040k933L487o338L95
$$ -2452 2529 478 -14475 2775 8092 -2077 1217 -3439 -1853 3187 254 3741 -2597 -2202
1475b202J2102j2576k983J2197n479K868K061j2233M012P171J110L69q915j050
$$ -2202 9900 -2676 -5659 6538 1059 3927 5988 -6245 -2233 4938 6048 6417 -2498 -3548
1489c548M666Q78Q608m420j3184M395L711N296N949j3830o930O811M821P904n648
$$ -3548 1118 1996 10604 6184 -7000 -2605 1106 6402 12351 -1479 -8409 -1598 3223 11127 5479
1504E479j2629K844M549N170J246r068m77O01J631P393o683l870M501m672M159
$$ 5479 -7150 -4306 243 5413 6659 -2409 -2886 -2285 -654 6739 56 -3814 687 -3985 174
1519A74M053n989j779J215L568M40n124J561o21J953O125r503n074Q183L258M50
$$ 174 4227 -1762 -3541 -2326 1242 1682 -3442 -1881 -2502 -549 5576 -3927 -9001 -818 2440 2890
1535B890m510n655J880M647O818l985j0090L106K087K505P155p381q347K900M225
$$ 2890 -1620 -7275 -5395 -748 6070 2085 -8005 -4899 -2812 -307 6848 -533 -8880 -5980 -1755
1550a755P198j326q980j407M78Q129M581r951k073K604j17O714k719o212L544
$$ -1755 5443 4117 -4863 -6270 -5792 2337 6918 -3033 -5106 -2502 -2619 4095 1376 -4836 -1292
1565a292M62J693J353o027K591K388j561L506n704j727Q131j443j6j756q252Q318
$$ -1292 -830 863 2216 -3811 -1220 1168 -393 3113 -2591 -4318 3813 2370 2354 598 -7654 664
1581F64N980k942n15r329O90J2029n91l14o222q070R914N271n83O66j2068L9R578
$$ 664 6644 3702 3187 -6142 -5452 6577 5986 5672 -550 -8620 1294 6565 5982 6648 -5420 -5381 4197
1598D197M32M102o272r466O929L154K989J384j0963J142M574q05M911m517m544
$$ 4197 4629 8731 2459 -7007 -78 3076 6065 7449 -3514 -2372 2202 1397 6308 1791 -2753
1613b753M498k914K410L075m998J598n57l242M179o15K11K469n491j047J135M32
$$ -2753 1745 -1169 1241 4316 -682 916 359 -2883 1296 681 892 3361 -2130 -3177 -2042 -1610
1629a610O045j121p323r73L70N506N192n532n596j554K692Q043K99o498k938k270
$$ -1610 4435 3314 -4009 -4982 -4612 894 6086 554 -5042 -6596 -3904 4139 4438 -2060 -4998 -7268
1645g268N626P814l510o283k594O45O776L398k569m295n046N208M637p05M33m699
$$ -7268 -1642 6172 2662 -3621 -6215 -5570 1206 4604 2035 -2260 -7306 -2098 2539 1834 2267 -2432
1661b432l368M736K948n78n69k089j369M51K405J774j724n4j667k213K940L587
$$ -2432 -5800 -1064 1884 1306 737 -1352 -2721 -2270 135 1909 185 131 -1536 -3749 -809 2778
1677B778j093k140k333l91L109L004J62m226k696J063L298L862j420m020l003
$$ 2778 1685 -455 -2788 -3179 -70 2934 3096 -1130 -3826 -2763 535 4397 2977 -1043 -4046
1692d046R77N060L275l329l873j046J349L993K291k256l963n40K398J701J501
$$ -4046 -3069 1991 5266 1937 -1936 -2982 -1633 2360 4651 2395 -1568 -2108 290 1991 3492
1707C492k41m134q54L417J273j31m24j604j849J701K413J14o66j240j928L2L093
$$ 3492 3251 -883 -1737 1680 2953 2822 2398 794 -1055 646 3059 3173 2507 1267 -661 -629 2464
1724B464J891j983k214r63n0K502J696p81k259k312R54K929L37j00k236k441Q00
$$ 2464 4355 2372 158 -805 -855 1647 3343 2562 303 -2009 -1055 1874 2211 2111 -125 -2566 -1766
1741a766L263K85j833j461j24o97J726K478k473k120R82o46P04J780m3k701q25
$$ -1766 1497 1782 -51 -1512 -1636 -2333 -607 1871 -602 -2722 -1740 -2386 -1682 98 55 -2646 -3471
1758c471J282L96O62J758k151l191J546J815L70J042m32l816J58L202J756m17
$$ -3471 -2189 -1793 -1131 627 -1524 -4715 -3169 -1354 -984 58 -374 -4190 -4032 -830 926 509
1774E09j489k052j61K186L286j048l248l16L7J703K962o02k333k413J271L507
$$ 509 -980 -3032 -3193 -1007 2279 1231 -2017 -2333 -2296 -593 2369 1767 -566 -2979 -1708 1799
1790A799N86j090p28k866R87K881J031l99k030q20j17N10M057J75m572J09O01
$$ 1799 2385 1295 567 -2299 -1312 1569 2600 2201 171 -649 -766 -256 3801 3976 -596 -487 114
1807A14k38L260N26k889k307P31K424M91N48l59m821K47N595k72j524ml174j089
$$ 114 -124 3136 3662 773 -1534 -803 1621 2112 2660 2301 -2520 -2273 3322 3050 1526 1522 -1652 -2741
1825b741M300K577j643k966j310l12J796M714l56o274n89K205P63K970R8m657
$$ -2741 1559 4136 2493 -473 -1783 -2095 -299 4415 4059 -2215 -2804 -599 164 3134 3232 -1425
1841a425j735J469L418J373k078j860k488Q83N351k87k906j403j186K394J621
$$ -1425 -3160 -1691 1727 3100 1022 -838 -3326 -2443 2908 2621 -285 -1688 -2874 -480 1141
1856A141O00r82l426J0K907r7P98k01k120j165J285K258n30m18N50l060r36M035
$$ 1141 1741 759 -2667 -2657 250 153 951 750 -1370 -2535 -1250 1008 478 60 610 -2450 -3386 649
1874F49R26j021n36j905j485K400M553k091m457J148J203m54M201j052n218j08
$$ 649 1575 554 18 -1887 -3372 -972 3581 1490 -2967 -1819 -616 -1070 3131 2079 -3139 -3247
1890c247K321K174Q10q26l171l065L617N778k468l204n53j719L348L690l032k026
$$ -3247 -926 1248 2058 1232 -1939 -5004 -1387 4391 1923 -1281 -1834 -3553 -205 3485 453 -1573
1906a573k97Q77K104j557M55O08l188K498J409k579K179j391r47L270k808N41
$$ -1573 -1870 -993 1111 -446 9 617 -2571 -73 1336 -1243 936 -455 -1402 1868 -940 -399
1922c99R47j978M111j427m636L659Q79J396N97o138J491K449P72M086o092m357
$$ -399 548 -1430 2681 1254 -3382 277 1156 2552 3149 -2989 -1498 951 1723 5809 -283 -4640
1938d640N771n36K333K648p596q57L093K147L276m605l176J999j018N912k11q284
$$ -4640 1131 595 2928 5576 -2020 -2877 216 2363 5639 1034 -2142 -143 -1161 4751 4540 -3744
1954c744K724K376j145L944l559l551L498l37K011o14m997L970L77j928L580n365
$$ -3744 -1020 1356 211 4155 596 -2955 543 206 2217 1603 -3394 576 953 -975 2605 -2760
1970b760r46O417j851m32k606l898P879J068l012K56o877K812R027l928j723k813
$$ -2760 -3706 2711 860 428 -2178 -6076 1803 2871 -141 115 -6762 -3950 5077 1149 -574 -3387
1986c387l089P365J711p43k078p466N150O219k843J842n428m894Q703L326k669
$$ -3387 -6476 889 2600 1857 -221 -7687 -2537 3682 839 2681 -2747 -7641 1062 4388 1719
2001A719k135m469L329M325j045K01m493o4O407k972j575K071k363K674J399l682
$$ 1719 -416 -4885 -1556 2769 1724 1925 -2568 -2632 3775 803 -772 1299 -1064 1610 3009 -673
2017f73Q35l33J059L490l713k253J418m64N223j32o573l68J309M399K987o020
$$ -673 162 -171 888 4378 665 -1588 -170 -634 4589 4457 -2116 -2484 -1175 3224 6211 191
2033A91l722R85K217O861k577p706O2J919L689L620m962m080r63L478N156k469
$$ 191 -3531 -2546 -329 6532 3955 -3751 -3689 -1770 1919 5539 577 -3503 -4466 -988 4168 1699
2049A699l429j015j275M857K338m253j117l30J207K526r68k079l90P74K115q66
$$ 1699 -1730 -2745 -4020 837 3175 -1078 -2195 -2525 -1318 1208 240 -1839 -2229 -1455 660 -206
2065b06j476J69N18J423l79k585Q25K008R80j97k330k152K244L326J006k662k585
$$ -206 -1682 -1513 -995 428 49 -2536 -1711 297 1277 1080 -1250 -3402 -1158 2168 3174 512 -2073
2082b073O4K010L912n14m831j421J919K764J982j736m216o57L847L006k73m003
$$ -2073 -2009 1 3913 3399 -1432 -2853 -934 1830 3812 2076 -2140 -2797 1050 4056 3783 -220
2098b20n99j46J627L284k202k992Q39N56K034k43j688J19p65J212J649k827J21
$$ -220 -819 -965 662 3946 1744 -1248 -409 147 2181 1938 250 369 -396 816 2465 -362 -241
2115b41J665r31O34j265j220K034O40O39j997l387L358J909q67K33l054j340L380
$$ -241 1424 493 1127 -138 -1358 676 1316 1955 -42 -3429 -71 1838 971 1204 -1850 -3190 190
2132A90K037m99k733k456J873J688J275P93m413j301M217K84J213j493k618j137
$$ 190 2227 1728 -1005 -3461 -1588 100 1375 2168 -2245 -3546 671 955 2168 675 -1943 -3080
2148c080K679J524J98k436K78l0q10K152J95k144L87N36o85Q98j32J354q66j811
$$ -3080 -401 1123 1321 -1115 -837 -867 -1677 475 670 -1474 -1087 -551 -1236 -338 -470 884 18 -1793
2166a793J280N77l04K348j785k573R39J401J335k14j349r96j189K921L086l104
$$ -1793 -513 64 -240 2108 323 -2250 -1311 90 1425 1211 -138 -1134 -2323 598 3684 580
2182E80j440R5r80K714K401k017k936J5J898P52O85M61l279j141L335L81n24Q85
$$ 580 -860 -765 -1745 969 3370 1353 -1583 -1568 330 1082 1767 2228 -1051 -2192 1143 1524 1000 1885
2200A885j981j643J640J910r5j160n26q04NK203P94j389j244q66M68J930J002
$$ 1885 -96 -1739 -99 1811 1716 556 30 -774 -769 1434 2228 839 -405 -1271 -803 1127 2129
2217B129q52j909j455J523K307N3j076j467j169J151K460M81k388j058M32M58
$$ 2129 1277 -632 -2087 -564 1743 1796 720 -747 -1916 -765 1695 2176 -212 -1270 -838 -380
2233c80J389J291k679j840J550N11N86Q52q01k464P5K283K77k47M14j966j206
$$ -380 1009 2300 -379 -2219 -669 -158 428 1280 479 -1985 -1910 373 650 403 817 -1149 -2355
2250b355K094J162k92k14j469p59Q97J586R73j971r14n4J76J976M33j371j176
$$ -2355 -261 901 609 395 -1074 -1833 -936 650 1623 -348 -1262 -1316 -1140 836 1269 -102 -1278
2267a278n90J541J922j054o50j048j125K272J421n44j119j473K92J326J080O18
$$ -1278 -1868 -327 1595 541 -109 -1157 -2282 -10 1411 867 -252 -1725 -1433 -107 973 1591
2283A591k454j486K300L47J94J018j972o90O31R52Q46j224j61N99j614J184J959
$$ 1591 -863 -2349 -49 298 492 1510 -462 -1152 -521 431 1277 53 -108 491 -1123 61 2020
2300B020k383L54Q78j545Q34K12N15J47k035J348M1j719M262j727l434K851o65
$$ 2020 -363 -9 869 -676 158 370 885 1032 -1003 345 386 -1333 2929 1202 -2232 619 -46
2317d6l4K422k070m6k040M07M180k503k12J053m016K549L143l128Q3j69j124K200
$$ -46 -80 2342 272 226 -1814 -1407 2773 270 58 1111 -2905 -356 2787 -341 -258 -427 -1551 649
2335F49j155R08P47m045L081M80k257L289j708k329K439j203J853L02k627K309
$$ 649 -506 402 1149 -2896 185 665 -1592 1697 -11 -2340 99 -1104 749 1051 -1576 733
2351G33j731j137M798k649j208K721l557J150K092j039J479k463m19L084l838
$$ 733 -998 -2135 2663 14 -1194 1527 -2030 -880 1212 173 1652 -811 -1230 1854 -1984
2366a984K791K191n222K806K95k573L730p04j166n40k643N044N12l140K636m484
$$ -1984 807 2998 -2224 582 877 -1696 2034 1330 164 -376 -3019 2025 2537 -603 2033 -2451
2382b451p51P172j909j925j197k235M000P42M28R8o709L146M861l685J518n00
$$ -2451 -3202 3970 2061 136 -1061 -3296 704 1446 1874 1972 -4737 -1591 3270 -415 1103 603
2398F03m431L746J739o83j444k791M166m22k149L531l388r72N362l326j860K579
$$ 603 -3828 -82 1657 974 -470 -3261 905 483 -1666 1865 -1523 -2495 2867 -459 -2319 260
2414B60o14J495j578j233J097k001M671J707p179J424J591r55N402k832l814N06
$$ 260 -354 1141 -437 -1670 -573 -2574 2097 3804 -3375 -1951 -360 -1315 4087 1255 -2559 -2053
2430b053JN574p75n075K369k827J857O395n360k013J268k236N679j70l316J400
$$ -2053 -2052 3522 2747 -2328 41 -2786 -929 5466 106 -1907 -639 -2875 2804 2634 -682 718
2446G18m140L698M237n569J256j026k417N682k259o59J762n185N952N42n055M527
$$ 718 -3422 276 4513 -1056 200 -826 -3243 2439 180 -479 1283 -3902 2050 2592 -2463 2064
2462B064k067j822M956l407o94K092k776M367j984k686M041l995K303M530p991
$$ 2064 -3 -1825 3131 -276 -970 1122 -1654 2713 729 -1957 2084 -1911 392 4922 -3069
2477c069J834K743k973N347k209m897L103j097L883J325p362K783j27q67P450
$$ -3069 -1235 1508 -1465 3882 1673 -3224 -121 -1218 2665 3990 -3372 -589 -716 -1583 5867
2492E867n725m168M808k841L984J715p031K425l29R53M898o469p92K809k273N551
$$ 5867 142 -4026 782 -2059 1925 3640 -3391 -966 -1295 -342 4556 -1913 -2705 104 -2169 3382
2508C382j837o703N182p73J182L181p463J366L899j866L292m291l070N783j246
$$ 3382 1545 -5158 24 -749 433 3614 -3849 -2483 1416 -450 2842 -1449 -4519 1264 18
2523A8J361L29o961M437K040j355L603n141k426N246p85K095j347n617M138J246
$$ 18 1379 1708 -5253 -816 1224 -131 3472 -1669 -4095 1151 366 2461 1114 -4503 -365 881
2539H81N2J543n467O28L886j124J491k229k455M128n87m04J294l798K212K184
$$ 881 933 2476 -2991 -2363 1523 399 1890 -339 -2794 1334 747 343 1637 -2161 51 2235
2555B235k817J161j163r22L520j297n21o42k401M447L16k374J149l196Q27M873
$$ 2235 -582 579 -584 -1506 2014 717 196 -446 -2847 1600 1916 -458 691 -2505 -1678 3195
2571C195k178j180j114j408L507J077j174j016l365K983K723j045j42k627j013
$$ 3195 1017 -163 -1277 -2685 822 1899 725 -291 -3656 -673 2050 1005 863 -1764 -2777
2586b777L998n3L75j525k731K406J379j37O38k420l50K004k35N23p56j289J847
$$ -2777 1221 1168 1543 18 -2713 -307 1072 935 1573 -847 -1197 807 572 1095 339 -950 897
2603H97q28J81J034j918Q56J488k021P33P6p5J084r35p68m35N01K319p86k377
$$ 897 69 250 1284 -634 222 1710 -311 422 498 423 1507 572 -196 -631 -130 2189 1403 -974
2621i74N69m07J181K130j820j917o4O88K170J55k024r14q42K380J866j864j050
$$ -974 -405 -812 369 2499 679 -1238 -1302 -614 1556 1711 -313 -1227 -2069 311 2177 313 -737
2638g37j044K36K562p3j581m45j257J610J262q92Q2j440j28J621k33J14pj219
$$ -737 -1781 -1545 1017 944 -637 -1082 -2339 -729 533 -359 -277 -1717 -1845 -224 -457 -343 -350 -1569
2656a569P93K31l64R96m90n65M23q82J527K42m78J20q15l50J683j07j44l43j278
$$ -1569 -776 -545 -909 87 -403 -968 -545 -1427 100 342 -136 -16 -831 -1181 502 395 251 -92 -1370
2675a370R87P17M28L97j107p17J300j01P49l75j214J77R03K28J31n39j2m95L20
$$ -1370 -383 334 762 1159 52 -665 635 534 1283 908 -306 -129 774 1002 1133 594 582 87 407
2694D07R55k92r44R52m06p71J199K48j017K96M0l88M6O60N57j735J15R28j176
$$ 407 1362 1070 126 1078 672 -99 1100 1348 331 627 667 279 325 985 1542 -193 -78 850 -326
2713c26Q70P67j868k10Q97O6J70l49K57j148j47J685n40j093P03k78o86R43L15
$$ -326 544 1311 -557 -767 130 196 366 17 274 -874 -1021 664 124 -969 -266 -544 -1230 -287 28
2732B8n70k25J09K90r19P66J007j499J79O49j018M3J431l7j128m85J301m04j43
$$ 28 -542 -767 -658 -368 -1287 -521 486 -1013 -834 -185 -1203 -1160 271 234 -894 -1379 -78 -482 -625
2751f25J665j535j618K292O92j380Q01j17j265L91J969J46k245N30Q58j259J709
$$ -625 1040 -495 -2113 179 871 -509 292 175 -1090 -699 1270 1416 -829 -299 559 -700 1009
2768A009J041k283o5O07N42L07j26L00j540o51K437j82j230J042j097r20J227
$$ 1009 2050 -233 -298 309 851 1158 1032 1332 -208 -859 1578 1396 166 1208 111 -809 418
2785D18O82o1j251r9J078j798J525J470l019K92J464j251N08J112n74j546n84
$$ 418 1100 1039 -212 -311 767 -1031 494 1964 -1055 -763 701 -550 -42 1070 496 -1050 -1634
2802a634K584o53j466K397j967k208L613J77j484Q49j238j041J413J735L96l342
$$ -1634 950 297 -1169 1228 -739 -2947 666 843 -641 208 -1030 -2071 -658 1077 1473 -1869
2818a869P0K275k218K342J286m572O39K390p19J163p53q89j58o47L560l43l336
$$ -1869 -1799 476 -1742 600 1886 -2686 -2047 343 -376 787 34 -855 -1013 -1660 1900 1557 -1779
2835a779K379j386r46L849j562j128P46j373J934n90l94K431l943R01K861k908
$$ -1779 600 -786 -1732 2117 555 -573 173 -1200 734 144 -250 2181 -1762 -861 2000 -908
2851i08J071J560l106J534L56l90J270j960J143M3k270L612m64k795K694j833
$$ -908 163 1723 -1383 151 507 117 1387 -573 570 613 -1657 1955 1491 -1304 1390 -443
2867d43r31K805j225J51j31j909K609q27o4K673l818n74K727j351J630j01k829
$$ -443 -1374 1431 206 357 226 -1683 926 99 35 2708 -1110 -1684 1043 -308 1322 1221 -1608
2884a608J146j18K080J005m078J52J975j449L206j111l221J802K19P80O26k417
$$ -1608 -462 -580 1500 2505 -1573 -1421 554 -895 2311 1200 -2021 -219 0 780 1406 -1011
2900a011R78n06L1L467l537j473L461j482N94N80k921J182J516K83m58l205K192
$$ -1011 -33 -539 -508 2959 -578 -2051 1410 -72 522 1102 -1819 -637 879 1162 704 -2501 -309
2917c09J676j536J567j752k283L427R17j838Pj629P11J383J192m10l417J05L120
$$ -309 1367 -169 1398 -354 -2637 790 1707 -131 -124 -1753 -1042 341 1533 1123 -2294 -2189 931
2934I31j63M77j188k933K292J989o50j096j264M70J548P5J67j902l40K516n63
$$ 931 768 1245 57 -2876 -584 1405 755 -341 -1605 -1135 413 488 655 -1247 -1587 929 366
2951C66n52L52k094J543J449q89l76j192L86J877l53l68r83q39K444Q0p33k82
$$ 366 -186 166 -1928 -385 1064 175 -201 -1393 -1007 870 517 149 -834 -1673 771 851 118 -164
2969a64j709J338K089j103j83j531r82K959P95o16q07k032J730J730o27K55k286
$$ -164 -1873 -535 1554 451 268 -1263 -2245 714 1509 893 86 -1946 -216 1514 887 1142 -1144
2986a144j34K839m55P2r47j825K081J109q57K80j761O6K027l38m9o32j422K246
$$ -1144 -1278 1561 1106 1178 231 -1594 487 1596 739 1019 -742 -676 1351 1013 964 332 -1090 1156
3004A156k7j137Q16j638R89J914j845q04n6J54K980j230k334J72j95K450R27k997
$$ 1156 1129 -8 808 -830 159 2073 228 -576 -632 -478 2502 1272 -1062 -890 -1085 1365 2292 -705
3022g05l07j15Q44K887k286j825K80j08K596P92l171m06l55J347K526j784j477
$$ -705 -1012 -1127 -283 2604 318 -1507 -1227 -1335 1261 2053 -1118 -1524 -1879 -532 1994 210 -1267
3039a267j07k82K670J85k325M35j011J971R81k321q1O43m15J643q71j349P99J92
$$ -1267 -1374 -1656 1014 1199 -1126 -691 -1702 269 1250 -1071 -1152 -509 -924 719 -152 -1501 -702 -510
3057e10P38J10j507Q77K60K01O95j325n11J612j62N44k66j888O18J369K45m77
$$ -510 228 338 -1169 -292 -32 169 864 -461 -972 640 478 1022 756 -1132 -514 855 1100 623
3075F23j409O3Q66N32J239j379k076J369J123j59L44r88j350J287J032m7j046
$$ 623 -786 -723 143 675 1914 535 -1541 -172 951 792 1136 148 -1202 85 1117 1070 24
3092B4n58P42n3R58K83j533m69J025N5k36j43l40n67J226Q7r12n01J672k11r98
$$ 24 -534 208 155 1113 1396 -137 -606 419 474 238 95 -245 -812 414 501 -411 -912 760 549 -449
3112d49J859j695q70K323k36j329m55O14K03K6J142j102j470J111J148p06O6j84
$$ -449 1410 -285 -1155 1168 932 -397 -852 -238 -35 -9 1133 31 -1439 -328 820 114 180 -4
3130dn33J36R68k51q80J12K75j73P48P0q94m3K28N30l12P3K7k03j31N8M26p92
$$ -4 -537 -401 567 316 -564 -452 -177 -350 398 468 -426 -469 -241 289 -23 50 77 -126 -257 -199 227 -565
3152e65M19K23m39l71N79K93l77j35L80n70j89J500q39q61Q54lj173J830J11j287
$$ -565 -146 77 -362 -733 -154 139 -238 -373 7 -563 -752 748 -91 -952 -98 -101 -1274 556 667 -620
3172f20m02R26j14l51J169m08j770J414R77j308M39Q23j485k5J475j98r95P48
$$ -620 -1022 -96 -210 -561 608 200 -1570 -156 821 -487 -48 775 -710 -735 740 542 -453 295
3190B95Q1j125N23J724j133q72J035n43l38J269K10j206k91R31K22l31L85k28
$$ 295 376 -749 -226 1498 365 -507 528 -15 -353 916 1126 -80 -371 560 782 451 836 608
3208F08j486R40J176o83l89L94n87l5Q66L15r17q87Q54J4k17J362r08r47M84O62
$$ 608 -878 62 1238 555 166 560 -27 -62 804 1119 202 -685 169 183 -34 1328 420 -527 -43 619
3228F19k96l22N55j10j285O01J321j836O78P68j737R5J840q76n34P2J90o61O04
$$ 619 323 1 556 446 -839 -238 1083 -753 -75 693 -1044 -949 891 15 -519 -447 -257 -918 -314
3247c14J529j348j665J942p93m60J946n25j682O04J012k14n21O23m02j132J253
$$ -314 1215 -133 -1798 144 -649 -1109 837 312 -1370 -766 246 32 -489 134 -268 -1400 -147
3264a47J107j766K79O35j315J199M95p20m95j4Q78j60l61J538j272n42J114l22
$$ -147 960 -806 -527 108 -1207 -8 487 -233 -728 -742 136 -24 -385 1153 -119 -661 453 131
3282A31k05P35k18n59Q4K85N41j132M57R44j630O40J177j208J36L71m05l79L79
$$ 131 -74 661 443 -116 -32 253 794 -338 119 1063 -567 73 1250 42 178 549 144 -235 144
3301A44J035j147l94J028n08p08K036r09j438R51L43l3j24p0q7j292J301J137
$$ 144 1179 32 -362 666 158 -550 1486 577 -861 90 433 400 276 206 119 -1173 128 1265
3319A265j644N11k36j014Q12J271o96o80n21Q06Q9l41Q68j124q06K285q03q52
$$ 1265 -379 132 -104 -1118 -306 965 269 -411 -932 -126 -37 -378 490 -634 -1440 845 42 -810
3337h10J189n18k11L91j81N00j067Q35R16k665J498J180k388J654M37j434O05
$$ -810 379 -139 -350 41 -140 360 -707 128 1044 -1621 -123 1057 -1331 323 760 -674 -69
3354f9q0O95k11j169J430j335k43L443k196j085J298j254Q32J692j794k10k01
$$ -69 -149 546 335 -834 596 -739 -982 2461 265 -820 478 -776 56 1748 -46 -256 -457
3371d57L33J726j605L00L84k216K729K50k153J492j539m18K508j225J41l60j615
$$ -457 -124 1602 -3 297 681 -1535 1194 1444 -709 783 -756 -1174 1334 109 250 -110 -1725
3388a725K569j90j041J062j796Q27J327j758J111m33q82K202j485p08J228j113
$$ -1725 844 654 -387 675 -1121 -294 1033 -725 386 -47 -929 1273 -212 -920 308 -805
3404h05R49J149k706O48O02k7J603k158m1P76q60K260k84l284K166m49M00J925
$$ -805 144 1293 -1413 -765 -163 -190 1413 -745 -786 -10 -870 1390 1106 -2178 -12 -461 -61 1864
3422A864k271p93O94J41K199r71k159J224j016K350J312l595O3O72m6K217j453
$$ 1864 -407 -1200 -506 -365 1834 863 -1296 -72 -1088 1262 2574 -1021 -958 -286 -332 1885 432
3439D32j630J311m18J071K59j794N23J6P0J666j808l26J157p30J112k16j803J375
$$ 432 -1198 113 -305 766 1025 -769 -246 -230 -160 1506 -302 -628 529 -201 911 695 -1108 267
3457B67m6K96L09j770J65J107J20Q07j910p29J928k4K19m38k109R10J403j93P40
$$ 267 221 517 826 -944 -779 328 448 1255 -655 -1384 544 520 739 301 -1808 -898 505 312 1052
3476A052k071m32J366K79R82j350n81j96J065N56M27j850J54O45j28J292j225
$$ 1052 -1019 -1451 -85 194 1176 -174 -755 -951 114 670 1097 -753 -599 46 -82 1210 -15
3493a5j495J128O69K90j73j214N79J76Q10J43k132O29J578j206Q56k25j780J612
$$ -15 -1510 -382 287 577 404 -810 -231 -55 755 898 -1234 -605 973 -233 623 398 -1382 230
3511B30P41p94j83q56O03N69K81O27k253k46K695j136J80O56k404N57K051l94
$$ 230 971 177 -6 -862 -259 310 591 1218 -1035 -1281 1414 278 458 1114 -1290 -733 1318 924
3529I24o33p46j9P42j41J238j433j818K411K50j113R18j199j44J106l2m0o64l45
$$ 924 291 -455 -474 268 127 1365 -68 -1886 525 775 -338 580 -619 -763 343 311 271 -393 -738
3548g38J298o79P1N44j723J155Q60j086K13m40l09J342m57l65n63l91J609J96
$$ -738 560 -119 -48 496 -1227 -72 788 -298 -85 -525 -834 508 51 -314 -877 -1268 341 537
3566E37p79r0p24M67J323p05j50o57n54J674P73j411K88m40k59J573L75j091j501
$$ 537 -242 -332 -1056 -589 734 29 -121 -778 -1332 342 1115 -296 -8 -448 -707 866 1241 150 -1351
3585a351J237J109j403J125j50j358R33J047j475M05P04o58j84O77l66n77P40
$$ -1351 -114 995 -408 717 567 -791 142 1189 -286 119 823 165 -19 658 292 -285 455
3602D55J072j695l15J657r03l31Q83k97j349J479O37j267j93J58Km48J031K02
$$ 455 1527 -168 -483 1174 271 -60 823 526 -823 656 1293 26 -167 -9 -7 -455 576 778
3620G78j665L97J88%J106l65j101nP59j31J02r5k16o70Q66M71p30J92j83o01P53
$$ 778 -887 -490 -302 -302 804 439 -662 -667 92 -39 63 -32 -248 -918 -52 419 -311 -119 -302 -903 -150
3641a50R1r6k06k86J33L92j29K38n20k28M71K21K33m70M1k2m35N25N05p64K24
$$ -150 -59 -155 -361 -647 -514 -122 -251 -13 -533 -761 -290 -69 164 -306 -265 -287 -722 -197 308 -456 -232
3662b32K05l08n0R43k66n81K14K53k95J70N65q02j32P01j91o20R71j81p87L49
$$ -232 -27 -335 -385 558 292 -289 -75 178 -117 53 618 -184 -316 385 194 -426 545 364 -423 -74
3682g4O42p55K15O09l65o80P06K65q28N40K64q25L7J064n51k44K52n7p34N40O92
$$ -74 568 -187 28 637 272 -408 298 563 -265 275 539 -286 -249 815 264 20 272 215 -519 21 713
3703G13o75k67N44l43k00O99j41p24M68K54k13j95M53p7r63R50L56j076K2Q14
$$ 713 38 -229 315 -28 -228 471 330 -394 74 328 115 -80 373 296 -667 283 639 -437 -415 399
3723C99n58j6L50J55m04J31M90q83j99J096m23o8J64l34n39R45M54p57o66P53
$$ 399 -159 -175 175 330 -74 57 547 -336 -535 561 138 70 234 -100 -639 306 760 3 -663 90
3743I0J55o84Q73J07j358N73Q98o82k59L81m25m10O71N86p08m22O83k73l22J148
$$ 90 245 -439 434 541 -817 -244 654 -28 -287 94 -331 -741 -70 516 -192 -614 69 -204 -526 622
3763F22l72r06M76K41l39N6P52n80p47O67N16p52J29J032j621O3Q86R4o22P0L53
$$ 622 250 -656 -180 61 -278 -222 530 -50 -797 -130 386 -366 -237 795 -826 -763 123 217 -405 -335 18
3784A8n61P4R02n95p47J229n42m39Q31K50r41K31M82l77l10J080l97j034P15N65
$$ 18 -543 -469 433 -162 -909 320 -222 -661 170 420 -521 -290 192 -185 -495 585 188 -846 -131 434
3804D34n36N81k3q18j83J198J26o60k34o5N8O79M78r99l21N04O4M42J10p27o7
$$ 434 -102 479 456 -362 -545 653 779 119 -115 -180 -122 557 1035 36 -285 219 283 725 835 108 41
3825D1j97O82K48n02k32M2m9M61p4p1m54j53N99l27j76Q27l73n10M88l33j68M74
$$ 41 -156 526 774 272 40 82 33 494 420 349 -105 -258 341 14 -162 665 292 -218 270 -63 -231 243
3847B43Q1m12J00k08m5j81Q80m50j006O74M13m19M29k58p31N79L91J60k98p62
$$ 243 324 -88 12 -196 -241 -422 458 8 -998 -324 89 -330 99 -159 -890 -311 80 240 -58 -820
3867h20K92q3P98N90j300l57P01o43J351o7q17l15M48M68J33o47m5j72M50P27
$$ -820 -528 -611 187 777 -523 -880 -179 -822 529 462 -355 -670 -222 246 379 -268 -313 -485 -35 692
3887F92o34k68K18m48K99J445j508k68O92J44J71q03j98O29L36J84l83r95N30
$$ 692 58 -210 8 -440 -141 1304 -204 -472 220 364 535 -268 -466 163 499 683 300 -695 -165
3906a65Q09j24K22j251l3O40L54O44j014r71Q62K79K04J58j307j56R77N07r4j213
$$ -165 644 520 742 -509 -542 98 452 1096 82 -889 -27 252 456 614 -693 -849 128 635 541 -672
3926f72N1N38r5O46k39j168L15J028k90J63l92l52P7R86k77j016LR07J79k53j2
$$ -672 -621 -83 -178 468 229 -939 -624 404 114 277 -115 -467 -390 596 319 -697 -694 213 392 139 127
3947A27n52k30J380l2q42n89N51L91M79K73j054l82J090K69o77J75p01k41R40
$$ 127 -425 -655 725 693 -149 -738 -187 204 683 956 -98 -480 610 879 202 377 -324 -565 375
3966C75J133j198j020k98R38J278m06r56q00M68P70m55L34j221N52J101m45P6
$$ 375 1508 310 -710 -1008 -70 1208 802 -154 -954 -486 284 -171 163 -1058 -506 595 150 226
3984B26p86j44R65J39j96j88l47K05L93l1N29j731m31J778p79Q1J56k60O42R71
$$ 226 -560 -704 261 400 204 16 -331 -126 267 236 765 -966 -1397 381 -398 -317 -161 -421 221 1192
4004A192m32k208L11R81R53q71J85r43n43J674O57j172N04q56N87O85K72p66m10
$$ 1192 760 -1448 -1137 -156 797 -74 111 -832 -1375 299 956 -216 288 -568 19 704 976 210 -200
4023b00q90J897M45q71o98l47Q81N35o96J69p33O7P54M6rn77l8L15J05o87Q33
$$ -200 -1090 807 1252 381 -317 -664 217 752 56 225 -508 -441 313 359 350 -227 -265 50 155 -532 301
4044C01j013R69n34L92m35K08M64k77j85M05j68o61O71k80l5l00M49q3R70n50
$$ 301 -712 257 -277 115 -320 -112 352 75 -110 295 127 -534 137 -143 -178 -478 -29 -112 858 308
4064C08q66K48M32k43J99L0n68J57N07N21n70n36J18O5O22N9m63p95N08L35K74
$$ 308 -558 -310 122 -121 78 108 -460 -303 204 725 155 -381 -263 -198 424 483 20 -775 -267 68 342
4085C42j85k72j18J09L49k08m52K33K22K68j14l3n1k81%L58k13l29M75J0k78L23
$$ 342 157 -115 -233 -124 225 17 -435 -202 20 288 174 141 90 -191 -191 167 -46 -375 100 110 -168 155
4107A55k7j98J21K16j70j42N1L51m64N49k27k35j19M80k04k19N75j89m94M56N38
$$ 155 128 -70 51 267 97 -45 6 357 -107 442 215 -20 -139 341 137 -82 493 304 -190 266 804
4128H04p13k46L91k61k52K99K06n72J95K59j32m98Q29l47n56M00K21j35P9L00
$$ 804 91 -155 236 -25 -277 22 228 -344 -149 110 -22 -520 309 -38 -594 -194 27 -108 -29 271
4148B71m71m75Q88K4o88L77J70o93K52O12o26k24N26j75l51M99K84l34l69O87
$$ 271 -200 -675 213 237 -451 -74 96 -597 -345 267 -359 -583 -57 -232 -583 -84 200 -134 -503 184
4168A84m16l46R79j23n81J41K99r84Q94Q94o58n00O62l30q67J579r30J8j83Q55
$$ 184 -232 -578 401 278 -303 -162 137 -847 47 941 283 -217 445 115 -752 827 -103 -85 -268 587
4188E87j60m23l6J84j31J39M45m89m40M85J20j44K78J59p99K3N53P5j50j52j31
$$ 587 427 4 -32 152 21 160 605 116 -324 161 281 137 415 574 -225 -202 351 426 276 124 -7
4209gj72K3Q07n17j02K60j94j67K37n3m0k72L01j84n20P92j46o32N92q9l32J99
$$ -7 -179 -156 651 134 32 292 98 -69 168 115 75 -197 104 -80 -600 192 46 -586 6 -83 -415 -216
4231b16L98k74k27J22J1J45k45j72l77K86O12k33l19K44L33l03m94L69J87q3k45
$$ -216 182 -92 -319 -197 -186 -41 -286 -458 -835 -549 63 -170 -489 -245 88 -215 -709 -340 -153 -236 -481
4252d81J087r00N08m68k25J105n23j39l31J94K47P0l83N20k12k58K92k54J23K78
$$ -481 606 -294 214 -254 -479 626 103 -36 -367 -173 74 144 -239 281 69 -189 103 -151 -28 250
4272B50k08k56j64L24P6K37r0q5j22n2K10r7N0j25Mnl9K19k80M92j41l46J20K99
$$ 250 42 -214 -378 -54 22 259 169 84 -38 -90 120 23 73 -52 -48 -53 -92 127 -153 339 198 -148 -28 271
4296B71m39L11l9l86K70J41k40K21J4j27l31L19P14o87j77L93j89K52J62n20k13
$$ 271 -168 143 104 -282 -12 129 -111 110 124 -3 -334 -15 699 12 -165 228 39 291 453 -67 -280
4317b80O55k64K92m81J35L3j56N58m94l86N36jR5j10o9j13K35j16L98l97l20O13
$$ -280 375 111 403 -78 57 90 -66 492 -2 -388 148 147 242 132 63 -50 185 69 467 70 -250 363
4339C63k18j47J24l27j40O07J63k76m99K40L02j33L40m10m30N19L65j55l56R4
$$ 363 145 -2 122 -205 -345 262 425 149 -350 -110 192 59 399 -11 -441 78 443 288 -68 26
4359B6o43L02M27J67m15l20L01k44K84O40q37m91P04N6j3k32j33M1J87J39n1o15
$$ 26 -617 -315 112 279 -136 -456 -155 -399 -115 525 -312 -803 -99 -43 -56 -288 -421 -380 -193 -54 -105 -720
4381g20N11K66m09K37J89m57J92L01k05p2l55P57J87n25J5n0k36P22J77l29n68
$$ -720 -209 57 -352 -115 74 -383 -191 110 -95 -167 -522 235 422 -103 -88 -138 -374 348 525 196 -372
4402c72O7L69M44l10o7r05Q79Q22n71l64M6k18L80O94p6j111j45Q60L72m45Q1
$$ -372 -305 64 508 198 131 -774 105 927 356 -8 38 -180 200 894 818 -293 -438 422 794 349 430
4423D30n02n76Q86M76n45j76R0k44L99R5j99m98L89N07k17o97L68L5J48L08k93
$$ 430 -72 -648 238 714 169 -7 83 -161 238 333 134 -364 25 532 315 -382 -14 21 169 477 184
4444A84p00M54N21k01l78J18k81K89K2M84j123m17Q74K80J11k19n31r5O86K28
$$ 184 -516 -62 459 258 -120 -2 -283 6 28 512 -611 -1028 -154 126 237 18 -513 -608 78 306
4464C06q6q19J08J8M45M95n27m69N8O35K04j81m18l9O3L34L17m16l87J95M63k24
$$ 306 220 -599 -491 -473 -28 467 -60 -529 -471 164 368 187 -231 -270 -207 127 444 28 -359 -164 299 75
4486G5jp3j95M16k2o0k76Q7R7n4K65k34j32Q9O00k61k32k72K24n7K24J98p44O7
$$ 75 74 1 -194 222 200 140 -136 -49 48 -6 259 25 -107 -18 582 321 89 -183 41 -16 208 406 -338 -271
4510b71M92M07m05k02j1k71M82M52l27j022K76P02j70N8k08m48K45N82k88k27
$$ -271 221 628 223 21 10 -261 221 673 346 -676 -400 302 132 190 -18 -466 -221 361 73 -154
4530a54k30N19l37K86J94n68J25J00K36j46n3j72J16K39l9l42O3O9M95k81Jk29
$$ -154 -384 135 -202 84 278 -290 -165 -65 171 25 -28 -200 -84 155 116 -226 -163 -94 401 120 121 -108
4552a08j46K83L57j00m22n21P38L49l22Lk03l12L43O69k63n58J27M0r3J38J89
$$ -108 -254 29 386 286 -136 -657 81 430 108 111 -92 -404 -61 608 345 -213 -86 -46 -139 -1 188
4573A88m11j02N72k10o5o8K10n61O08M59n31l78M90J11p45O43j75k88M72ql57
$$ 188 -223 -325 247 37 -28 -96 114 -447 161 620 89 -289 201 312 -433 210 35 -253 219 211 -146
4594a46j08M21j24j41K00l7l93L86L62k18l17K07j36K6K08K7m70pN25q4p0j46
$$ -146 -254 167 43 -98 102 65 -328 58 420 202 -115 92 -44 -18 190 217 -253 -260 265 181 111 -35
4616c5r7o8N81j79m15K03j76J39J4J64j57Q8m19K82L08J78m24L1j54J68K23k36
$$ -35 -132 -200 381 202 -213 -10 -186 -47 -33 131 -26 62 -357 -75 233 411 -13 18 -136 32 255 19
4638A9k41K92J8nq1J93k06Q6M6K36k76O2q3l91L25K64k61l39N76k72k15L21r3
$$ 19 -222 70 88 83 2 195 -11 75 121 357 81 143 60 -331 -6 258 -3 -342 234 -38 -253 68 -25
4661b5j38L23k8m77P0L77n77J82L49j91j84L72p8j92M46k28j96J46J95j70p8m1
$$ -25 -163 160 132 -345 -275 102 -475 -293 56 -135 -319 53 -25 -217 229 1 -195 -49 146 -24 -102 -143
4683a43K82o94N01J41m83K32J58l8k12L01k93J34j30M25l46K61j51p2k5J52j92
$$ -143 139 -555 -54 87 -396 -164 -6 -44 -256 45 -248 -114 -244 181 -165 96 -55 -127 -152 0 -192
4704a92P1K77l17J36RM05j50l21J47m0o0P1P8r3R4k00L12q7j07K79m57L9L71J1
$$ -192 -121 156 -161 -25 -16 389 239 -82 65 25 -35 36 114 21 115 -85 227 140 33 312 -145 -106 265 276
4728B76k53M44j50k48q2K60jl97J0J72l82M82L11p93M05j28J14q8K19k39m5o2
$$ 276 23 467 317 69 -13 247 246 -151 -141 31 -351 131 442 -351 54 -74 40 -48 171 -68 -113 -175
4750a75M67k44k17j00J69k13Q05o00l67M72m1l08L68n8k06j38K14K30m31L47L17
$$ -175 292 48 -169 -269 -100 -313 492 -108 -475 -3 -44 -352 16 -42 -248 -386 -172 58 -373 -26 291
4771B91p11N74o2n69O77j01mk06o1O97o51p1O99p60m37Q31j80l6K91j57o2kj67
$$ 291 -420 154 92 -477 200 99 95 -111 -172 525 -126 -197 502 -258 -695 136 -44 -80 211 54 -8 -10 -177
4794a77N37n75K27M19o48M44L5l56K26q4m4R2J7P8k09k36N13K6m06K19k08J83
$$ -177 360 -215 12 431 -217 227 262 -94 132 48 4 96 113 191 -18 -254 259 285 -121 98 -110 73
4816G3J57o5l97j62R3O79n84K38J32l75J14N88p66M1K76J9k6k59M09j71k34O04
$$ 73 230 165 -232 -394 -301 378 -206 32 164 -211 -97 491 -275 -234 42 61 35 -224 185 14 -220 384
4838C84l20o68P18o9p8K92k80j74j69L40M15o02k15O76m13M53J57p93L9N11J2
$$ 384 64 -604 114 45 -33 259 -21 -195 -364 -24 391 -211 -426 250 -163 290 447 -346 -307 204 216
4859B16J9k20r9q2N4N52j35m48J73L4K1K41k12nl10J97L68n38j31N52l28r3P00
$$ 216 235 15 -84 -166 -112 440 305 -143 30 64 85 326 114 109 -201 -4 364 -174 -305 247 -81 -174 526
$$ [...]
8191I0
##END NTUPLES=NMR FID
##END=
