##TITLE=1H_LR-725-RM1-C1
 CDCl3, 8 sc, 
 22.10.2020
##JCAMPDX= 6.0         $$ Bruker NMR JCAMP-DX V2.0
##DATA TYPE= NMR FID
##DATA CLASS= NTUPLES
##ORIGIN= UXNMR, Bruker Analytische Messtechnik GmbH
##OWNER= root
$$ XWIN-NMR		Version 3.5
$$ Thu Oct 22 10:44:36 2020 Russian Standard Time (UT+4h)  she@DPX200
##.OBSERVE FREQUENCY= 200.1315066352
##.OBSERVE NUCLEUS= ^1H
##.DELAY= (6, 6)
##.ACQUISITION MODE= SIMULTANEOUS
##.ACQUISITION SCHEME= undefined
##.AVERAGES= 8
##.DIGITISER RES= 18
##SPECTROMETER/DATA SYSTEM= spect
##.PULSE SEQUENCE= zg30
##.SOLVENT NAME= CDCl3
##.SHIFT REFERENCE= (INTERNAL, CDCl3, 0, 15.7039)
##AUDIT TRAIL= $$ (NUMBER, WHEN, WHO, WHERE, WHAT)
$$ ##TITLE= Audit trail, XWIN-NMR		Version 3.5
$$ ##JCAMPDX= 5.01
$$ ##ORIGIN= Bruker BioSpin GmbH
$$ ##OWNER= she
$$ F:/spectra/data/she/nmr/H-F/1/audita.txt
$$ ##AUDIT TRAIL=  $$ (NUMBER, WHEN, WHO, WHERE, WHAT)
(   1,<2020-10-22 10:43:21.89 +0400>,<she>,<DPX200>,
      <created by zg, POWCHK disabled, PULCHK disabled
       configuration hash MD5:
       00 E9 B6 7A A2 85 ED C7 34 08 36 98 17 FE 4E 26
       data hash MD5: 16K
       03 81 32 7A 64 2E 74 57 0A A3 18 03 E4 63 FC 8C>)
$$ ##END=
$$ 
$$ hash MD5
$$ 09 EF AD 55 9C D2 4A 84 35 9A 92 E4 D7 71 8B 4C
##$RELAX= 
##$RELAX= 
##$RELAX= 
##$RELAX= 
##$RELAX= 
##$RELAX= 
$$ Bruker specific parameters
$$ --------------------------
##$DU= <F:/spectra>
##$EXPNO= 1
##$NAME= <H-F>
##$PROCNO= 1
##$TYPE= <nmr>
##$USER= <she>
##$AMP= (0..31)
100 100 100 100 100 100 100 100 100 100 100 100 100 100 100 100 100 100 
100 100 100 100 100 100 100 100 100 100 100 100 100 100 
##$AQSEQ= 0
##$AQ_mod= 1
##$AUNM= <au_zg>
##$AUTOPOS= <>
##$BF1= 200.13
##$BF2= 200.13
##$BF3= 200.13
##$BF4= 200.13
##$BF5= 200.13
##$BF6= 200.13
##$BF7= 200.13
##$BF8= 200.13
##$BYTORDA= 1
##$CFDGTYP= 0
##$CFRGTYP= 5
##$CHEMSTR= <none>
##$CNST= (0..31)
1 1 145 1 1 1 1 1 1 1 1 1 1 1 1 1 1 1 1 1 1 1 1 1 1 1 1 1 1 1 1 1 
##$CPDPRG= <>
##$CPDPRG1= <>
##$CPDPRG2= <>
##$CPDPRG3= <>
##$CPDPRG4= <mlev>
##$CPDPRG5= <mlev>
##$CPDPRG6= <mlev>
##$CPDPRG7= <mlev>
##$CPDPRG8= <mlev>
##$CPDPRGB= <>
##$CPDPRGT= <>
##$D= (0..31)
0 1.2 0 0 0 0 0 0 0 0.06 0 0.03 0 0 0 0 0.0002 0 0 0 0 0 0 0 0 0 0 0 0 
0 0 0 
##$DATE= 1603349001
##$DBL= (0..7)
120 120 120 120 120 120 120 120 
##$DBP= (0..7)
150 150 150 150 150 150 150 150 
##$DBP07= 0
##$DBPNAM0= <>
##$DBPNAM1= <>
##$DBPNAM2= <>
##$DBPNAM3= <>
##$DBPNAM4= <>
##$DBPNAM5= <>
##$DBPNAM6= <>
##$DBPNAM7= <>
##$DBPOAL= (0..7)
0.5 0.5 0.5 0.5 0.5 0.5 0.5 0.5 
##$DBPOFFS= (0..7)
0 0 0 0 0 0 0 0 
##$DE= 6
##$DECBNUC= <off>
##$DECIM= 32
##$DECNUC= <off>
##$DECSTAT= 4
##$DIGMOD= 1
##$DIGTYP= 9
##$DL= (0..7)
0 120 120 120 120 120 120 120 
##$DP= (0..7)
150 150 150 150 150 150 150 150 
##$DP07= 0
##$DPNAME0= <>
##$DPNAME1= <>
##$DPNAME2= <>
##$DPNAME3= <>
##$DPNAME4= <>
##$DPNAME5= <>
##$DPNAME6= <>
##$DPNAME7= <>
##$DPOAL= (0..7)
0.5 0.5 0.5 0.5 0.5 0.5 0.5 0.5 
##$DPOFFS= (0..7)
0 0 0 0 0 0 0 0 
##$DQDMODE= 0
##$DR= 18
##$DS= 0
$$ [...]
##$SUBNAM2= <"">
##$SUBNAM3= <"">
##$SUBNAM4= <"">
##$SUBNAM5= <"">
##$SUBNAM6= <"">
##$SUBNAM7= <"">
##$SUBNAM8= <"">
##$SUBNAM9= <"">
##$SW= 16.880792210976
##$SWIBOX= (0..15)
0 0 2 0 0 0 0 0 0 0 0 0 0 0 0 0 
##$SW_h= 3378.37837837838
##$TD= 16384
##$TD0= 1
##$TE= 0
##$TE2= 300
##$TE3= 300
##$TEG= 300
##$TL= (0..7)
0 120 120 120 120 120 120 120 
##$TP= (0..7)
150 150 150 150 150 150 150 150 
##$TP07= 0
##$TPNAME0= <>
##$TPNAME1= <>
##$TPNAME2= <>
##$TPNAME3= <>
##$TPNAME4= <>
##$TPNAME5= <>
##$TPNAME6= <>
##$TPNAME7= <>
##$TPOAL= (0..7)
0.5 0.5 0.5 0.5 0.5 0.5 0.5 0.5 
##$TPOFFS= (0..7)
0 0 0 0 0 0 0 0 
##$TUNHIN= 0
##$TUNHOUT= 0
##$TUNXOUT= 0
##$USERA1= <user>
##$USERA2= <user>
##$USERA3= <user>
##$USERA4= <user>
##$USERA5= <user>
##$V9= 5
##$VALIST= <valist>
##$VCLIST= <CCCCCCCCCCCCCCC>
##$VD= 0
##$VDLIST= <DDDDDDDDDDDDDDD>
##$VPLIST= <PPPPPPPPPPPPPPP>
##$VTLIST= <TTTTTTTTTTTTTTT>
##$WBST= 1024
##$WBSW= 4
##$XGAIN= (0..3)
0 0 0 0 
##$XL= 0
##$YL= 0
##$YMAX_a= 781248
##$YMIN_a= -710026
##$ZGOPTNS= <>
##$ZL1= 120
##$ZL2= 120
##$ZL3= 120
##$ZL4= 120
##$ABSF1= 10
##$ABSF2= 0
##$ABSG= 5
##$ABSL= 3
##$ALPHA= 0
##$AQORDER= 0
##$ASSFAC= 0
##$ASSFACI= 0
##$ASSFACX= 0
##$ASSWID= 0
##$AUNMP= <proc_1d>
##$AZFE= 0.1
##$AZFW= 0.1
##$BCFW= 1
##$BC_mod= 2
##$BYTORDP= 1
##$COROFFS= 0
##$CY= 11.3945322036743
##$DATMOD= 1
##$DC= 2
##$DFILT= <>
##$DTYPP= 0
##$F1P= 16.9975609425685
##$F2P= -3.02152046262296
##$FCOR= 0.5
##$FTSIZE= 0
##$FT_mod= 4
##$GAMMA= 1
##$GB= 0.15
##$INTBC= 1
##$INTSCL= 1
##$ISEN= 128
##$LB= 0.24
##$LEV0= 0
##$LPBIN= 0
##$MAXI= 10000
##$MC2= 0
##$MEAN= 0
##$ME_mod= 0
##$MI= 1.114404
##$NCOEF= 0
##$NC_proc= 0
##$NLEV= 6
##$NOISF1= 3.799351
##$NOISF2= 2.8
##$NSP= 1
##$NTH_PI= 0
##$NZP= 0
##$OFFSET= 15.70392
##$PC= 1
##$PHC0= -10692.54
##$PHC1= 17.00089
##$PH_mod= 1
##$PKNL= yes
##$PPARMOD= 0
##$PSCAL= 0
##$PSIGN= 0
##$REVERSE= no
##$SF= 200.130013532006
##$SI= 16384
##$SIGF1= 3
##$SIGF2= 2
##$SINO= 400
##$SIOLD= 16384
##$SREGLST= <1H.CDCl3>
##$SSB= 0
##$STSI= 0
##$STSR= 0
##$SW_p= 3612.71676300578
##$SYMM= 0
##$S_DEV= 0
##$TDeff= 0
##$TDoff= 0
##$TI= <>
##$TILT= no
##$TM1= 0
##$TM2= 0
##$TOPLEV= 0
##$USERP1= <user>
##$USERP2= <user>
##$USERP3= <user>
##$USERP4= <user>
##$USERP5= <user>
##$WDW= 1
##$XDIM= 8192
##$YMAX_p= 0
##$YMIN_p= 0
$$ End of Bruker specific parameters
$$ ---------------------------------
##NTUPLES= NMR FID
##VAR_NAME=  TIME,          FID/REAL,        FID/IMAG
##SYMBOL=    X,             R,               I
##VAR_TYPE=  INDEPENDENT,   DEPENDENT,       DEPENDENT
##VAR_FORM=  AFFN,          ASDF,            ASDF
##VAR_DIM=   8192,          8192,            8192
##UNITS=     SECONDS,       ARBITRARY UNITS, ARBITRARY UNITS
##FACTOR=    0.000296,      1,               1
##FIRST=     0,             0,               0
##LAST=      2.424536,      0,               0
##MIN=       0,             -710026,         0
##MAX=       2.424536,      781248,          0
$$ Real data points
##PAGE= N=1
##DATA TABLE= (X++(R..R)), XYDATA
$$ [...]
$$ plain form
3039 -1182 2993 -1970 1804 -578 -1580 3727 -3157 -1157 4378 -1554 -1131 -162 382 4118 -2834 -2687
3055 -2687 3279 32 333 -848 -1563 3581 -1134 -2735 3381 -305 -1289 312 -554 2675 -730 -3207
3071 -3207 2575 1128 -1162 -1243 -1026 3045 -268 -2948 1812 996 -732 -51 -1333 1652 668 -3229
3087 -3229 1021 2440 -1276 -1200 -574 1660 597 -2851 336 1972 -9 -947 -1014 1807 1177 -2694 102
3104 102 2131 -645 -1275 -381 1161 918 -2047 -990 2080 695 -1597 -589 1923 1531 -1680 -810
3120 -810 1946 596 -1216 -515 1003 1514 -1069 -1425 1971 1095 -1562 -901 1310 1298 -683 -1161 1152
3137 1152 1151 -939 -1295 563 1890 -1031 -1733 1434 1497 -1364 -1362 767 1250 -315 -1653 417 1820 -735
3155 -735 -1766 317 1740 -1005 -2128 776 1481 -760 -1293 -115 1590 193 -2499 -336 2098 -589
$$ packed form
3039a182M175m963L774k382j002N307o884K000N535n932M23R69N44L736o952J47
3055b687N966l247L01j181p15N144m715j601O116l686r84J601q66L229l405k477
3071c207N782j447k290q1K17M071l313k680M760q16j728O81j282K985r84l897
3087c229M250J419l716P6O26K234j063l448L187J636j981r38o7K821o30l871K796
3104A02K029k776o30Q94J542k43k965J057L070j385k292J008K512l92l211Q70
3120h10K756j350j812P01J518N11k583l56L396q76k657O61K211j2j981m78K313
3137A152jk090l56J858J327k921p02L167O3k861KK129M83j565j338K070J403k555
3155g35j031K083J423k745j123K904P05k241n33J178J705j397k692K163K434k687
$$ plain form
3171 -589 -1569 -19 1842 478 -2175 198 1425 -245 -1145 -781 1503 1232 -2505 -309 2422 -393
3187 -393 -1314 -365 791 1243 -1534 -558 2017 -40 -831 -656 1244 1933 -2613 -358 2938 -261 -789
3204 -789 -644 169 2536 -1616 -2075 2429 397 -680 -279 -93 2059 -1669 -1337 2877 -451 -1098 -140
3221 -140 -378 3131 -1113 -3836 2737 615 -1071 268 -1802 2134 440 -2814 2150 -222 -1757
3236 -1757 888 -1072 2316 -553 -4573 3260 1097 -2538 682 -2427 2232 2668 -4610 1215 1547
3251 1547 -1880 2430 -1473 160 1731 -4175 2914 2331 -3581 801 -1292 1389 4127 -5881 -183
3266 -183 4368 -2201 1808 -1456 -1907 4812 -2457 -55 3363 -4317 1543 1406 -748 3708 -5223 -1402
3282 -1402 6689 -2404 58 -638 -3237 6735 -1453 -3953 3943 -2971 1050 3187 -3883 2429 -1994
$$ packed form
3171e89r80J550J861j364k653K373J227j670r00L64K284k71l737K196K731k815
3187c93r21R49J156M52k777R76K575k057p91J75J900O89m546K255L296l199n28
3204g89J45Q13K367m152m59M504k032j077M01J86K152l728L32M214l328o47R58
3221a40k38L509m244k723O573k122j686J339k070L936j694l254M964k372j535
3236a757K645j960L388k869m020P833k163l635L220l109M659M36p278N825L32
3251A547l427M310l903J633J571n906P089n83n912M382k093K681K738j0008N698
3266a83M551o569M009l264m51O719p269K402L418p680N860j37k154M456q931L821
3282a402Q091r093K462o96k599R972q188k500P896o914M021K137p070O312m423
$$ plain form
3297 -1994 -2362 7112 -3231 -2727 1613 -2555 6190 -737 -7774 5138 21 -772 2904 -6175 1931
3312 1931 2878 -3814 4806 -2242 -4651 4610 -1791 2623 258 -8296 5709 3239 -4148 1864 -5302
3327 -5302 1560 6609 -6449 1162 1036 -3687 6149 -1284 -2237 2582 -6117 4713 4692 -7029 1368
3342 1368 -1378 1268 7134 -7931 -2113 5536 -2673 4289 -1540 -5436 5779 -2413 735 4403
3356 4403 -7717 1437 3024 -1385 4905 -7175 -2799 9076 -2690 128 -1048 -5111 8398 149
3370 149 -5103 3839 -5131 1214 4862 -4976 2009 -2546 -2911 9161 -3169 -4349 1603 -3564 7286
3385 7286 678 -9177 4406 164 -196 4419 -7217 916 3033 -3950 5881 -2456 -5664 5329
3399 5329 -1422 2745 763 -9623 5546 4114 -3671 2418 -5628 731 7102 -5761 1046 714
$$ packed form
3297a994l68R474j0343N04M340m168Q745o927p037J2912n117p93L676r079Q106
3312A931R47o692Q620p048k409R261o401M414k365q554J4005k470p387O012p166
3327e302O862N049j3058P611j26m723R836p433r53M819q699J0830k1j1721Q397
3342A368k746K646N866j5065N818P649q209O962n829l896J1215q192L148L668
3356D403j2120R154J587m409O290j2080M376J1875j1766K818j176m063J3509q249
3370A49n252Q942q970O345L648r838O985m555l65J2072j2330j180N952n167J0850
3385G286o608r855J3583m242l60M615j1636Q133K117o983R831q337l208J0993
3399E329o751M167j982j0386J5169j432p785O089q046O359O371j2863O807l32
$$ plain form
3413 714 -4376 6359 -499 -1814 2561 -6164 4116 5354 -6482 1302 -1627 505 7374 -6834
3427 -6834 -2266 4918 -3066 3948 -394 -5014 5049 -2437 364 4815 -6443 329 2252 -1755
3441 -1755 4976 -5311 -3272 7401 -2324 -318 464 -4784 5972 199 -4128 4146 -3458 -135
3455 -135 3942 -3310 1835 -1896 -3514 6877 -1851 -3093 1381 -2905 4721 750 -6822 3564 567
3470 567 -1396 3154 -3982 825 1805 -3854 3738 -340 -3576 2491 -1149 1928 1351 -5726 3230 2483
3486 2483 -3014 1622 -2437 576 4168 -3752 730 1949 -2997 1985 -112 -310 1740 -3620 1542
3501 1542 3485 -3206 136 -490 98 3459 -3562 -784 3630 -2017 485 181 -1386 2492 -1338 -586
3517 -586 2811 -1871 -631 528 -91 1978 -2681 -1526 3520 -712 -824 431 -1101 2182 -706 -2153
$$ packed form
3413G14n090J0735o858j315M375q725J0280J238j1836P784k929K132O869j4208
3427f834M568P184p984P014m342m620J0063p486K801M451j1258O772J923m007
3441a755O731j0287K039J0673r725K006P82n248J0756n773m327Q274p604L323
3455a35M077p252N145l731j618J0391q728j242M474m286P626l971p572J0386k997
3470E67j963M550p136M807R80n659P592m078l236O067l640L077n77p077Q956p47
3486B483n497M636m059L013L592p920M482J219m946M982k097j98K050n360N162
3501A542J943o691L342o26N88L361p021K778M414n647K502l04j567L878l830P52
3517e86L397m682J240J159o19K069m659J155N046m232j12J255j532L283k888j447
$$ plain form
3533 -2153 2421 -396 -933 650 -581 1053 -1311 -1807 2211 -14 -1281 205 -620 1793 -290 -2866
3549 -2866 1809 855 -1363 89 -222 722 330 -1664 1075 719 -1275 -325 128 1243 -73 -1811 1101
3566 1101 1490 -1050 -274 -138 819 573 -1578 -41 1956 -375 -723 321 828 499 -1350 96 1399
3583 1399 -434 -593 91 1109 830 -1566 -338 1748 76 -1056 37 628 489 -924 -557 1081
3599 1081 -15 -825 -370 1040 686 -1324 -641 1311 -77 -1326 -146 835 478 -757 -1193 1173 615
3616 615 -1413 -649 744 798 -929 -1007 960 515 -809 -565 318 1042 -561 -1283 1063 987 -1009 -664
3634 -664 683 727 -490 -938 604 1137 -450 -616 83 1282 19 -1187 846 1351 -1008 -539 609
3651 609 977 353 -1540 130 1649 -576 -542 369 994 501 -1444 248 1311 -708 -3 174 331 886
$$ packed form
3533b153M574k817n37J583j231J634k364m96M018k225j267J486q25K413k083k576
3549b866M675r54k218J452l11R44l92j994K739l56j994R50M53J115j316j738K912
3566A101L89k540P76J36R57k46k151J537J997k331l48J044N07l29j849J446J303
3583A399j833j59O84J018k79k396J228K086j672j132J093N91j39j413L67J638
3599A081j096q10M55J410l54k010O83J952j388j249J180R81l57j235m36K366n58
3616F15k028P64J393N4j727p8J967m45j324K44Q83P24j603p22K346p6j996L45
3634f64J347M4j217m48J542N33j587j66O99J199j263j206K033N05k359M69J148
3651F09L68o24j893J670J519k225L4R11O25m93j945J692J063k019P05J77J57N55
$$ plain form
3669 886 -1907 -313 2026 -889 -1348 -12 511 1056 -1343 -846 1729 -322 -621 -286 -144 1430 -1162
3686 -1162 -853 2154 -1160 -1029 646 -338 1350 -854 -1873 2422 343 -1234 -149 -734 1533 -501
3702 -501 -1754 1969 -480 -1044 1190 -953 1062 50 -2911 3053 855 -2354 742 -462 1368
3717 1368 864 -3097 1235 848 -1079 1574 -1287 235 1460 -2665 2108 1261 -3259 1358 -21 352
3733 352 2116 -3548 647 3111 -1939 461 -960 -686 2978 -2287 336 1938 -3325 1918 652
3748 652 -1329 2089 -3508 -381 4698 -2921 -880 210 -1426 3777 -2002 -2601 2950 -1925 976
3763 976 1395 -3185 2125 -1325 -1251 4745 -3232 -2064 2558 -1369 3390 -1342 -4578 4270 -190 -1168
3779 -1168 1276 -3391 2521 1913 -2828 3162 -2178 -2326 4004 -1671 1294 45 -4516 5243 1454
$$ packed form
3669H86k793J594K339k915m59J336N23N45k399M97K575k051k99L35J42J574k592
3686a162L09L007l314J31J675r84J688k204j019M295k079j577J085n85K267k034
3702e01j253L723k449n64K234k143K015j012k961N964k198l209L096j204J830
3717A368n04l961M332l87j927K653k861J522J225m125M773q47m520M617j379L73
3733C52J764n664M195K464n050K400j421K74L664n265K623J602n263N243j266
3748F52j981L418n597L127N079p619K041J090j636N203n779n99N551m875K901
3763I76M19m580N310l450P4N996p977J168M622l927M759m732l236Q848m460r78
3779a168K444m667N912o08m741N990n340j48O330n675K965j249m561R759l789
$$ plain form
3794 1454 -3801 1429 -2392 2262 3653 -4949 1276 539 -2123 4256 -2165 -1429 2177 -3415 4161
3809 4161 1969 -5547 1938 266 826 3502 -5937 267 4278 -2328 2591 -2015 -2453 4732 -1851
3824 -1851 718 2298 -5318 2574 2133 -1921 2277 -4588 -477 6517 -3298 -778 -550 -2435 5488
3839 5488 -1665 -3484 2877 -2885 1939 2744 -4283 1995 -1344 -1335 5969 -4085 -2596 2645 -1704 4358
3855 4358 -1308 -5611 4519 -126 -404 2150 -4770 2041 2108 -2821 4141 -2705 -2920 5033 -1509 1356
3871 1356 119 -5539 5261 1967 -3521 1827 -3078 1761 4236 -4775 1510 398 -2366 5030 -1888
3886 -1888 -1444 2046 -3823 3709 2600 -5690 1639 44 367 3773 -5514 -492 3999 -2370 2597
3901 2597 -1502 -2930 4122 -2353 222 2418 -5271 1733 1687 -1878 3023 -4077 -1059 5544 -2801
$$ packed form
3794A454n255N230l821M654J391q602O225p37k662O379o421P36L606n592P576
3809D161k192p516P485j672N60K676r439O204M011o606M919m606m38P185o583
3824a851K569J580p616P892m41m054M198o865M111O994r815K520K28j885P923
3839E488p153j819O361n762M824Q05p027O278l339RP304j0054J489N241m349O062
3855D358n666m303J0130m645k78K554o920O811O7m929O962o846k15P953o542K865
3871A356j237n658J0800l294n488N348m905M839K475r011O285j112k764P396o918
3886a888M44L490n869P532j109q290P329j595L23L406r287N022M491o369M967
3901B597m099j428P052o475K575K196p689P004m6l565M901p100L018O603q345
$$ plain form
3916 -2801 -831 397 -2624 4285 -1150 -2890 2981 -2908 719 2642 -3183 1950 -1242 -1911 4946
3931 4946 -2374 -2467 2074 -1557 2850 -239 -4195 3251 91 -1213 2110 -2663 1333 1369 -2272 3064
3947 3064 -1075 -2466 3199 -627 781 708 -3809 2687 1896 -2626 1210 -1120 675 2403 -2862 893
3963 893 858 -2067 2091 -564 -807 1497 -2650 1605 2143 -3239 548 463 -72 2253 -2461 -380 2369
3980 2369 -1267 223 -201 -1106 1672 -1418 286 1925 -2120 -41 728 -582 1317 -1640 -792 2697
3996 2697 -884 -1041 611 -507 1287 -650 -1128 1807 -651 -548 680 -648 827 -1005 -919 2213
4012 2213 -380 -1167 747 39 888 -75 -1644 1430 540 -936 418 -57 483 -132 -907 1395 173
4029 173 -1189 454 137 508 -149 -1318 1050 937 -1334 104 372 449 417 -1053 521 1135 -634 -351
$$ packed form
3916b801J970J228l021O909n435j740N871n889L627J923n825N133l192o69O857
3931D946p320r3M541l631M407l089l956P446l160j304L323m773L996L6l641N336
3947C064m139j391N665l826J408p3m517O496p91m522L836k330J795J728n265L755
3963H93l5k925M158k655k43K304m147M255N38n382L787q5n35K325m714K081K749
3980B369l636J490m24r05K778l090J704J639m045K079P69j310J899k957Q48L489
3996B697l581j57J652j118J794j937m78K935k458J03J228j328J475j832Q6L132
4012B213k593p87J914p08Q49r63j569L074q90j476J354m75N40o15p75K302j222
4029A73j362J643l17L71o57j169K368j13k271J438K68P7l2j470J574O14j769K83
$$ plain form
4047 -351 62 457 54 -1074 498 1080 -910 -266 121 171 280 -874 -132 1112 -583 -902 45 118 176
4066 176 -1233 -109 644 -378 -790 262 257 45 -839 -547 1209 0 -1173 213 542 -35 -712 -726
4084 -726 791 226 -776 111 681 492 -564 -564 914 282 -760 -106 519 424 -548 -670 808 645 -720
4103 -720 -265 668 559 -269 -522 1024 685 -907 -74 402 620 182 -844 718 627 -726 -369 459 357
4122 357 -208 -746 448 903 -535 -375 354 271 310 -1187 153 969 -952 -244 404 124 274 -906 -85
4141 -85 1081 -815 -541 496 243 418 -969 -330 1061 -734 -407 166 -587 739 -737 -648 1376 -755
4159 -755 -990 494 -103 336 -1240 -465 1752 -393 -597 356 -311 1422 -124 -1374 1860 -253 -929
4176 -929 1264 -387 485 75 -1382 2132 332 -1461 656 -57 932 157 -2105 1532 607 -932 1404
$$ packed form
4047c51M13L95m03j128J572N82j990O44L87N0J09j154P42J244j695l19R47P3N8
4066A76j409J124P53j022m12J052nk12q84K92J756j209j173J386L29n77o77j4
4084g26J517n65j002Q87N70j89j056%J478o32j042O54O25r5r72j22J478j63j365
4103g20M55R33j09q28k53J546l39j592Q33M76K18m38j026J562r1j353L57Q28j02
4122C57n65n38J194M55j438J60P29q3L9j497J340Q16j921P08O48k80J50j180Q21
4141h5J166j896K74J037k53J75j387O39J391j795L27N73p53J326j476Q9K024k131
4159g55k35J484n97M39j576P75K217k145k04R53o67J733j546j250L234k113o76
4176i29K193j651Q72m10j457L514j800j793K117p13R89p75k262L637r25j539K336
$$ plain form
4193 1404 -897 6 1205 -1819 1302 864 -2431 1323 256 20 607 -2554 1061 1618 -1858 645
4209 645 -858 -162 2293 -2214 -69 1382 -2630 1369 602 -1540 1386 -2042 383 2719 -2256 -59
4225 -59 307 -440 2272 -2375 -1343 2507 -1926 913 691 -2596 1956 -772 -569 2950 -2654 -739
4241 -739 2189 -1136 1778 -1447 -2267 3626 -453 -463 1069 -2791 2570 888 -2528 2597 -1772 -966
4257 -966 3600 -1690 168 -47 -2416 3974 -169 -2907 1310 -1381 2042 1484 -3962 1877 438 -1194
4273 -1194 2960 -2494 -939 2502 -2406 2506 267 -4169 2536 316 230 1400 -4624 1264 3100
4288 3100 -2544 1259 -1803 -1378 4015 -2700 -16 1323 -3902 2989 1283 -2390 1695 -3008 624
4303 624 4401 -3675 -213 379 -1059 4029 -2546 -2134 2914 -2198 1984 1482 -3780 2059 -203 -577
$$ packed form
4193A404k301R03J199l024L121m38l295L754j067k36N87l161L615N57l476K503
4209F45j503O96K455m507K145J451m012L999p67k142K926l428K425K336m975K197
4225e9L66p47K712m647J032L850m433K839k22l287M552k728K03L519n604J915
4241g39K928l325K914l225q20N893m079j0J532l860N361j682l416N125m369Q06
4257i66M566n290J858k15k369O390m143k738M217k691L423n58n446N839j439j632
4273a194M154n454J555L441m908M912k239m436O705k220q6J170o024N888J836
4288C100n644L803l062M25N393o715K684J339n225O891j706l673M085m703L632
4303F24L777q076L462N92j438N088o575M12N048n112M182n02n262N839k262l74
$$ plain form
4319 -577 3873 -3852 -1272 2939 -1058 2603 -1807 -3120 4169 -641 -404 1397 -3635 2457 1743 -2643
4335 -2643 2879 -2344 -1515 4388 -1927 441 183 -3167 4596 566 -3063 1589 -1867 2042 2080 -4355
4351 -4355 1517 268 -1665 3817 -2232 -1632 1887 -2245 3037 852 -4876 2539 152 81 1664 -4379
4367 -4379 608 2612 -2337 1627 -1630 -1849 3048 -2178 250 1519 -3722 2505 1773 -1963 1491
4382 1491 -2617 -50 3677 -2934 -251 529 -1217 3472 -1850 -1939 2387 -2285 990 1900 -2722 1442
4398 1442 -211 -910 3435 -2037 -1260 2300 -642 1690 -891 -2263 2755 -378 -593 1101 -2353 1344
4414 1344 1051 -1806 2220 -979 -1429 2740 -686 104 202 -2076 2716 939 -1947 800 -755 605
4430 605 1197 -2385 977 492 -1505 1811 -758 -927 1178 -1607 1458 784 -2690 174 392 -235 425
$$ packed form
4319e77M450p725K580M211l997L661m410j313P289m810K37J801n032O092p14m386
4335b643N522n223Q29N903o315K368k58l350P763m030l629M652l456L909L8o435
4351d355N872j249j933N482o049O00L519m132N282k185n728P415k387p1J583o043
4367d379M987K004m949L964l257k19M897n226K428J269n241O227p32l736L454
4382A491m108K567L727o611K683P80j746M689n322q9M326m672L275R10m622M164
4398A442j653o99M345n472P77L560k942K332k581j372N018l133k15J694l454L697
4414A344k93k857M026l199m50M169l426P90R8k278M792j777k886K747j555J360
4430F05N92l582L362m85j997L316k569j69K105k785L065o74l474K864K18o27O60
$$ plain form
4447 425 -1994 505 1754 -1315 509 -320 -580 1450 -905 -141 738 -2007 481 1021 -588 609
4463 609 -1163 -168 1627 -761 -389 353 -95 1030 -753 -362 1379 -808 221 639 -999 577 -245
4480 -245 -419 1730 -681 -759 1010 -35 314 -485 -797 1162 -34 -486 363 -249 342 -30 -964 1032
4498 1032 -112 -1082 1011 31 195 -125 -668 745 480 -1008 -131 223 257 -202 -912 553 375 -709
4516 -709 370 41 -287 161 -749 348 555 -1056 49 310 103 -331 -423 311 525 -694 -150 399 105
4535 105 183 -451 169 998 -301 -358 628 71 -112 -223 -196 516 -195 -573 382 469 -141 -484 -18 614 -310
4556 -310 -504 419 140 -56 -269 -185 673 35 -1043 630 620 41 -116 -63 694 -239 -757 97 237 247 -479
4577 -479 -545 695 194 -753 98 296 85 -84 -511 344 319 -729 -82 263 72 -494 -733 863 126 -1005
$$ packed form
4447D25k419K499J249l069J824q29k60K030k355P64Q79k745K488N40j609J197
4463F09j772R95J795k388L72P42m48J125j783L91J741k187J029M18j638J576q22
4480b45j74K149k411p8J769j045L49p99l12J959j196m52Q49o12N91l72r34J996
4498A032j144r70K093r80J64l20n43J413k65j488Q77L54L4m59p10J465j78j084
4516g09J079l29l28M48r10J097K07j611J105K61k07m34r2P34K14j219N44N49k94
4535A05P8o34O20Q29j299n7R86n57j83j11K7P12p11l78R55Q7o10l43M66O32r24
4556c10j94R23k79j96k13Q4Q58o38j078J673j0n79j57N3P57r33n18Q54J40J0p26
4577d79o6J240n01r47Q51J98k11j69m27Q55k5j048O47L45j91n66k39J596p37j131
$$ plain form
4597 -1005 1 175 62 25 -711 88 587 -741 56 183 -132 139 -613 387 457 -650 5 570 402
4616 402 119 -924 124 1054 -765 -137 585 -119 326 -474 -196 1076 -951 -341 526 70 322 -683
4634 -683 -12 1327 -867 -516 536 -464 763 -316 -747 1294 -388 -365 547 -628 250 -395 -604
4651 -604 1628 -857 -688 995 -297 611 -101 -1585 1541 54 -1036 885 -690 185 575 -1109
4667 -1109 916 -74 -1297 1324 -233 -138 251 -1501 1780 591 -1819 861 -865 -99 1322 -1823
4683 -1823 557 765 -1602 1736 235 -1050 993 -1476 1135 1369 -2314 704 400 -446 1744 -1939
4699 -1939 79 2198 -1710 734 233 -1629 1857 -626 -373 1799 -2213 437 1417 -1309 1471 -1465
4715 -1465 -613 3144 -1682 -513 838 -1656 2207 -104 -2032 2189 -1355 56 2287 -1858 623
$$ packed form
4597a005J006J74j13l7p36P99M99j328P97J27l15K71p52J000P0j107O55N65j68
4616D02k83j043J048R30j819O28P22p04M45q00K78J272k027O10Q67m56K52j005
4634f83O71J339k194L51J052j000J227j079m31K041j682K3R12j175Q78o45k09
4651f04K232k485J69J683j292R08p12j484L126j487j090J921j575Q75L90j684
4667a109K025r90j223K621j557R5L89j752L281j189k410K680j726P66J421l145
4683a823K380K08k367L338j501j285K043k469K611K34l683L018l04q46K190l683
4699a939K018K119l908K444n01j862L486k483K53K172m012K650R80k726K780k936
4715a465Q52L757m826J169J351k494L863k311j928M221l544J411K231m145K481
$$ plain form
4730 623 -180 -992 3026 -1548 -1963 1701 -1331 1541 119 -3197 2356 2 -1242 2175 -2352 78
4746 78 1547 -1893 2022 -660 -2578 2699 -556 -13 657 -3237 2414 1469 -2532 1569 -1782 -157
4762 -157 3018 -2527 620 1167 -2317 2846 -112 -1660 1607 -2194 1708 1922 -3506 1163 450 -408
4778 -408 3017 -2466 -704 2645 -2020 1694 436 -2982 2278 -469 -40 2049 -3255 661 2174
4793 2174 -1498 1592 -1755 -1274 3727 -1824 -300 1036 -2449 2584 -34 -2304 2286 -1988 18
4808 18 2745 -2537 496 -194 -1659 3553 -1629 -1974 1929 -1638 1951 700 -3379 2250 83 -1383
4824 -1383 2474 -2424 -345 1961 -1983 2347 -689 -2556 2579 -649 -182 1086 -3264 2076 1417
4839 1417 -2248 1649 -1144 -647 2501 -1905 573 1068 -2391 2549 163 -1383 1366 -1981 1191
$$ packed form
4730F23q03q12M018m574m15L664l032K872j422l316N553k354j244L417m527K430
4746G8J469l440L915k682j918N277l255N43O70l894N651r45m001M101l351J625
4762a57L175n545L147N47l484N163k958j548L267l801L902K14n428M669p13q58
4778d08L425n483J762L349m665L714j258l418N260k747M29K089n304L916J513
4793B174l672L090l347M81N001n551J524J336l485N033k618k270M590m274K006
4808A8K727n282L033o90j465N212n182l45L903l567L589j251m079N629k167j466
4824a383L857m898K079K306l944M330l036j867N135l228M67J268m350N340o59
4839A417l665L897k793M97L148m406K478M95l459M940k386j546K749l347L172
$$ plain form
4854 1191 2093 -2904 883 508 -637 2444 -1970 -822 2294 -2111 912 802 -2228 1951 -259 -376
4870 -376 2184 -2682 99 1391 -1273 1397 -1071 -1238 2884 -1253 -296 1224 -1864 1483 261 -1579
4886 -1579 1474 -1243 -527 1868 -1251 30 111 -1282 2302 -515 -1343 1260 -910 843 608 -1930
4902 -1930 1304 246 -1046 1406 -901 -586 1052 -1153 1094 56 -1656 1289 190 -173 564 -1302
4918 -1302 1032 734 -1585 769 -533 -463 1341 -1018 209 1013 -1274 620 443 -432 664 -771
4934 -771 470 932 -1113 271 415 -256 871 -601 -184 1046 -902 65 453 -463 122 -87 -101 811
4952 811 -819 -237 627 -202 265 -852 -472 1050 -551 -535 344 -254 386 -4 -506 418 -339 -539 521
4971 521 -78 -200 -241 -106 342 -185 -392 203 159 -161 -404 -562 736 190 -665 483 158 -94 247 -334
$$ packed form
4854A191R02m997L787l75j145L081m414J148L116m405L023j10l030M179k210j17
4870c76K560m866K781J292k664K670k468j67M122m137R57J520l088L347j222j840
4886a579L053k717P16K395l119J281Q1j393L584k817q28K603k170J753k35k538
4902a930L234j058j292K452k307L15J638k205K247j038j712K945j099l63P37j866
4918a302K334k98k319K354j302P0J804k359J227Q04k287J894j77q75J096j435
4934g71J241M62k045J384J44o71J127j472M17J230j948R67L88r16N85k09j4R12
4952H11j630N82Q64q29M67j117L80J522j601J6Q79n98O40l90n02R24p57k00J060
4971E21n99j22m1J35M48n27k07N95m4l20k43j58J298n46q55J148l25k52L41n81
$$ plain form
4991 -334 320 97 -520 41 162 144 -42 -400 583 206 -726 229 529 -83 144 -141 141 533 -484 -362
5011 -362 501 -124 -54 76 300 418 -621 47 156 217 52 -242 25 704 -281 -320 538 145 -300 -308 -23
5032 -23 437 -78 -221 193 231 -240 -519 16 429 -335 -524 351 -117 225 11 -175 345 -50 -258 276 173
5053 173 140 -72 -15 319 -322 -396 171 336 79 -221 -413 468 300 -574 182 326 -91 45 -147 515 353
5074 353 -415 50 136 -170 299 -271 473 396 -712 211 409 -42 132 -277 153 763 -731 -179 486 -27
5094 -27 143 -567 -15 555 -460 336 449 -570 224 -413 100 813 -793 -355 666 -348 316 -89 -341
5113 -341 914 -542 -223 111 -803 128 -161 -337 738 -993 -549 840 -636 47 66 -1012 1232 -57
5131 -57 -867 757 -448 33 509 -681 789 -815 -666 1478 -544 -288 165 -1013 1361 504 -1173
$$ packed form
4991c34O54k23o17N61J21j8j86l58R83l77r32R55L00o12K27k85K82L92j017J22
5011c62Q63o25P0J30K24J18j039O68J09O1j65k94K67O79r85l9Q58l93m45qK85
5032b3M60n15j43M14L8m71k79N35M13p64j89Q75m68L42k14j86N20l95k08N34j03
5053A73l3k12N7L34o41p4N67J65k57l00j92Q81j68q74P56J44m17J36j92O62j62
5074C53p68M65Q6l06M69n70P44p7j108R23J98m51J74m09M30O10j494N52O65n13
5094b7J70p10N52N70j015P96J13j019P94o37N13P13j606M38J021j014O64m05k52
5113c41J255j456L19L34r14R31k89j76J075j731M44J389j476O83J9j078K244j289
5131e7q10J624j205M81M76j190J470j604J49K144k022K56M53j178K374q57j677
$$ plain form
5148 -1173 963 -260 -6 793 -1240 297 705 -1094 1425 -244 -691 1021 -1022 1019 629 -1714
5164 -1714 1068 495 -540 1080 -1358 149 1432 -1483 366 240 -869 1331 -667 -183 1093 -1825
5180 -1825 790 925 -1320 855 -1105 -355 2207 -1644 -489 833 -1067 1444 -368 -1466 1587
5195 1587 -1196 0 1470 -2042 533 204 -884 2114 -1745 -1057 2118 -1152 687 97 -2085 2169
5211 2169 -433 -1218 1498 -1869 244 1204 -1498 1058 -783 -1351 2715 -1026 -269 824 -1795 1992
5227 1992 969 -2304 1298 -650 103 2136 -2045 346 757 -1725 1972 -530 -1436 1607 -1257 1041
5243 1041 911 -2760 1474 657 -869 1773 -2137 -456 2260 -1749 936 -252 -1878 1898 -685
5258 -685 -369 1240 -2370 1137 1581 -1880 1420 -1202 -639 2635 -1837 -714 763 -1772 1741 -121
$$ packed form
5148a173K136j223K54P99k033J537M08j799K519j669m47J712k043K041l90k343
5164a714K782n73j035J620k438J507J283k915J849j26j109K200j998M84J276k918
5180a825K615J35k245K175j960P50K562l851J155J322j900K511j812j098L053
5195A587k783J196J470l512K575l29j088K998l859O88L175l270J839n90k182M254
5211B169k602p85K716l367K113R60k702K556j841n68M066l741P57J093k619L787
5227A992j023l273L602j948P53K033m181K391M11k482L697k502r06L043k864K298
5243A041j30l671M234q17j526K642l910J681K716m009K685j188j626L776k583
5258f85L16J609l610L507M44l461L300k622N63L274m472J123J477k535L513j862
$$ plain form
5274 -121 -1605 1695 -1523 141 1745 -2186 414 76 -940 2496 -1750 -1272 1967 -1279 949 233
5290 233 -2422 1726 256 -1093 1706 -1880 240 1375 -1448 1581 -815 -1593 2483 -759 -406 781
5306 781 -2332 1781 625 -1983 1262 -996 188 2131 -1907 594 720 -1663 2324 -443 -1266 1042
5322 1042 -1466 1224 1169 -2529 870 596 -676 1779 -1829 -408 1842 -1473 960 201 -1445 1449
5338 1449 -692 -3 1094 -2384 724 1289 -1417 870 -985 -1017 2076 -1380 -361 689 -1408 1202
5354 1202 61 -1411 1420 -1024 -143 1865 -1410 229 138 -868 1866 -874 -1250 1490 -779 286
5370 286 633 -1754 1150 83 -721 1132 -976 74 967 -752 569 -486 -1226 1478 -279 -163
5386 -163 536 -1185 918 660 -1355 609 -3 -346 944 -926 285 403 -1088 922 215 -505 616
$$ packed form
5274a21j484L300l218J664J604l931K600l38j016L436m246M78L239l246K228p16
5290B33k655M148j470j349K799l586K120J135k823L029k396p78M076l242L53J187
5306G81l113M113j156k608L245k258J184J943m038K501J26k383L987k767q23K308
5322A042k508K690n5l698L399k74j272K455l608J421K250l315K433p59j646K894
5338A449k141O89J097l478L108N65k706K287j855l2L093l456J019J050k097K610
5354A202j141j472K831k444Q81K008l275J639r1j006K734k740l76K740k269J065
5370B86L47k387K904j067q04J853k108J050Q93j719J321j055p40K704j757J16
5386a63O99j721K103k58k015J964o12l43J290j870J211J18j491K010p07p20J121
$$ plain form
5403 616 -709 311 832 -1328 261 388 -604 894 -593 -399 888 -774 154 276 -871 263 -346
5420 -346 -176 615 -807 271 616 -472 296 -247 -211 804 -636 -393 484 -350 170 100 -428 147 -284
5439 -284 -292 495 -128 -61 -278 -54 654 -410 -477 487 -100 -134 -11 -230 652 181 -342 244 199 -103 125 10
5461 10 520 302 -419 584 97 -114 238 -430 698 394 -455 188 569 32 198 125 -242 360 -545 -107
5481 -107 45 165 16 -253 145 164 -506 101 227 89 20 -10 -96 128 -201 -419 121 -69 -110 -156 300 -37
5503 -37 -259 78 207 -67 -202 -79 -266 323 -358 -441 619 116 115 -251 -128 243 -103 -180 164 79 -10 -38
5525 -38 -22 407 124 -219 185 57 -228 -195 87 338 -212 -388 107 206 -188 -128 -177 298 47 -311 -3 344
5547 344 -258 282 -266 329 159 -262 169 157 -484 165 -316 190 373 -588 271 315 -114 164 -329 -187 319
$$ packed form
5403F16j325J020N21k160J589J27r92J498j487J94J287j662R28J22j147J134o09
5420c46J70P91j422J078L45j088P68n43L6J015j440K43Q77q34N20p0n28N75m31
5439b84qP87o23O7k17K24P08j064o7R64n87l4J23k19Q82m71n23N86m5l02K28j15
5461A0N10k18p21J003m87k11L52o68J128l04q49O43L81n37J66p3l67O02r05M38
5481a07J52J20j49k69L98J9o70O07J26j38o9l0q6K24l29k18N40j90m1m6M56l37
5503c7k22L37J29k74j35J23j87N89o81q3J060n03jl66J23L71l46p7L44q5q9k8
5525c8J6M29k83l43M04j28k85L3K82K51n50j76M95R9l94O0m9M75k51l58L08L47
5547C44o02N40n48N95j70m21M31j2o41O49m81N06J83r61Q59M4m29K78m93J42N06
$$ plain form
5568 319 -633 215 209 -686 100 -311 40 620 -555 64 365 -499 40 -379 -142 736 -602 -77 497 -777
5588 -777 190 101 -671 610 -541 -383 848 -316 131 -133 -259 1037 -535 -346 376 -466 226 241 -819
5607 -819 625 -17 -519 1140 -567 -109 596 -637 1011 63 -1232 578 -11 29 417 -977 771
5624 771 421 -678 805 -384 -406 1007 -707 442 453 -1478 1201 404 -847 710 -859 -72 1063
5641 1063 -1405 299 160 -885 1148 -684 -217 981 -1478 756 666 -1580 670 -329 -188 1744
5657 1744 -1720 -216 899 -1009 833 -648 -865 1611 -927 152 939 -1539 861 387 -699 1505
5673 1505 -1283 -773 1862 -1130 217 137 -1256 1811 -188 -931 1339 -947 764 1075 -1480 1167
5689 1167 -329 -1048 2276 -981 -458 819 -1166 1400 352 -1870 1356 -620 22 1036 -1948 315
$$ packed form
5568C19r52Q48oq95P86m11L51N80j175O19L01q64N39m19K37Q78j338N25N74j274
5588g77R67q9p72J281j151J58J231j164M47k64j26J296j572J89P22q42O92J5j060
5607h19J444o42n02J659j707M58P05j233J648r48j295J810n89M0L88j394J748
5624G71l50j099J483j189k2J413j714J149J1j931K679p97j251J557j569P87J135
5641A063k468J704j39j045K033j832M67J198k459K234r0k246K250r99J41J932
5657A744l464J504J115j908J842j481k17K476k538J079P87k478K400m74j086K204
5673A505k788N10K635k992J347q0j393L067j999p43K270k286J711L11k555K647
5689A167j496p19L324l257N23J277j985K566j048k222L226j976O42J014k984K263
$$ plain form
5705 315 864 -1361 1656 -621 -1228 1761 -944 491 692 -2288 1308 340 -1304 1288 -1578 41
5721 41 1449 -1433 570 -100 -1220 2005 -830 -819 1059 -1998 1120 1051 -2079 889 -435 -381 2032
5738 2032 -1576 -337 1227 -1069 1398 -19 -1190 1570 -802 98 1304 -2111 992 685 -766
5753 -766 1791 -1465 -941 2032 -990 282 269 -1680 1909 -55 -976 1285 -1351 625 1139 -1495
5769 -1495 1295 -343 -1290 1931 -923 -613 851 -1279 1487 417 -1820 1491 -469 -223 1481 -1795
5785 -1795 441 658 -1334 1618 -620 -1393 1273 -883 757 767 -2105 982 453 -823 1058 -1625
5801 -1625 139 1140 -1256 419 56 -1225 1603 -600 -401 1015 -1591 908 1069 -1454 563 -403
5817 -403 -632 1509 -1148 -211 769 -807 1111 -95 -1142 1436 -568 106 1242 -1396 694 532
$$ packed form
5705C15N49k225L017k277o07K989k705J435K01k980L596r68j644K592k866J619
5721D1J408k882K003o70j120L225k835J1J878l057L118o9l130K968j324N4K413
5738B032l608J239J564k296K467j417j171K760k372R00J206l415L103l07j451
5753g66K557l256N24K973l022J272j3j949L589j964r21K261k636J976N14k634
5769a495K790j638r47L221k854L10J464k130K766j070k237L311j960K46J704l276
5785a795K236K17j992K952k238p73K666k156J640J0k872L087n29j276J881k683
5801a625J764J001k396J675l63j281K828k203J99J416k606K499J61k523K017r66
5817d03k29K141k657R37R80j576J918j206j047K578k004O74J136k638K090j62
$$ plain form
5833 532 -668 1448 -701 -463 1421 -792 401 343 -1472 1381 -42 -641 1006 -941 329 817
5849 817 -941 576 -264 -742 1446 -797 -316 586 -1022 1040 741 -1183 521 242 -138 736 -1126
5866 -1126 330 445 -918 857 -140 -926 898 -763 308 960 -1381 647 726 -662 274 -475 -239
5883 -239 709 -728 303 213 -540 770 -175 -232 518 -1046 19 878 -688 226 -30 -283 634 -411
5901 -411 -392 574 -119 279 22 -277 823 -335 -201 699 -393 114 190 -670 741 -378 -561 572 -5
5920 -5 -137 154 -172 147 56 -293 458 67 40 212 -218 454 201 -464 581 63 -331 431 -252 445 350
5941 350 -408 -121 324 -211 247 -239 -96 33 -492 307 -96 -84 -260 -224 118 284 -573 74 497 -129 30
5962 30 73 -182 308 -256 -16 434 -339 54 -60 -130 354 -363 -87 228 -187 -200 101 -22 449 -49 -301
$$ packed form
5833E32j200K116k149K38J884k213J193n8j815K853j423n99J647j947J270M88
5849H17j758J517q40m78K188k243M81R02j608K062k99j924J704k79l80Q74j862
5866a126J456J15j363J775r97p86J824j661J071O52k341K028P9j388R36p49K36
5883b39R48j437J031r0p53J310r45n7P50j564J065Q59j566R14k56k53R17j045
5901d11J9R66o93L98k57k99J100j158J34R00j092N07P6q60J411j119j83J133n77
5920ej32K91l26L19r1l49P51l91k7J72m30O72k53o65J045n18l94P62o83O97r5
5941C50p58K87M45n35M58m86J43J29n25P99m03J2j76L6L42J66q57O47M23o26J59
5962C0M3k55M90n64K40M50p73L93j14p0M84p17K76L15m15j3L01j23M71m98k52
$$ plain form
5983 -301 419 166 -343 91 210 364 -85 -287 326 -101 3 -100 -38 253 -177 -375 476 148 -348 11
6003 11 2 85 -10 -255 159 -110 116 -9 -42 239 -4 -447 302 -68 -338 100 -48 -132 203 -184 60 158 -261
6026 -261 -117 4 -58 67 -471 170 25 -209 125 -268 5 367 -453 16 165 -162 124 -147 56 185
6046 185 -616 294 378 -567 374 -228 -303 629 -321 -255 433 -188 248 110 -427 450 -299 -238 531 -305 -9
6067 -9 130 -273 485 -279 -309 526 -433 217 -68 -619 691 -382 -464 795 -514 -160 448 -483 462 -314
6087 -314 -824 684 -295 -146 323 -875 349 264 -871 578 -569 -702 922 -444 382 149 -573 679
6105 679 44 -693 660 -633 170 745 -1220 623 206 -830 850 -807 -318 755 -894 741 323
6122 323 -1000 774 -135 -242 958 -1054 -29 989 -990 958 -303 -496 1243 -682 99 942
$$ packed form
5983c01P20k53n09M34J19J54m49k02O13m27J04j03O2K91m30j98Q51l28m96L59
6003A1rQ3r5k45M14k69K26j25l3K81k43m43P49l70k70M38j48q4L35l87K44R8m19
6026b61J44J21o2J25n38O41j45k34L34l93K73L62q20M69J49l27K86k71K03J29
6046A85q01R10Q4r45R41o02p5R32r50O6O88o21M36j38n37Q77p49O1P69q36K96
6067iJ39m03P58p64l0Q35r59O50k85n51J310j073q2J259j309L54O08r31R45p76
6087c14n10J508r79J49M69j198J224q5j135J449j147j33J624j366Q26k33p22J252
6105F79o35p37J353j293Q03N75j965J843m17j036J680j657M89J073j649J635m18
6122C23j323J774r09j07J200k012J025J018j979J948j261j93J739j925P81Q43
$$ plain form
6138 942 -1014 751 615 -662 1181 -1060 -275 1345 -1012 518 300 -760 1542 -576 -673 1195
6154 1195 -1067 657 901 -1361 1116 -319 -665 1634 -824 -217 751 -883 971 -24 -1217 1158
6170 1158 -532 -16 864 -1594 573 403 -1088 1251 -730 -1133 1445 -1058 163 507 -1538 1255
6186 1255 157 -1077 1044 -1038 341 1198 -1531 303 -106 -1161 1679 -745 -702 1051 -1585 889
6202 889 950 -1432 636 -331 -224 1593 -1534 -69 1012 -1069 1343 -162 -1190 1335 -897 1
6218 1 1193 -1836 692 746 -1177 1236 -969 -420 1600 -833 171 158 -1327 1498 -198 -724 1216
6235 1216 -1028 383 998 -1431 844 -90 -839 1618 -982 -546 718 -1110 913 195 -1525 1197
6251 1197 -543 -315 1311 -1880 377 881 -1126 1200 -419 -1154 1124 -553 180 657 -1374 1167
$$ packed form
6138I42j956J765j36j277J843k241P85J620k357J530k18j060K302k118r7J868
6154A195k262J724K44k262K477j435l46K299k458O07R68j634J854r95j193K375
6170A158j690N16Q80k458K167j70j491K339j981m03K578k503J221L44k045K793
6186A255j098j234K121k082J379Q57k729J834m09j055K840k424M3J753k636K474
6202H89O1k382K068r67J07J817l127J465J081k081K412j505j028K525k232Q98
6218AJ192l029K528N4j923K413k205N49K020k433J004j3j485K825j696n26J940
6235A216k244J411O15k429K275r34p49K457k600M36J264j828K023p18j720K722
6251A197j740K28J626l191K257N04k007K326j619p35K278j677P33M77k031K541
$$ plain form
6267 1167 313 -911 786 -833 298 1279 -1140 504 469 -1168 1454 -380 -650 939 -1129 517
6283 517 944 -1295 433 41 -319 1321 -869 62 1023 -878 865 10 -852 787 -459 -182 1043
6300 1043 -1104 351 595 -580 948 -452 -499 1207 -691 -113 279 -922 1248 -31 -794 638
6316 638 -704 58 911 -887 477 231 -711 1088 -409 -359 655 -744 59 -6 -994 370 -392 -338
6334 -338 707 -862 320 314 -684 421 72 -838 668 -251 71 340 -623 359 377 -290 558 -386 -108
6353 -108 538 -632 177 548 -356 691 -51 -293 609 45 57 667 -382 144 36 -335 396 -405 -65
6372 -65 642 -171 262 250 -555 422 -25 -75 623 -332 -26 199 -340 320 -393 -183 328 -136 -137 71 -179 216
6394 216 -186 -573 312 -112 -290 429 -239 39 509 -353 160 238 -338 189 -69 130 -98 -505 241 -99
$$ packed form
6267A167q54j224J697j619J131R81k419J644l5j637K622j834k70J589k068J646
6283E17M27k239J728l92l60J640k190R31R61j901J743q55q62J639j246K77J225
6300A043k147J455K44j175J528j400m7J706j898N78L92j201K170j279p63J432
6316F38j342P62Q53j798J364k46r42J799j497N0J014j399Q03o5r88J364p62N4
6334c38J045j569J182or98J105l49r10J506r19L22K69r63R82J8o67Q48r44K78
6353a08O46j170Q09L71r04J047p42k42R02n64J2O10j049N26j08l71P31q01L40
6372f5P07q13M33j2q05R77m47n0O98r55L06K25n39O60p13K10N11m64jK08k50L95
6394B16m02l87Q85m24j78P19o68K78M70q62N13P8n76N27k58J99k28m07P46l40
$$ plain form
6414 -99 -23 387 -77 -30 221 -556 343 -46 -188 370 218 -213 242 -460 -69 491 -143 75 -7 -159 234
6435 234 -56 186 248 -332 -48 64 -90 323 -39 -179 439 -116 -263 5 -138 113 -131 28 198 -85
6455 -85 -10 215 -235 183 -17 -26 666 -222 -384 206 11 43 127 -304 220 49 -169 -31 -55 108 126 -232 73
6478 73 -304 -405 364 -109 -232 234 -141 159 121 -262 209 -186 82 -69 -454 114 -17 -385 300 30 -16
6499 -16 264 -441 310 450 -297 23 -97 90 62 -313 -30 37 47 354 144 -198 278 -546 91 356 -460
6520 -460 278 250 -409 560 -145 -185 261 -314 167 158 -215 253 -169 -237 565 -534 67 320 -295 370 -42
6541 -42 -354 654 -32 -46 412 -729 71 -47 -236 558 -454 26 538 -425 300 -4 -833 737 -218
6560 -218 -155 396 -592 66 66 -912 527 67 -113 600 -225 -49 196 -604 796 67 -571 485 -377 336
$$ packed form
6414i9P6M10m64M7K51p77Q99l89j42N58j52m31M55p02L91N60o34K18q2j52L93
6435B34k90K42O2n80K84J12j54M13l62j40O18n55j47K68j43K51k44J59J70k83
6455h5P5K25m50M18k00rO92q88j62N90j95L2Q4m31N24j71k18J38k4J63J8l58L05
6478G3l77j01P69m73j23M66l75L00l8l83M71l95K68j51l85N68j31l68O85k70m6
6499a6K80p05P51J40p47L20j20J87k8l75K83O7J0L07k10l42M76q24O37K65q16
6520d60P38k8o59R69p05m0M46n75M81rl73M68m22o8Q02j099O01K53o15O65m12
6541d2l12J008o86j4M58j141Q00j18j89P94j012M80N12r63P25l04q29J570r55
6560b18O3N51r88O58%r78J439m60j80P13q25J76K45q00J400p29o38J056q62P13
$$ plain form
6580 336 582 -859 410 364 -435 956 -516 -381 671 -734 473 435 -758 830 -301 -108 489
6597 489 -795 183 848 -889 521 -192 -614 1197 -429 -169 796 -875 332 291 -557 802 -604
6614 -604 -254 1177 -922 261 81 -960 1006 -359 -770 680 -846 251 560 -1121 606 -36
6630 -36 -455 1144 -987 -69 770 -948 1021 -146 -1021 1285 -351 -396 767 -1087 451 623 -1211
6647 -1211 1042 -204 -622 1217 -585 86 344 -1257 1227 146 -1190 928 -800 486 997 -1362
6663 -1362 668 137 -978 1519 -736 -511 1256 -895 745 326 -1429 910 -205 -223 1503 -1328
6679 -1328 -87 850 -761 945 -199 -1147 1145 -508 -141 790 -1476 658 432 -933 831 -844
6695 -844 -237 1408 -927 41 226 -805 1191 -273 -941 926 -809 205 888 -1492 542 -228 -570
$$ packed form
6580C36K46j441J269m6p99J391j472J35J052j405J207l8j193J588j131J93N97
6597D89j284R78O65j737J410p13m22J811j626K60R65j671J207m1q48J359j406
6614f04L50J431k099J183j80j041J966j365m11J450j526J097L09j681J727o42
6630c6m19J599k131R18Q39j718J969j167q75K306j636m5J163j854J538J72j834
6647a211K253j246m18J839j802O71K58j601K484j081j336K118j728J286N11k359
6663a362K030n31j115K497k255K25J767k151J640m19j755K339j115j8J726k831
6679a328J241R37j611J706j144r48K292j653L67R31k266K134k26j365J764j675
6695h44O07J645k335R68J85j031J996j464o68J867j735J014O83k380K034p70l42
$$ plain form
6712 -570 1165 -558 -392 975 -749 899 -61 -1368 1046 -324 -466 1056 -1067 354 612 -952
6728 -952 1027 -638 -848 1474 -579 24 337 -1473 1174 206 -1028 794 -879 -196 1136 -1081
6744 -1081 659 445 -965 1030 -277 -676 691 -1220 543 473 -996 783 61 -345 1175 -981
6760 -981 -212 839 -1086 589 158 -745 950 -275 -518 745 -827 223 585 -725 539 -517
6776 -517 -487 1050 -583 26 322 -817 722 -200 -625 717 -401 -68 557 -639 401 64 -646 820
6794 820 -499 -268 460 -634 321 132 -735 795 189 -544 793 -486 179 339 -813 318 273 -396
6812 -396 647 -197 -372 381 -627 331 568 -597 484 -381 78 682 -535 -41 300 -464 166 181 -469
6831 -469 514 -130 35 453 -333 234 183 -224 505 -374 -59 362 -470 169 19 -207 390 -10 -157 147
$$ packed form
6712e70J735j723J66J367j724J648r60j307K414j370j42J522k123J421K58j564
6728i52J979j665k10K322k053O03L13j810K647r68j234J822j673O83J332k217
6744a081J740k14j410J995j307l99J367j911J763p0j469J779p22m06J520k156
6760i81P69J051j925J675m31r03J695j225k43J263j572J050L62j310J264j056
6776e17L0J537j633O09K96j139J539r22m25J342j118L33O25j196J040l37p10J466
6794H20j319K31P28j094R55j89q67J530o06p33J337j279O65J60j152J131m5o69
6812c96J043q44j75P53j008R58K37j165J081q65M59O04j217M94L41p64O30J5o50
6831d69R83o44J65M18p86N67n1m07P29q79L15M21q32O39j50k26N97m00j47L04
$$ plain form
6851 147 -386 -67 -121 -193 -54 -104 -119 116 -31 -408 58 -172 241 47 -267 123 -81 -269 392 -231 107
6872 107 133 -483 44 -17 -245 221 8 252 74 -253 -6 121 -366 52 27 -158 157 -392 13 95 -264
6893 -264 -219 197 -101 200 -5 -85 136 189 -62 -212 -157 -33 25 -23 172 -197 -129 69 -192 208 10 -180
6915 -180 346 -46 -94 82 -225 55 -387 -25 269 -54 -57 -74 -206 119 -41 -407 119 52 -78 9 -200 36
6937 36 14 -193 283 5 -147 -46 -114 -89 266 -29 99 -123 -438 206 72 120 85 -333 21 197 -115 192
6959 192 -34 -69 298 112 143 -7 -119 311 -14 3 117 -282 253 348 -433 -37 308 -14 204 182 213 287
6981 287 -160 48 -53 -146 389 -209 -26 111 -463 178 155 -149 228 19 -373 253 -597 99 -62 -350 364
7002 364 99 352 348 -570 -112 -19 -250 208 -207 -362 365 -123 -5 234 -516 395 -8 -397 484 -285 -129
$$ packed form
6851A47n33L19n4p2J39n0j5K35j47l77M66k30M13j94l14L90k04j88O61o23L38
6872A07K6o16N27o1k28M66k13K44j78l27K47J27m87M18k5j85L15n49M05Q2l59
6893b64M5M16k98L01k05q0K21N3k51j50N5J24N8m8J95l69O8J98k61M00j98j90
6915a80N26l92m8J76l07K80m42L62K94l23lj7j32L25j60l66N26o7j30Q7k09K36
6937C6k2k07M76k78j52J01o8K5L55k95J28k22l15O44j34M8l5m18L54J76l12L07
6959A92k26l5L67j86L1j50j12M30l25J7J14l99N35R5p81L96L45l22K18k2L1P4
6981B87m47K08j01r3N35n98J83J37n74O41k3l04L77k09l92O26q50O96j61k88P14
7002C64k65K53mr18M58R3k31M58m15j55P27m88J18K39p50R11m03l89Q81p69J56
$$ plain form
7023 -129 411 -425 150 202 -336 415 -149 -72 552 -410 31 510 -423 258 -83 -424 483 -298 133 618 -448
7044 -448 733 47 -461 520 -477 113 509 -756 80 217 -439 433 -186 -173 490 -615 352 289 -851
7063 -851 716 -80 -237 577 -792 24 859 -593 367 204 -434 587 -494 -335 509 -535 457 88
7081 88 -579 578 -284 -173 807 -931 -19 400 -625 903 -306 -256 763 -679 335 644 -910 525
7099 525 9 -313 746 -579 -241 580 -690 442 84 -1051 793 -98 -330 841 -904 211 700
7116 700 -704 750 -370 -509 890 -751 134 420 -731 845 169 -681 809 -248 197 710 -1034
7133 -1034 346 468 -590 866 -367 -549 922 -774 502 72 -929 757 42 -713 558 -1094
7149 -1094 55 977 -745 315 -82 -589 809 -362 -266 806 -943 476 479 -993 515 -250 -259 1211
$$ packed form
7023a29N40q36N75N2n38P51n64P7O24r62M41M79r33O81l41l41R07p81M31M85j066
7044d48J181o86n08R81r97N90L96j265Q36J37o56Q72o19J3O63j105R67o3j140
7063h51J567p96j57Q14j369Q16Q35j452R60j63o38J021j081J59Q44j044R92l69
7081H8o67J157q62J11R80j738R12M19j025J528j209N0J019j442J014L09j554J435
7099E25n16l22J059j325L38Q21j270J132l58j135J844q91k32J171j745J115M89
7116G00j404J454j120j39J399j641Q85K86j151J576o76q50J490j057M45N13j744
7133a034J380J22j058J456j233j82J471j696J276m30j001J686p15p55J271j652
7149a094J149R22j722J060l97n07J398j171R6J072j749J419Lj472J508p65rJ470
$$ plain form
7167 1211 -790 141 466 -937 727 -35 -509 570 -443 -47 649 -1281 307 35 -443 609 -695
7184 -695 -310 1097 -710 455 190 -1045 625 -75 -517 480 -960 109 675 -795 367 -80 -491
7201 -491 904 -437 102 478 -706 835 363 -743 655 -303 21 1026 -768 341 355 -478 570
7218 570 -410 -463 755 -676 266 489 -851 771 173 -311 836 -734 4 896 -801 200 247 -560
7236 -560 766 -304 -220 600 -672 374 304 -586 418 -166 -387 584 -514 -102 252 -535 524 12
7254 12 -679 538 -368 -127 683 -507 429 259 -332 372 -222 -283 540 -351 142 79 -362 388 20 -277
7274 -277 357 -633 -2 368 -515 215 -28 -470 430 -16 -278 319 -570 465 110 -353 360 -166 0 249
7294 249 -284 33 304 -497 420 -20 19 330 -149 30 271 -541 261 96 -357 326 -27 -438 356 -250
$$ packed form
7167A211k001R31L25j403J664p62m74J079j013L96O96j930J588k72m78J052j304
7184f95L85J407j807J165k65j235J670p00m42R97j440J069N66j470J162m47m11
7201d91J395j341N39L76j184J541m72j106J398r58L24J005j794J109J4q33J048
7218E70r80n3J218j431R42K23j340J622n98m84J147j570P38Q92j697J001M7q07
7236e60J326j070Q4Q20j272J046p0q90J004n84k21R71j098M12L54p87J059n12
7254A2o91J217r06K41Q10j190R36j70n91P04n94o1Q23q91M93o3m41P50l68k97
7274b77O34r90O31L70q83P30k43m42R00m46k62N97q89J035l55m63P13n26J66K49
7294B49n33L17K71q01R17m40L9L11m79J79K41q12Q02j65m53O83l53m11P94o06
$$ plain form
7314 -250 115 113 -27 -36 -76 -267 155 -55 26 240 -257 249 -153 -104 201 122 -97 398 -230 -88 199 -306 108
7337 108 -167 -145 460 75 -234 35 -278 154 57 -195 265 -14 -25 -9 -347 -59 248 -274 -82 96 -99
7358 -99 274 -54 52 138 24 -63 -4 -124 455 -262 -50 328 -360 14 102 -183 102 146 -60 209 -112 -70
7380 -70 3 -288 -107 -102 -52 -10 -202 112 205 -150 -83 -87 -41 29 -120 -131 578 2 44 -17 76 -23 217 73 289 34
7406 34 -171 -214 -53 151 -108 -61 -34 -227 -215 48 -278 -85 66 -50 26 107 -58 43 -177 299 81 -253
7428 -253 62 -130 -107 -50 -62 -86 89 -263 226 -172 -164 119 -191 306 85 -23 127 -75 -133 260 -137 -102 159
7451 159 -86 168 12 -91 219 -283 87 127 -556 176 223 -260 320 -226 22 170 -235 267 3 -394 445
7472 445 -4 -269 337 -243 -86 358 -351 159 -108 -52 326 -222 47 330 -437 426 164 4 295 -259
$$ packed form
7314b50L65kj40rm0j91M22k10Q1K14m97N06m02M9L05p9k19M95o28J42K87n05M14
7337A08k75K2O05l85l09K69l13M32r7k52M60k79j1J6l38K88L07n22J92J78j95
7358i9L73l28J06Q6j14q7N9j20N79p17K12L78o88L74Q8k85K85M4k06K69l21M2
7380g0P3k91J81NN0M2j92L14R3l55O7mM6P0j49j1P09n76M2o1R3r9K40j44K16k55
7406C4k05m3J61K04k59M7K7j93J2K63l26J93J51j16P6Q1j65J01k20M76k18l34
7428b53L15j92K3N7j2k4J75l52M89l98QK83l10M97k21j08J50k02n8L93l97L5K61
7451A59k45K54j56j03L10n02L70M0o83P32M7m83N80n46K48J48m05N02k64l97Q39
7472D45m49k65O06n80J57M44p09N10k67N6L78n48K69K83p67Q63k62j60K91n54
$$ plain form
7492 -259 19 432 -86 408 266 -431 427 -26 -184 309 -286 124 78 -512 216 110 -131 335 -350 -150
7512 -150 258 -312 26 28 -385 427 -422 25 215 -546 189 296 -600 482 -516 -80 453 -510 289 283 -478
7533 -478 680 2 -321 517 -308 10 354 -505 346 -4 -230 523 -426 -13 261 -338 96 84 -341 465
7553 465 -426 -50 450 -565 115 389 -539 405 -171 -430 664 -465 -40 366 -449 418 191 -359 953
7572 953 -468 -146 657 -594 272 93 -728 607 -104 -394 417 -622 280 468 -740 395 -68 -580
7590 -580 945 -252 -84 664 -481 525 160 -676 725 -299 -261 413 -622 324 226 -733 513 -427
7608 -427 -392 852 -545 111 340 -842 673 37 -660 579 -600 -219 182 -457 372 -130 -616 668
7626 668 -362 13 487 -745 412 436 -796 410 -326 -345 694 -413 61 400 -593 509 75 -590
$$ packed form
7492b59K78M13n18M94j42o97Q58m53j58M93n95M10m6n90P28j06k41M66o85K00
7512a50M08n70L38Km13Q12q49M47J90p61P35J07q96J082r98M36N33r63P99op61
7533d78J158o78l23Q38q25L18L44q59Q51l50k26P53r49M13K74n99M34j2m25Q06
7553D65q91L76N00j015O80K74r28R44n76k59J094j129M25M06q15Q67k27n50J312
7572I53j421L22Q03j251Q66j79q21J335p11k90Q11j039R02J88j208J135m63n12
7590e80J525j197J68P48j145J006l65q36J401j024L8O74j035R46r8r59J246r40
7608d27L5J244j397O56K29j182J515o36o97J239j179L81M01o39Q29n02m86J284
7626F68j030L75M74j232J157K4j232J206p36j9J039j107M74L39r93J102m34o65
$$ plain form
7644 -590 582 -162 343 434 -483 238 66 -597 753 -527 -281 617 -375 193 26 -801 393 41 -189
7663 -189 422 -249 131 518 -519 498 -42 -716 724 -262 26 534 -497 368 407 -647 454 -247
7681 -247 -149 541 -478 27 130 -467 301 -100 -314 528 -474 254 420 -577 712 2 -421 285 -373
7700 -373 -113 458 -262 147 -61 -453 330 -180 -112 40 -405 169 317 -667 521 -379 -381 515 -393 -107 146
7721 146 -257 203 58 -259 367 -353 47 470 -690 447 263 -351 530 -254 -92 319 -317 -83 161
7740 161 -536 182 77 -336 400 -20 64 411 -436 387 -231 -343 455 -277 -34 276 -347 188 297 -429
7760 -429 214 -179 -287 180 -383 223 99 -263 243 -180 -144 281 -173 48 312 -121 148 156 -238 229 -287
7781 -287 -58 254 -175 -77 -90 -299 56 179 157 342 -107 -31 90 -82 283 -105 -211 64 -201 -144 261 -152
$$ packed form
7644e90J172p44N05R1r17P21j72o63J350j280K46Q98r92N68j67q27J194l52k30
7663a89O11o71L80L87j037J017n40o74J440r86K88N08j031Q65L9j054J101p01
7681b47R8O90j019N05J03n97P68m01k14Q42j002P28J66r97J289p10m23P06o58
7700c73K60N71p20M09k08l92P83n10O8J52m45N74J48r84J188r00kQ96r08K86K53
7721A46m03M60j45l17O26p20M00M23j160J137j84o14Q81p84J62M11o36K34K44
7740A61o97P18j05m13P36m20Q4L47q47Q23o18j12P98p32K43L10o23N35J09p26
7760d29O43l93j08M67n63O06j24l62N06m23L6M25m54K21K64m33K69Ql94M67n16
7781b87K29L12m29R8j3k09L55J23k2J85m49P6J21j72L65l88j06K75k65N7M05m13
$$ plain form
7803 -152 181 34 -201 295 -112 190 26 -97 202 159 -222 314 -68 -211 268 -6 -57 -284 -131 406 275
7824 275 -280 213 -84 -239 312 -136 286 87 -299 36 14 -194 110 -199 321 40 -15 -15 -46 89 33 -147
7846 -147 -79 260 70 166 208 -126 117 -56 -184 253 -52 8 111 -29 -13 142 -9 21 152 -78 155 -261
7868 -261 41 28 -133 195 232 -231 144 139 -106 47 17 63 84 92 247 226 26 -38 -223 81 -142 -46 94 24
7892 24 21 -98 -18 168 -70 -340 105 -28 61 195 -132 169 337 22 272 -197 -56 182 -8 136 12 -6
7914 -6 -106 75 -142 122 -342 -69 249 -144 -41 154 -91 17 -107 -107 79 -174 145 118 -220 103 -12 54
7936 54 196 -230 -70 126 -372 324 -15 -128 233 164 157 129 -196 203 -64 -261 296 -121 12 254 -92 452
7958 452 57 -90 235 -161 113 162 -10 115 -77 -66 354 171 25 279 -174 147 191 -274 497 -44 -274
$$ packed form
7803a52L33j47k35M96m07L02j64j23K99m3l81N36l82j43M79k74n1k27J53N37j31
7824B75n55M93k97j55N51m48M22j99l86L35k2k08L04l09N20k81n5%l1J35n6j80
7846a47O8L39j90R6M2l34K43j73j28M37l05O0J03j40J6J55j51L0J31k30K33m16
7868b61L02j3j61L28L7m63L75nk45J53l0M6K1QJ55k1k00o4j85L04k23R6J40p0
7892B4lj19Q0J86k38k70M45j33Q9J34l27L01J68l15K50m69J41K38j90J44j24j8
7914fj00J81k17K64m64K73L18l93J03J95k45J08j24%J86k53L19k7l38L23j15O6
7936E4J42m26J60J96m98O96l39j13L61o9pk8l25L99k67j97N57m17J33K42l46N44
7958D52l95j47L25l96K74M9j72J25j92J1M20j83j46K54m53L21M4m65P71n41k30
$$ plain form
7979 -274 238 -391 74 305 -290 180 60 -35 216 -10 -53 -91 -532 26 90 -330 180 -55 -218 143 -282
8000 -282 89 257 -347 406 14 -319 255 -400 -51 290 -175 -1 71 -184 387 -455 -54 408 -293 227
8020 227 64 -344 280 -77 -266 341 -351 50 120 -290 106 -179 -210 484 -120 8 211 -347 226 127 -357
8041 -357 426 -464 -75 258 -356 244 79 -503 505 -316 -346 224 -358 -58 224 -329 202 -60 -103 580
8061 580 -248 -32 286 -376 265 -110 -402 351 -219 -56 298 -532 315 194 -577 472 -480 -320 449 -368
8081 -368 176 -37 -524 135 244 -77 492 -83 -144 448 -626 407 -179 -361 565 -76 -351 210 -179 81
8101 81 -74 -438 602 -318 -219 386 -484 -17 327 -493 430 -52 -323 441 -419 27 380 -586 360 -114
8121 -114 -282 211 -313 16 392 -237 350 64 -666 211 -157 -117 543 -504 215 307 -595 359 -331 -227
$$ packed form
7979b74N12o29M65K31n95M70j20r5K51k26m3l8m41N58O4m20N10k35j63L61m25
8000b82L71J68o04P53l92l33N74o55L49L41m65J74P2k55N71q42M01M62p01N20
8020B27j63m08O24l57j89O07o92M01P0m10L96k85l1O94o04J28K03n58N73r9m84
8041c57P83q90L89L33o14O00j65n82J008q21l0N70n82L00K82n53N31k62m3O83
8061E80q28K16L18o62O41l75k92P53n70J63L54q30Q47j21p71J049r52J60P69q17
8081c68N44k13m87O59J09l21N69n75o1N92j074J033n86j82R26o41k75N61l89K60
8101H1j55l64J040r20R9O05q70M67L44q20R23m82k71P64q60M46L53r66R46m74
8121a14j68M93n24L29L76o29N87k86p30Q77l68M0O60j047P19R2r02R54o90J04
$$ plain form
8141 -227 227 -226 46 519 -322 125 -36 -450 608 -179 -107 230 -261 175 259 7 370 -230 -148 324 -484
8162 -484 47 129 -104 208 7 -241 71 -183 -84 402 -278 159 24 -316 493 205 2 526 -578 341
8182 341 481 -284 220 -83 -59 126 -192 -106 235
$$ packed form
8141b27M54m53K72M73q41M47j61m14J058p87P2L37m91M36Q4k52L63o00Q2M72q08
8162d84N31Q2k33L12k01k48L12k54R9M86o80M37j35l40Q09k88k03N24j104R19
8182C41J40p65N04l03K4J85l18Q6L41
8191B35
$$ Imaginary data points
##PAGE= N=2
##DATA TABLE= (X++(I..I)), XYDATA
$$ plain form
0 0 0 0 0 0 0 0 -8 8 -8 16 -16 16 -24 32 -40 56 -66 80 -96 120 -141 168 -200 237 -275 321 -371 427 -493
29 -493 567 -647 737 -836 945 -1065 1195 -1345 1505 -1680 1873 -2083 2309 -2560 2832 -3130
45 -3130 3458 -3817 4203 -4628 5099 -5614 6186 -6821 7529 -8323 9219 -10239 11417
58 11417 -12790 14417 -16374 18788 -21844 25843 -31330 39325 -52058 75391 -131598 527781
70 527781 385596 -633131 204326 -434654 330000 556508 -673030 90375 75637 -276339
80 -276339 636245 -266686 -255510 245855 -381849 481131 247235 -710026 247860 36226
90 36226 55662 429217 -658726 -64435 472041 -266332 272871 -140383 -397958 434967
100 434967 -120411 69707 224738 -624315 189588 324153 -147954 208006 -482857 -79630
$$ packed form
0@%%%%%%qJ6j6K4l2L2m0N6p2R6j22J46j76K16k61L09l68M37n12N96o92P98r20
29d93J060j214J384j573J781k010K260k540K850l185L553l956M392m869N392n962
45c130O588p275Q020q831R727j0713J1800j3007J4350j5852J7542j9458K1656
58A1417k4207K7207l0791L5162m0632M7687n7173P0655r1383J27449k06989O59379
70E27781j42185j018727Q37457o38980P64654K26508j229538P63405j4738l51976
80b76339R12584r02931J1176N01365o27704Q62980k33896r57261R57886k11634
90C6226J9436L73555j087943N94291N36476p38373N39203m13254k57575Q32925
100D34967n55378J90118J55031q49053Q13903J34565m72107L55960o90863M03227
$$ plain form
110 -79630 662879 -285593 -113556 1100 -244235 483249 -67723 -314172 250383 -247414
120 -247414 104593 286704 -310832 68226 -121765 -72959 498428 -256279 -272391 173492
130 173492 -69788 302483 -62174 -420069 291368 42517 -57166 171411 -270683 56414
140 56414 126589 -150157 242609 -135043 -239166 247871 -9463 87871 -30275 -324640
150 -324640 284259 138446 -191798 77747 -130149 86536 191757 -218293 75704 15297
160 15297 -162635 192216 -12058 -45615 20264 -191930 212969 151337 -252777 3522 -2219
171 -2219 85033 158243 -247993 -7247 161876 -100533 62380 -40699 -75092 112218 -107955
182 -107955 52362 119961 -189510 13946 57278 2786 86033 -189564 -21911 205980 -83363
$$ packed form
110g9630P42509r48472J72037J14656k45335P27484n50972k46449N64555m97797
120b47414L52007J82111n97536L79058j89991M8806N71387p54707j6112M45883
130A73492k43280L72271l64657l57895P11437k48851r9683K28577m42094L27097
140E6414P0175k76746L92766l77652j04123M87037k57334R7334j18146k94365
150c24640O08899j45813l30244K69545k07896K16685J05221m10050K93997o0407
160A5297j77932L54851k04274l3557O5879k12194M04899o1632m04114K56299n741
171b219Q7252P3210m06236K40746J69123k62409J62913j03079l4393J87310k20173
182a07955J60317O7599l09471K03456M3332n4492Q3247k75597J67653K27891k89343
$$ plain form
193 -83363 -34029 -12587 -42788 125422 -76731 -53207 114366 -90804 -7148 60563 -22817
204 -22817 55347 -110997 -46366 177163 -53036 -83102 19792 -2540 99439 -56697 -103831
215 -103831 120040 6731 -46280 22731 -17666 61695 -30008 -64848 116347 -11819 -83117
226 -83117 21857 8401 66211 -30093 -106016 97068 54743 -65111 -6000 5887 53090
237 53090 -2931 -71157 61404 37871 -50903 -9485 7079 47589 -19850 -92774 56860 66789
249 66789 -52677 -27883 12234 42885 850 -73641 16831 63133 -21165 -42667 4848 51704
261 51704 -12301 -76741 21701 53611 -25733 -39348 -1335 49901 11354 -73210 -5835 63699
273 63699 -8005 -60922 -3272 59556 3961 -57280 -2046 40363 6879 -41677 -22830 61761
$$ packed form
193h3363M9334K1442l0201J68210k02153K3524J67573k05170Q3656O7711q3380
204b2817P8164j66344O4631K23529k30199l0066J02894k2332J01979j56136m7134
215a03831K23871j13309n3011O9011m0397P9361r1703l4840J81195j28166p1298
226h3117J04974j3456N7810r6304p5923K03084m2325j19854N9111J1887M7203
237E3090n6021o8226J32561k3533q8774M1418J6564M0510o7439p2924J49634R929
249F6789j19466K4794M0117L0651m2035p4491R0472M6302q4298k1502M7515M6856
261E1704o4005o4440R8442L1910p9344j3615L8013N1236l8547q4564O7375O9534
273F3699p1704n2917N7650O2828n5595o1241N5234M2409l3484m8556J8847Q4591
$$ plain form
285 61761 26530 -66987 -9110 57080 6148 -48918 -20804 46005 21914 -45103 -17738 42020
297 42020 33247 -39881 -40175 59584 37918 -53458 -10709 44520 21877 -24141 -37119 31017 41920
310 41920 -43676 -38502 40897 41717 -33982 -43475 41605 41822 -35765 -24964 26806 34944 -13326
323 -13326 -51771 20982 60443 -32342 -52908 26609 34070 -25920 -38713 16833 43073 -13051
335 -13051 -47587 8479 49239 -11809 -58193 9039 54095 -13694 -50783 10095 39892 -9040
347 -9040 -41446 -8154 38493 11435 -51354 -3864 60691 -9558 -54851 2924 34338 6991
359 6991 -42226 -16637 55328 12893 -46983 -12641 33572 27929 -39641 -23657 61424 4730
371 4730 -43357 9664 19402 17744 -32012 -46962 65137 31601 -61482 -5879 31520 34642 -15307
$$ packed form
285F1761l5231r3517N7877O6190n0932n5066K8114O6809k4091o7017K7365N9758
297D2020q773p3128k94R9759k1666r1376M2749N5229k2643m6018j2978O8136J0903
310D1920q5596N174P9399Q20p5699r493Q5080K17p7587J0801N1770Q138m8270
323a3326l8445P2753L9461r2785k0566P9517P461n9990j2793N5546K6240n6124
335a3051l4536N6066M0760o1048m6384O7232M5056o7789l7089O0878K9797m8932
347i040l2406L3292M6647k7058o2789M7490O4555p0249m5293N7775L1414k7347
359F991m9217K5589P1965m2435n9876L4342M6213n643o7570J5984Q5081n6694
371D730m8087N3021R738j658m9756j4950J12099l3536r3083N5603L7399L122m9949
$$ plain form
384 -15307 -56377 46194 37978 -38936 6078 5803 17623 1825 -58535 47261 37429 -78932
396 -78932 3934 35910 19826 4468 -81349 25854 81461 -46991 -18678 -243 6113 41280
408 41280 -54850 5592 53402 -73728 960 38738 -13695 17560 -68136 4252 106700 -65381
420 -65381 -50631 28169 6404 55357 -62870 -56063 88128 -28457 -11376 37453 -51384 27124
432 27124 -22187 -23136 110776 -64744 -75443 70723 8614 42645 -54155 -100439 120204 21319
444 21319 -58582 23402 -53304 55437 41928 -79956 66531 -25748 -64790 107504 -10148
455 -10148 -12988 -9897 -86888 126769 44480 -130171 16195 -6501 56498 68279 -130286 27164
467 27164 50027 -60481 89919 -28451 -60385 54689 -59506 85851 57397 -174196 25346
$$ packed form
384a5307m1070J02571q216p6914M5014k75J1820j5798o0360J05796r832j16361
396g8932Q2866L1976j6084j5358q5817J07203N5607j28452K8313J8435O356L5167
408D1280r6130O0442M7810j27130P4688L7778n2433L1255q5696P2388J02448j72081
420f5381J4750P8800k1765M8953j18227O807J44191j16585J7081M8829q8837P8508
432B7124m9311r49J33912j75520j0699J46166o2109L4031r6800m6284K20643r8885
444B1319p9901Q1984p6706J08741j3509j21884J46487r2279l9042J72294j17652
455a0148k840L091p6991K13657q2289j74651J46366k2696O2999J1781j98565J57450
467B7164K2863j10508J50400j18370l1934J15074j14195J45357k8454k31593J99542
$$ plain form
478 25346 60497 15179 47981 -159281 6386 151367 -64499 9791 -39100 -64237 131718
489 131718 -44057 -23883 63240 -138631 54971 100351 -75634 20083 -101532 -1006 196445
500 196445 -94471 -79094 18886 -29991 145908 -41245 -130041 88871 -51127 34605 96687
511 96687 -136515 16253 9971 -25861 163258 -107125 -126372 118491 8759 69650 -46881
522 -46881 -167511 148331 49341 -60583 40503 -120814 47669 103420 -89444 80811
532 80811 -52242 -110265 167099 -1355 -29819 -3597 -136551 154107 96842 -153258 12769
543 12769 -39354 45617 121853 -149637 1906 53327 -68420 130777 -31695 -103346 70084
554 70084 -62096 88244 81530 -199479 23080 73949 3630 71280 -159472 -33093 152354
$$ packed form
478B5346L5151m5318L2802k07262J65667J44981k15866P4290m8891k5137J95955
489A31718j75775K0174Q7123k01871J93602M5380j75985R5717j21615J00526J97451
500A96445k90916J5377R7980m8877J75899j87153q8796K18912j39998Q5732O2082
511I6687k33202J52768o282l5832J89119k70383j9247K44863j09732O0891j16531
522d6881j20630L15842r8990j09924J01086j61317J68483N5751j92864J70255
532H0811j33053n8023K77364j68454k8464K6222j32954K90658n7265k50100J66027
543A2769n2123Q4971P6236k71490J51543N1421j21747J99197j62472p1651J73430
554G0084j32180J50340o714k81009K22559N0869p0319O7650k30752J26379J85447
$$ plain form
565 152354 -54564 23546 -21913 -92551 117293 -23667 -19897 70843 -147527 28229 114818
576 114818 -58102 26739 -93370 -32624 183556 -64742 -75522 23095 -39046 117137 -13318
587 -13318 -107228 75918 -48766 10303 91718 -98529 9463 -501 -33271 145904 -65703
598 -65703 -111598 82575 1417 60655 -13758 -131531 98740 36293 -46268 44090 -77500
609 -77500 18213 59546 -63168 70865 -26573 -91283 104002 10480 -6295 -1580 -105252
620 -105252 95818 74099 -96811 8861 -21038 21636 71015 -88905 7972 31394 -61486
631 -61486 68694 2260 -42279 29449 -60329 54760 67956 -113455 114 32429 4395
642 4395 49330 -88056 -15803 83185 -46594 6964 1427 -40280 52662 -29944 -160 59546
$$ packed form
565A52354k06918P8110m5459p0638K09844j40960L770R0740k18370J75756Q6589
576A14818j72920Q4841j20109O0746K16180k48298j0780R8617o2141J56183j30455
587a3318r3910J83146j24684N9069Q1415j90247J07992r964l2770J79175k11607
598f5703m5895J94173q1158N9238p4413j17773K30271o2447q2561R0358j21590
609g7500R5713M1333j22714J34033r7438o4710J95285r3522j6775M715j03672
620a05252K01070k1719j70910J05672k9899M2674M9379j59920R6877K3422r2880
631f1486J30180o6434m4539P1728q9778J15089J3196j81411J13569L2315k8034
642D395M4935j37386P2253R8988j29779N3558n537m1707R2942q2606K9784N9706
$$ plain form
654 59546 -82694 -5185 52757 -16676 23219 -58735 -21539 99885 -31816 -38953 16266 -15349
666 -15349 47046 -18937 -40036 58011 -25581 -17830 41499 -21925 8928 -22126 -26663 80106
678 80106 -12395 -56446 26856 8927 28481 -10490 -51148 50245 13747 -33635 19754 -6581
690 -6581 10165 -274 -35200 44949 6143 -50959 20518 17770 10824 -6379 -42361 37032 31933
703 31933 -41295 -5876 9660 14660 2227 -36690 18600 22390 -34201 -963 13525 5131 -3634
716 -3634 -32182 19976 36287 -32184 -20863 15949 14788 -4455 -32190 7667 30927 -17815
728 -17815 -19176 7779 14976 -1222 -30413 7251 33838 -17109 -23463 12652 18547 -3576 -28601
741 -28601 -162 30383 -3931 -26381 2397 28298 4216 -28877 1265 29093 -3709 -21784
$$ packed form
654E9546j42240P7509N7942o9433L9895q1954L7196J21424j31701p137N5219l1615
666a5349O2395o5983k1099R8047q3592P751N9329o3424L0853l1054m537J06769
678H0106r2501m4051Q3302j7929J9554l8971m0658J01393l6498m7382N3389k6335
690f581J6746j0439l4926Q0149l8806n7102P1477k748o946j7203l5982P9393n099
703C1933p3228L5419J5536N000j2433l8917N5290L790n6591L3238J4488q394q765
716c634k8548N2158J6311o8471J1321L6812j161j9243k7735L9857K3260m8742
728a7815j361K6955P197j6198k9191L7664K6587n0947o354L6115N895k2123k5025
741b8601K8439L0545l4314k2450K8778K5901k4082l3093L0142K7828l2802j8075
$$ plain form
753 -21784 1308 23292 9290 -25837 -9849 26713 5185 -25528 -3340 27524 7960 -23894
765 -23894 -2863 26050 8018 -19542 -13235 20364 17862 -23753 -12792 27255 8523 -25465
777 -25465 -12423 19025 15040 -17314 -13956 18829 16511 -16576 -19128 18275 20192 -24030 -19774
790 -19774 21148 13617 -16588 -16800 8545 18875 -12260 -25270 14123 23309 -16243 -21859 13927
803 13927 20873 -12740 -23362 8068 17570 -9406 -19321 5092 24293 -4195 -31232 8001 28870
816 28870 -11568 -19482 6912 16304 2176 -21786 -1174 27973 -5501 -26461 3461 23964
828 23964 5098 -25393 -932 32825 -2925 -20947 1390 13308 14764 -18374 -16001 32884
840 32884 1632 -27950 8357 14447 3795 -16664 -14833 34232 11799 -28749 -1001 12851
$$ packed form
753b1784K3092K1984j4002l5127J5988L6562k1528l0713K2188L0864j9564l1854
765b3894K1031K8913j8032k7560O307L3599k502m1615J0961M0047j8732l3988
777b5465J3042L1448l985l2354L358L2785k318l3087k552L7403J917m4222M256
790a9774M0922p531l0205k12K5345J0330l1135j3010L9393R186l9552n616L5786
803A3927O946l3613j0622L1430R502k6976r915K4413J9201k8488k7037L9233K0869
816B8870m0438p914K6394R392j4128k3962K0612K9147l3474k0960K9922K0503
828B3964j8866l0491K4461L3757l5750j8022K2337J1918J456l3138K373M8885
840C2884l1252k9582L6307O090j0652k0459J831M9065k2433m0548K7748J3852
$$ plain form
852 12851 16876 -12362 -32371 29048 16190 -29308 5815 3439 1604 2303 -27723 22307 21770
865 21770 -39785 1680 21060 7153 -3395 -40007 16721 36642 -33352 -8008 4508 803
877 803 21351 -31089 -1663 33848 -37529 -697 28556 -11814 3313 -26861 3677 53469
889 53469 -37397 -31648 21620 5769 25561 -29602 -28975 51530 -12979 -13365 26119 -25806 10379
902 10379 -4 -16126 52076 -26643 -43536 42259 6042 8473 -19971 -43368 63421 15471
914 15471 -40250 16765 -18590 17649 25930 -42188 28141 -2422 -42653 52641 3858 -22339
926 -22339 -1372 -35769 57036 28211 -73618 8592 15950 17835 27628 -66466 5288 40324
938 40324 -34918 29276 -5795 -40170 29242 -15888 24872 28173 -82777 7761 48220 -909
$$ packed form
852A2851M025k9238k0009O1419j2858m5498L5123k376j835O99l0026N0030n37
865B1770o1555M1465J9380j3907j0548l6612N6728J9921o9994K5344J2516l705
877H03K0548n2440K9426L5511p1377L6832K9253m0370J5127l0174L0538M9792
889E3469r0866N749N3268j5851J9792n5163O27Q0505o4509l86L9484n1925L6185
902A0379j0383j6122O8202p8719j6893Q5795l6217K431k8444k3397J06789m7950
914A5471n5721N7015l5355L6239Q281o8118P0329l0563m0231R5294m8783k6197
926b2339K0967l4397R2805k8825j01829Q2210P358J885R793r4094P1754L5036
938D0324p5242O4194l5071l4375O9412m5130M0760L301j10950R0538M0459m9129
$$ plain form
950 -909 10351 -64844 -558 78909 -34072 -14295 -4522 -31108 55368 -7973 -24461 31245
962 31245 -54379 13173 59724 -35324 -6214 -30790 2827 89600 -44125 -51979 23819 -2597
974 -2597 53228 -18888 -66339 50856 -5433 -792 45518 -55211 -1325 19752 -11654 62220
986 62220 -42368 -63878 61372 16689 15738 -25337 -72979 72015 32904 -40985 17307 -42284
998 -42284 16167 55617 -43631 20934 -12707 -52999 73958 9762 -32119 -4748 -47157 68016
1010 68016 42701 -82816 3210 311 19238 52483 -73189 -4355 39435 -39108 48765 -5303
1022 -5303 -58924 32295 -18087 30353 39009 -94427 5863 49607 -1735 22355 -73109 -11786
1034 -11786 85272 -31931 -3326 -1966 -46130 58593 -4144 -26977 38258 -61343 6838 69443
$$ packed form
950i09J1260p5195O4286P9467j12981J9777R773k6586Q6476o3341j6488N5706
962C1245q5624O7552M6551r5048K9110k4576L3617Q6773j33725p854P5798k6416
974b597N5825p2116m7451J17195n6289M641M6310j00729N3886K1077l1406P3874
986F2220j04588k1510J25250m4683r51m1075m7642J44994l9111p3889N8292n9591
998d2284N8451L9450r9248O4565l3641m0292J26957o4196m1881K7371m2409J15173
1010F8016k5315j25517Q6026k899J8927L3245j25672O8834M3790p8543Q7873n4068
1022e303n3621R1219n0382M8440Q656j33436J00290M3744n1342K4090r5464O1323
1034a1786R7058j17203K8605J360m4164J04723o2737k2833O5235r9601O8181O2605
$$ plain form
1046 69443 -33141 -2247 -30363 -12293 90120 -32185 -49043 23260 -13316 50983 -3142
1057 -3142 -63055 44394 -12973 -8594 56161 -46771 -7621 17985 -18464 64707 -24646 -67874
1069 -67874 47993 11541 15495 -6339 -66225 51378 27625 -36619 24405 -32433 -23 43060
1081 43060 -34412 25916 -920 -56811 52036 16623 -24176 -385 -43860 41939 43362 -59307
1093 -59307 546 3654 3896 35304 -45855 -2340 31109 -35880 28096 10491 -36616 15656
1105 15656 -19016 15229 38277 -59169 -7974 32799 81 17201 -38761 -12771 48758 -21253
1117 -21253 -2886 10153 -25246 23956 -5799 -9452 32602 -38882 -11325 40600 -8057 816
1129 816 -19610 -10290 53106 -13274 -30791 14245 -3356 20270 -4598 -26007 31082 -8190
$$ packed form
1046F9443j02584L0894k8116J8070J02413j22305j6858P2303l6576O4299n4125
1057c142n9913J07449n7367M379O4755j02932L9150K5606l6449Q3171q9353m3228
1069f7874J15867l6452L954k1834n9886J17603k3753o4244O1024n6838L2410M3083
1081D3060p7472O0328k6836n5891J08847l5413m0799K3791m3475Q5799J423j02669
1093e9307N9853L108K42L1408q1159M3515L3449o6989O3976j7605m7107N2272
1105A5656l4672L4245K3048r7446N1195M0773l2718J7120n5962K5990O1529p0011
1117b1253J8367J3039l5399M9202k9755l653M2054p1484K7557N1925m8657Q873
1129H16k0426R320O3396o6380j7517M5036j7601K3626k4868k1409N7089l9272
$$ plain form
1141 -8190 -17127 27913 -9670 -2716 -1181 -12983 37893 -2922 -35638 17585 9502 5622 -6475
1154 -6475 -26490 26587 10650 -24651 10064 -873 300 5509 -17764 18102 6324 -30278
1166 -30278 11824 14872 -2465 -6280 -21374 17029 16762 -26666 -2323 9044 3388 2435 -19402
1179 -19402 8468 17014 -22209 -1746 13052 -1663 -2639 -13432 8375 17756 -20655 -11418 12646
1192 12646 7259 -1867 -16167 5457 21234 -13524 -11164 10042 5153 -600 -11440 1543 19395
1205 19395 -8478 -15792 9577 10781 -3328 -13168 2549 18623 -3737 -12535 5456 10959 792
1218 792 -12916 -2560 18473 -698 -16303 4656 13104 -864 -11927 -1870 13957 2452
1230 2452 -13216 -1160 14269 4552 -14841 -4620 15225 1510 -14937 -1383 11464 3326
$$ packed form
1141h190q937M5040l7583O954J535j1802N0876m0815l2716N3223q083l880j2097
1154f475k0015N3077j5937l5301L4715j0937J173N209k3273L5866j1778l6602
1166c0278M2102L048j7337l815j5094L8403k67m3428K4343J1367n656r53k1837
1179a9402K7870Q546l9223K0463J4798j4715r76j0793K1807R381l8411R237K4064
1192A2646n387r126j4300K1624J5777l4758K360K1206m889n753j0840J2983J7852
1205A9395k7873p314K5369J204j4109r840J5717J6074k2360q798J7991N503j0167
1218G92j3708J0356K1033j9171j5605K0959Q448j3968j1063J0057J5827j1505
1230B452j5668J2056J5429r717j9393J0221J9845j3715j6447J3554J2847q138
$$ plain form
1242 3326 -11098 -6158 12469 6557 -14635 -7678 13598 6161 -13584 -5745 12033 3432 -12537
1255 -12537 -7501 8055 8611 -9671 -11747 11297 10599 -12517 -7787 11053 6544 -9779 -9422 7437
1269 7437 10785 -6773 -10898 5643 10599 -7742 -13665 10059 13183 -9732 -8231 8019 9393
1282 9393 -1318 -12198 1513 15375 -4953 -12856 7719 11670 -3713 -12082 3328 14392 -4872
1295 -4872 -10259 5005 9798 3052 -12644 -2403 20075 -3770 -17345 6036 8864 1874 -7019
1308 -7019 -7145 13403 1921 -14278 3675 8363 1228 -9498 -6655 19018 919 -20448 3990
1321 3990 6319 2032 -4051 -15979 14258 12183 -19802 375 6932 -1371 -310 -10272 10453 7259
1335 7259 -21087 3613 10572 -1014 -2817 -20267 12094 22358 -23378 -4474 10099 -934
$$ packed form
1242C326j4424M940J8627n912k1192O957K1276p437j9745P839J7778q601j5969
1255a2537N036J5556N56j8282k076K3044o98k3116M730J8840m509j6323L57J6859
1269G437L348j7558m125J6541M956j8341n923K3724L124k2915J501J6250J374
1282I393j0711j0880J3711J3862k0328p903K0575L951j5383q369J5410J1064j9264
1295d872n387J5264M793o746j5696J0241K2478k3845j3575K3381K828o990q893
1308g019j26K0548j1482j6199J7953M688p135j0726K843K5673j8099k1367K4438
1321C990K329m287o083j1928L0237k075l1985K0177O557q303J061r962K0725l194
1335G259k8346K4700O959j1586j803j7450L2361J0264m5736J8904J4573j1033
$$ plain form
1347 -934 9587 -13231 -2365 18332 -17280 -747 14777 -6769 1553 -12229 4784 26430
1359 26430 -24255 -11772 19108 881 10883 -15242 -14268 31756 -6380 -12075 12575 -12632
1371 -12632 7231 3418 -7778 22781 -18348 -17568 27663 -561 546 -11200 -18796 39391 1753
1384 1753 -29044 11727 -7675 9978 11409 -27259 15674 29 -18602 29446 -5983 -13743
1396 -13743 1954 -16516 34662 5965 -46003 13937 9348 6120 10155 -42675 9335 26574
1408 26574 -21277 15786 -8225 -18279 23908 -11994 10995 8727 -44845 20774 23744 -12673
1420 -12673 5116 -34995 10480 45501 -33894 -6798 5310 -11702 35778 -13207 -16162 21589
1432 21589 -29089 16427 28169 -30668 4264 -13772 6428 50518 -41292 -24324 27450 -3748
$$ packed form
1347i34J0521k2818J0866K0697l5612J6533J5524k1546Q322j3782J7013K1646
1359B6430n0685J2483L0880j8227J0002k6125R74M6024l8136n695K4650k5207
1371a2632J9863l813j1196L0559m1129P80M5231k8224J107j1746p596N8187l7638
1384A753l0797M0771j9402J7653J431l8668M2933j5645j8631M8048l5429p760
1396a3743J5697j8470N1178k8697n1968N9940m589l228M035n2830N2010J7239
1408B6574m7851L7063k4011j0054M2187l5902K2989k268n3572O5619K970l6417
1420a2673J7789m0111M5475L5021p9395K7096J2108j7012M7480m8985k955L7751
1432B1589n0678M5516J1742n8837L4932j8036K0200M4090r1810J6968N1774l1198
$$ plain form
1444 -3748 29278 -17593 -38499 41637 -3629 -3414 20815 -38508 10444 15352 -12708 32875 -33599
1457 -33599 -26164 49692 -5534 1295 -11359 -38662 53575 10734 -38099 16158 -20508 12352
1469 12352 29769 -37414 12096 -3655 -25157 47398 -8636 -22761 8636 -24701 41789 15083
1481 15083 -60181 16442 8282 2678 27426 -48699 -470 32228 -25639 24093 -6228 -33731
1493 -33731 28471 -7743 14587 16974 -58637 16622 32934 -13500 12045 -40267 -1850 57981
1505 57981 -28479 -9317 6352 -23945 37336 -1749 -22040 22872 -27705 10312 36237 -30032
1517 -30032 97 -9173 -2363 50921 -29484 -28809 26715 -8262 22734 -2325 -38193 29561 -826
1530 -826 -8601 28214 -27213 -5232 14551 -7932 28978 -21044 -33607 36275 5279 526 -6859
$$ packed form
1444c748L3026m6871k0906Q0136m5266K15K4229n9323M8952M908k8060M5583o6474
1457c3599P435P5856n5226O829j2654k7303R2237m2841m8833N4257l6666L2860
1469A2352J7417o7183M9510j5751k1502P2555n6034j4125L1397l3337O6490k6706
1481A5083p5264P6623q160n604K4748p6125M8229L2698n7867M9732l0321k7503
1493c3731O2202l6214K2330K387p5611P5259J6312m6434K5545n2312L8417N9831
1505E7981q6460J9162J5669l0297O1281l9085k0291M4912n0577L8017K5925o6269
1517c0032L0129r270O810N3284q0405O75N5524l4977L0996k5059l5868O7754l0387
1530h26p775L6815n5427K1981J9783k2483L6910n0022j2563O9882l0996m753p385
$$ plain form
1543 -6859 -34595 35294 16387 -30130 10377 -13525 358 24961 -19691 5962 -2232 -24903
1555 -24903 29703 5599 -16978 -1125 -17395 28542 16805 -38584 3948 6291 1240 16583
1567 16583 -26762 -1924 19363 -16881 12658 3694 -19691 7932 -3996 11586 12980 -32289
1579 -32289 3383 20237 -1200 4281 -23355 -471 29382 -14843 -3672 6943 -10706 13046
1591 13046 -1877 -5010 13033 -19057 940 22471 -5300 -2562 -12391 1956 28447 -15270
1603 -15270 -15382 11195 -568 11571 -5463 -13738 17440 -5867 -8196 14367 -6737 -1794 -1002
1616 -1002 -2991 18726 -9869 -17499 13089 3651 2436 -6384 -13534 18864 2801 -15632 7711
1629 7711 -1325 -1795 2154 -8556 10900 -127 -16638 8950 6464 -3453 -4885 -9975 14154 6902
$$ packed form
1543f859k7736O9889j8907m6517M0507k3902J3883K4603m4652K5653q194k2671
1555b4903N4606k4104k2577J5853j6270M5937j1737n5389M2532K343n051J5343
1567A6583m3345K4838K1287l6244K9539q964k3385K7623j1928J5582J394m5269
1579c2289L5672J6854k1437N481k7636K2884K9853m4225J1171J0615j7649K3752
1591A3046j4923l133J8043l2090J9997K1531k7771K738r829J4347K6491m3717
1603a5270j12K6577j1763J2139j7034q275L1178k3307k329K2563k1104M943P92
1616a002j989K1717k8595p630L0588r438j215q820p150L2398j6063j8433K3343
1629G711r036m70L949j0710J9456j1027j6511K5588k486r917j432n090K4129p252
$$ plain form
1643 6902 -17867 2836 7053 413 780 -11006 5889 8653 -13572 1574 8103 -2393 -2268 -6140
1657 -6140 7727 9003 -13877 -2466 10196 1944 -1229 -7884 3999 11775 -10065 -5535 9158
1670 9158 1788 -2097 -4884 2896 9784 -6965 -7034 8165 3917 -3213 -6404 3058 11606 -5332 -9273
1685 -9273 6347 5069 -2817 -6095 449 9852 -1817 -9235 4124 6846 -4154 -8053 965 9020
1699 9020 -1912 -9342 2041 6654 -2139 -7668 -996 8811 226 -10114 1147 9102 -1252 -8431
1713 -8431 -1252 6924 712 -8301 -1353 7860 1434 -8671 -2883 8613 2248 -9049 -1791 8396
1727 8396 2402 -5959 -2665 7100 4047 -7531 -4554 7718 4578 -7337 -4537 7657 4760 -6485
1741 -6485 -3247 6091 4109 -4369 -5195 6304 7897 -6698 -5725 6998 4829 -4738 -4959 4587 7070
$$ packed form
1643F902k4769K0703M217o640L67j1786J6895K764k2225J5146O529j0496J25l872
1657f140J3867J276k2880J1411J2662q252l173o655J1883P776k1840M530J4693
1670I158p370l885k787P780O888j6749o9J5199m248p130l191R462Q548j6938l941
1685i273J5620j278p886l278O544R403j1669p418J3359K722j1000l899R018Q055
1699I020j0932p430J1383M613q793n529O672R807q585j0340J1261P955j0354p179
1713h431P179Q176o212r013O948R213o426j0105N788J1496o365j1297P258J0187
1727H396n994q361L294R765l053j1578K977J2272l140j1915K800J2194k897j1245
1741f485L238R338j982q478q26J1499J593j4595R73J2723k169r567k21R546K483
$$ plain form
1756 7070 -4867 -5916 5451 6110 -2756 -7774 2728 8797 -5775 -6828 6745 3977 -3051 -6101
1770 -6101 -332 9464 -2583 -10019 4206 6705 -1298 -6413 -1593 8176 -3170 -9046 4464 3740
1784 3740 -1057 -4943 -3776 10738 -310 -13552 4604 6732 -1655 -3851 -4645 8897 4124 -11965
1798 -11965 430 4256 -18 -924 -5773 8279 3391 -14211 5157 8342 -3725 -1776 -7169 8105
1812 8105 11892 -14469 -1967 8287 -220 2024 -7794 1623 9978 -10618 2499 8347 -6608
1825 -6608 1749 -5236 4058 14137 -17012 -5318 15233 -1101 1782 -8761 -5340 18212 -6251
1838 -6251 -6923 8449 -6780 4474 329 -4557 13167 -13417 -8703 19135 -4400 -3085 -4388
1851 -4388 -8057 22984 -3977 -19794 10479 -1285 4278 3605 -16198 11332 -285 -10768 17245
$$ packed form
1756G070j1937j049J1367O59q866n018J0502O069j4572j053J3573k768p028l050
1770f101N769R796j2047p436J4225K499q003n115M820R769j1346n876J3510p24
1784C740m797l886J167J4514j1048j3242J8156K128q387k196p94J3542m773j6089
1798a1965J2395L826m274r06m849J4052m888j7602J9368L185j2067J949n393J5274
1812H105L787k6361J2502J0254q507K244r818R417Q355k0596J3117N848j4955
1825f608Q357o985R294J0079l1149J1694K0551j6334K883j0543L421K3552k4463
1838f251o72J5372j5229J1254m145m886J7724k6584M714K7838k3535J315j303
1851d388l669L1041k6961j5817L0273j1764N563o73j9803K7530j1617j0483K8013
$$ plain form
1864 17245 -7997 -9447 5372 -7894 18414 -1091 -27708 15617 7526 -2687 3256 -21604
1876 -21604 11221 16334 -16442 8912 -4114 -9860 15856 -8499 5338 5361 -25777 17408 14991
1889 14991 -14030 2764 -15397 9499 25611 -25262 -3114 9474 -5632 18382 -11474 -10481
1901 -10481 16674 -15330 9507 14500 -22676 5481 -1320 2095 23738 -28429 -10474 23855
1913 23855 -4978 9123 -11270 -17650 28202 -5344 -7193 11691 -21278 9163 10752 -11020
1925 -11020 16100 -20043 -12236 32942 -8721 -6773 -4186 -15934 32648 111 -27099 12309
1937 12309 -7124 8203 13721 -25091 9324 441 -12977 28360 -10558 -16263 10139 -10467
1949 -10467 22380 2700 -37275 16706 10397 -1985 9845 -27752 6252 21074 -16901 12708
$$ packed form
1864A7245k5242j450J4819j3266K6308j9505k6617M3325q091j0213N943k4860
1876b1604L2825N113l2776K5354j3026n746K5716k4355J3837K3l1138M3185k417
1889A4991k9021J6794j8161K4896J6112n0873K2148J2588j5106K4014k9856R93
1901a0481K7155l2004K4837M993l7176K8157o801L415K1643n2167J7955L4329
1913B3855k8833J4101k0393o380M5852l3546j849J8884l2969L0441J589k1772
1925a1020K7120l6143P807M5178m1663J948K587j1748M8582l2537k7210L9408
1937A2309j9433J5327N518l8812L4415q883j3418M1337l8918n705K6402k0606
1949a0467L2847j9680l9975N3981o309j2382J1830l7597L4004J4822l7975K9609
$$ plain form
1961 12708 -5582 -16317 22552 -6355 4381 6906 -32727 18094 19663 -16147 4905 -17680
1973 -17680 6400 31268 -24392 -5555 7425 -9615 22891 -6787 -13135 15447 -17252 10740
1985 10740 18952 -25284 2433 -1230 784 28135 -25366 -15384 21926 -5271 9646 -6990 -21117
1998 -21117 22965 -2460 -6066 13747 -20549 3335 11182 -8625 15650 -16849 -16035 29638 -3501
2011 -3501 -6457 -3069 -17710 24713 5207 -22275 9062 -6486 2623 13594 -16163 5497 -1079
2024 -1079 -12805 23386 -3469 -14059 5919 -8168 18166 5884 -28964 9400 9070 -1928
2036 -1928 8005 -18086 2322 14673 -11596 8948 -361 -12819 11074 -2702 5858 6761 -23318
2049 -23318 8362 15663 -8240 1695 -11406 1568 20703 -12712 -4256 6672 -6877 9039
$$ packed form
1961A2708j8290j0735L8869k8907J0736K525l9633N0821J569l5810K1052k2585
1973a7680K4080K4868n5660J8837J2980j7040L2506k9678o348K8582l2699K7992
1985A0740Q212m4236K7717l663K014K7351n3501R982L7310k7197J4917j6636j4127
1998b1117M4082k5425l606J9813l4296K3884P847j9807K4275l2499Q14M5673l3139
2011c501k956L388j4641M2423j9506k7482L1337j5548R109J0971k9757K1660o576
2024a079j1726L6191k6855j0590J9978j4087K6334j2282l4848L8364l30j0998
2036a928R933k6091K0408J2351k6269K0544r309j2458K3893j3776Q560R03l0079
2049b3318L1680P301k3903R935j3101J2974J9135l3415Q456J0928j3549J5916
$$ plain form
2061 9039 -2474 -5191 8448 -11484 3248 13977 -10624 -1236 -2903 516 16642 -13070 -10411
2074 -10411 12862 -1408 2303 -3046 -9099 10742 -3176 -5707 8829 -5991 -1279 2077 -2332
2087 -2332 10251 -8338 -11384 13176 1400 -2986 -2079 -7091 11232 1818 -12074 4740 547
2100 547 -1500 2475 -4130 5515 -243 -9090 8020 2881 -4790 -374 -3602 8247 3945 -12576
2114 -12576 2931 6466 -2451 -211 -3994 3705 4906 -7261 1723 5167 -2970 -796 -1908 4926
2128 4926 4219 -9456 507 7869 -1404 -1998 -2700 2656 6124 -6228 -2878 6386 236 -2638 -2610 2549
2144 2549 4069 -5781 -2683 5603 330 -2767 -2338 2436 5863 -4770 -5579 5042 2544 -3926 -2807
2159 -2807 1679 3977 -2979 -4566 3096 2603 -3156 -4122 1546 5568 -2389 -5582 3394 3599 -3239 -3499
$$ packed form
2061I039j1513k717J3639j9932J4732J0729k4601R388j667L419J6126k9712K659
2074a0411K3273j4270L711n349o053J9841j3918k531J4536j4820M712L356m409
2087b332J2583j8589l046K4560j1776m386R07n012J8323r414j3892J6814m193
2100E47k047L975o605R645n758q847J7110n139p671M416l228J1849m302j6521
2114a2576J5507L535q917K240l783P699J201j2167Q984L444q137K174j112O834
2128D926p07j3675R963P362r273n94p02N356L468j2352L350R264o150k874K8N159
2144B549J520r850L098Q286n273l097M29M774L427j0633q09J0621k498o470J119
2159b807M486K298o956j587P662m93n759r66N668M022p957l193Q976K05o838k60
$$ plain form
2175 -3499 1364 4387 -667 -5545 1095 5165 -1650 -4934 697 4833 -1003 -4464 1866 4863 -625
2190 -625 -3862 -518 4963 1195 -5211 487 5947 -356 -4755 365 4533 314 -4343 -643 4943
2205 4943 1875 -4087 -2017 4683 1759 -5328 -669 5124 94 -3670 -867 3577 2594 -3788 -3047
2220 -3047 4451 2456 -3970 -2594 3838 2584 -5135 -2257 3637 1058 -2559 -3500 1227 4511 -3683
2235 -3683 -4345 5182 2185 -4257 -2825 2026 4152 -3182 -4531 3060 2477 -1386 -3733 -697 5750
2250 5750 -2630 -5422 5308 2004 -2268 -1028 -914 4831 -534 -6564 4306 4525 -2177 -3082 -1216
2265 -1216 6623 440 -7378 3085 2366 -1171 1578 -2885 4326 2086 -9036 4308 5813 -4123
2279 -4123 -850 -1758 4917 4564 -8978 854 5065 -1416 1410 -4759 1991 7067 -8304 1614 5225
$$ packed form
2175c499M863L023n054m878O640M070o815l284N631M136n836l461O330K997n488
2190f25l237L344N481l768o406N698N460o303m399N120M168m219m657L700N586
2205D943l068n962K070O700k924p087M659N793n030l764K803M444r83o382P41
2220c047P498j995o426J376O432j254p719K878N894k579l617r41M727L284q194
2235c683o62R527k997o442J432M851K126p334j349P591n83l863k347L036O447
2250E750q380k792J0730l304m272J240J14N745n365o030J0870K19o702r05J866
2265a216P839o183p818J0463p19l537K749m463P211k240j1122J3344J505r936
2279d123L273r08O675l53j3542R832M211o481K826o169O750N076j5371R918L611
$$ plain form
2294 5225 -6853 1695 -644 730 6866 -10351 -1891 10417 -2618 -1321 -4861 -1302 11266 -6336
2308 -6336 -4520 5833 -5915 3450 929 -5777 7488 -7287 -4212 13716 -5224 -4427 535 -3039
2322 -3039 12308 -4380 -11960 8947 -793 1369 1876 -10604 7874 610 -7468 11690 -5881
2335 -5881 -6373 7900 -3586 8648 -1457 -16046 12394 5515 -4910 1500 -10726 8836 9253
2348 9253 -12773 5566 -1461 -5311 11742 -6372 630 4544 -13920 12283 7862 -12784 2293
2361 2293 -4873 6442 12780 -17835 -690 8213 -3882 10015 -8615 -6753 11516 -8790 5866
2374 5866 7633 -17072 4652 2831 -653 10742 -17967 -4115 17408 -4634 2159 -6639 -8047
2387 -8047 18524 -5604 -6298 7277 -12537 7542 6906 -9852 7952 -11129 -4753 20887 -8697
$$ packed form
2294E225j2078Q548k339J374O136j7217Q460J2308j3035J297l540L559J2568j7602
2308f336J816J0353j1748R365k521o706J3265j4775L075J7928j8940P97M962l574
2322c039J5347j6688p580K0907r740K162N07j2480J8478p264q078J9158j7571
2335e881m92J4273j1486J2234j0105j4589K8440o879j0425O410j2226J9562M17
2348I253k2026J8339p027l850J7053j8114P002L914j8464K6203m421k0646J5077
2361B293p166J1315O338l0615J7145Q903j2095J3897j8630J862J8269k0306J4656
2374E866J767k4705K1724j821l484J1395k8709J3852K1523k2042O793q798j408
2387h047K6571k4128o94J3575j9814K0079o36j6758J7804j9081O376K5640k9584
$$ plain form
2400 -8697 -5674 221 -5636 19819 -4146 -16588 10289 -4099 5752 6652 -16999 7861 1051
2413 1051 -6947 16900 -10507 -9317 10363 -4549 12205 -2164 -21161 15596 5477 -3455 4034
2426 4034 -17187 8954 12474 -13575 8780 -5084 -8405 17173 -6632 396 3963 -18259 15445
2439 15445 9663 -14122 3551 -8815 6709 16212 -19477 81 5510 -6531 15155 -8505
2451 -8505 -8268 12561 -12153 7863 9605 -19683 5174 1514 -155 14141 -19858 -5260 16750
2464 16750 -6268 5208 -6822 -10499 19381 -5225 -4679 9009 -15591 6379 8398 -9939 9658
2477 9658 -10301 -6771 21215 -7579 -5506 851 -8132 17716 -1265 -14650 10293 -4518 2736
2490 2736 8344 -14257 6846 1527 -8875 16549 -5732 -9809 8309 -4774 9539 1583 -18216
$$ packed form
2400h697L023N895n857K5455k3965j2442K6877j4388R851R00k3651K4860o810
2413A051p998K3847k7407J190J9680j4912J6754j4369j8997L6757j0119q932P489
2426D034k1221K6141L520k6049K2355j3864l321K5578k3805P028L567k2222L3704
2439A5445n782k3785J7673j2366J5524R503l5689J9558N429j2041K1686k3660
2451h505K37K0829k4714K0016J742k9288K4857l660j669J4296l3999J4598K2010
2464A6750k3018J1476j2030l677K9880k4606N46J3688k4600K1970K019j8337J9597
2477I658j9959L530K7986k8794K073O357q983K5848j8981j3385K4943j4811P254
2490B736N608k2601K1103n319j0402K5424k2281m077J8118j3083J4313p956j9799
$$ plain form
2503 -18216 10836 5549 -3349 4369 -11706 4990 9309 -11118 7032 -1372 -8674 11065 -3618
2516 -3618 636 4439 -14305 8104 9125 -9913 1149 -4730 2894 10935 -11674 -982 5193
2529 5193 -4992 6815 -3345 -3768 7506 -8068 2654 8486 -10305 410 719 -946 8308
2542 8308 -9507 -4634 9871 -2579 176 -2092 -3761 8257 -3794 -2838 6862 -5343 351 2581
2556 2581 -3125 5947 -5268 -5697 9927 -740 -3397 -66 -2010 7125 -1091 -6592 4832 100
2570 100 -209 1390 -3060 4738 -939 -5554 6581 343 -3767 1411 -882 4734 281 -7261 3927
2585 3927 3443 -2023 -650 -2012 3765 1627 -5590 3046 2107 -2911 318 -1189 2998 1672 -6009
2600 -6009 1784 4331 -2230 -1653 -1402 2749 1862 -5171 368 3377 -939 -1338 -1972 1910 2485 -4491
$$ packed form
2503a8216K9052n287q898P718j6075J6696M319k0427J8150q404p302J9739j4683
2516c618M254L803j8744K2409J021j9038J1062n879P624Q041k2609J0692O175
2529E193j0185J1807j0160m23J1274j5574J0722N832j8791J0715L09j665R254
2542H308j7815M873J4505j2450K755k268j669J2018j2051R56R700j2205N694K230
2556B581n706R072j1215m29J5624j0667k657L331j944R135q216n501J1424m732
2570A00l09J599m450P798n677m615J2135o238m110N178k293N616m453p542J1188
2585C927m84n466J373j362N777k138p217Q636r39n018L229j507M187j326p681
2600f009P793K547o561N77K51M151q87p033N539L009m316l99o34L882N75o976
$$ plain form
2616 -4491 5 4297 -1236 -2203 -812 1877 2079 -3908 -2157 3464 470 -1892 -1566 2071 2465 -3233
2632 -3233 -1612 3278 759 -1896 -1230 1573 2493 -2200 -2770 2827 1950 -2704 -1853 2190 2900 -1785
2648 -1785 -2244 2273 2099 -1580 -1897 1014 3044 -975 -3206 2256 2805 -2031 -2159 1363 2480 -526
2664 -526 -2522 1070 2649 -988 -2947 540 2790 -956 -3184 983 2894 -1153 -2408 -149 2372
2679 2372 63 -3381 -285 3662 -313 -3107 -4 2416 -42 -3183 -263 2372 -186 -2464 -1084
2694 -1084 2377 1146 -4012 -1484 3617 245 -2339 -336 1774 1335 -2687 -1089 2942 368 -2475
2709 -2475 -1442 2348 2802 -2969 -1657 3675 261 -1937 -725 746 3060 -1539 -2952 3410 1483
2724 1483 -2050 -767 1288 2606 -2024 -2330 4081 1208 -1962 -1261 -480 4096 -573 -4793 3757 2100
$$ packed form
2616d491M496M292n533r67J391K689K02n987J751N621k994k362L26L637L94n698
2632c233J621M890k519k655O66K803R20m693n70N597q77m654Q51M043P10m685
2648a785m59M517j74l679l17K911K030m019k231N462N49m836j28L522J117l006
2664e26j996L592J579l637j959L487K250l746k228M167J911m047j255K259K521
2679B372k309l444L096L947l975k794L103K420k458l141K920K635k558k278J380
2694a084L461j231n158K528N101l372k584K003K110m39m022J598M031k574k843
2709b475J033L790M54n771J312N332l414k198J212J471K314m599j413O362j927
2724A483l533J283K055J318m630l06O411k873l170P01P81M576m669m220Q550j657
$$ plain form
2740 2100 -2315 555 -580 1764 67 -4161 3173 2407 -2719 -520 -571 3450 -25 -6896 2686 3267
2756 3267 -2671 418 -2726 1086 3563 -5492 1132 3250 -4598 748 624 1236 1917 -6837 1249 5088
2772 5088 -3674 -438 -2351 681 6327 -6095 -1657 5176 -4072 1680 827 -2970 4182 -3939 -521
2787 -521 7227 -4712 -2244 976 -84 6690 -5534 -5328 8055 -1132 450 804 -5851 6060 149
2802 149 -4462 7037 -3613 -3039 5069 -2036 4031 -2896 -7123 9629 1058 -3754 1275 -5235 7078
2817 7078 3142 -9481 5022 -672 -3027 7040 -4853 27 2130 -7414 8422 2056 -8976
2830 -8976 2579 -1756 4703 5053 -12656 2785 5388 -4310 4899 -6472 -2967 8493 -6003 2968
2844 2968 3431 -10247 5088 1862 -1187 4318 -11219 1804 11185 -6400 226 -3605 -2827 12143
$$ packed form
2740B100m415K870j135K344j697m228P334p66n126K199n1M021l475o871R582N81
2756C267n938L089l144L812K477r055O624K118p848N346j24O12O81q754Q086L839
2772E088q762L236j913L032N646j2422M438O833r248N752q53l797P152q121L418
2787e21P748j1939K468L220j060O774j2224K06J3383r187J582L54o655J1911n911
2802A49m611J1499j0650N74Q108p105O067o927m227J6752q571m812N029o510J2313
2817G078l936j2623J4503n694k355J0067j1893M880K103r544J5836o366j1032
2830h976J1555m335O459L50j7709J5441K603r698R209j1371L505J1460j4496Q971
2844B968M63j3678J5335l226l049N505j5537J3023R381j7585O626l831P78J4970
$$ plain form
2858 12143 -6256 -4303 6327 -7209 5568 4082 -7343 5062 -5342 -397 12522 -7969
2870 -7969 -3469 2439 -1961 11197 -5621 -9941 9744 -1753 2345 3026 -10716 6504 2424 -4664
2884 -4664 9031 -7692 -4750 8803 -2808 5088 -3391 -10745 12352 1578 -5042 2594 -8384
2897 -8384 7322 6888 -10909 4805 -1852 -4708 10508 -4996 -1574 2202 -8549 10324 3772
2910 3772 -11283 2675 -2647 4790 7762 -14475 943 6043 -4329 7446 -6159 -5682 8834
2923 8834 -5685 3646 3681 -12083 5043 3115 -844 5150 -12188 187 11516 -5816 991 -3306
2937 -3306 -4555 12275 -4223 -4647 5691 -7897 4702 5578 -6569 4003 -4939 -1060 12079
2950 12079 -6971 -3665 2292 -2185 10168 -3457 -9395 8384 -1869 700 4300 -8675 4152
$$ packed form
2858A2143j8399J953J0630j3536J2777j486j1425J2405j0404M945J2919k0491
2870g969M500N908m400J3158j6818m320J9685j1497M098O81j3742J7220m080p088
2884d664J3695j6723K942J3553j1611P896q479p354K3097j0774o620P636j0978
2897h384J5706m34j7797J5714o657k856J5216j5504L422L776j0751J8873o552
2910C772j5055J3958n322P437K972k2237J5418N100j0372J1775j3605M77J4516
2923H834j4519R331L5j5764J7126j928l959N994j7338J2375J1329j7332O807m297
2937c306j249J6830j6498m24J0338j3588J2599Q76j2147J0572q942L879J3139
2950A2079j9050L306N957m477J2353j3625n938J7779j0253K569L600j2975J2827
$$ plain form
2963 4152 1767 -4321 8541 -4517 -5966 6311 -1204 4371 -1993 -9471 8791 2860 -3813 1585
2977 1585 -6676 4060 5734 -7452 3636 -648 -4451 7255 -2431 -1039 1313 -6611 6037 3591
2991 3591 -7038 1098 -1524 2835 4640 -8540 977 3882 -3543 3808 -2261 -2756 4682 -4474 1931
3006 1931 4244 -6851 599 1954 579 3425 -6602 -408 6385 -2591 243 -1697 -1606 6061 -2943
3021 -2943 -1792 4445 -3917 449 2383 -1798 2700 -3278 -1318 6308 -1826 -2132 239 -128 4551
3036 4551 -2451 -3541 4356 -995 -545 1407 -2505 2466 -488 -2979 4571 -637 -2986 1339 -6
3051 -6 2321 -1551 -4115 3667 1148 -1801 214 -1659 2481 530 -3620 2543 812 -2941 986 -127
3067 -127 1188 48 -3820 1624 2050 -2627 -950 -536 1952 880 -3641 991 2402 -1653 -29 -430
$$ packed form
2963D152k385o088J2862j3058j449J2277p515N575o364p478J8262n931o673N398
2977A585q261J0736J674j3186J1088m284l803J1706r686J392K352p924J2648k446
2991C591j0629Q136k622M359J805j3180R517K905p425P351o069m95P438r156O405
3006A931K313j1095P450J355j375K846j0027O194O793q976K834j940R1P667r004
3021b943J151O237q362M366J934m181M498n978J960P626q134l06K371l67M679
3036D551p002j090P897n351M50J952l912M971k954k491P550n208k349M325j345
3051fK327l872k564P782k519k949K015j873M140j951m150O163j731l753L927j113
3067a27J315j140l868N444M26m677J677M14K488j072m521M632J411m055J624m01
$$ plain form
3083 -430 875 1333 -2704 530 2969 -1728 -1499 291 1463 900 -2339 175 2624 -485 -1221 -274
3099 -274 1152 1182 -2400 -517 2752 -88 -1673 391 966 973 -1635 -1124 2368 1125 -1480 -666 1938
3116 1938 1020 -1731 -825 1763 544 -1524 -250 1426 987 -1064 -1589 1601 1263 -2051 -1165 1774
3132 1774 1088 -1360 -1151 968 885 -1371 -1453 798 1504 -982 -1950 925 1688 -1634 -1288 865 1129 -781
3150 -781 -1833 316 1471 -679 -1793 547 1681 -606 -2096 830 2002 -852 -1227 498 1263 174
3166 174 -2011 -173 2201 -359 -1648 426 1358 81 -1865 173 1912 -50 -1088 130 1329
3181 1329 979 -1958 -508 3045 -93 -1707 390 969 1149 -1242 -1143 2075 289 -1307 -281 645
3197 645 1372 -1819 -1216 2898 -279 -2122 -31 188 1694 -694 -2733 2479 840 -1989 69 4
$$ packed form
3083d30J305M58m037L234K439m697K29J790J172n63l239K514K449l109p36R47
3099b74J426L0l582J883L269k840j585K064N75Pk608N11L492j243k605Q14K604
3116A938r18k751R06K588j219k068J274J676m39k051n25L190l38l314Q86K939
3132A774o86k448K09K119q3k256q2K251P06k486r68K875P63l322L46K153K64j910
3150g81j052K149J155k150j114K340J134k287j490K926J172k854l75J725P65j089
3166A74k185J838K374k560j289K074R32j277j946K038J739j962j038J218J199
3181A329l50k937J450L553l138j614K097N79J80k391R9L218j786j596J026R26
3197F45P27l191O03M114l177j843K091K19J506k388k039N212j639k829K058o5
$$ plain form
3213 4 1123 -560 -2135 2635 199 -2420 252 -654 1513 -143 -3833 2513 2481 -2640 81 -415 766
3230 766 1373 -3446 1024 1667 -2542 1006 94 144 1076 -3815 2161 3432 -3427 215 129 611 3761
3247 3761 -3961 -883 3710 -2399 1119 256 -1460 2355 -2530 526 3921 -4157 -437 1481 -376
3262 -376 3838 -3852 -2298 6040 -1812 -957 755 -2959 3754 -123 -2710 3950 -2781 -1147 3480
3277 3480 -1980 1787 -1982 -3458 7408 -1483 -4135 2081 -2950 3882 1210 -7177 3695 161
3291 161 -2285 4363 -3780 -409 1817 -4050 5494 -393 -5978 3632 -585 2241 1636 -8369 3841
3306 3841 4057 -4096 2423 -3372 -1021 5935 -3879 1434 1581 -6128 4457 1241 -1855 2316 -6539
3321 -6539 2954 6861 -6399 600 -329 -1080 7623 -4897 -2677 5386 -3869 3492 1530 -5842 3689
$$ packed form
3213DJ119j683j575M770k436k619K672r06K167j656l690O346l2n121K721m96J181
3230G66O07m819M470O43m209L548r12N0R32m891N976J271o859L642q6M82L150
3247C761p722L078M593o109L518q63j716L815m885L056L395q078L720J918j857
3262c76M214p690J554Q338p852Q55J712l714O713l877k587O660o731J634M627
3277C480n460L767l769j476J0866q891k652O216n031O832k672q387J0872l534
3291A61k446O648q143L371K226n867R544n887n585R610m217K826o05j0005J2210
3306C841K16q153O519n795K351O956r814N313J47p709J0585l216l096M171q855
3321f539R493L907j3260O999r29p51Q703j2520K220Q063r255P361j962p372R531
$$ plain form
3336 3689 -2018 552 6552 -7402 -1131 3801 -1316 5475 -4780 -5512 8480 -1377 -323 1739
3350 1739 -6547 4679 1777 -4006 4290 -5553 -1582 6853 -2880 1589 -2744 -5271 9391 -334
3364 -334 -5511 1879 -4039 5076 3511 -8387 2678 -321 -2287 6319 -4515 -1662 1928 -4232
3378 -4232 7216 282 -8195 3711 -275 2496 3070 -9899 2705 5109 -3726 3572 -4011 -2575
3392 -2575 6778 -3221 1650 1475 -7070 5290 2265 -2012 2243 -7377 2781 8065 -5914 229
3406 229 -831 -1776 7943 -4229 -3194 4528 -3865 3587 2834 -5441 2843 -2677 253 6828 -6812
3421 -6812 -1426 3475 -1552 5669 -4229 -5873 7357 -1350 -473 2189 -5909 3569 1403 -3408 4862
3436 4862 -4492 -2629 5567 -2295 1833 -1716 -5512 7812 19 -4661 2341 -3469 2980 3172 -6621
$$ packed form
3336C689n707K570O000j3954O271M932n117O791j0255p32J3992r857J054K062
3350A739q286J1226k902n783Q296r843L971Q435r733M469m333k527J4662r725
3364c34n177P390n918R115j565j1898J1065k999j966Q606j0834K853L590o160
3378d232J1448o934q477J1906l986K771N74j2969J2604K404q835P298p583J436
3392b575R353r999M871j75q545J2360l025m277M255r620J0158N284j3979O143
3406B29j060r45R719j2172J035P722q393P452p53q275Q284n520K930O575j3640
3421f812N386M901n027P221r898j644J3230q707Q77K662q098R478k166m811Q270
3436D862r354J863Q196p862M128l549l796J3324p793m680P002n810O449J92r793
$$ plain form
3451 -6621 2763 164 -2787 4881 -2979 -1085 1830 -3770 5190 871 -5974 2822 -482 1409 2805
3466 2805 -6885 1930 4050 -3396 2509 -1572 -1955 4075 -3005 1375 2372 -4632 2455 1435 -970
3481 -970 2275 -4624 1096 5186 -3962 59 498 -1396 4290 -2227 -1665 3634 -2724 689 2124 -1956
3497 -1956 1492 -1777 -385 4338 -3095 -1383 1440 -984 2529 -1613 -2627 4010 -921 -1538 1534
3512 1534 -1624 1352 348 -1837 2882 -940 -2085 1503 -584 722 -1224 -2538 3488 6 -2755
3527 -2755 989 -853 1005 330 -2829 1734 874 -2140 1247 202 -43 -111 -1930 1804 942 -2079
3543 -2079 472 429 636 521 -2668 1192 2063 -2098 -23 608 255 866 -1336 772 1997 -1339 -465
3560 -465 782 516 422 -1616 826 1952 -1009 -926 439 327 392 -1300 -287 2055 -513 -1191 539
$$ packed form
3451f621R384k599k951P668p860J894K915n600Q960m319o845Q796l304J891J396
3466B805r690Q815K120p446N905m081l83O030p080M380R97p004P087j020k405
3481i70L245o899N720M090r148M021M39j894N686o517N62N299o358L413J435m080
3497a956L448l269J392M723p433J712K823k424L513m142j014O637m931o17L072
3512A534l158K976j004k185M719l822j145L588k087J306j946j314O026l482k761
3527b755L744j842J858o75l159M563q60l014L387j045k45o8j819L734q62l021
3543b079K551m3K07j15l189L860Q71m161K075O31l53O11k202K108J225l336Q74
3560d65J247k66r4k038K442J126k961Q3J365j12O5j692J013K342k568o78J730
$$ plain form
3577 539 826 -88 -1127 -101 1650 -445 -1119 381 647 425 -1449 -1053 1568 204 -1464 12 648
3594 648 -40 -1007 -497 967 192 -1093 -116 968 491 -1262 -794 1284 281 -1472 -181 819 534
3611 534 -322 -971 1062 888 -1275 -930 1308 659 -825 -909 873 631 -697 -675 678 639 -195 -1146 970
3630 970 1400 -1145 -721 1007 525 -369 -1109 497 1399 -349 -726 155 892 49 -1111 668 1589 -1061
3648 -1061 -755 490 315 159 -1011 -318 1755 -503 -1354 329 699 140 -1163 -388 1524 -922 -1143
3665 -1143 398 194 601 -928 -704 2003 -646 -1743 611 712 566 -825 -1069 1502 126 -1363
3681 -1363 242 -272 517 -520 -1562 2010 -150 -1764 1017 137 514 -42 -1946 1845 1071 -1994
3697 -1994 306 258 861 452 -2245 1469 1173 -1749 1557 -213 -287 921 -2364 1688 2267 -3145 484
$$ packed form
3577E39K87r14j039J026J751k095o74J500K66k22j874L96K621j364j668J476O36
3594F48o88r67N10J464p75j285R77J084m77j753M68K078j003j753J291J000k85
3611E34q56o49K033j74k163L45K238o49j484q4J782k42j328K2J353l9q34r51K116
3630I70M30k545M24J728m82q94p40J606R02j748l77Q81P37q43j160J779R21k650
3648a061L06J245j75j56j170O93K073k258q51J683L70n59j303P75J912k446k21
3665a143J541k04M07j529K24K707k649j097K354J01j46j391k44K571j376j489
3681a363J605n14P89j037j042L572k160j614K781q80L77n56j904L791p74l065
3697a994K300m8O03m09k697L714k96k922L306j770p4J208l285M052N79n412L629
$$ plain form
3714 484 964 63 1156 -2526 110 2294 -1616 596 230 -943 1905 -1743 367 2638 -3435 300
3730 300 1496 -1094 1358 -2528 -891 4061 -1749 -1042 622 -1322 2631 -1111 -1908 2616 -2427 27
3746 27 2620 -2375 984 -884 -1941 4586 -1900 -3076 2151 -1217 2054 -33 -4327 3125 -25
3761 -25 -1333 2264 -2931 355 1412 -2651 3809 -1039 -3847 4202 -440 428 663 -4998 3432 2709
3777 2709 -3404 1728 -1494 94 3482 -3377 1345 703 -3504 4287 9 -1976 1650 -3564 3027
3792 3027 3723 -5513 711 846 -316 4366 -4269 -1317 3491 -2648 2466 8 -3899 3007 -1560
3807 -1560 796 3399 -5994 262 3058 -1729 2743 -3824 -2227 6262 -2401 -814 528 -3633 4140
3822 4140 309 -2910 2764 -3660 197 4588 -3684 606 -1574 -2442 6727 -2043 -4041 2317 -1745
$$ packed form
3714D84M80r01J093l682K636K184l910K212l66j173K848l648K110K271o073L735
3730C00J196k590K452l886J637M952n810P07J664j944L953l742p97M524n043K454
3746B7K593m995L359j868j057O527o486j176N227l368L271k087m294P452l150
3761b5j308L597n195L286J057m063O460m848k808Q049m642Q68K35n661Q430p23
3777B709o113N132l222J588L388o859M722o42m207P791m278j985L626n214O591
3792C027O96r236O224J35j162M682q635K952M808o139N114k458l907O906m567
3807a560K356K603r393O256K796m787M472o567J597Q489q663J587J342m161P773
3822D140l831l219N674o424L857M391q272M290k180q68R169q770j998O358m062
$$ plain form
3837 -1745 3417 771 -5694 2919 -202 -632 3796 -4083 -429 2074 -2435 4949 -1760 -5167 4432
3852 4432 -21 1059 1251 -6016 3653 3310 -3383 2308 -2876 -173 4733 -3275 1367 372 -4617 5156
3868 5156 490 -2226 1876 -4470 3114 4563 -5482 816 145 -464 4728 -4177 -1470 3354 -2992
3883 -2992 2890 640 -4445 2833 -1814 789 3909 -6019 -76 3240 -1840 2904 -3515 -3215 5798
3898 5798 -1904 -553 1096 -3803 3227 107 -2511 3390 -3588 -734 4434 -2897 1224 -925 -3184
3913 -3184 5769 -1285 -3581 2263 -1881 2338 1387 -4644 2780 -267 -1434 3765 -2920 -607 1892
3928 1892 -2603 3885 49 -4526 3166 -137 91 1532 -4438 1871 2716 -2975 1670 -976 -523 2854
3944 2854 -2333 1126 1079 -3425 2660 829 -1729 1466 -3108 1219 3321 -3459 33 698 -826 2507
$$ packed form
3837a745N162k646o465Q613l121m30M428p879L654K503m509P384o709l407R599
3852D432m453J080J92p267R669l43o693N691n184K703M906q008M642r95m989R773
3868E156m666k716M102o346P584J449j0045O298o71o09N192q905K707M824o346
3883b992N882k250n085P278m647K603L120r928N943L316n080M744o419L00R013
3898E798p702J351J649m899P030l120k618N901o978K854N168p331M121k149k259
3913c184Q953p054k296N844m144M219r51o031P424l047j167N199o685K313K499
3928A892m495O488l836m575P692l303K28J441n970O309Q45n691M645k646M53L377
3944B854n187L459m7m504O085j831k558L195m574M327K102o780L492O65j524L333
$$ plain form
3960 2507 -1889 -1128 2153 -2057 928 1044 -1717 1339 -1012 -370 2682 -3089 -807 2092 -971 1294
3976 1294 -1372 -1713 2786 -1084 -1288 1049 -1328 869 4 -1115 2067 -1347 -893 1790 -737 407
3992 407 -597 -1546 2507 -121 -1979 910 -55 564 283 -1323 1631 267 -1373 1091 -219 406
4008 406 -19 -1136 1641 480 -1785 998 533 172 233 -1412 708 1326 -1501 158 356 -90 206
4025 206 -766 827 871 -1417 16 661 227 297 -1279 461 1402 -1601 -428 824 56 93 -949 179
4043 179 925 -934 -599 520 40 114 -799 166 1149 -916 -958 560 124 -73 -776 -431 1136 -273 -1235
4062 -1235 619 536 -103 -838 114 1061 -166 -668 430 567 51 -370 -446 914 251 -1064 431 748
4080 748 91 -448 -197 897 606 -715 -3 818 472 -379 -464 881 444 -1040 -146 939 226 -397 -562
$$ packed form
3960B507m396P61L281m210K985J16k761L056k351O42L052n771K282K899l063K265
3976A294k666l41M499l870k04K337k377K197q65j119L182l414M54K683k527J144
3992D07j004r49M053k628j858K889r65O19k81j606K954j364j640K464j310O25
4008D06m25j117K777j161k265K783m65l61O1j645K120O18k827J659J98m46K96
4025B06r72J593M4k288J433O45m34P0j576J740R41l003J173J252p68L7j042J128
4043A79P46j859L35J119m80P4r13R65R83k065m2J518m36j97p03L45J567j409r62
4062a235J854q3o39p35R52R47j227n02J098J37n16m21p6J360o63j315J495L17
4080G48o57n39K51J094k91j321P12Q21l46q51q5J345m37j484Q94J085p13o23j65
$$ [...]
8191e2
##END NTUPLES=NMR FID
##END=
