##TITLE=1H_LR-725-C1-Et20
 CDCl3, 24 sc, 
 30.10.2020
##JCAMPDX= 6.0         $$ Bruker NMR JCAMP-DX V2.0
##DATA TYPE= NMR FID
##DATA CLASS= NTUPLES
##ORIGIN= UXNMR, Bruker Analytische Messtechnik GmbH
##OWNER= root
$$ XWIN-NMR		Version 3.5
$$ Fri Oct 30 11:22:13 2020 Russian Standard Time (UT+4h)  she@DPX200
##.OBSERVE FREQUENCY= 200.1315066352
##.OBSERVE NUCLEUS= ^1H
##.DELAY= (6, 6)
##.ACQUISITION MODE= SIMULTANEOUS
##.ACQUISITION SCHEME= undefined
##.AVERAGES= 8
##.DIGITISER RES= 18
##SPECTROMETER/DATA SYSTEM= spect
##.PULSE SEQUENCE= zg30
##.SOLVENT NAME= CDCl3
##.SHIFT REFERENCE= (INTERNAL, CDCl3, 0, 15.7039)
##AUDIT TRAIL= $$ (NUMBER, WHEN, WHO, WHERE, WHAT)
$$ ##TITLE= Audit trail, XWIN-NMR		Version 3.5
$$ ##JCAMPDX= 5.01
$$ ##ORIGIN= Bruker BioSpin GmbH
$$ ##OWNER= she
$$ F:/spectra/data/she/nmr/H-F/1/audita.txt
$$ ##AUDIT TRAIL=  $$ (NUMBER, WHEN, WHO, WHERE, WHAT)
(   1,<2020-10-30 11:17:07.84 +0400>,<she>,<DPX200>,
      <created by zg, POWCHK disabled, PULCHK disabled
       configuration hash MD5:
       00 E9 B6 7A A2 85 ED C7 34 08 36 98 17 FE 4E 26
       data hash MD5: 16K
       E2 91 47 A0 99 1D 53 01 D2 C8 A2 9C 4E 03 08 42>)
$$ ##END=
$$ 
$$ hash MD5
$$ 8D C5 36 01 13 AD FE EE B8 D9 8B 14 F2 F3 0A E4
##$RELAX= 
##$RELAX= 
##$RELAX= 
##$RELAX= 
##$RELAX= 
##$RELAX= 
$$ Bruker specific parameters
$$ --------------------------
##$DU= <F:/spectra>
##$EXPNO= 1
##$NAME= <H-F>
##$PROCNO= 1
##$TYPE= <nmr>
##$USER= <she>
##$AMP= (0..31)
100 100 100 100 100 100 100 100 100 100 100 100 100 100 100 100 100 100 
100 100 100 100 100 100 100 100 100 100 100 100 100 100 
##$AQSEQ= 0
##$AQ_mod= 1
##$AUNM= <au_zg>
##$AUTOPOS= <>
##$BF1= 200.13
##$BF2= 200.13
##$BF3= 200.13
##$BF4= 200.13
##$BF5= 200.13
##$BF6= 200.13
##$BF7= 200.13
##$BF8= 200.13
##$BYTORDA= 1
##$CFDGTYP= 0
##$CFRGTYP= 5
##$CHEMSTR= <none>
##$CNST= (0..31)
1 1 145 1 1 1 1 1 1 1 1 1 1 1 1 1 1 1 1 1 1 1 1 1 1 1 1 1 1 1 1 1 
##$CPDPRG= <>
##$CPDPRG1= <>
##$CPDPRG2= <>
##$CPDPRG3= <>
##$CPDPRG4= <mlev>
##$CPDPRG5= <mlev>
##$CPDPRG6= <mlev>
##$CPDPRG7= <mlev>
##$CPDPRG8= <mlev>
##$CPDPRGB= <>
##$CPDPRGT= <>
##$D= (0..31)
0 1.2 0 0 0 0 0 0 0 0.06 0 0.03 0 0 0 0 0.0002 0 0 0 0 0 0 0 0 0 0 0 0 
0 0 0 
##$DATE= 1604042227
##$DBL= (0..7)
120 120 120 120 120 120 120 120 
##$DBP= (0..7)
150 150 150 150 150 150 150 150 
##$DBP07= 0
##$DBPNAM0= <>
##$DBPNAM1= <>
##$DBPNAM2= <>
##$DBPNAM3= <>
##$DBPNAM4= <>
##$DBPNAM5= <>
##$DBPNAM6= <>
##$DBPNAM7= <>
##$DBPOAL= (0..7)
0.5 0.5 0.5 0.5 0.5 0.5 0.5 0.5 
##$DBPOFFS= (0..7)
0 0 0 0 0 0 0 0 
##$DE= 6
##$DECBNUC= <off>
##$DECIM= 32
##$DECNUC= <off>
##$DECSTAT= 4
##$DIGMOD= 1
##$DIGTYP= 9
##$DL= (0..7)
0 120 120 120 120 120 120 120 
##$DP= (0..7)
150 150 150 150 150 150 150 150 
##$DP07= 0
##$DPNAME0= <>
##$DPNAME1= <>
##$DPNAME2= <>
##$DPNAME3= <>
##$DPNAME4= <>
##$DPNAME5= <>
##$DPNAME6= <>
##$DPNAME7= <>
##$DPOAL= (0..7)
0.5 0.5 0.5 0.5 0.5 0.5 0.5 0.5 
##$DPOFFS= (0..7)
0 0 0 0 0 0 0 0 
##$DQDMODE= 0
##$DR= 18
##$DS= 0
$$ [...]
##$SUBNAM2= <"">
##$SUBNAM3= <"">
##$SUBNAM4= <"">
##$SUBNAM5= <"">
##$SUBNAM6= <"">
##$SUBNAM7= <"">
##$SUBNAM8= <"">
##$SUBNAM9= <"">
##$SW= 16.9725356469052
##$SWIBOX= (0..15)
0 0 2 0 0 0 0 0 0 0 0 0 0 0 0 0 
##$SW_h= 3396.73913043478
##$TD= 16384
##$TD0= 1
##$TE= 0
##$TE2= 300
##$TE3= 300
##$TEG= 300
##$TL= (0..7)
0 120 120 120 120 120 120 120 
##$TP= (0..7)
150 150 150 150 150 150 150 150 
##$TP07= 0
##$TPNAME0= <>
##$TPNAME1= <>
##$TPNAME2= <>
##$TPNAME3= <>
##$TPNAME4= <>
##$TPNAME5= <>
##$TPNAME6= <>
##$TPNAME7= <>
##$TPOAL= (0..7)
0.5 0.5 0.5 0.5 0.5 0.5 0.5 0.5 
##$TPOFFS= (0..7)
0 0 0 0 0 0 0 0 
##$TUNHIN= 0
##$TUNHOUT= 0
##$TUNXOUT= 0
##$USERA1= <user>
##$USERA2= <user>
##$USERA3= <user>
##$USERA4= <user>
##$USERA5= <user>
##$V9= 5
##$VALIST= <valist>
##$VCLIST= <CCCCCCCCCCCCCCC>
##$VD= 0
##$VDLIST= <DDDDDDDDDDDDDDD>
##$VPLIST= <PPPPPPPPPPPPPPP>
##$VTLIST= <TTTTTTTTTTTTTTT>
##$WBST= 1024
##$WBSW= 4
##$XGAIN= (0..3)
0 0 0 0 
##$XL= 0
##$YL= 0
##$YMAX_a= 933102
##$YMIN_a= -745754
##$ZGOPTNS= <>
##$ZL1= 120
##$ZL2= 120
##$ZL3= 120
##$ZL4= 120
##$ABSF1= 10
##$ABSF2= 0
##$ABSG= 5
##$ABSL= 3
##$ALPHA= 0
##$AQORDER= 0
##$ASSFAC= 0
##$ASSFACI= 0
##$ASSFACX= 0
##$ASSWID= 0
##$AUNMP= <proc_1d>
##$AZFE= 0.1
##$AZFW= 0.1
##$BCFW= 1
##$BC_mod= 2
##$BYTORDP= 1
##$COROFFS= 0
##$CY= 11.3945322036743
##$DATMOD= 1
##$DC= 2
##$DFILT= <>
##$DTYPP= 0
##$F1P= 15.9154993809931
##$F2P= -4.1035820241983
##$FCOR= 0.5
##$FTSIZE= 0
##$FT_mod= 4
##$GAMMA= 1
##$GB= 0.15
##$INTBC= 1
##$INTSCL= 1
##$ISEN= 128
##$LB= 0.24
##$LEV0= 0
##$LPBIN= 0
##$MAXI= 10000
##$MC2= 0
##$MEAN= 0
##$ME_mod= 0
##$MI= 1.114404
##$NCOEF= 0
##$NC_proc= 0
##$NLEV= 6
##$NOISF1= 3.799351
##$NOISF2= 2.8
##$NSP= 1
##$NTH_PI= 0
##$NZP= 0
##$OFFSET= 15.70392
##$PC= 1
##$PHC0= -11051.46
##$PHC1= 16.20088
##$PH_mod= 1
##$PKNL= yes
##$PPARMOD= 0
##$PSCAL= 0
##$PSIGN= 0
##$REVERSE= no
##$SF= 200.130013532006
##$SI= 16384
##$SIGF1= 3
##$SIGF2= 2
##$SINO= 400
##$SIOLD= 16384
##$SREGLST= <1H.CDCl3>
##$SSB= 0
##$STSI= 0
##$STSR= 0
##$SW_p= 3612.71676300578
##$SYMM= 0
##$S_DEV= 0
##$TDeff= 0
##$TDoff= 0
##$TI= <>
##$TILT= no
##$TM1= 0
##$TM2= 0
##$TOPLEV= 0
##$USERP1= <user>
##$USERP2= <user>
##$USERP3= <user>
##$USERP4= <user>
##$USERP5= <user>
##$WDW= 1
##$XDIM= 8192
##$YMAX_p= 0
##$YMIN_p= 0
$$ End of Bruker specific parameters
$$ ---------------------------------
##NTUPLES= NMR FID
##VAR_NAME=  TIME,          FID/REAL,        FID/IMAG
##SYMBOL=    X,             R,               I
##VAR_TYPE=  INDEPENDENT,   DEPENDENT,       DEPENDENT
##VAR_FORM=  AFFN,          ASDF,            ASDF
##VAR_DIM=   8192,          8192,            8192
##UNITS=     SECONDS,       ARBITRARY UNITS, ARBITRARY UNITS
##FACTOR=    0.0002944,     1,               1
##FIRST=     0,             0,               0
##LAST=      2.4114304,     0,               0
##MIN=       0,             -745754,         0
##MAX=       2.4114304,     933102,          0
$$ Real data points
##PAGE= N=1
##DATA TABLE= (X++(R..R)), XYDATA
0@%%%%%%%qJ6j6J6j6K4l2M0n6O8q4J04j24J48j80K18k58L00l48M08m76N48o28
30c36P25q30R43j070J210j366J538j726J931k157K406k677K971l294L648m035
46b119M454m912N416n968O575p242P979q799R713j0738J1894j3212J4734j6508
60h733J8610k1145K4273k8251L3494m0753N1537o9368J05449l01010Q71363K97636
72I33102j361080K96816Q03472p52809o65255O74929J74204j34517L48719j45843
82A71738n35556M54280M11873p19935m57809P71304M34348o83603k71614Q22785
92C97811J62563r02024j39081O81813r9534l74470L27163J57078k42454J96624
102A65489N0748n43815n036N56469j56378m31751M44701N21415m83491n62678
$$ plain form
0 0 0 0 0 0 0 0 0 -8 8 -8 8 -8 16 -16 24 -32 36 -48 56 -68 80 -100 118 -140 160 -188 220 -256 292 -336
30 -336 389 -441 502 -568 642 -724 814 -912 1019 -1138 1268 -1409 1562 -1732 1916 -2119
46 -2119 2335 -2577 2839 -3129 3446 -3796 4183 -4616 5097 -5641 6253 -6959 7775 -8733
60 -8733 9877 -11268 13005 -15246 18248 -22505 29032 -40336 65113 -235897 635466 933102
72 933102 -427978 -131162 672310 -80499 -745754 -70825 103379 -31138 317581 171738
82 171738 -363818 90462 502335 -217600 -675409 95895 530243 -153360 -424974 397811
92 397811 560374 -341650 -480731 201082 101548 -272922 54241 211319 -31135 165489
102 165489 216237 -327578 -332614 223855 67477 -364274 80427 601842 118351 -444327
112d44327L15163L17319l42657j02298M32212O5297k72432O1319M6634k21440
122a45210P9849J79948k72681r2197M69552J12402m32868l9107L11903j48583
132B3008l30057J94887L33778j06157j77510R8767K0551j33550L8881O0711j19944
143i6635L5884J99709p2288j52488J63465Q6644k82569j19531K50487J01114j44828
154c1036J7829J36068o6330j37662K7401M7948l1993L1184M7505n6888Q177J19997
166A12200m7968j81185K3390J34982m4741o0888J20512O7159j24606p8266N8459
177b0952K6827k2413K3112J5650l2189J2947M2281l6387m6939L5641O493o8312
189f4241K4242J17941P234r4349k1135K9358k4796j6628M9941K9817k6554j3364
$$ plain form
112 -444327 -129164 188155 -154502 -256800 175412 240709 -31723 29596 76230 -145210
122 -145210 -65361 114587 -158094 -250291 219261 331663 -101205 -140312 171591 23008
132 23008 -307049 -112162 221616 115459 -62051 36716 57267 -76283 -37402 23309 -96635
143 -96635 -60751 138958 66670 -85818 77647 164291 -118278 -237809 12678 113792 -31036
154 -31036 -13207 122861 56531 -81131 -53730 -5782 -37775 -6591 40914 -15974 -7797 112200
166 112200 64232 -116953 -93563 41419 -3322 -64210 56302 123461 -1145 -79411 -20952
177 -20952 5875 -16538 6574 22224 -9965 2982 45263 8876 -38063 -2422 4071 -64241
189 -64241 -39999 77942 85176 -9173 -30308 -950 -25746 -42374 7567 37384 10830 -2534
201b534P109p208M822K0628k5540m7608K2615N6875m201k6669J6049M00m8067
214c3329q716N3876K4789k6815k0113k760m534J2418K4925m953k5779p21J0868
227h44o312P447L0276o196m8687j4194L5045K1061n818k66l669k0685n640K0953
241B471J2607o388p192j0253j2016J4484L3342J637l1043j3991Q035j036M05K0749
255A1811R902k2837k0612R041J8367P736k549j3606j5310M420J8115N865n106
268E237m12o190j7223K037K9472J5100k0174k1826r17P336O068R343M456p407
282D900j1362k744P809J3641M760j5485k0615J527J9486R633m062k997l203j0453
296i165l211J6077J6337o399k0197j2119N924J4639Q367k009o388n320m985R20
$$ plain form
201 -2534 4575 -2633 2189 22817 -2723 -50331 -27716 29159 24958 -1711 14338 14738 -33329
214 -33329 -42045 11831 36620 9805 -10308 -13068 -17602 -5184 19741 14788 -10991 -11712 -844
227 -844 -7156 291 30567 24371 -24316 -38510 -3465 17596 11778 11512 7843 -12842 -18482 2471
241 2471 15078 8690 1498 -8755 -20771 -6287 27055 28692 -2351 -16342 -8307 -9343 -8938 11811
255 11811 21713 -1124 -21736 -12695 5672 13408 10859 -2747 -18057 -13637 4478 10343 5237
268 5237 4825 -1365 -18588 -16551 12921 28021 7847 -13979 -14896 -7560 -1492 7851 12307 4900
282 4900 -6462 -9206 -1397 12244 17004 1519 -19096 -17569 1917 11550 7488 4491 1288 -9165
296 -9165 -12376 3701 20038 13639 -6558 -18677 -12753 1886 10253 8244 1856 -3464 -8449 -7529
310g529J1682J1030q483j9931m758J5292J4577L62o677p410p275k769P762J2853
324H726M805j0476j6475k076J6300J3114m014r684l959k910k150P993J3243j488
338A0949j5795q463P422J2946O403m724j1799p039J493N411O219Q788J55j5634
352c668j1481J0961J5543l171j1029k594k65j689O615J1049o41j0864p568q40
366i642P199J3205K754j5901j1154O908P007j659N661O715j1084j4001Q243J5564
380I815p69p793l748o204k276J3022J1666n906p457j152o556j904J5363R655j5968
395b12j2578R074O919l527N708O635j3575j4313R210J2837L33J651j231j5698
409h767r051J5333J0865q522o75P856p767q918J3702R846j6784j1833R675M359
$$ plain form
310 -7529 4153 15183 6700 -13231 -17989 -2697 11880 12242 5565 -1845 -9120 -11889 -4127 8726
324 8726 13531 3055 -13420 -15496 804 13918 9904 220 -3739 -6649 -8799 -806 12437 10949
338 10949 -4846 -13309 -5887 7059 13462 8738 -3061 -10100 -8607 -3196 3023 11811 11966 -3668
352 -3668 -15149 -4188 11355 8184 -2845 -5439 -5704 -7393 -778 10271 9630 -1234 -8802 -9642
366 -9642 -2443 10762 13516 -2385 -13539 -6631 376 -1283 4378 11093 9 -13992 -5749 9815
380 9815 9046 1253 -2495 -8699 -10975 2047 13713 7807 350 -802 -7358 -9262 6101 15756 -212
395 -212 -12790 -3716 3203 -324 5384 12019 -1556 -15869 -6659 6178 6511 8162 6931 -8767
409 -8767 -17818 -2485 8380 -142 -817 7039 -728 -9646 4056 13902 -2882 -14715 -5040 -681
423f81k12J3628O003k1455j5454R801N949k649J2606J0556j6661j2035J4173M414
437G983j5144J54J0012r550n030K2918J1482k0785j1321O725o777n448K2280J3409
451B0908j8747q634J0493o188j3011J4669J2893j7670n898K2806M385j8116N90
464a520M544j9618o346K8293J3167j4589J409Q640j9629j6082J9274J0450j6929
477h936K255K1279o072j4008J3538J863k8806m483K7880N568j0758J4017P068
490B0405k7952j2959K1062K238j5936J3412J7518j7024q458K1632j871k9966M87
503a7412K0443n780k242K6128L363l1907q333J4851r251q527K6067J3409k1935
516a126l363J9912j0011k3433Q925J1180j5064M472L0220r77k4819R44N316k0609
$$ plain form
423 -681 -893 12735 18738 -2717 -18171 -8370 -2421 -5070 7536 18092 1431 -10604 3569 7983
437 7983 -7161 -7007 3005 -6545 -11575 11343 22825 2040 -9281 -2556 -9333 -14781 7499 20908
451 20908 2161 -6473 4020 -2168 -15179 -510 12383 -5287 -11185 11621 16006 -2110 -1520
464 -1520 3024 -16594 -22940 5353 18520 3931 5340 13980 -5649 -21731 -2457 7993 -8936
477 -8936 -6681 14598 8526 -5482 8056 9919 -18887 -23370 4510 10078 -680 13337 20405
490 20405 -7547 -20506 556 2794 -13142 270 17788 764 -7694 13938 12067 -17899 -17412
503 -17412 3031 -2749 -4991 21137 24500 -7407 -15740 -889 -10140 -18667 7400 20809 -1126
516 -1126 -4489 15423 5412 -18021 -9096 2084 -12980 -8508 21712 20735 -4084 -3140 2176 -18433
530a8433k667L0495P439j8883M741J3334j7452j4150J5612J415j8485J0848K6789
543B0603n949j4838P769n583k6481L767K8234K545q783J3332R91k5974n257J8889
557C265m540j4981J4473J6418r871k434J2330j1498k4139O130J5841l897L373
570D70K0018n418k5122l42J2740q080n796J6558M498j2792N104J2684j2851j5419
584a3748P298M289q102J1408J9591q373j8066K866J666j2471M687J8876k263j1729
598d071P962O987j2477n968P941m893q843J3425J4551p062o097M479q454j4165
612a6685R130J5268m885n213R304n95j1839J676P903p886o569J0136O690m641
626A794K950M899j2531j0978Q088Q246l648L066Q487o667j0787N428N467p400
$$ plain form
530 -18433 -21100 9395 16834 -2049 2692 16026 -1426 -15576 36 1451 -17034 -6186 20603
543 20603 14654 -184 7585 2002 -24479 -20712 7522 10067 1284 14616 15607 -10367 -15624 3265
557 3265 -1275 -16256 -1783 14635 4764 2330 14660 3162 -20977 -14847 994 -2903 470
570 470 20488 15070 -10052 -10394 2346 -5734 -11530 5028 9526 -3266 1838 14522 1671 -13748
584 -13748 -6450 -2161 -10263 1145 20736 12363 -5703 -2837 -1171 -13642 -8955 9921 7658 -4071
598 -4071 3891 10878 -1599 -7567 374 -4519 -13362 63 14614 7552 1455 5934 -2520 -16685
612 -16685 -7555 7713 2828 -2385 6919 6324 -5515 -3839 4064 -3822 -10391 -255 6435 1794
626 1794 4744 9643 -2888 -13866 -5778 2468 -1180 1886 10373 3706 -7081 -1653 3814 -3586
640c586k431P956L47m195O573M555r703o886M055P71j718P994O579q456o972N028
656h9J398o000K357O563l828m545N822L880n501k280J618l238j183P546M057m958
672A619l065J644k879k693O164M153n180k717M454J570l222l0J666l878k511M294
688f11L400j86M1j042m612j165M873K547k948r49J108j344j297L684K522l601
704D20l234J203J347P88J522r7l003j648J718J115R42J222p55l848j007L632J826
721B143j452j254q2o95m9K453J686j382k339j447O95J943J870m23j775j302L80
738a030Q62J033Q48j087k295p41K474K127J01j464j681p38M79J453J469k21j681
755i2j729L57J476J925Q3j581j678J29N91J179N77o14j859q18Q13K533O52j084
$$ plain form
640 -3586 -6017 1939 2286 -1909 4664 9219 -484 -7370 -3315 -2544 -4262 3732 10311 1855 -5117 -89
656 -89 1309 -4691 -2334 4229 401 -4144 1678 5558 57 -2223 -605 -3843 -5026 2520 6577 1619
672 1619 -1446 198 -2681 -5374 790 4943 -237 -2954 1500 3070 -152 -182 1484 -2394 -4905 -611
688 -611 2789 2603 2644 1602 -3010 -4175 698 3245 297 -652 456 -888 -2185 1499 4021 420
704 420 -2814 -1611 -264 524 2046 1949 -1054 -2702 -984 131 1073 2295 1540 -2308 -3315 317 2143
721 2143 691 -563 -645 -1340 -1389 1064 2750 1368 -971 -2418 -1723 220 2090 1667 -108 -1410 -1030
738 -1030 -168 865 1713 626 -1669 -2410 64 2191 2292 828 -853 -1591 -1112 341 1810 1589 -92
755 -92 -1821 -1464 12 1937 2020 439 -1239 -1110 -519 660 1237 623 -1236 -2054 -1241 1292 1944 860
773H60j784o01K00J339J160J88j321j892r5J256K039M47j007j554l92J092P89
790G24Q01n51j646j092M26K252Q74m14j373j209L20Q17J017L95r29j293o92R11
808f62J578P22r20j171l50L1J194Q43j52j217j352K84R30J226K18j198j182j82
826a360J205J018NL01j151j127J92J524M26o70p60o04j05J239J731j54j697p56
844g43J76J68Q67Q94r17j405j51J037L55M03P37j739j350R36J707K07j344k89
862d51O5j483J276K030K0j144o51l10o02J276J473j347j847J347J216p17M14J050
880A615j605k387Q17K354N5l80M69q78j876R90J748m12j201R48k07r82J533J667
898B268j971k755J484J157o70Q73K354j369l440L67J775n32K86J819j098k000
$$ plain form
773 860 -924 -1525 -1325 14 1174 1362 41 -1851 -1946 -690 1349 1796 789 -765 -1157 -65 724
790 724 1525 974 -672 -1764 -1338 914 1788 1374 1 -1208 -888 -71 946 1341 412 -881 -1573 -662
808 -662 916 1638 718 -453 -803 -772 422 1265 1113 -104 -1456 -1172 -242 984 1202 4 -1178 -1360
826 -1360 -155 863 868 1169 18 -1109 -917 607 1033 363 -397 -1001 -1106 133 1864 1710 13 -743
844 -743 -567 -399 468 1362 445 -960 -1111 -74 281 684 1421 -318 -1668 -732 975 1182 -162 -451
862 -451 -386 -1869 -593 1437 1457 313 -338 -648 -1250 26 1499 152 -1695 -348 868 151 565 1615
880 1615 10 -2377 -1560 794 849 469 938 60 -1816 -826 922 510 -691 257 50 -932 601 2268
898 2268 297 -2458 -974 183 -487 386 2740 1371 -2069 -1702 73 -459 -173 1646 548 -1452
914a452J332J993k318j238J990o06j810K556L084k208l205J280M26k176J598L424
930B670j529k495J627Q25k270L96K071j743k160K963K209k354r38J945j972l202
946c957L126M013j954j859K005p01l015J142K546j903j384K760J001k506J259
961E73K107l345l060K872K425j993O29K896k424l423J952K036k228r4K840q62
977I01k215K061J774l577j763K903N2j591K631K675l490k920K493K00k375J432
993h09L159j545j766K012O06k762l85J890j515r88L782J684l062j187J488j715
1009a113k173K964K563j968r54K326p67k550J492R71k736o0L700J12j817O56M38
1026A084l148j130L562R51j601R28J652k567j785K061P93k604N77K352o26o52
$$ plain form
914 -1452 -120 1873 -445 -1683 307 -299 -2109 447 3531 1323 -1882 -602 -176 -2352 -754 2670
930 2670 1141 -1354 273 1098 -1172 -776 1295 -448 -2608 355 2564 210 -728 1217 -755 -3957
946 -3957 -831 3182 1228 -631 1374 673 -2342 -1200 1346 -557 -1941 819 1820 -686 573
961 573 2680 -665 -3725 -853 1572 -421 208 3104 680 -2743 -791 1245 -983 -1077 1763 901
977 901 -1314 747 2521 -1056 -2819 84 136 -1455 1176 3851 361 -2559 -66 134 -2241 -809
993 -809 2350 805 -961 1051 1657 -1105 -1490 400 -1115 -2103 1679 3363 301 -886 602 -1113
1009 -1113 -3286 -322 2241 273 -681 1645 878 -1672 -180 791 -1945 -2005 1695 1807 -10 646 1084
1026 1084 -2064 -3194 368 1319 -282 646 2298 -269 -2054 7 800 -1804 -1227 1125 499 -153
1042a53K173o53l678qK562k62q36K622O11k948p89J928q06j457J582J438j800
1059d74J3K628j045k619N50Q52j390N40L145Lk819K74Q62j555n64K588J32k061
1077i40P62J952j546j408J663m70k024J047K688l99j439Q85k16k568L62K546k73
1094F22j208J270M42j840n7K009r06k007J289J233r26J00J322r23k264P55J669
1111E80l91m09J524n35j860R76P09o65j102J388K87r65N55J423j268j399P64N41
1129A53q04N48J661r08j613P67N79p10o0J096l42j314J000J034q78o69N78j48
1147c0o95N54J238p11r35O97o8q14O28R64q86n44O37M98n46j13N86o16p91O67
1167b80P86k45j18L87p77l59L85O64m08l50L67k18k3N17K23n37n72M18L3l05M33
$$ plain form
1042 -153 2020 1367 -2311 -2319 243 -19 -855 1767 2378 -570 -1359 569 -237 -1694 -112 1326 -474
1059 -474 -461 2167 1122 -1497 -947 -95 -1485 -945 2200 2203 -616 -342 520 -1035 -1599 989 1121 -940
1077 -940 -178 1774 228 -1180 483 13 -2011 -964 1724 1325 -114 771 555 -2013 -1651 895 622
1094 622 -586 684 1126 -714 -771 1238 332 -1675 -386 847 -79 21 1343 420 -1844 -1089 580
1111 580 189 -220 1304 769 -1091 -115 594 -71 -1173 215 502 -463 92 1515 247 -1152 -388 153
1129 153 -651 -103 1558 650 -963 -196 383 -327 -387 709 367 -947 53 1087 209 -460 118 -30
1147 -30 -725 -171 1067 356 -579 118 50 -764 -136 828 -58 -602 35 533 -13 -126 460 -156 -947 -280
1167 -280 506 261 143 530 -247 -606 -221 443 35 -315 52 -166 -189 328 551 14 -558 -140 -107 -412 21
1188B1N74n95n35J25N58M5K55j22k71l84K44K36k17M8K71n45n6M40K46j88j49
1209Aj07Q5M0L67j9k19m39J2K53J5J64j52J6k89J44L75j79Jk58m4jK90J69J8j80
1234F3j87Q3K57Q6q8J82n23j66J93J8M74j76m44L7J97J40J40%l12k27%K21M62
1257D30l05p9m18j4M97J89p4k56k44J1J56M4M10m28R0l94K06L99R1j89j77j75
1279b30K40k83L27J3m9j13j58M42kk11K9Jk56r8J10L35K8l0l06J74L15j10J42
1302C10l77K0j41J65N0K57l6j68l82j60M58M63m63Q5K5l38Q6R3L15n65N6J5k68
1325e00M91M52k84m45K47p5K09Q2M7j80k24j40L75O5j15O8k62j18J24N11l70K1
1347b1K74l09l02M26J43r0l43J72L98p2l5K41o71j88L62L66m83J22M27j14p37
$$ plain form
1188 21 595 0 -535 -410 148 193 448 326 55 -329 -85 151 -66 -18 253 -292 -348 92 338 150 1
1209 1 -106 -21 19 386 367 148 -291 -279 -26 -11 153 1 17 -272 -128 247 68 69 -189 -233 -234 56 225 243 63
1234 63 -124 -41 216 302 214 396 -127 -293 -100 -82 392 216 -228 -191 6 146 286 286 -26 -253 -253 -32 430
1257 430 125 46 -372 -386 111 300 226 -30 -274 -263 -107 -63 347 -81 9 -385 -179 220 311 122 -55 -230
1279 -230 10 -273 54 67 18 -95 -253 189 187 -24 5 6 -250 -348 -238 97 125 95 -211 -37 278 168 310
1302 310 -67 -47 -188 -23 27 284 248 80 -302 -462 -4 459 -4 81 106 -232 -146 -53 262 -303 -247 -232 -500
1325 -500 -9 443 159 -286 -39 -114 95 177 224 44 -180 -320 55 120 5 73 -189 -307 -183 328 -42 -21
1347 -21 253 -56 -358 68 211 121 -222 -50 348 276 241 482 -189 -377 -15 351 -132 -10 417 303 -434
1368d34Q7P22l19j13J68Pm45K93L55m48m12K29J56J74k19P66m69l25J67J55m91
1389c96N5O39m35k78L68N30m79l82L52k4j88M38N63r55J73K48k83o64P59M76o59
1410a42k57M78O3m22J21N49o56j42K66N87n35J17K75m50m36O12M81o20M0M48n41
1431a64l33N47K19p74N2Q98n83J45J26M08q64n8M18j24j9L08Q0k28n79O44J93
1452C12p64K93L64k68m53J143P1j073qL81m45k6P29N25q81k4K02l33m4J79M87
1473C67o39o6J188p34m75L86P7o60Q0P72M0o31J73K11m71j95Q63mq17Q80q1j65
1495I9o94Q13J14o02r5O14M8n65O41m3q66O4R46l04m29M62K23n18n5K77K29n60
1517b01L26K49m53NP14k31p80N1N77m85P0O95l17m53J26K53l36k02L85J58l56
$$ plain form
1368 -434 -347 375 56 -57 111 118 -327 -34 321 -127 -539 -310 -154 20 -199 567 98 -227 -60 95 -396
1389 -396 -341 298 -137 -415 -47 483 4 -378 -26 -50 -238 200 763 -192 -19 229 -54 -718 41 517 -142
1410 -142 -399 79 142 -280 -159 390 -266 -408 -142 445 -90 27 302 -148 -584 28 509 -111 -71 377 -164
1431 -164 -497 50 269 -505 -453 445 -138 7 133 541 -323 -381 37 -87 -106 202 282 54 -525 119 312
1452 312 -452 -159 205 -63 -516 627 698 -375 -383 -2 -447 -473 256 781 -100 -124 78 -255 -299 -120 367
1473 367 -272 -338 850 116 -359 27 104 -556 -476 296 336 -295 -122 89 -382 -577 286 282 -535 345 264 99
1495 99 -595 218 332 -270 -365 249 297 -268 373 330 -536 -472 474 170 -259 203 426 -92 -147 130 359 -201
1517 -201 125 374 -79 -74 640 409 -371 -320 257 -228 -158 537 220 -233 -107 146 -190 -392 -7 151 -205
1538b05K33L52k84m17L19J21l63J76P33l17p14M37J35l82p4N59kn08J27M82n03
1559i5J32K00l88J42J13J41j20k22J81K34m76j99N68j96l10L05P7k58N3L81j42
1580A21m77J47K03M5j03L15K0n65L40J0k06J71J38l3l22J07K51l07j25L6J52N2
1602c0p1M92l13r5o8P8j56K98O9k03l04M37k16pR8K42l61p4L59J62l96Q3mQ3l38
1627b35J13J00M0J17J23m28O7J01J59J8k97j4L59j36L0k96K02l75J78J47O0n1
1649a8J29r8l74N34q5j4k56M07l14l2J66J25l27J96l23M64k33J36l6J03k30k81
1671c61M81N1k08K45l39j57K25K39k81O0K23l79L12k53K53P0j95K21k54J44j02
1692eP6j14j00J27R6k5Q1k22J40k78K84j14M85m68J10j0k66J89J34J08ok35J07
$$ plain form
1538 -205 28 380 96 -321 -2 119 -244 -68 665 348 -366 71 206 -176 -250 309 307 -201 -74 408 -95
1559 -95 37 237 -151 -9 104 245 125 -97 84 318 -158 -357 211 15 -295 10 87 -171 -118 263 121
1580 121 -356 -209 -6 39 -64 251 271 -294 46 56 -150 21 159 126 -196 -89 162 -145 -270 -234 -82 -30
1602 -30 -101 391 78 -17 -85 -7 -163 135 204 1 -303 134 -82 -89 9 251 -110 -184 175 337 -59 24 20 103 -235
1627 -235 -122 -22 18 135 258 -170 -103 -2 157 175 -122 -136 223 87 117 -179 23 -352 -174 -27 33 -18
1649 -18 111 13 -361 173 88 74 -182 225 -89 -121 45 170 -157 39 -284 180 -53 83 47 150 -80 -361
1671 -361 120 171 -37 208 -131 -288 -63 176 -105 -45 178 -201 111 -142 111 181 -14 207 -47 97 -5
1692 -5 71 -43 -143 -16 80 55 136 -86 54 -224 60 -54 431 -37 73 63 -203 -14 120 228 222 -13 94
1715I4k19K17j6k46M48m55K84OJ8m9j65p6J36L81o7l68j90K38K8N7k9O4j69l84
1739d62L15M2K17L3j40j08J5J64o4J17n1k10N6mQ6j24L13k24P0K09k99J46r0j85
1763a78j73K75Q3J05j18j14J69P9l12L91m8k09j81J86K6k3O1K31j92O4k7j57J5
1786d7K23l60l5L06Q6p7k25M0J01j49Q6M5j61M41k84j07j02J49L23k77l0q0K0
1809a14q2L06N6N7j50l2o1Q1J9k5K66k18j27n8P0n7K2l4P7j73R0J55J19l19J93
1834F1Q7k79L06R8j29k88m7J67m2mk08L46l50M27J00n11K15K68l32M9J16M5K7
1857A22k61r9M02k14K70l36J39r9j04J75l10L16R1j80p7J80K77l63j18K86j29
1878c2j64L74J21j33l00M3j37J10mJ27m3J49P3j59P6P2J14m90l1M00J24k63QL00
$$ plain form
1715 94 -125 92 76 -170 278 -177 107 113 131 82 -83 -159 -23 358 291 -77 -267 -29 -1 56 27 91 -78 -462
1739 -462 -147 -105 112 145 5 -103 -88 76 12 129 78 -132 -76 -80 6 -118 195 -29 41 250 -49 97 7 -178
1763 -178 -351 -76 7 112 -6 -120 49 128 -184 207 159 -50 -231 -45 -19 -42 19 250 58 122 95 -62 -47
1786 -47 176 -184 -219 87 173 96 -129 -89 12 -137 -51 -6 -167 274 -10 -117 -219 -70 253 -24 -54 -134 -114
1809 -114 -196 110 166 223 73 41 -20 61 80 55 321 103 -24 -82 -12 -69 -47 -81 -4 -177 -87 68 187 -132 61
1834 61 148 -131 175 273 144 -144 -191 -24 -66 -70 -278 68 -282 145 245 -266 -51 217 -115 -66 50 95 122
1857 122 -139 -238 164 -50 220 -116 23 -76 -180 -5 -315 1 92 -88 -165 15 292 -71 -189 97 -32
1878 -32 -196 178 299 166 -134 -91 -228 -118 -122 5 -38 111 184 25 101 173 287 -203 -234 166 290 27 35 335
1902C35n24J61K55l06R1R7J48l85J34J71j73L6q9K11o8j40K96j56l76L59K35k59
1924E3k62K26p5J1R2k0o0q2K4J66L8j75J33M2k79J51Qj88k9K70L5j57J36m9j18
1949a09M9R2K22l87R1j22J21J15J5J36m48K22J63k48K5K11J17k89k39K63M6R0
1971A36k00J4j90K89j95K31j40J25J72k11p4J9Rj74Q6J76M8j85K79k01M0k79K20
1994eR4k26R5M2k26Q5L58j77j75L2k9loJ97J88j23j00J56j02j48P4o4pj62L60
2019A28K34n60L74o0k19q4J62K6j36N75l34n9r1M2L55l41k13M3L60k06j34J70
2041C2k24m9K83Q5l2J31k86K20l39L77P2n21J16Q6l6J59n8q3J21j8l38J34J42
2064b6J54k8j15M5j18p4J58Q5M6l00L41R2j07J14k63k8M7j2j62J24J39K92m33
$$ plain form
1902 335 -189 -28 227 -79 12 109 257 -128 6 177 4 40 -49 162 94 -46 250 94 -282 77 312 53
1924 53 -209 17 -58 -47 45 25 -35 -117 -93 73 111 -64 69 111 -168 -17 -9 -197 -226 44 79 -78 58 9 -109
1949 -109 -60 32 254 -133 -42 -164 -43 72 87 223 -225 -3 160 -88 -63 148 265 -24 -263 0 46 136
1971 136 -64 -50 -240 49 -146 85 -55 70 242 31 -43 -24 -15 -189 -103 73 121 -64 215 14 54 -225 -5
1994 -5 89 -137 -42 0 -226 -141 217 40 -135 -103 -132 -135 -141 56 244 121 21 177 75 -73 1 -63 -70 -232 128
2019 128 362 -198 176 116 -103 -187 -25 1 -135 440 106 47 -44 -2 353 12 -201 -158 202 -4 -138 32
2041 32 -192 -241 42 127 95 226 -60 160 -179 198 270 -251 -135 -49 -85 74 16 -67 54 36 -302 -168 -26
2064 -26 128 100 -15 30 -88 -162 -4 81 127 -173 168 260 153 267 4 -24 23 11 -151 -27 112 404 -29
2087b9J01p3J35n4l56L28M2o8O0J66m00O2k0Q6K70l28J8PK28k77J24oj2q2O5r8
2113a11l7J71J73m01L38l07J30j29L22l61M15l82O2J11r1K21j51LN0p3L7Q9n1
2136B8j01k2N6K8JJ98j91j02j21M11j75O4j60O2Q8k00J90j91K99k62J23J2N2k64
2160a77q1R9O6K64j39K31j88j26K72m36K75m8pj44Q0J48k32J97J69j15k59J30
2182b1J78j34K22k33j83L07p7n1R5j65J22j08J16L7k39o6K02p9j5j08L1R2J13
2205C6Q0o2J17%q0l7m1m1j13L92k3k94J32N5n8j94L25k35J78j62J31J2N2Q5k19
2230C6n3J14O2j71J92k32k19L96r8k01J11J0K20lk16J43J42k59k1j57J48K28n9
2253A13p8J48j48k0P1m2N6m8L7k41Q0j60L02j6Q5K9m1l72J43O5L4K39j30QJ14
$$ plain form
2087 -29 72 -1 134 80 -276 52 94 26 86 252 -148 -86 -106 -20 250 -78 -60 -53 175 -102 22 16 4 -78 -13 -111
2113 -111 -148 23 196 -205 133 -174 -44 -173 149 -212 203 -179 -117 -6 -97 124 -27 -24 26 -47 -10 79 28
2136 28 -73 -95 -39 -11 -10 188 -3 -105 -226 185 10 74 -86 -24 64 -136 54 -137 162 -100 23 35 87 -177
2160 -177 -258 -159 -93 171 32 263 75 -51 221 -215 60 12 5 -139 -59 89 -143 54 223 108 -151 -21
2182 -21 157 23 245 12 -171 136 59 8 103 -62 60 -48 68 105 -134 -200 2 -77 -92 -200 -169 -77 36
2205 36 116 54 171 171 91 54 13 -28 -141 251 228 -66 66 121 63 -131 194 -41 137 -25 106 118 170 255 36
2230 36 -17 97 159 -12 180 -52 -271 125 27 -174 -63 -53 167 164 -52 91 233 -26 -47 -204 -56 172 113
2253 113 35 183 35 15 86 44 100 52 89 -152 -72 -232 70 54 139 168 127 -245 -102 -37 -3 236 106 114 228
2278B28l05K06l3l9J74k8k68L0N2j95K44J13l04K78l39j0l7K13k11L51k73R3m2
2301a02N4j52K43n4j3N2n8J14P8l31K28m1J05j25j31J07Lr7o7l0K93M3j49N1l4
2326a3Q6L7j30K01k33K19k50O4n2N8J74j19k07K57k38K2L73m39K52p2K4J80l17
2349a23J46RQ7l03J98K14l39J98l01J23J11k54K12j2l20K66l0J68j30m7K23J5
2371A11r7m1L1j12R3j00J5K32j74j74J05Q9j16N4L63n45L15j87K19K73l49M0J76
2394B21j15j84r1K96j14n0o9L70n45L71%j40n4J87J2n3qJ59N6l6k24m9P8j37K51
2419A32l01l7L07R6j42K96l17N6j60kR4l7k0l4q6P4K89M7l84J85k48M2M96m90
2443a44N0J6n3OL05m40J72J53l27J87J78k49L13j62p6j64J37K21l2k8n2m3j83
$$ plain form
2278 228 -77 129 96 57 231 203 -65 -35 17 -178 66 179 -125 153 -186 -196 -233 -20 -231 120 -153 -60 -102
2301 -102 -48 -200 43 -11 -24 28 -30 84 162 -169 59 18 123 -2 -133 -26 -23 -120 -187 -217 76 119 -30 21 -13
2326 -13 73 110 -20 181 -52 167 -83 -19 -71 -13 161 42 -165 92 -146 -124 249 -190 62 -10 14 194 -123
2349 -123 23 32 119 -184 14 228 -111 87 -214 -91 20 -234 -22 -34 -354 -88 -118 50 -80 -127 96 111
2371 111 14 -27 4 -108 -15 -115 -100 132 -42 -216 -111 -22 -138 -84 279 -266 49 -138 81 354 5 45 221
2394 221 106 -78 -169 127 13 -37 -106 264 -281 90 90 -50 -104 83 95 42 34 193 249 213 -11 -60 18 -119 132
2419 132 -169 -206 101 197 55 351 34 90 -70 -72 22 -15 -35 -69 -155 -81 208 255 -129 56 -192 -150 346 -144
2443 -144 -94 -78 -131 -125 180 -260 -88 65 -262 -75 103 -146 167 5 -71 -235 -98 123 91 63 11 -32 -215
2466b15K45O7k25L17r4k57J65O8q0J94j35q6K5j26J17LJO6J6Q1k67l3P2Q7Q0n
2492H1m7p2P9n8J7Q8j2jJ00j12j76j56J15L1p4K88j6j61j15M06j09k23J19j12
2516a20M9q7M5M5R2J63k40j19J45J14j23J23L5k24q7m2L57o5O5l82M33k99jK32
2540A09k1J57k35J47k32L29k58R2k3j41mJ52k1m82O09l06PK10l01L06k46J17O9
2563C4j11q9j17M25k7q1jJ5L9j69L55j93r6j9j05Q3k5J93R3k38LJ2j34K06R0J37
2589B80j42l10L50k65J39J2l13M81m15J86J37k73o9K53j46K3N5K21r3l24K50J07
2611A44o0k91k7R3K63j50J19k89J87K12j66m9j17Q5J46l5k02J02L04k17J33k7
2633A58Jl02J11NJ11j14j36K62j02J64j41K32j86k67j65M99l3l21K51Q2K8k24
$$ plain form
2466 -215 30 97 -128 189 95 -162 3 71 -9 185 50 -36 -11 -137 -20 -17 -16 50 66 147 -120 -153 -81 6 86 81
2492 81 34 -38 41 -17 0 88 76 75 175 63 -113 -269 -154 -123 -197 91 75 -86 -201 205 96 -127 -8 -120
2516 -120 -71 -158 -113 -68 24 187 -53 -172 -27 87 -36 87 122 -102 -189 -231 126 61 126 -256 177 -122 -123 109
2540 109 88 245 10 157 -75 254 -4 88 65 -76 -80 72 51 -431 178 -128 -121 89 -212 94 -152 -35 34
2563 34 -77 -166 -283 142 115 34 33 48 87 -82 273 80 -16 -35 -140 -57 -82 111 204 -34 -31 -19 -153 53 143 280
2589 280 138 -172 178 -87 52 64 -249 232 -183 3 140 -133 -202 51 -95 -72 -17 204 111 -213 37 144
2611 144 84 -207 -234 -141 122 -28 91 -198 -11 201 35 -14 -131 -46 100 65 -137 -35 269 52 185 158
2633 158 159 -143 -32 -27 84 -30 -166 96 -6 158 17 249 63 -204 -369 130 97 -224 27 109 137 -87
2655h7J02o1orJ36Q3j76K0q2Q7r9P3K61q6m04K69J07j20n5l1n3J94r4J06M2j21
2681dj3nj17L52l45J47q0J80k60J41k9P1J05k49J42K3j44J57P6K01n49J54K27
2704A81k21O3J06o9r2J18k42K51R3l11K50j23P9j14l2m1K43k48qJ23k47K36Q0
2727G5l16N05j66n1lj92J65R4k41L53j52j42K5m5J14J1k20K63o5M6n2J23k87m3
2751b01L11j5j14q2m5J38L8jj35K43k37o5K41j46N6n4J53J2j70J22j62J51q1N3
2775A0J7J88k17J0P4l51L83R4k69J60k54j08K37R9N3r2j25j27K56J27m7N2J61
2798C31o09N16l44K30j38k36M05k44J55j96K14j06K9j73J36J13N1r7j30K57j07
2819E7P4j74k6J21r0K04k17j98K52j95J22J21j8l43K05L4q6O5J09m4K91j61m5
$$ plain form
2655 -87 15 -46 -52 -61 75 158 -18 2 -80 7 -92 -19 242 156 -248 21 128 8 -47 -78 -131 63 -31 75 117 -4
2681 -4 -17 -22 -139 213 -132 15 -65 115 -145 -4 -33 38 143 -106 36 59 -85 72 148 349 -200 -46 181
2704 181 -40 23 129 60 -32 86 -156 95 188 -123 127 4 83 -31 -63 -104 139 -109 -117 6 -241 -5 75
2727 75 -241 264 98 47 44 -148 17 111 -130 223 71 -71 -46 -91 23 34 -186 77 12 58 6 129 -158 -201
2751 -201 110 95 -19 -101 -146 -8 30 29 -106 137 -100 -165 76 -70 -14 -68 85 97 -73 49 -113 38 -43 10
2775 10 27 215 -2 8 82 -269 114 208 -61 99 -155 -263 -26 73 126 34 -91 -218 38 165 118 170 331
2798 331 -278 238 -106 124 -14 -250 155 -89 66 -130 84 -22 7 -166 -30 83 134 37 -93 164 57
2819 57 131 -43 -69 52 -38 166 -51 -249 3 -192 -70 51 33 -310 -105 -71 -157 -92 17 -27 264 103 58
2842E8j4p0K48k94N7j76K4n1K00j96J30j03K41q2J68R4k45R8j67O8j57J64P6j10
2866c9K85l2j78M1rm0k03J80K1j65L11l25J99K6l27L79l5k22K13k16K54k22K8
2889g6J26k08J48k01K86J20l45L91j77K8o2j5j62K62n9r1P9J3j59qQ0K81K4m03
2913a28J49rk1J28m25J00O4M33j88j34pR3k57K63N2j60J18j69J04L5J32k70J33
2936C6j26N7J39k91L19m0j22K85k21j02K9K05m87L18j63L76Q5l36J50j72J57l83
2958b87M31j86O2j95L21m30J64K03j93J29j6j56J04j30K40QQ4j61L0J28k79M2
2980h7O1L6J6R3j60n6K21q5j89L45m12K41j87J73L5rj41P6n7M1J55k12P6J05o6
3005A3j53J22O9M1K1j43L03q3O9l81J78n2q3K71k26L92m36m2j19K35N7K3M3k00
$$ plain form
2842 58 44 -26 222 -72 -15 -191 -167 -218 -18 -214 -84 -187 54 -28 140 234 -11 87 -80 -12 -169 -5 71 -39
2866 -39 246 214 36 77 68 28 -175 5 26 -139 172 -153 46 72 -255 124 89 -133 80 -136 118 -104 -76
2889 -76 50 -158 -10 -211 75 195 -150 241 64 92 30 15 -147 115 56 -35 44 57 -102 -110 -30 251 275 -128
2913 -128 21 12 -9 119 -306 -206 -142 291 103 -31 -38 55 -202 61 113 -47 71 -98 6 41 173 -97 36
2936 36 -90 -33 106 -185 134 94 -28 257 36 -66 -37 168 -319 -1 -164 212 297 -39 111 -61 96 -287
2958 -287 144 -42 20 -175 146 -284 -120 83 -110 19 3 -153 -49 -179 61 69 153 -8 22 150 -129 -87
2980 -87 -26 10 26 119 -41 -97 124 39 -150 195 -217 24 -163 10 45 36 -105 -29 -86 -45 110 -102 -26 79 13
3005 13 -140 -18 51 92 113 -30 273 190 259 -122 56 4 -79 192 -34 358 -78 -120 -239 -4 53 76 119 -81
3029h1J64q3k95K58p2L37j59lj67J6K57P6m01M48l87k3L60j68o1k7j8N5j90K16
3053E2J60k59M3R0o0j82K95p5k73J9L18n0q5n7P8q5J76J6k46J90Q4j77K67r3m7
3078I9K2K5j07j24QK28l86L2J51J48k56K54l9j08J34r0K8J20nl60K47N0j06j48
3102a83J09N6K57N9l49r2J31R2o7M3l50J91J62q1J41%p6J28j76k06M29k47k25
3125b54N05j57j62j5P6m2P3Q2q0j23J72p8L5j80K42j90K73j82J44j78j10L90k89
3148d8j11J93r9n8K19m6j09j16o7K30j78J63j1J1r1J18J91l11Q8j88J88n2L35
3171B51k59j76K76l55L23j65J59k9m5o9J37j74J88q4P4l21M42j88n1n0R5J05P8
3194A62Qk98L19k50j3j16K33K9k36K08J34k11Q3k46K20j09L20j40j79K21K6q0
$$ plain form
3029 -81 83 0 -295 -37 -109 228 69 66 -101 -85 172 248 -153 295 -92 -115 245 77 16 -11 -29 26 -164 52
3053 52 212 -47 -4 86 26 -156 139 64 -209 -190 128 78 -7 -64 14 -71 105 121 -125 65 149 -28 239 146 99
3078 99 121 146 39 -85 -77 151 -235 -203 -52 96 -160 94 55 -53 81 -9 19 139 134 -226 21 71 -35 -183
3102 -183 -74 -18 239 298 -51 -143 -12 80 13 56 -294 -103 59 -22 119 119 43 171 -5 -211 218 -29 -254
3125 -254 251 94 -68 -83 -7 -49 24 106 26 -97 75 -3 32 -148 94 -96 177 -5 139 -39 -149 241 -48
3148 -48 -159 34 -65 -123 96 50 -59 -175 -242 -12 -190 -27 -38 -27 -118 0 191 -120 -32 -220 -32 -84 251
3171 251 -8 -184 92 -263 60 -105 54 25 -20 -89 48 -126 62 -22 52 -269 173 -15 -66 -116 -21 84 162
3194 162 170 -128 191 -59 -72 -188 45 74 -162 46 180 -31 52 -194 26 -83 237 97 -82 139 165 85
3216H5p4J77l06N9j0r4L9J83m4j2k7r7Q1N9K06l63M53m04J67l79J85K69k42N9
3240c0l12K08K06m3j76r6K59j61J51n1k31L98k43M71l36K2M1j04O5p7j59J41j
3263e8M4l3K80l09L20k32L6O3j84jj68K87O6r9M7j51J56nN5j05Ko1r2J99K34l34
3289d3K15q4k09K33r3o2K16j11j56J69P4k82K23q7n5J5K14j43n6j18K76j75K4
3312a5j52K02O8n6J05j96J25pj33L1J0lk1j59J27j0R1l35L20J4N5l00J61O1J05
3337H8J6j36K14j78j29K2LK27K2l51K76k42J03k3NJ94k01K32o2l01L52%m2r5J06
3362A00k3P1O5n05K43M1J33k12J96m8p0J24Kj70l9K93O7m81K54J90k42j53R7J22
3386E5J42m54K48MM8J54j15q7l4O7j62Q6M9P1N1L9l61P5q2L0p6J52K10Jj52k26
$$ plain form
3216 85 11 188 -118 -59 -69 -163 -124 59 15 3 -24 -121 -40 19 225 -138 315 -89 78 -301 -116 153 -89 -30
3240 -30 -342 -134 72 29 -147 -243 16 -145 6 -45 -276 122 -121 350 14 36 77 -27 38 -39 -198 -57 -58
3263 -58 -14 -47 233 -76 244 12 48 111 -73 -74 -242 45 111 12 59 -92 64 59 114 9 11 -50 -142 57 291 -43
3289 -43 172 88 -121 112 19 -43 173 62 -94 75 149 -133 90 3 -52 -37 177 34 -22 -140 136 -39 -15
3312 -15 -167 35 103 47 152 -44 81 74 -59 -28 -18 -21 -42 -201 -74 -84 7 -328 -8 6 61 -239 -78 -17 88
3337 88 104 -32 182 4 -125 -103 -100 127 149 -202 74 -168 -65 -88 -83 111 -90 142 80 -221 131 131 89 -6 100
3362 100 77 148 213 -292 -49 -8 125 -87 109 61 -9 115 117 -53 -92 201 268 -213 41 231 -11 -164 -67 55
3386 55 197 -257 -9 -5 43 197 82 -5 -39 28 -134 -48 1 72 123 162 -199 -124 -206 -176 -252 -100 110 111 -41 -267
3412b67N50j86p5N9j97N0J27J3q5j30j03J45r5M1J17J07J39k34k4J02j5r7n6J40
3436B6l0J83q6O5l34K35J03j58J49j19j43p8L12jM3l6j95N7J59J9q2L0L0m55L05
3461ap0p0J25l02K65Q3O4j29j3L8J2P7j50j22M55l59j47jQ4P8J33j80k2L71p2
3486A47K7l39O3JJ68j49j31J18k10k4N47l83J75j07N3nK45k71K45q3k47J65L3
3509C8J64j94k2M0r7K10k21J58ok25K13k18K89m32J95j33L38j34P8J07o8o3J0
3532B7J80j68j19O8j79J64L6K18l26P6J67O2k75J24R3O2k54K60k86j6n1L07j92
3555b2J0r7J83k5l83N78l62J44j38p0J02R1L2j22M1m5r1K96r7o4j23K22k8q4j6
3580f8l8L41l79m3L11j35m6j07o3JJ02K07j42q1R3J53Nj42q7L5JRr1QJ09Q1j97
$$ plain form
3412 -267 283 97 22 81 -116 -66 61 74 -11 -141 -244 -99 -194 -153 -36 71 210 -24 -48 54 39 -58 -114 26
3436 26 -4 179 93 158 -176 59 162 4 153 34 -109 -187 125 124 167 131 -64 -7 152 171 89 119 149 -306 -1
3461 -1 -71 -141 -16 -318 -53 30 94 -35 -48 -10 2 79 -71 -193 262 -97 -244 -245 -161 -83 50 -130 -152 219 147
3486 147 174 -165 -102 -101 67 -82 -213 -95 -305 -329 218 -165 10 -97 -44 -49 196 -75 170 87 -160 5 38
3509 38 202 8 -14 26 -71 139 -82 76 70 -155 58 -160 129 -303 -108 -241 97 -37 41 148 80 17 27
3532 27 207 39 -80 -12 -191 -27 9 227 -99 -23 144 206 -69 55 148 210 -44 216 -70 -86 -137 170 -22
3555 -22 -12 -109 74 49 -334 244 -118 26 -112 -182 -80 11 43 -79 -38 -83 -174 122 25 -39 -162 60 32 -52 -68
3580 -68 -106 235 -144 -187 124 -11 -57 -164 -227 -226 -124 83 -59 -140 -47 106 111 -31 -118 -83 -82 -73 -164 -156 -47 34 -163
3607a63J66J92Jk11q9L0n8J08K52l65J53N1Q0l05N2J98k14J66j23n9K07P0o0k43
3631a64J39J35l1K2r7r2M7K9j15K18j78J34J53N3l57J59L1k9K9r0P1K0j01j78
3655a92M45j66p9j17K04K4j05Mk85M20Q0p9k14J9R1j4Mk14M7J75j73jL9J3J66
3680I2j14J55l17l8J3K10j3j12j39J7J53nn1J30J8j11J42q0L6j06Q3p5M3J68Q
3705A07N0m8l61L97k07Q1J04k59O8K82m4j99L7l4k78J26J41j27L48l23K31P7j67
3728Bj31k6K81K7n5k34j07J63J3J17k0rN8J30m16N8L87j54k85J35J42o1M0k5j47
3753a17K79l60J74N6j43K44j81j40K63j8m5j35K09k82p3M4L81q7j21o9l9J97r7
3776f0O4k22K40J3p1j35K18j85K66j55J7K05l74J0J45J14j55OK04pK8n1j89Q0
$$ plain form
3607 -163 3 195 196 -15 -104 -74 -132 -24 228 -137 16 67 147 -158 -106 92 -122 44 -79 -138 69 139 79 -164
3631 -164 -25 110 79 101 4 -88 -41 -12 -127 91 -87 47 200 253 -104 55 86 57 86 -4 67 87 -14 -192
3655 -192 253 87 8 -109 95 119 14 18 -267 153 233 154 -60 -41 50 36 40 -174 -127 48 -125 -126 -87 -74 92
3680 92 -22 133 -184 -222 -209 1 -12 -124 -263 -246 -93 -98 -149 -19 -1 -112 30 -50 -14 -120 -37 -112 -69 99 107
3705 107 157 109 -252 145 -62 19 123 -136 -68 214 170 -29 8 -26 -304 -178 -37 -164 184 -139 92 169 2
3728 2 -129 -155 126 153 98 -136 -243 -80 -67 50 30 21 79 209 -207 -149 238 84 -201 -66 76 15 55 30 -117
3753 -117 162 -198 -24 32 -111 133 -48 -188 75 57 12 -123 86 -196 -269 -225 156 69 -52 -121 -160 37 -60
3776 -60 4 -218 22 35 -36 -171 47 -138 128 -27 -10 195 -179 -169 -24 90 -65 -59 145 138 166 115 -74 6
3800Fp8n3m2j03p1L57J04l0N9k05m9M7J05m3J80o6o4p2j93L65l81K76j5Q3l01
3825a84L06L7j46o5j19K20r9j25J33q4J40p3k90N17j26k36K84K50k11J8k57K80
3847A70j93N2lo3Q6k90J42K16l66J98j45K05J35j31J8Q5r7K16k57K9m1j46K56
3870G6j42J38k07M44k71q6j15J9K1J10P3p1J12m0j11J7PJ86j44q7j14J65J56j78
3894d2j18K57J3j86P2R7j74p1M70k25k44M02l17M9N2j11Q5lK6j56N2J28j71j0
3918a25K59j39l2J1o7n9L8j3J57p5NL7k40M5K81k66K17k36R4L32k79J5L40m89
3942a89K43k06K05q9MJ40k73Q6J01n1R4j65K52k93J88q6j42K45m9k08J72m9k45
3965c15L58j77K44k94J56J0l6n6n6J75j81J6J61j37J41L0j22l6K46k29r4K30n2
$$ plain form
3800 6 -72 -125 -167 -270 -341 16 120 90 149 -56 -105 -58 47 4 184 118 54 -18 -211 154 -227 49 34 117 -184
3825 -184 122 159 13 -52 -171 49 -50 -175 -42 -126 14 -59 -349 168 42 -194 90 340 129 147 -110 170
3847 170 -23 29 26 -37 49 -241 -99 117 -249 -51 -196 9 144 13 31 116 19 235 -22 7 -34 -180 76
3870 76 -66 72 -135 309 38 -48 -163 -144 -123 -13 60 -11 101 61 -50 -33 -26 160 16 -71 -185 -20 136 -42
3894 -42 -160 97 110 -76 -4 93 -81 -152 318 93 -151 251 -66 -17 35 -76 9 6 32 -124 -72 56 -115 -125
3918 -125 134 -5 -37 -26 -93 -152 -114 -127 30 -45 -40 -3 -243 -198 83 -183 34 -202 -108 224 -55 -40 300 -189
3942 -189 54 -152 53 -36 -32 108 -165 -79 22 -29 65 -100 152 -141 47 -39 -181 64 15 -193 -21 -70 -315
3965 -315 43 -134 110 -184 -28 -18 -54 -110 -166 9 -172 -156 5 -132 9 39 -83 -119 127 -102 -196 34 -18
3988a8J9P0j77m9L9p8K53j12j93L13J78j67j26q7N8J35n9q5J67n4n6q6J88O2r7
4013C8j98J79q5JJ55k75J81P6k02J09R3m3q5O7J8J18j32n9J92k87l3J89q2J05
4037D0K04m28J03N4j35J65Q4K3J85k00r2J4m2P8m7nj00L24j82j43N3k55M87j32
4061E3P8m3p7n8L18l17K17j23p4j51j27L23j5r6k4kJ4J71j27j91L58j26J19J11
4085B11k92L8N6K8J44P4l81K82J04j75l00J45M0j25K42l6k49J49K16j54j3K09
4107B13j43m9j69J05O9r7K01n01L83M1Jk05L32k96J0K76l77k8L77l16Q4J17j2
4130A6k5MNQ1m2K37r0k87J68J01l1J3o5j31L57m66J47j36K67j99K17j6J04l72
4154a43j14L87r6j68JQ6J53j8R3P0m35p2L87j98J64j20j14o1l24L33J34r9J40
$$ plain form
3988 -18 1 71 -106 -155 -116 -194 59 -53 -246 67 245 78 -48 -135 -77 58 -1 -86 81 27 -29 -115 73 135 38
4013 38 -160 19 -66 -65 90 -185 -4 72 -130 -21 72 29 -56 11 29 147 15 -44 148 -139 -172 17 -65 40
4037 40 244 -184 -81 -27 -162 3 87 110 295 95 3 17 -25 53 6 1 -99 225 43 -100 -47 -302 185 53
4061 53 131 88 11 -47 271 -46 171 48 -26 -177 -304 19 4 -92 -116 -118 -104 67 -60 -251 107 -19 100 211
4085 211 -81 -43 13 41 185 259 -122 160 264 89 -211 -66 -26 -151 91 55 -194 -45 171 17 4 213
4107 213 70 21 -148 -43 26 -71 130 -371 12 53 54 -151 181 -115 -105 171 -206 -234 143 -173 -89 28 16
4130 16 -9 -5 0 81 39 276 186 -101 67 168 137 150 85 -46 311 -155 -8 -144 123 -76 141 125 229 -143
4154 -143 -257 130 34 -134 -133 -47 106 88 181 251 -184 -256 131 -67 97 -23 -137 -198 -522 -189 -55 -154 -14
4177a4J37j01j67K29kq6j91L0q6L11n8L6P6K7j01P5M8l54K9P2J5K28p1N0j10k09
4203a87L64k53lp3K67j3l60J31J92J35k04j32J59K08k87n0K26j78J27n5l8K21
4225A97k47K55j12j29R4K58m26m7K98k20J97MLl08L13k65J54K45j74k43R6j97
4247b54J80j9K65j66P9J03j14j49R1J67l11M9M0mn6J01K4m5j9k43M92l09j2Q5
4271b5K28M2N9m01J73j37Q3k8K77k55P5Rk88J70l02Q2L36p8J6M2k90K32k23K19
4295A6J28k88J95J7J51m58O7K02r9J73j46J20o0q2j52J02q3K2O4J36m4K3k44K18
4319b2p7j61K97KK30j95l62M62j43J81k17k5J90m32O64m41K7J84j04o5J27k65
4341a45N7q4Q0p3J16Mq8N1R2K7k9M3k20m1o5L04Q9Mp7m1m3k6LL54k08n9J99m4
$$ plain form
4177 -14 123 22 -145 84 82 -4 -195 -165 -251 60 2 38 114 141 40 115 163 -191 -162 -90 -75 153 82 132 22 -187
4203 -187 177 -76 -79 -152 115 102 -258 -127 65 200 -4 -136 23 231 -56 -106 120 -58 69 14 -24 197
4225 197 -50 205 93 -36 58 316 -110 -157 141 -79 118 122 125 -183 130 -135 19 264 90 -153 -57 -254
4247 -254 -74 -93 172 6 85 188 74 -75 16 183 -128 -79 -39 -43 -99 2 26 -19 -38 -281 211 -98 -110 -25
4271 -25 203 245 304 -97 76 -61 22 -6 271 16 91 100 -188 -18 -320 -238 98 20 36 78 -212 20 -203 16
4295 16 144 -144 51 68 219 -239 -172 30 -69 104 -42 78 18 -64 -216 -114 -197 -175 -111 25 -19 4 -240 -22
4319 -22 -99 -260 37 39 269 74 -288 174 31 212 -5 -30 160 -272 392 -49 -22 162 58 -7 120 -145
4341 -145 -88 -172 -92 -165 -49 -45 -133 -82 10 37 8 51 -169 -210 -275 29 118 122 45 4 -39 -65 -62 292 84 25 224 180
4369A80j66k7J87mr8j78J93J46k70j4O3J12j79j9n1K49m07L00j26n6J04o3J67
4392D3kJ47l06K66l53K09M7J56m17K65j10K0j50K26q1j6O9j21j0K81k07j40K01
4415A7k38K68k7j34K42r0n6j6O1N8j15j70Q1K00k05kj4L07l87J87N1Oj18K09l
4440A12J40k44N6r2k5j21J93N7N4K9q9N7m13K82k17J23k40J71J91m1M4j84O5K65
4464A73j58o1M0j1nM1j05L7M6N6n4r5Ok1J01j94J29J0J73j47lJ32j09q6o1L96
4490B30m15N26l31Q4k02p2J64J24oR8k17K50k48K3J61l16l2Q3q9O1K96k53J34
4513E3j08K91l39j71L58R9j12k4J8l33J01J59Q8q4l5J22ol3j56K21o9m2j80N0
4537a32J7N0j4J34j28K4K7jR4l23L35k37J59M5j45J12N2N2O4k28J35l44K02j05
$$ plain form
4369 180 14 -13 174 170 72 -106 87 233 -37 -51 12 124 -55 -74 -125 124 -283 17 -109 -165 -61 -124 43
4392 43 41 188 -118 148 -205 4 51 207 -210 55 -55 -35 -185 41 -40 -56 13 -108 -118 163 -44 -184 17
4415 17 -221 47 20 -114 128 38 -18 -34 27 85 -30 -200 -119 81 -124 -126 -140 167 -220 -33 18 24 -94 115 112
4440 112 252 8 64 -28 -53 -174 19 76 130 159 70 127 -286 -4 -221 -98 -338 -167 24 -17 27 -157 -92 173
4464 173 15 -46 -6 -17 -22 19 -86 -49 -3 53 -1 -96 -90 -111 -10 -204 -75 -65 108 -39 -42 90 -19 -105 -166 230
4490 230 -185 341 10 94 -108 -180 -16 108 102 200 -17 233 -15 8 169 -147 -179 -96 -185 -124 172 -81 53
4513 53 -55 236 -103 -274 84 183 71 47 65 -268 -167 -8 80 -4 -39 83 77 44 -112 109 40 -2 -182 -132
4537 -132 -115 -65 -79 55 -73 -49 -22 -23 71 -252 83 -154 5 50 -95 17 69 121 185 -43 92 -252 -50 -155
4561a55L33j52l2l9J30j54k98M21o0l17L43j18R0N7j97J04J33p6jk9j59J56j43
4584a63J59j92J63j07L9j47J83j47R7J36O6j44N6p0P6K82m51J94j98J83J33k94
4606a46R5j31Q5K38L5k26K0O2k03K30J28O7l72J55J29k41P4r0J58r3J51l0Nj62
4630f2%K2j50RK01K4k06J71p3o0K81n76M68K8k86K68k62M53l49N12m94n2K9R1
4654a3K87k94K67j83J24m4j59J6j09J04L6j53p0K84J36q7k1j52P3k05n5R9K02
4677H3j6l61J65N6P8j8J15j30Q7k2j09n3P8K26k56J83L5j55J06l21L16j35PLj8
4702e6k38K17Q6P4ol3L9j36m1O3J33k44J96j05L18j00k7j28K9j39K13n0q8K2p6
4727g7J08J3r1o4L38k90L2L5k0M9j51N0m1k15M41o7k03M9J20J12l22J8K49K17
$$ plain form
4561 -155 178 26 -6 -45 85 -69 -367 54 -6 -323 20 -98 -8 49 -148 -44 89 13 12 -17 -176 -20 -163
4584 -163 -4 -196 -33 -140 -101 -248 -65 -212 -115 21 87 -57 -1 -71 5 287 -164 30 -168 15 148 -146
4606 -146 -51 -182 -97 141 176 -50 -30 32 -171 59 187 254 -118 37 166 -75 -1 -91 67 -26 125 95 100 -62
4630 -62 -62 -40 -190 -181 20 44 -162 9 -64 -124 157 -419 49 77 -209 59 -203 250 -99 413 -81 -133 -104 -13
4654 -13 274 -20 247 64 188 144 -15 1 -108 -4 32 -121 -191 93 229 142 121 -31 42 -163 -218 -119 83
4677 83 67 -294 -129 -73 5 -13 102 -28 59 37 -72 -125 -47 179 -77 106 141 -14 92 -229 87 -48 -41 -38 -56
4702 -56 -294 -77 9 83 77 44 83 -53 -94 -31 102 -142 54 -51 267 167 140 12 41 -98 115 65 -23 -1 -77
4727 -77 31 44 -47 -111 227 -63 -31 4 -16 33 -118 -68 -109 -324 117 50 -153 -104 16 128 -194 -176 73 290
4751B90k21R6j06q8n9Q3J35j93j04J57J81l35J76J62j57m0J70k50J98k77L44j79
4773a7J64n7p0J38m3k04J96k83K88k03LN7j29K90Pl7rk9k93L11l63J93J28k20
4797a82J34k20K86p1J23q1l9j28N25k33k98N4N9O7j47J21J01j48N6R9j52J25n8
4820gN9J09n9O3l38N7J90L35k45k24K54l40J31L4J37q9P8j58J00k78K41jp2j87
4844b10K36k06L10j67K50k37j3J49k39j50N22j98K24k66k52J87K73Q7k42m4j5
4865aj95J40K74n26L37j88J89j02J92m02J62J83j80J82k52K25j65K34l8j7k17
4886a65K30j63L61q5k46q6O2K59k39j76L88J36k92j99L0K99j14J08l8Q9j70o2
4908g3K6M3j29K73k90J73q4J03L4k83k1L92k99j69M93l42J17j76K65l9k02J20
$$ plain form
4751 290 69 165 59 -29 -88 -5 130 -63 -167 -10 171 -164 12 174 17 -23 147 -103 95 -182 162 -17
4773 -17 147 90 20 158 115 -89 107 -176 112 -91 -88 -31 -160 130 137 100 91 62 -231 80 -283 -90 38 -182
4797 -182 -48 -268 18 -53 70 -11 -50 -178 347 114 -184 -130 -71 -4 -151 -30 71 -77 -21 78 -74 51 -7
4820 -7 52 161 102 165 -173 -116 74 409 164 -60 194 -146 -15 19 156 67 145 -13 87 -191 50 49 -23 -210
4844 -210 26 -180 130 -37 213 -24 -37 112 -127 -277 245 47 271 5 -247 -60 213 300 58 14 -1
4865 -1 -196 -56 218 -308 29 -159 30 -72 120 -282 -120 63 -117 65 -187 38 -127 107 69 52 -165
4886 -165 65 -98 263 178 -68 -154 -92 167 -72 -248 140 276 -16 -215 -185 114 0 108 70 159 -11 -73
4908 -73 -47 -4 -133 140 -150 23 -61 42 76 -207 -228 164 -135 -304 189 -153 -36 -212 53 14 -188 -68
4930f8J25m3j7n5J12j06m2K12k32oL1J9j44J58j14J83q0R9p7j67J58K5pJ29j62
4955f9L98k91p7q3N6O4J19n0q2p5J92j29j37Q8J54k48p1L42k90M11k81K8k6J11
4979E4P9l54L64k91L2K95p3J3r9k8j82J18O4K8o4mJ11n3k44J88P1K29j31o0l9
5004B4Q1k95J68J17j40L0j9J89k23L46k03k2K77l58K01k77J24M9j87q4K45k98
5026b55M8M03j54j92J96o8j3N0J5J04j43k5K31k42L6K04k73J78n6J19j22J80k82
5049f1N6qqJ22k28J1P3j11K64P3k05N5L0R8j81l9Q5J42j08p3J43O3j28j86j60
5074b81J01l3J05J33j24J08k0J24l9o7Rj54K95N8j57l0m5j62J17N8J36j29L5J5
5098E3j87Q0J02Q2j52K0J18k93K31r4Q3J36J5j15L1k6n3p3k8k5J41mk1k7j36K
$$ plain form
4930 -68 57 14 -3 -58 54 -52 -94 118 -114 -120 -89 -70 -214 -56 -170 13 -67 32 -45 -212 -54 -29 -36 93 -69
4955 -69 329 38 -39 -122 -66 -2 117 67 -15 -90 102 -27 -164 -76 78 -170 -241 101 -189 222 -59 -31 -57 54
4979 54 133 -221 143 -148 -116 179 106 119 20 -8 -190 -72 -8 20 -44 -48 63 10 -234 -46 25 254 123 63 24
5004 24 105 -190 -22 95 -45 -15 -34 155 -68 278 75 53 330 -28 173 -104 20 69 -118 -202 43 -255
5026 -255 -207 196 42 -150 46 -22 -35 15 30 134 -9 -34 197 -45 -9 195 -78 100 44 163 41 221 -61
5049 -61 -5 -13 -21 101 -127 -116 -43 -154 110 183 -22 33 63 161 -20 -59 26 168 60 -13 130 193 65 -121 -281
5074 -281 -180 -213 -108 25 -99 9 -11 113 74 7 16 -138 157 215 58 28 -17 -179 -62 -4 132 3 38 53
5098 53 -134 -54 48 130 -22 -2 116 -177 54 -40 43 179 194 79 110 84 31 -42 -70 -95 46 42 21 -6 -142 -140
5124a40L37k85K74k43J32N6j22J25o2P2j69K33k91K70k69K29k23Q1j17J50j63
5145a25P9q9J23p2J49o1j9N4p7j13r2J73L01m02R8m8K32o7p7R2j86L7p4k4K20
5170C2l0Q3Oj34N5o0J40k36O8J21k31L41k67J86p4K13m4k61J35k59M4J08n7j85
5194c06J89Q6j1K49q7L2n9k58j27M02k61L63j79m8Q7J86j35j07j61k3J06J22l13
5217b53M05Nl77Q2L74j79j80L89l76Q9K03O4j95j44k2J72k4J17j62K7L64k19l04
5240a44P3O0j37J98r4J10l47L72j76Q4j28j60L95R9k67n9K6O1J40m2k77J64o5
5263a14J42ll0n6n0K45j91m5Q8J22j80J81r7K4k23L43l54M10l20J38j47J26Q0
5286H9j05K18j86p7n2M1K61j00p2K11q7J4J3k19r7R8O9j00P9J08J04k28j76j9
$$ plain form
5124 -140 197 -88 186 -57 75 131 9 134 72 144 -25 208 -83 187 -82 147 -76 5 -112 38 -125
5145 -125 -46 -135 -12 -84 65 4 -15 39 -38 -151 -243 -70 231 -171 -73 -121 111 44 -33 59 -127 -90 -164 -188 32
5170 32 2 85 91 -43 12 -48 92 -144 -76 45 -186 155 -112 74 0 213 169 -92 43 -216 -172 -64 -121 -306
5194 -306 -117 -31 -42 207 120 152 93 -165 -292 110 -151 212 33 -15 72 258 123 16 -145 -168 -62 60 -253
5217 -253 152 157 -220 -138 236 57 -123 266 -110 -21 182 246 51 -93 -115 57 33 150 -12 15 379 160 -144
5240 -144 -71 -11 -148 50 -44 66 -281 91 -85 -1 -129 -289 106 205 -62 -121 -95 -34 106 64 -213 -49 -114
5263 -114 28 25 -5 -61 -111 134 -57 -102 -14 108 -72 109 12 36 -187 156 -198 212 -108 30 -117 9 89
5286 89 -16 202 16 -61 -113 -72 189 89 17 228 141 155 168 -51 -148 -50 19 -81 -2 106 210 -18 -194 -213
5310b13L09L6jk43Q4n0J44N7M3k65J10M9L7r3j53K05j08o4M1L5r5k7L11k17Nl4
5336i7Pk2J56N0l10L99o43N47o0J00j39O7j28O9o6q1J28L6J77l39O0L75j69j22
5360eJ11k09J89j65L95m05R4O1rl2o3l2O8L6j51Q4J10j60J40j52m8R0p1K01n0
5385B7j51K3K32K3M3j28r8K39k39j51K19j11k27K13J37k46J85K4k01L04k3j36
5407d2N4n8N3k31N32l05l10L23j04j0k8L95o4k52j73N11q5l94J47j13K60j55j00
5430a49K67j64K95p0k50K49j05l72K40L6P0j08J46L2k73J99l6R6j12J47j09r9
5452g0K8J17j17Q6q2k38M38J39j07l66L87j81k17K39k20J88j36K0M34m99J0J28
5474a9m3n5J30N5J77k13K9j11j37N4K31p7o7k29N2K92J50l31J50O8j74K95k87
$$ plain form
5310 -213 96 132 131 -112 -28 -78 66 123 166 -99 11 60 97 4 -149 56 -52 -116 -75 -40 -135 -162 149 -68 -63 -97
5336 -97 -90 -112 44 94 -216 183 -460 87 27 127 -12 55 -73 -4 -70 -151 -23 13 190 -149 -89 286 117 -5
5360 -5 106 -103 86 -79 316 -89 5 66 57 25 -38 -70 -2 34 -117 -33 77 -83 57 -95 -143 -53 -124 77 27
5385 27 -124 -101 131 154 197 69 -29 210 -29 -180 39 -72 -299 -86 51 -195 -10 14 -187 117 94 -42
5407 -42 12 -46 7 -224 308 3 -307 16 -88 -98 -126 269 205 -47 -220 291 206 -188 -41 -154 106 -49 -149
5430 -149 118 -46 249 179 -71 178 73 -299 -59 -23 47 -61 85 117 -156 43 7 103 -9 138 29 -70
5452 -70 -42 75 -42 44 -38 -276 162 301 194 -172 215 34 -183 56 -164 24 -112 -92 342 -157 -147 -19
5474 -19 -62 -117 13 68 245 32 61 -50 -187 -133 98 21 -46 -275 -223 69 219 -112 38 106 -68 227 -60
5497f0K06j04j67J31L26m53M99j63m62j7M20j51r6k1R3q5r1J32J65J03k89L61
5519B77j84q5l7jO9n6P1mJ68k01l0M1k14P1J15j05K23j33P5Q1m21K35j02K34k06
5544a19p0O6N8nJ08J33j6j65k7J62o6n5M6j51L08pj46j35J69J13m93L76j15J86
5568A55j43j36K11J87m41K3K22k64J83o0j3J7J15Oj73L18l17J93L6l72K43k4j57
5591a91J64J57m12N68m10J09lm13M40j01J15r8k74L79j25o5P6p9K71J7l19J90
5613dK51k78k38R9K00k09k72J71K64lJ48q1j9j20P9Q0J3m9K6k94M6K40k06K08
5637E2k19KK74j00K0j82J0J27j41K93j49OL3K2q1K07j56R7j19J89k35n7K52r2
5661E3j61L7L9J8N5k24K9K15O0j31P4Q8k46L2k07P0K0J36K51k21J7L7j40Q8k29
$$ plain form
5497 -60 146 42 -125 6 332 -121 378 215 -247 -264 156 5 -91 -112 -19 -104 -195 -63 102 205 -84 277
5519 277 93 8 -29 -30 39 -17 54 50 218 17 -13 28 -186 -115 0 -105 118 -15 60 141 -280 -45 -147 87 -119
5544 -119 -189 -123 -65 -70 38 171 155 -10 -37 125 59 4 50 -101 207 200 54 -81 88 201 -292 84 -31 155
5568 155 12 -124 87 274 -167 -144 78 -186 -3 -63 -76 -59 56 62 -111 207 -110 83 119 -253 -10 -34 -191
5591 -191 -27 130 -282 286 -124 -15 -18 -431 9 -92 23 -75 -349 30 -95 -160 -84 -163 108 125 -194 -4
5613 -4 247 -31 -269 -170 30 -179 -451 -280 -16 -19 129 48 29 -91 -12 68 81 32 58 -236 -190 50 -156 52
5637 52 -167 -165 109 9 29 -153 -143 -16 -157 136 -13 -7 26 48 -33 174 18 115 -4 185 -50 -107 145 53
5661 53 -108 -71 -32 -14 41 -183 -154 61 121 -10 64 152 -94 -62 -269 -199 -179 -43 208 -13 4 41 -99 -11 -240
5686b40K19n3j58L12k13m4q8M76j16j71K4r3J54J9k8J98l09K1k0M1Q6j9l33N56
5710B21j23l71J89O4K43l5l29J24L2j3Q4J36l33J36o6L27k15j93J90k22J95k56
5732b15K39J34n7j43J39j02q7rK02j37l6J61q7J50j54J26j40j65K13q2o0p8p0
5755b58K93pJ05o4k25L03J58l52j12J02l3N6J30Kq9O9j45J1J70j50J68k68O9Q9
5779B2J26jj63J92j46j87J78j47J89Q7j61j97K05K6L1M8j28j5m7J62j53mJ70n7
5803C0R5j50j27K02R3oJ46l33P5j04J66k60j82L92J06j10r6K69j72p0M0J27k81
5826a50L23j31p3J11j64q3K79r9j65J33j44r2K73J72j90j53J24L6q8P7Q8Qo6q9
5850f3k8K39L7j70K44j63o5k85K07R0k0J02O9k55J37r0n3m2J78q0m6L1K80l26
$$ plain form
5686 -240 -21 -74 -232 80 -133 -177 -265 211 95 -76 -52 -145 9 28 0 198 -111 -90 -110 -69 17 -2 -335 221
5710 221 98 -273 -84 -20 223 188 -141 -17 15 2 86 222 -111 25 -41 286 71 -122 68 -154 41 -215
5732 -215 24 158 101 -42 97 -5 -92 -101 101 -36 -72 89 2 152 -2 124 -16 -181 32 -50 -110 -188 -258
5755 -258 35 28 133 69 -156 147 305 -47 -159 -57 -90 -34 96 98 9 78 -67 -56 114 -36 132 -136 -67 22
5779 22 148 147 -16 176 30 -157 21 -126 63 150 -11 -208 -3 23 54 102 -26 -41 -88 74 -79 -83 87 30
5803 30 125 -25 -152 50 143 137 283 -50 25 -79 87 -173 -355 37 143 33 -63 206 34 -36 4 131 -150
5826 -150 173 42 -31 80 -84 -167 112 13 -152 -19 -163 -255 18 190 0 -153 -29 7 -81 -4 84 92 26 -63
5850 -63 -91 148 185 15 259 96 31 -254 -47 43 23 125 194 -61 76 -14 -67 -109 69 -11 -57 -26 254 -72
5874g2nJ25r5J54p8p9k0j23M9K09m34L61L1j08M6k03L38R4k35j33K3pJ63k93O8
5899b24J66l3J16J24j29k41J55J95j14j56p5L25k03j22M8K58j87j20L02q5P7k62
5921a85K33J02l59K16k75L36Q6K3l55L76j51j75J88j41L19l61K14k49J64J6nl0
5943a3K25j09N2M0k32j58NL10j08p9j84M45n8k06K04k89N0P4J73k02j02M8K77
5966A63l4k08M9J88j64j03M3j42J26N6p4m8J89Q1l4l32J53Q5OR2l06L14q5J3J00
5991A28j27K50j86j13o9K28J8j36K0j1q4J50J73k06o6J2K39m21M19k07k8J01K8
6014A12j76Q0J0j03o6NJ08j01K53kk06J71j0R7k18K67o1k69J3q2K49J23j15j52
6038g3J43N6N2j98N2j65J78j39M07l34K0p7j99K79kr6K93l39KJ20N5pj1m9O1J87
$$ plain form
5874 -72 -77 48 -47 107 29 -50 -70 -193 -144 65 -369 -8 23 -85 -39 -242 96 190 -45 -178 -155 -162 1 -292 -224
5899 -224 -58 -91 25 149 20 -221 -66 129 15 -141 -216 109 -94 -216 -168 90 -97 -217 85 0 77 -185
5921 -185 48 150 -209 7 -268 68 154 177 -178 198 47 -128 60 -81 238 -123 91 -158 6 22 17 -13
5943 -13 212 103 155 195 -37 -195 -190 120 12 -67 -251 194 136 -70 134 -155 -105 -31 142 -60 -162 -114 163
5966 163 129 -79 -30 158 -6 -109 -66 -208 -82 -26 -100 -148 41 122 88 -244 -91 -6 0 92 -214 100 15 28 128
5991 128 1 251 65 -48 -117 111 129 -7 13 2 -82 68 241 35 -31 -19 220 -201 218 11 -17 84 112
6014 112 -64 16 26 -77 -143 -138 -30 -131 122 120 -86 85 75 172 -46 221 160 -109 -96 -178 71 194 79 -73
6038 -73 70 126 178 -20 32 -133 45 -94 313 -21 -1 -78 -277 2 0 -96 197 -142 -140 -20 35 28 17 -32 29 216
6064B16l10j4K48j75K25k09j19k1j0P4J71J88l66J43k1o1O8J8n1Mj29K9OJ58p7
6089a5J55P4l43N1J65P4j60mL5K4R3j79O4k00J83pk3N3M0l0q1O2m6M4k05J83J66
6116A73m83L27l67L29J02k50L11j26j84J22J31o8k24L00L8j31N8m9j94K98j06
6137Gj95L38l71J55j03J25k57M08k91J72L4j11K16j60j13pQ2j1Q8N5j57J18j00
6160g8K47j06m8J56l87L42n1j34L0J08j3k7%J29p1j84K87j46k50L0L79Kl18L14
6184B11j85j29l4j11J16J37O1k24J73rj10K52L6Nk27j07L9l5J27o2K00J22l83
6207a37J54J10j83K53j44o1j44k8J03l1K38m79L60p2j28L26J1k98N2K27j9l3n4
6230B3Pj01N6J53l42M04k64K3n7K31q2p0j54M1K57j9k37J98P5j64R1L1o2Q0J41
$$ plain form
6064 216 -94 -108 140 -35 190 -19 -138 -159 -169 -95 76 264 -102 41 20 -41 27 45 -6 -2 -131 -102 -96 62 -15
6089 -15 140 214 -129 -78 87 161 1 -3 32 56 149 -30 34 -166 17 10 -13 40 80 50 -31 31 -15 29 -176 7 173
6116 173 -310 17 -350 -21 81 -169 142 16 -168 -46 85 17 -207 93 131 0 58 9 -185 113 7
6137 7 -188 150 -221 -66 -169 -44 -301 107 -184 -12 22 -89 127 -33 -146 -153 -71 -82 6 61 -96 22 -78
6160 -78 169 63 15 171 -216 126 75 -59 -29 79 66 39 39 168 97 -87 200 54 -196 -166 213 215 -103 211
6184 211 26 -103 -137 -248 -132 5 66 -158 15 6 -104 148 184 189 -38 -145 -106 -141 -14 -76 124 246 -137
6207 -137 17 127 -56 197 53 -8 -152 -180 -77 -108 130 -349 11 -61 -189 137 148 -150 -98 129 110 77 23
6230 23 30 -71 -15 138 -204 200 -64 -41 -98 133 51 -19 -173 -132 125 106 -131 67 142 -22 69 100 38 118 259
6255B59k82k3pk5K23j26j71K40j67J64l45Q8m4J09K93j04L6M3L0j17j33K88k82
6278e3pP0j66K29Q4k49J46j18J05L1J71l49J07L7j12J4J66J99j77j74O8k8M1j80
6302a45O9J33p4O0j60N7J0k1O2o8J63q3Oj55rj36J05J11K47k25j72K47J73n07
6326c12QK93j66L46k77m4J8K39p0mK01m08K47Q1k64L98k09j49p3nK02p8R9j34
6350f1o2J59j65J3Q2k25M04k72M45m80j00J83L11k94k8L17k51k8p9L1J0N0k22
6373b62N28q5j11j61K30q6NKk3N9j2k63L34k47M4l2lN4j61J98M9j43J89k92J67
6398b2j00J42R5k25J80j96N8O9J1k5p2K3j46L12K47m71L12k43j37J52o9J02J6
6421A3O1o8J57k70J08j44J5J29q0L4j60K87Q7p7J22j54p1L71k72k20%J30J59k24
$$ plain form
6255 259 -23 -46 -53 -78 145 19 -152 88 -79 85 -260 -172 -216 -107 186 82 118 161 191 74 -59 229 -53
6278 -53 -60 10 -156 73 157 -92 54 -64 41 72 243 -106 1 38 -74 -60 106 305 128 -46 22 -6 35 -145
6302 -145 -76 57 -17 43 -117 -60 -50 -71 -9 -77 86 3 9 -146 -155 -291 -186 -75 172 -53 -225 22 195 -312
6326 -312 -304 -11 -177 169 -108 -152 -134 105 35 31 232 -176 71 152 -112 286 77 -72 -145 -150 52 -26 73 -61
6350 -61 -123 36 -129 -116 -34 -259 145 -127 318 -162 -262 -79 232 -62 -90 227 -24 -52 -131 -100 -90 -40 -262
6373 -262 266 181 70 -91 139 53 58 60 37 96 84 -179 155 -92 -48 -80 -83 -29 -190 8 57 -86 103 -189 -22
6398 -22 -122 20 115 -110 70 -126 -68 1 12 -13 -85 -62 -208 104 351 -120 192 -51 -188 -36 -105 -3 13
6421 13 74 6 163 -107 1 -143 -128 1 -79 -45 -205 82 169 92 214 60 -11 360 88 -132 -132 -2 157 -67
6445f7K17j41nQ9k2j41J79Lj43j89M21m50K13j13J97j10j9k4MJ16K4J24k83o8
6469a88L83l75m2J73j36K43n0j54N0Q0lJ14qj10J60j63j03K06j94R9J42m8j38
6492f2J10J65q4k36J31n0j80J39P5j0M6JJ95k48n1j89J10QJ64j36Qr0K2K03K1
6517F2N1Nk34L8Q4J26k65K16R2k48K52m61L28j27L72k46j99K9J67k94K1J08J48
6540B5k4n4k58L19l1n9J92k56L76j71J54k39l6LR0J28j51r9K14l52Q3K51r8m5
6564c8k40K88Q9k13J0J6K13j55J35o7P2k27n8J32J52m2k46Q0J1J25j49LK23j08
6588Fm1K7j35J62j93j3r4J78J38q0L06p0n35K83J13j50j1%o6K50l0j47K19l69
6612b52L11J96j03k87J86k43O8J76k0R3q5M2p3J27o2j12J22J0j70Q2n0J18J77
$$ plain form
6445 -67 150 9 4 93 71 -70 109 112 -31 -220 201 -249 -36 -149 48 -62 -81 -105 -101 15 39 163 -120 -188
6469 -188 195 -180 -222 -49 -185 58 8 -146 -96 -16 -19 95 87 -23 137 -26 -129 77 -117 -18 124 76 -62
6492 -62 48 213 129 -107 24 -26 -206 -67 8 -2 44 45 240 -8 -59 -248 -138 -130 34 -102 -94 -184 -162 41 62
6517 62 113 118 -116 -78 6 132 -133 83 175 -73 179 -282 46 -81 291 45 -154 -125 42 -252 -231 -123 25
6540 25 1 -53 -311 8 -23 -82 110 -146 230 59 213 -26 -62 -59 31 159 8 -91 123 -229 -146 105 7 -38
6564 -38 -278 10 99 -114 -104 -88 125 -30 105 38 110 -117 -175 -43 109 67 -179 -99 -88 37 -112 -109 114 6
6588 6 -35 -8 -143 19 -174 -187 -281 -103 35 -45 261 191 -344 -61 52 -98 -109 -109 -175 75 45 -102 117 -252
6612 -252 59 255 152 -135 51 -192 -124 52 32 125 40 82 9 136 74 -38 84 94 -76 6 -44 74 251
6635B51m80J46K1m0L8r0J28n6j49J11K5K16l88MJ61J33J54o8%j91k7L51j40N6
6659A66o8qq9k7m6J10j05k42L80Nj41n9l3J58r2m0J1J7J17J4m5k7J50m7k50K25
6685C4o3N1k79K52Q2k68L72k08l2q3R7j15J59R3j06J12o3k7L9K28m79L48J29m18
6709a45J8J04J03l9J41q4k83K04N1n0M2J36J39k61j03n1L9J08l4n1k02J44J54
6732H0K27m79L60j69j33Q5q2J39J17o3Mj62J39k17R5J38n6O1nj71R9M9K26l10
6756b8j02j4J65j00pK26k03J12j76J78l5K86k75J28m7k94J93QL7J75k13n8j37
6779a81K62j89j64n0K99JJ27k24J63j14J29k39J66K10j63j01J39o4j20L55l04
6800f2J60J2r9p9J19k4q0jj5j43M12j58P0j49r3KK1M5n9K55k75K47m68L63P4k41
$$ plain form
6635 251 -229 -83 -62 -102 -64 -154 -26 -82 -231 -120 -95 121 -267 -263 -102 31 185 117 117 -74 -101 250 110 166
6659 166 98 90 1 -26 -72 38 -67 -309 71 76 -65 -124 -157 1 -91 -131 -120 -103 14 28 -17 -44 106 59 -191 34
6685 34 -29 22 -257 -5 77 -191 181 -27 -59 -142 -45 -160 -1 92 -14 98 35 8 47 275 -204 144 273 -145
6709 -145 -127 -23 80 41 182 98 -185 19 70 20 62 198 337 76 -27 -78 -39 69 35 -16 -218 -74 80
6732 80 307 -172 188 19 -114 -29 -111 28 145 82 86 -76 63 -154 -59 79 23 84 79 -92 7 56 282 -28
6756 -28 -130 -144 21 -79 -86 140 -63 49 -127 51 16 302 27 155 108 -186 7 15 52 227 14 -44 -181
6779 -181 81 -108 -272 -322 -23 -22 105 -119 44 -70 59 -180 -14 196 33 -68 71 7 -113 242 -62
6800 -62 98 110 11 -68 51 27 -53 -54 -69 -212 200 42 112 -37 -130 -128 -107 -62 -121 134 -141 106 -362 1 75 -166
6826a66K96j58J22n6j07J0J02J49k40j28J4j14J73J02j14j42L47j19P9%k22J21
6848e1M8o4j9J87j48r5K19J13j66j43J92j92K68l94L66j74L9K19l25L1N9l9j24
6871a93L64j44k55L30j89K01m62N89p19O29r4j91L12l72M29n8L6j88J2k37J65
6892c5J23n3j53R6%k53J37J30J36k01R2j75J08K48j41j06k54J70O1j40J33L15
6914B38rk77J43n0M1o4j32q5J94j8NJ71k59N2j03L58l9k08q4L36j87j2r3K00j86
6939f8Q5R4m7o3Q1j30L6N5k41K36R1j37K8R2j64J54j17K44o5m9Q8j60P7l03K74
6964I1j46Qj19K21Q9j39l3q0J35p1k4k1J11j35K0L04j01q3J17l1N8l11K29P8m17
6989b50M13j76Q3j61j76K26J81j97L38k12M4m2l6K3K3k11M09l37J64l8J54J3l93
$$ plain form
6826 -166 130 -28 94 38 -69 -59 43 192 -48 -176 -162 -276 -103 -1 -115 -257 90 -29 50 50 -172 -51
6848 -51 -3 -67 -86 101 -47 -142 77 190 24 -119 73 -119 149 -245 121 -53 -14 205 -120 -89 -30 -69 -193
6871 -193 171 27 -228 102 -87 114 -348 241 -478 151 57 -134 178 -194 235 177 213 25 37 -200 -35
6892 -35 88 35 -118 -22 -22 -275 -138 -8 128 -73 19 -156 -48 200 59 -47 -301 -131 -70 -210 -77 238
6914 238 229 -48 95 45 86 22 -110 -195 -1 -19 -14 157 -102 -50 -153 205 166 -42 -126 210 23 11 -82 118 -68
6939 -68 17 111 64 1 82 -48 -12 43 -198 38 129 -8 20 112 -52 102 -15 229 164 115 203 43 120 -183 91
6964 91 -55 -47 -166 55 144 5 -28 -108 27 -44 -68 -89 22 -113 -93 211 110 27 144 113 171 -140 89 167 -250
6989 -250 163 -13 70 -91 -267 -41 140 -57 281 69 113 71 35 58 81 -130 279 -58 106 68 222 235 -158
7012a58J64O1j72mK64j58P1j66N1N8j9K9J38k10J1k5J15j67J05P3j1N3J0j30%
7037a7J59r9P4k09k9K43k00N0K26k02K92k41r8J42l1k4R6j18k89J96J06o6M6K34
7061B41l72o0J25J77k68K45j28o7oJ40J12k00j37K17M1j82J90Q1k84J98J7k5K5
7084H0p6l5K15m39J28J42N0L8l29J59P7j40n3L45j33j27J25k35M22J76n18m6k0
7107a94K34p0l11K48n1K67k16q2Q7r9J60J83k18J9r6L3K66j67N6MQ7P2j47j99
7131a34nN6r9J93m3n7K03j48j8q2K46j98j43L13k22J30o7J31o0J5j63J87j7n9
7155d1k46M24j38M7q0j60L36k09l5j1J47m8K2j59k33N05k01JK91j03k20J51Q4
7178A24j94J49J45j38j41j0l0J01R7p0k03L38j53K23k79M8kP9l00K32j25L75l10
$$ plain form
7012 -158 6 67 -105 -109 155 -3 68 -98 -47 11 -8 21 159 -51 -40 -65 50 -117 -12 61 50 103 113 -17 -17
7037 -17 142 43 117 -92 -121 122 -78 -28 198 -4 288 47 -51 91 60 36 132 14 -275 -79 27 -39 7 241
7061 241 -131 -191 -66 111 -157 88 -40 -107 -113 27 139 -61 -198 19 60 -122 68 149 -135 63 80 55 80
7084 80 4 -31 184 -255 -127 15 65 103 -226 -67 10 -130 -183 162 29 -98 27 -208 214 390 -128 -174 -194
7107 -194 40 -30 -341 -93 -144 123 -93 -175 -88 -187 -27 156 -62 -43 -139 -106 160 -7 49 53 140 212 65 -134
7131 -134 -139 -83 -182 11 -32 -89 114 -34 -52 -134 112 -86 -229 84 -138 -8 -75 56 -4 11 -152 35 18 -41
7155 -41 -287 137 -1 46 -34 -194 142 -67 -102 -113 34 -14 8 -151 -384 121 -80 -79 212 109 -111 40 124
7178 124 -70 79 224 86 -55 -65 -95 6 103 33 -170 168 15 238 -41 7 5 84 -216 16 -109 266 -44
7201d4L2o0j30K91l26K60Kk50K68O0J65k91j25K22k44k1M26k90K69L9m04K8O4
7224e9q2K73k07O4j11j28J86j4Q0m5J39k49K65j60M0J81l86K92k72L72k38K10
7246A51j33j33q2K0K01mp2M9P9n7P9r7K73k20j24J67o3k00J42K39j7o3q9j3j47
7271a14J26J22j42J63r9j29qK2J9J58j12j22J20j99J44J53j76n7j15M98j50P4
7293A76j72j05Q0Q1q7L2j43J14k0qj91J05L27l21K30K1R7K9j76r9O9o0j96J30
7317h7K07Lj06N0j47K17j45J8K6P6m4k12j25K59k53K13K16r8j48n3j25L12K08
7340B62j04k86k3J17N0j0j0r5n1J42r7J87K03l58K07l9J38l13j40J58M3J44k63
7363a38R0N3j78m0L66l15P0j60K08q1J44N6k91K98l4j76N4o3J41P3L4r8l64N84
$$ plain form
7201 -44 -12 -72 -202 89 -237 23 25 -225 43 103 268 -23 -148 74 -170 -191 235 -55 214 253 -151 -123 -59
7224 -59 -141 132 -75 -11 -122 -250 -64 -78 2 -43 96 -153 112 -48 -8 173 -213 79 -193 179 -59 151
7246 151 18 -115 -197 -177 24 20 -52 -3 76 19 98 1 274 54 -70 97 34 -166 -24 215 198 135 46 33 -114
7271 -114 12 134 -8 155 56 -73 -81 -59 -40 118 6 -116 4 -195 -51 102 -74 -131 -246 252 102 176
7293 176 4 -101 -21 60 -27 5 -138 -24 -44 -52 -243 -138 189 -132 98 119 216 245 69 -30 39 -21 -217 -87
7317 -87 120 123 17 67 -80 137 -8 10 36 112 68 -144 -269 -10 -263 -50 166 68 -80 -133 -258 54 262
7340 262 158 -128 -151 -34 16 6 -4 -99 -150 -8 -105 82 285 -73 134 95 233 -80 -220 -62 -19 125 -138
7363 -138 -48 5 -173 -213 153 -162 -92 -252 -44 -125 19 75 -216 82 48 -128 -74 -137 4 77 111 13 -351 233
7387B33k74p1R4K7L45m30oJ01K18l61J43K6P8Q8k76M1n2J45jk17K68l47J5J45
7411f8J12p5l8L1J49l21K24P9J9l9k4j10o1NJ90j29l1o3K68P4j23o1nO3o5lk98
7438c00K34M8K55j92M1p4m4L8J59l06rJ77OK05k68l1L00m52L34Rk06k3L16o2O4
7463B19m29L50j83N26l02j90P1Lj06j03M16k11J9j55Qj64K23L2j28p0O5P2N7J66
7487A86j21j86K5M18l08J16j20N4K3n1N8p1r2J54j4k24L38k20J26o1l4K57J10
7510C63m05J8j2j96L71j51L6R2j49J36j75k6L27j76l9m07M75o0K1K2J02J36l29
7533b6n1J67k33J30L03kl50Q8N7o1j11R7k4J17L3k16j3J26O5M4k08K60l88L02
7557A06j39m1O2l3j92L59j86J70n06N35r1K2j04K39k78o1J28j99J13o0L21M2l47
$$ plain form
7387 233 -41 -112 -18 9 354 -76 -82 19 237 -124 19 45 123 211 -65 -24 -76 69 68 -149 119 -228 -213 -68
7411 -68 44 -31 -69 -38 111 -210 14 93 112 73 49 -61 -122 -117 73 -56 -87 -150 118 192 69 8 3 66 1 -2 -300
7438 -300 -66 -18 237 45 86 12 -32 6 165 -141 -150 27 33 238 -30 -61 239 -213 121 130 -76 -99 217 155 219
7463 219 -210 140 -43 483 181 -9 62 65 -41 -144 272 61 80 -75 -67 -231 -8 24 -104 -174 -109 -37 20 186
7487 186 65 -121 -96 322 14 130 10 64 87 36 94 23 -69 85 71 -153 185 -35 91 30 -4 253 363
7510 363 -42 -24 -36 -232 139 -12 24 116 -33 103 -72 -98 229 53 14 -393 82 22 43 65 167 303 -26
7533 -26 -77 90 -143 -13 290 288 -62 26 83 22 -89 8 -16 101 134 -82 -95 31 96 140 -68 192 -196 106
7557 106 -33 -74 -12 -45 -237 122 -64 106 -400 135 44 66 -38 201 -77 -138 -10 -209 -96 -156 165 207 -140
7580a40J42jj46L27k24o1J16l0R5k15K21J3L0k43J33k13L13k68K16k37J02J00
7602C0j1J05j76J86m0k73J77k26K52K06j80p7k13K50k03j7K00J6j88J51J30k30
7624a31l6L81n0m67K25K94o76K96K70n4k6qj84K31j92J57m4J06l4J47j29l9K3
7647F0j99J29o7M3K69l10k2J15m7k0K6k3K14j84J35j26l8J9J28n0j3M2j62n6K28
7672I1k09J00MN5l96L12L12J4m72P7O5M8k3R8M4j2j61kq9P3n8J39r5M4k08J69
7698h0LO1m2K5j9J3J20p2K4J02l22K85n8M6l19K01J4J25rO9k86Q6J87j55K5J05
7724A29k24J35j7j2J91o2k30P7k9M6r6j33L52p5j10J37j00J30J80n62M40l73J88
7747a8QL52m19K88j76J14k72M1k7L14l53J78r0J0P4m2N0k9J24m4m15L15K38k21
$$ plain form
7580 -140 2 1 -145 182 -42 -103 13 -17 78 -137 84 97 127 -116 17 -196 117 -151 65 -172 -70 30
7602 30 19 124 -52 134 94 -179 -2 -228 24 230 50 -27 -240 10 -193 -210 -10 6 -182 -31 99 -131
7624 -131 -167 214 164 -303 -78 216 -460 -164 106 52 26 18 -166 65 -127 30 -14 92 58 205 76 37 60
7647 60 -139 -10 -77 -34 235 -75 -97 18 -29 -49 -23 -46 168 -16 119 -7 -45 -26 102 52 39 81 -81 -137 91
7672 91 -118 -18 -14 41 -355 -43 269 283 -189 -112 -47 1 -22 76 120 108 -53 -55 -144 -71 -129 10 -85 -41 -249 -80
7698 -80 -77 -16 -58 -33 -52 -39 81 9 33 135 -187 98 40 86 -233 -32 -18 107 98 167 -119 -33 154 -1 24 129
7724 129 -95 40 23 11 202 140 -90 -13 -42 4 -92 -225 127 52 -58 79 -21 109 289 -273 167 -206 -18
7747 -18 -10 342 -77 211 35 149 -123 -82 -109 205 -148 30 -60 -50 24 -18 32 3 127 83 -332 -17 221 0
7771@J28J36p3M5j86LK0r3L9j6j0j82K65m2k4L9k2m1K3r9K47o4j50J05qj51K37
7798A26O5j38P5k74j62L38l4R5o4Kq8J38k68N9O7J84j78K87N8j07j84R2k46J64
7822Gq6j41K53K33k46J18l5j97J03r6J61j84J53M1o10O06p8o6J3RJ17k8R9k28
7846h2n2J66JP4l53J96K1KJ64j46j78J77qJ24Lo6k4j73K55r4O3j28m1K11k28K65
7872A49qJ82m31J22j10j8K41k48M70k91L9m7M3r1m4K38k13J45j03k12K10j47J41
7895A7J90l73L9K31J11m89L42K10j49j86J04o7J70j85r6L64j70k00RL0K29j73
7917d2K6O4j05J16j15j9N0pJ42K6j83J57j01j58Q7nj6p3lj2K83j51n7J55NJ95
7943B59l39L8KO3m8K40k63K16P4k17l9K90k05q8L3P3j32K21l22J39Nk40J83K03
$$ plain form
7771 0 128 264 191 236 50 53 73 -20 19 3 -7 -189 76 34 10 49 27 -14 9 -90 157 93 -57 48 40 -111 126
7798 126 191 53 128 -146 -308 30 -4 91 27 29 -59 79 -189 -130 -63 121 -57 230 288 181 -3 89 -157 7
7822 7 -79 -220 33 266 20 138 103 -94 9 -87 74 -110 43 84 -526 80 2 -64 -51 -42 75 47 146 -82
7846 -82 -134 32 33 107 -246 -50 -29 -27 137 -9 -187 -10 -18 106 109 43 19 -154 101 7 70 -58 -99 112 -116 149
7872 149 141 323 -108 14 -96 -114 127 -121 349 58 97 50 93 2 -42 196 -17 128 25 -187 23 -124 17
7895 17 207 -166 -127 104 215 -274 68 278 129 -57 47 -20 150 -35 -131 233 63 -137 -128 -98 131 -42
7917 -42 -16 48 -57 59 -56 -75 -25 -32 110 136 -47 110 9 -149 -62 -67 -83 -156 -159 -171 112 -39 -96 59 64 259
7943 259 -80 -42 -40 23 -25 215 -48 168 242 25 -14 276 71 -17 16 89 -43 178 -144 -5 0 -240 -57 146
7967A46k9l25K56K22k18k17J41P2j57j64K08m3J11P5o2k4l3J63j38J79j62K35
7989B36k70m1P8J15j78k2LK9j91J61j5N0k8k62M10j21J31q2J92r4k57J16R0N0
8013A00j73K09l75M96j08l32L5J2J42n7K21j55P1k8j42Q8J52n1m0j30R7k43N07
8036B96j50p6Oj78J04j94L51k31j02K92K8j38k2J74l06M4l0K43l95L54J49n17
8058b98L91l9j90m2j0J04MJ07K01n27M11j04j5l32N47j24k23K27j61J75l79L56
8080G9j5j04J14j70K48k92K52k00j64J56K01J4m05J61J22m9k34K87j07J44J9j15
8102e8J46j25j3J23j40J24Nr9J44j43l5K3M4J64j46J0O8q0J89k99l5J76P6k88
8126a69o9K35k85L06K05j86Qj69L28q7L6j02j66K37J52k17j24J7J38k12N4J95
$$ plain form
7967 146 117 -208 48 270 52 -165 -24 48 -109 -273 -65 -108 3 78 16 -8 -41 122 -16 163 1 236
7989 236 -34 -75 3 118 -60 -82 -79 -50 -241 -80 -95 -45 -73 -335 75 -46 85 3 195 101 -156 -40 50 100
8013 100 -73 136 -239 257 149 -183 -148 -136 6 -51 170 15 86 58 -84 4 156 105 65 -65 32 -211 296
8036 296 146 70 76 -102 2 -192 159 -72 -174 118 146 8 -14 160 -146 -102 -132 111 -284 70 219 -298
8058 -298 93 54 -136 -178 -188 -84 -80 27 228 -299 112 8 -7 -339 208 84 -139 88 -73 102 -277 79
8080 79 64 -40 74 -96 152 -140 112 -88 -252 -96 105 119 -286 -125 -3 -52 -286 1 -106 38 57 -58
8102 -58 88 -37 -50 73 -67 57 62 -37 107 -36 -71 -48 -4 160 14 24 92 12 201 -98 -133 43 119 -169
8126 -169 -238 -3 -288 18 223 37 45 -124 204 117 153 51 -115 122 274 57 -67 -50 88 -124 -70 125
8148A25K05j82O5p7l95N45j43j8r0J63Ll9p1K9j60P6j84K05K3m83M76l22K17K94
8172B62q7j93N7m3j19j5J91m3P4j52L9J04M2l17K34K8q4j75O6
$$ plain form
8148 125 330 148 213 136 -259 286 143 125 35 198 201 162 91 120 -40 36 -148 57 80 -403 73 -249 -32 262
8172 262 175 -18 39 -4 -123 -138 53 10 84 -68 -29 75 117 -200 34 62 -22 -197 -131
8191a31
$$ Imaginary data points
##PAGE= N=2
##DATA TABLE= (X++(I..I)), XYDATA
0@%%%%%%qJ6j6J6j6K4l2M0n6P2q8J10j34J60j92K32k77L22l78M47n20N96o86P92
30D24r07J033j172J325j499J689j896K125k376K653k953L280l639M032m462M928
46B585n435N994o607P277q016Q829r730J0737j1863J3129j4568J6223j8142K0398
60A0811k3101K6407l0557L5942m3237N3729p0174R9695j68467O09624L31906j416524
72e83946L18185N39376l96088m67869M59233M96388p8985k33771O429k31405M0555
83a31898M31021l26528o50574P34256P07938q73458m45532R63367N8796r80205
93e12817L5123P37714n6402l34627J70932J62612j75130m1025K5345k63687m1948
104b93910M93567O4079m78746K11408N48203n00989o70526M64293M81396l83788
$$ plain form
0 0 0 0 0 0 0 0 -8 8 -8 8 -8 16 -16 24 -32 40 -48 62 -72 88 -104 128 -149 173 -205 242 -278 318 -368 424
30 424 -483 550 -622 703 -796 893 -1003 1122 -1254 1399 -1554 1726 -1913 2119 -2343 2585
46 2585 -2850 3144 -3463 3814 -4202 4627 -5103 5634 -6229 6900 -7668 8555 -9587 10811
60 10811 -12290 14117 -16440 19502 -23735 29994 -40180 59515 -108952 500672 832578 -583946
72 -583946 -265761 273615 -122473 -590342 -131109 365279 286294 52523 58952 -172453 -131898
83 -131898 299123 -27405 -677979 56277 764215 -109243 -554775 408592 467388 -512817
93 -512817 -477694 260020 203618 -131009 39923 202535 27405 -13620 11725 -251962 -293910
104 -293910 199657 263736 -215010 -3602 544601 43612 -626914 -162621 318775 -65013
114f5013j22851M35507R85l39219Q935P8424j22791N8871J67264j39197q8602
125a27687L33691J08503m46133j43671L69115k0701l43404K00001L85965j80474
135A35205k71004J19248N9399j33542M2159Q8945q0677K2605J56048o8091j68256
146i7961R4506R8182k09285j01848K75685J43769j99436n9777J43421o1292j58326
157a32362O1702R9532l2379J3243M9797n3545j6297Q2552n0524j54794M0200J62322
169F9447j6223q6867P5140N9306j31867q5350R8323O4514m0324L739K1990l8145
181f317l989L9706l3397m9109L9556K7579m4963K2076R5931j3184j14315k7688
193f8114N6572M229j7537M4255K8154m3084k6735J7397J691j774J6960j6227l5242
$$ plain form
114 -65013 -187864 247643 248628 -90591 -81656 -3232 -126023 -67152 100112 -39085 -127687
125 -127687 206004 314507 -131626 -275297 93818 73117 -270287 -70286 315679 135205
135 135205 -135799 -16551 42848 -90694 -48535 40410 -40267 -17662 138386 70295 -97961
146 -97961 -3455 94727 -114558 -216406 59279 203048 3612 -56165 87256 25964 -132362
157 -132362 -70660 28872 -3507 9736 59533 5988 -10309 72243 21719 -133075 -92875 69447
169 69447 53224 -33643 41497 100803 -31064 -116414 -18091 46423 6099 9838 31828 -6317
181 -6317 -10306 29400 -3997 -53106 -13550 14029 -30934 -8858 87073 73889 -40426 -68114
193 -68114 -11542 -7313 -24850 19405 47559 4475 -22260 -4863 -3172 -4946 12014 -4213 -39455
206c9455K8208N6136j3982m3234N614Q168l2061l32N4692K1268m0858k6235J1010
219a1061P962P370J6918r722k8728J614J9813j756m83J8974r233m1156k054M4241
233A2699J9881k0901j4265k068j1350o20K2586J0706j3925j0176k94j44J4071
246F200K3177r879l7390j0398J9488R318n45J1403L784k3057j4973J8719K1836
259A7683j109j3298j3486q172J0353J9773J812j3781n242j551n943Q182K6179
272B1400N307k8188k2504Q442J6995O218K950k009j0797r027L884J1803R614k479
286A1609j7104j4843R317K2166N864j2411q190j722m703K074J5924J0662j2417
299F226k0655m687J4160J4843L001q764r598l400O44M187J0278O157j0222j6485
$$ plain form
206 -39455 -11247 44889 30907 -12327 -6713 1455 -30606 -30938 23754 45022 4164 -22071 -11061
219 -11061 -3099 4271 21189 11467 -17261 -15647 4166 2410 1927 20901 11668 -29488 -31542 12699
233 12699 32580 11679 -2586 -4654 -16004 -16624 5962 16668 2743 -7433 -7727 -7871 6200
246 6200 29377 19498 -17892 -28290 -8802 516 -29 11374 15158 -7899 -22872 -4153 17683
259 17683 16574 3276 -10210 -18382 -8029 11744 13556 -225 -5467 -7018 -12961 -4779 21400
272 21400 26707 -1481 -23985 -15543 1452 7670 10620 8611 -2186 -11213 -7329 4474 14088 11609
286 11609 -5495 -20338 -11021 11145 17009 4598 -3592 -5314 -10017 -7943 7981 18643 6226
299 6226 -14429 -19116 -4956 9887 12888 4124 -5474 -8874 -8230 -4043 6235 12392 2170 -14315
313a4315K416J9108J0176q011j2539o076j312L401R276R207p88j2197j0965N178
327g441J7527P906j1680j3974j362L756J229O798Q325n172j4827k961J3335J1771
341A3230j677j1118j1254k134P888Q693L257J081m317j3035n360J5283J4825p913
355G449j5187q07N545J686M961O547n503j2499l487O754R621Q346l086j7079q734
370a5473J1619J0888k891r41K821j0137j0280J1306J6522m047j2527k672K71J355
384d186J1294P564j0652j1716M58J072Q99J2466P186j6333j2110J2662J0525o005
398C124j265M135j1593j1025J2711J5311l514n908k154r713l999J7092J1551j1589
412C164o985P418m323r338J1144R286j5398j0209J4874J0057m091L507J252k0328
$$ plain form
313 -14315 -11899 7209 17385 9374 -3165 -9241 -10553 -7152 2124 11331 10543 -1654 -12619 -7441
327 -7441 10086 17992 6312 -7662 -9024 -5268 -4039 2759 11084 5912 -8915 -11876 1459 13230
341 13230 11553 435 -10819 -12953 -5065 3628 6885 7966 3649 -9386 -14746 537 15362 7449
355 7449 -7738 -8545 -3000 -1314 3647 10194 4691 -7808 -11295 -4541 5080 13426 10340 -6739 -15473
370 -15473 -3854 7034 4143 3202 6023 -4114 -14394 -3088 13434 9387 -3140 -5812 -5541 -4186
384 -4186 7108 14672 4020 -7696 -7238 -6166 -5267 7199 14385 -1948 -14058 -1396 9129 3124
398 3124 1859 5994 -5599 -16624 -3913 11398 7884 1976 -178 -9891 -13890 3202 14753 3164
412 3164 -3821 3597 -726 -10064 1080 10366 -5032 -15241 -367 9690 5599 9106 10358 -9970
426i970j2439J7038J3155m242M146O493j6084j2243J4733Q461j5343k445J3601
439D861l519o552J6701O751k4596j3420J4034M394l113J6333R130k2373j4025
452a5394J3596J522j1226J1760J3603j5680r042K0766N278k2318m075J0460r204
465i954l169K7387J1321k2725r564R163j2346j1866K2449J6075j7188l573J9099
478A5109n387j9602P608O651k1394j805L1805P374j8728K633O510k3944j1420
491b4590K6353R264j6583O818J6728j6749j4713J8134K590k6437K544K8459r54
504A0864j0505J5318M0l3110p743K3699J737q539J9971J2502k5476j0369J9117
517G506n230k2314J0466J8874r770j448K3092m694l1279j420J5233r079j091K8292
$$ plain form
426 -9970 -22409 -5371 7784 3542 7688 14181 -1903 -14146 587 9048 -6295 -8740 4861
439 4861 1342 -5210 11491 18242 -6354 -19774 -5740 -1346 -4459 11874 21004 -1369 -15394
452 -15394 -1798 -276 -11502 258 13861 -1819 -10861 9905 15183 -7135 -11210 -750 -9954
465 -9954 -13123 14264 25585 2860 -6704 2459 -9887 -21753 696 16771 -417 -3990 15109
478 15109 9722 -9880 -2272 4379 -17015 -18820 12985 20359 1631 4264 10774 -13170 -24590
491 -24590 1763 11027 -5556 1262 17990 1241 -13472 4662 7252 -19185 -16641 11818 10864
504 10864 359 15677 15717 -17393 -25136 -1437 300 -8239 11732 24234 -1242 -11611 7506
517 7506 2276 -20038 -9572 9302 -468 -1916 21176 16482 -14797 -16217 -984 -10063 -11154 17138
531A7138O498k6105l225J4063j3163j4596J7446R280j5507P489K4262r805k3924
544a0149M155L237j7186P094L1558R89j8993K671K207k1854l230K4074K263j5135
558h299J0879J6464j2979j1857Q801o554j9423J0538K3832k099n204J1594p743
571G950k5602J519J9893k525p222J3601N382j5451j088J1615j0190j4694J1423
584e389J1556n597N198J3743j2492k1973M156R340o186L834J7837k758j6207L944
598i94Q242j1892p130J0908J540p232J0580J2417j1447j2179M376k068q520J0513
612b886J6775o316j0537O066J075j1883N14J0142m085o032J0083P966p602l059
626B21L138r259q133J1667J1536n072k622N036o124j0129N686Q838n664l570Q069
$$ plain form
531 17138 23636 -2469 -5694 8369 -4794 -19390 -1944 7336 -8171 -682 23580 13775 -10149
544 -10149 -5994 -2757 -19943 -12849 18709 19698 705 3376 5583 -16271 -19501 4573 6836 -8299
558 -8299 2580 19044 6065 -5792 3009 -3545 -22968 -12430 11402 9303 4099 15693 7950
571 7950 -17652 -16133 3760 1235 -5987 7614 12996 -2455 -3543 8072 -2118 -16812 -5389
584 -5389 6167 570 5768 19511 7019 -14954 -10798 -1458 -7644 -3810 14027 11269 -4938 -994
598 -994 7248 -4644 -11774 -866 674 -6558 4022 16439 4992 -7187 -2811 -4879 -13399 -2886
612 -2886 13889 7573 -2964 3102 4177 -7706 -7192 2950 -1135 -7167 2916 10882 3280 221
626 221 3359 -5900 -14033 -2366 9170 4098 1476 6512 388 -9741 -4055 4783 -881 -4451 3618
641C618J895o223K341L581r289o407P393N151j325M383L554r308p796O432M506
656B506n189R39O099l085n634N122M260o036l397L382Q0o05N685K909o988m916
672d868K927K58j742N207M095n443l918M461K253l876q66J860k360j207M823L061
688D665k110k439m21l241K97N344K207m411j645J866k10j317K756J493l781k774
704c721K378L203P9n80q10k293j166K559J811k41n23j070k455L15L837J897k678
721E42j652K44L84O08J365N44k103k514M23J655K320P37j205j925r21J402R56
738H60K68j81j130j827p7L051J659j057k156j044l1J492J506M62j037k021q95
755b158J032K217J164j050k007p38N16J303Q47m91r45j305o2J902J624J1j999
$$ plain form
641 3618 5513 -710 1631 5212 -4077 -10484 -3091 2060 735 5118 8672 -636 -8432 -2000 2506
656 2506 -2683 -1744 4355 1270 -4364 758 5018 -1018 -4415 -1033 -953 -1558 4127 7036 48 -4868
672 -4868 -1941 -1683 -3425 1782 5877 434 -3484 977 3230 -646 -1512 348 -2012 -3219 1604 4665
688 4665 2555 116 -305 -3546 -3249 2095 4302 -109 -1754 112 -98 -1415 1341 2834 -947 -3721
704 -3721 -1343 1860 1939 1359 549 -1744 -2910 -351 1460 1219 696 -374 -2829 -2514 1323 3220 542
721 542 -1110 -866 -482 126 1491 2035 -68 -2582 -2159 -504 1816 2553 1348 -577 -1498 -96 860
738 860 1128 947 -183 -2010 -2087 964 2623 1566 -590 -1634 -1665 -173 1333 1795 758 -1263 -2158
755 -2158 -1126 1091 2255 1205 -802 -1540 -1024 279 1126 635 -310 -1615 -1677 225 1849 1860 -139
772a39j241mJ048J276O33p38j222j196L54J858J379p00j855p60o1J591Q58J60
790A241j043j302m69J270J764L25j190j552q02J201J139P52l61j123r07k12J332
807F3J462m03j333j125J2J202J005K82o16j353o26J106J201M00o51j511o24P01
825h08J258J148k82p12j227o18P48J470Q1j364p48K89L34J127J002o24j997k99
843a222Q22O19Q71J1j202j279M62J378J97l13J42j063j195J123K206k79j463o16
861h01p0j25J144J456n24j999q4N03j05J177J172j569j406Q54J464p49m06O38
879E70j214j604J402K687k38j221l03m12j276J022J975o87j773J258L19j239J150
896D16J266j697k645J929K227j104J39J510j727l409J469K761n74n84J343p68
$$ plain form
772 -139 -1380 -1384 -336 940 1573 835 -387 -1583 -1229 629 2008 1308 -547 -1307 -1368 223 1081 1241
790 1241 198 -1104 -1573 -303 1461 1786 596 -956 -1758 -557 582 1334 973 -150 -1057 -1269 63
807 63 1525 1122 -211 -1336 -1324 -122 883 1165 549 -804 -1430 -324 877 1277 626 -885 -1509 -808
825 -808 450 1598 1316 604 -623 -1241 -493 977 1058 -306 -1054 -765 -431 696 1698 1074 -923 -1222
843 -1222 -400 219 1090 1101 -101 -1380 -918 460 657 344 486 -577 -1772 -649 1557 1278 -185 -801
861 -801 -871 -996 148 1604 1080 -919 -1003 -500 -605 572 1744 175 -1231 -377 1087 338 -68 570
879 570 -644 -2248 -846 1841 1603 382 79 -333 -1609 -587 1388 701 -1072 186 505 -734 416
896 416 1682 -15 -2660 -731 1496 392 531 2041 314 -3095 -1626 1135 561 -23 1320 552
912E52k250J529J825k176j617K520J62j795J725K857k814l438J343K074j173P91
928A15K907j816l453J559J565j633l59K275j037k146K745K176k573j977J542k52
944c62k238K619M040k360l180J227M38k244R02L212j681k194K765R98k394m50
960i02K096k300k312L268L227k006j342K399k085l367J898L322k058r07K787k63
976A455k866J451J761k976j564L068J183k135J968J849l713l295K929J994j954
991h45Q91K565j471k710J739R74k688m85K825n00j403K911J584m331j574K498
1007b0m90j714K561K859k842j582K140j50k687J073J653j599k73L232J86l090
1023g43j3J126k487n88L876J590k568j69J385j944j855K345J394k348P08K308
$$ plain form
912 552 -1698 -169 1656 -520 -2137 383 545 -1250 475 3332 518 -2920 -1577 497 -676 115
928 115 3022 1206 -2247 -688 877 -756 -1115 1160 123 -2023 722 2898 325 -1652 -110 -362
944 -362 -2600 19 4059 1699 -1481 -254 184 -2060 -1158 2054 373 -1821 944 1942 -452 -902
960 -902 1194 -1106 -3418 -150 3077 1071 -271 2128 43 -3324 -1426 1896 -162 -1069 1718 1455
976 1455 -1411 40 1801 -1175 -2739 329 1512 -623 1345 3194 -519 -3814 -885 1109 -845
991 -845 46 2611 1140 -1570 169 1143 -1545 -2030 795 295 -1108 1803 3387 -944 -2518 -20
1007 -20 -510 -2224 337 3196 354 -1228 912 762 -1925 -852 801 -798 -1071 2161 2347 -743
1023 -743 -756 370 -2117 -2705 1171 2761 193 24 1409 -535 -2390 -45 1349 -999 -291 2017
1039B017r34j525R55q9k853R1L208M57j452J502M25l077j128K672K58j991J509
1056D5J861j955l23J926p39l055P56K064q12L76K089r06l290J43J970p03m47K302
1074A302L31k135nJ938j242j625R18P51j480J206K554j384k188O56M15j617N10
1091a095K644m88k026J026J201k020k84J917o40j902J537J652q30q03R20q28j883
1108a902J141K058o73q43Q83L25k070L75J720j007j038J199P45j277M97P85p76
1125A42j928J150J152p75L63J140p98j780R79P87o44r1Q20j74j045P17J011q55
1143A71j104R11m7o96J073P60n74j334M30P27o91K43P43n92q01P76M10m69r8J90
1163B8j56m75O20J043q50n88L06k30j10L82P24n73k74J56rj28L48L26q40m38O98
$$ plain form
1039 2017 1083 -442 513 424 -2429 -2338 870 1327 -125 1377 1802 -1275 -2403 269 527 -1464 45
1056 45 1906 -49 -372 1554 815 -2240 -1484 580 -232 144 2233 1327 -1963 -1820 150 -553 -1000 1302
1074 1302 1633 -502 -507 1431 189 -1436 -518 233 -1247 -41 2513 1129 -1059 -403 12 -1605 -1095
1091 -1095 1549 1061 -965 61 1262 -758 -1042 875 235 -1667 -130 1522 692 -111 809 -19 -1902
1108 -1902 -761 1297 624 -219 664 989 -1081 -706 1014 7 -1031 168 913 -364 133 918 142
1125 142 -1786 -636 516 -259 104 1244 446 -1334 -355 432 -212 -303 517 343 -702 15 1026 171
1143 171 -933 -22 -69 -765 308 1068 494 -840 -410 317 -374 -131 612 20 -781 -5 405 -64 -162 28
1163 28 -128 -603 17 1060 210 -378 -72 -302 -412 -30 694 121 -153 3 -6 -134 214 540 -300 -738 -40
1184d0L15J22j48J49l15n29L36M51j51k90J01l99J30M13K28l51k29q7J77O2L11
1205B56J50o46k16L86J19K39PK8n32j26K89J13K1J60K3n69k0L85M79m23l02op9
1228b64k61P45L14l92m11J41L2K44N8K1l69Lj40M81j58J82k03k77jK51K30k70
1250d4j30K96k36K49K4o7N8l57L9k28L13L21J3l65q9j51M49p9Q6K27m41k87J96
1273b03L86n3k56k30K83o5J86K73k77O7j12j93N4N86j91m07l1m5Q4L14K69j01
1295C38n99J8J44M7K6M30o66J5K08N04L9o39M52m54K65k70M57j03o4n05J79K15
1317C7j06N12l34m23k9L14N4M2K00J13p56L67J20j55J18J97l36k47K74M19k31
1338A50j91k31P8M6J67M73m02l01L69m5k64J40M29l80j30j56M90k19l44N07k27
$$ plain form
1184 -40 275 397 249 398 83 -446 -110 341 190 -100 1 -398 -268 145 373 22 -207 -294 -117 -55 256
1205 256 406 -240 -456 -70 49 288 295 323 -209 -335 -46 67 88 248 271 -298 -318 67 546 123 -179 -185 -264
1228 -264 -525 220 534 142 -269 -128 -96 148 206 227 -142 -139 -279 202 44 226 23 -254 -255 -4 226 -44
1250 -44 -174 122 -114 135 159 92 150 -207 -168 -396 -83 238 251 -114 -203 -354 95 16 102 329 -112 -399 -203
1273 -203 183 130 -126 -356 -73 -138 48 321 44 111 -1 -194 -140 446 255 -152 -183 -228 -144 170 439 338
1295 338 -261 -243 -99 -52 -26 404 -262 -247 -39 465 504 -135 317 -137 128 -142 315 212 148 -357 -178 37
1317 37 -69 443 109 -314 -343 -29 25 67 267 380 -376 -9 111 -44 74 271 -65 -312 -38 381 150
1338 150 -41 -272 -194 -148 19 492 90 -211 158 113 -151 -11 418 38 -92 -248 242 23 -321 186 -41
1359d1k78L69K06J04k93k5Q5m77K62M78n61k65N59j07k20K81M57k63o96M94J02
1380A71j26J40K56m01o57M63L63k82l08P55m85j91O64j4m02k49M22m44m8M47M51
1401E25o19k24L18m9j64K97K42l10l79L55K31n72K2N63m93l46P98M03m48q6R9
1422A63k63k93N80L60m96m5L01l96m27L26Q94q29m66O20L42m44M57j61p14j73
1442f64R90l6p50N10M32n96m02L25K66l53j60Q96n43OM18k2q81l8P54k06l86P11
1464B71K35p86j9M80k91N3J88M56q77j19O69J49r04O7L72l69J79N42J75o23P5
1485g7M09n79n53J197K27q59K04K95k26l10M13J1n45J26R12k27o59O05m8q23K78
1506b29M25L13p13J83L03l00l22N63j43n65M25N85k74m96O17J08j062Q1Q12l87
$$ plain form
1359 -41 -319 50 256 360 67 42 127 -350 -88 390 -171 -436 123 16 -204 77 534 271 -425 69 171
1380 171 45 185 441 40 -617 -154 209 -73 -381 374 -111 -302 362 348 -54 -303 119 -325 -373 74 525
1401 525 -94 -318 0 -49 -213 84 326 16 -363 -8 223 -349 -327 236 -257 -603 195 598 150 64 163
1422 163 -100 -393 187 547 51 6 307 -89 -516 -190 704 -125 -591 29 371 -73 384 223 -491 -664
1442 -664 326 290 -460 50 482 -114 -516 -191 75 -278 -438 458 -85 -79 339 317 -564 -602 152 -54 -440 271
1464 271 506 -280 -299 181 -110 -57 131 587 -290 -409 260 409 -495 -428 -56 -425 -246 296 471 -152 -77
1485 -77 332 -247 -800 397 624 -235 -31 264 38 -272 141 152 -393 -267 645 418 -241 364 316 -507 -229
1506 -229 196 509 -204 -21 282 -18 -340 223 80 -485 -60 525 251 -245 372 480 -582 -501 311 -76
1526g6N3K20J41o62P8P14k72o69N40K18n23K17N03k65k82k71N57l69o5Q44j79
1547D52o41n6M96l04J7J90J28n42J0O22k47l62K39j03p9P8P07l19k38j49rk89
1569c99K4N36k32l91M32L02k48j24K46k10j82J68L17j20k21M18j44o21K90M2O9
1590d8J10J22n2m20K54M55m75j75J30J53OJ27M8j94k37K56oj01K86k1k19l50K83
1613f8J77q5o8J12n5j65n0L54K25l57M7j1r8N0K11l72K03j93J10J54j80J89k30
1636a00J41K32l00p7L77j96k39M1K16J16k14K43j21l14M1J85J41j16j98K06k34
1657a70K20M3j69j09J33o5O6k5K91o6k16Mj07J19l8K30k71J21j66J03K22k02p6
1680a28M8K51j32r2j1J48j93N8l0K49r7R3m2l73L66r6L07k74j12K60k62M1K62
$$ plain form
1526 -76 -23 197 338 -324 -246 468 196 -473 67 285 -238 -21 482 217 -65 -336 221 -148 -213 631 452
1547 452 -189 -245 251 -53 -36 154 282 -260 -250 372 125 -237 2 -101 -180 -102 605 286 48 -101 -110 -399
1569 -399 -375 161 -71 -462 -30 272 24 -100 146 -64 -246 -78 239 119 -102 316 172 -449 -159 -117 -48
1590 -48 62 184 132 -288 -34 421 -54 -229 -99 54 60 187 235 41 -196 60 54 -47 239 218 -1 -351 -68
1613 -68 109 24 -44 68 13 -152 -202 152 377 20 67 56 -42 8 219 -153 50 -143 -33 121 -59 130 -100
1636 -100 41 273 -27 -104 273 77 -162 -121 95 211 -3 240 119 -195 -154 31 172 56 -142 64 -170
1657 -170 50 93 -76 -185 -52 -117 -51 -76 215 149 -67 -63 -170 -51 -89 141 -130 -9 -175 -72 150 -52 -128
1680 -128 -80 171 39 -53 -64 84 -109 -51 -81 168 71 164 122 -251 115 19 326 52 -60 200 -62 -21 241
1703B41k73M7j35J37K40m55L04q6K2j71K6Q5N1K90l30PJ52j4k42J94p8rK50l44
1727i1K79j84j83N0P5q4K76R2j66j86J57o6k54J67Q4J44q0J48j9j57L94l55j84
1750a43J6J03J34Mj58m8j57J96O6K26r2m5k78K13J84k90K33K1k15j02l7L70k85
1773h4N5l18L02P2L4o5P3k6k03J56k12J86K06j71J47m01j8K92J80k4j39p7M9J57
1797A71J47l65m6j45L27l73L91j53O2k0R4P7p2J42k32J16k21K53j21m4Jj06L6
1820h1M0J54j63J09j07R1J3k10K29rN8l55mL41p6m3J11j56J60n42L83K04k2rm9
1845F7P8l87M30l58K0J46Km04L88M11l79k98J85J20j24J6l4L88n58J06L43k10
1867e2J45j12j21N2j41M03m4k50J41k05j22M64p4M7p1J33l13k9L28O2r0p2OKl68
$$ plain form
1703 241 -32 15 -120 17 257 -198 106 20 42 -129 -103 -18 33 323 -7 0 152 138 -104 90 12 3 253 -91
1727 -91 188 4 -179 -129 -54 -138 138 230 64 -122 35 -31 -285 -118 -34 110 30 178 159 2 396 41 -143
1750 -143 -127 -24 110 114 -44 -92 -249 -53 13 239 147 102 -176 37 221 -69 164 185 -30 -132 -169 201 -84
1773 -84 -29 -347 -45 27 61 -4 69 43 -160 -4 -216 -30 176 5 152 -249 -267 25 205 181 42 -35 14 171
1797 171 318 -47 -93 -238 89 -284 107 -46 16 -4 90 167 95 237 5 121 -100 153 32 -12 -11 -117 -81
1820 -81 -41 113 -50 59 -48 43 56 -154 75 66 124 -231 -235 106 30 -13 98 -58 102 -440 -57 147 125 116 67
1845 67 145 -242 188 -170 -150 -4 -2 -406 -18 393 14 -284 -99 21 -103 -87 -121 267 -291 -185 158 -52
1867 -52 93 -19 -140 -88 -229 174 130 -120 21 -184 -306 158 84 131 60 193 -120 -149 179 241 151 79 85 87 -281
1892b81K86K1j96M3K61j20K44k48rOm3R4K75k63j46J69m9k57L83Q0o46J15L39
1915E8KR9l3O0m74J31M4L20l80R8M46l99j97n3K55N8k74K30J11J1J1j49k12K83
1939D6Q3j58M0K51L8j62r1l9J4J3K2N0j31J4K06j66rl62N03j70r8m1L54l52K0
1964a25J28q4pJ13N1%J34l84K64k30L32p1k29PK55j54j12M26q8m90J43K11P2m72
1988c10L20R4L0m73L39K16k48J8J22j07j7K4J17m9j47J38k21nk4M08k05qj3l6
2012c7o0k2K07K6r2K40j01m8j76M7L4j61J37K8k4Q1l7j67J23J7o7M4j99K40j7
2037A6J26r1j76J27j4J14j02N9q7l6J8O4N1O6O4j92K75j81l94L80p8j34K00O2
2061A37L1k0j26j28j19M76j39j12k4J56k16j26J34j05M35l02K12k67J99j99L90
$$ plain form
1892 -281 5 26 -170 -127 134 14 258 10 1 7 -36 58 333 70 -76 93 44 -213 170 250 -396 -281 58
1915 58 60 159 126 186 -288 -157 -113 207 -173 -75 371 -28 -225 -278 -23 35 -239 -9 102 113 124 -25 -237 46
1939 46 129 -29 11 262 300 138 47 8 22 35 57 107 -24 -10 196 30 21 -341 162 -8 -106 -147 207 -145 -125
1964 -125 3 -81 -88 25 76 76 210 -174 90 -140 192 121 -108 -101 154 0 -112 314 226 -264 -121 90 162 -310
1988 -310 10 104 134 -339 0 216 -32 -14 108 1 -16 8 125 76 -71 67 -154 -159 -183 225 20 12 -1 -37
2012 -37 -97 -119 88 114 22 262 161 113 -63 -16 18 -143 -6 22 -2 79 42 -125 -2 15 -52 -8 -207 33 16
2037 16 142 51 -125 2 -12 102 0 59 -28 -64 -46 18 69 135 199 7 282 101 -293 87 9 -125 75 137
2061 137 168 148 22 -106 -225 251 112 0 -24 132 -84 -210 -76 -181 254 -48 164 -103 96 -103 287
2082B87j19l07O6K7Q4k88N29l49J13J67k85M9k38J11K32n7j01J06L11k46o9M4
2104F7k79J80N9J07k09J15P6l5J32l32l2L5j9K28q7m4O7J81m73K71p9K04j78J00
2128E5J4p9j9J12k8q2K18k95M7M7jJ19Rm5pKj44J06J5J98m59M79l29l2J29r1O4
2155CJ28j2j34r9RJ07P6J27j57R2j76m1j58K28J71l48L46j73jJ2r7K07j19k32
2179b41Q4p4K54J54l86L43n2k21L22k01O9j72j96M43k75J93j95J58n5K66j76n3
2201a1m2Qr6j40R5L13M2m5k19r7O8L3K18j79J95l03o2L97K5r2N6J3K9k18J62l28
2227a78J21K4r1p8L12j66K01j36K29j57J3j62j1O2q2L05k16M2O1K29l45Q8R7j97
2251c5J1J33q6q9Mn9J60O6q2j39L2j31J03J74k58K30J74j20j16m0K95j52j94J38
$$ plain form
2082 287 168 -139 -73 -46 38 -250 279 -70 43 210 -75 -26 -264 -153 79 22 -79 27 338 92 23 67
2104 67 -212 -32 27 134 -75 40 116 81 213 -119 -151 -116 -135 93 6 -38 29 210 -263 8 -71 133 -45 55
2128 55 69 -10 -29 83 55 -27 191 -104 -57 -10 -11 108 117 72 65 67 -77 29 44 242 -217 262 -67 -99 30 -61 3
2155 3 131 119 -15 -114 -105 2 78 205 48 140 -36 -77 -235 -7 164 -184 162 -11 -12 0 -97 110 -9 -241
2179 -241 -157 -231 23 177 -209 134 82 -139 183 -18 51 -121 -317 126 -149 44 -151 7 -48 218 42 -11
2201 -11 -53 -45 -141 -281 -186 127 169 124 -95 -192 -124 -91 127 -52 143 -160 -222 175 200 108 164 177 206 -12 150 -178
2227 -178 -57 -33 -124 -202 110 -56 145 9 238 81 94 -68 -79 -17 -99 206 -10 32 93 322 -23 65 162 -35
2251 -35 -24 109 23 -66 -62 -121 39 105 23 -116 -84 -215 -112 62 -196 34 208 88 -28 -68 227 75 -119 19
2275A9J69l56K85Jp8j58n5j0J31j4J4J63j27J30j2j35j16K78k7l58J62k1J59P9
2299A23j48P0N7j67kK98l19M0J65N6j85J20r7j82J65j83K36q1m2J74j83N2K94
2322B61m24J80R8l65L25j89K38q3k77K83q6J37l5j02P7j07j03K06Lj26M7L0l9
2345e1J08j49J70j9j74J05J28m6k69K57N0p6k8M8QPk61J08k39K76K9m2J27j19
2369e2p8J70J25M9j10j56P6n9KJ9j3p0L26k34JR5l64K39J67j23k45L18j95J58
2393D6j53J86qj86O5J06k34J89q1m8o5J35m5j09K25N0k39K00Q3j98q8M2J78j83
2417a32J49j24nk72N10k43L33k15j00J8K2O7p2J77l96L09J27j58p0j41J46N2j97
2440b15K40k49J32k5M2J98j76J64j61k00K74J22j83L9J0k64J04R1K78l34j01K61
$$ plain form
2275 19 188 -168 117 118 40 -118 -173 -183 -52 -66 -52 111 -16 114 102 -33 -149 129 102 -256 -94 -115 44 123
2299 123 -25 45 102 -65 -67 231 -88 -48 117 173 -12 108 11 -171 -6 -189 47 -34 -76 98 -85 -33 261
2322 261 -163 17 115 -250 75 -114 124 41 -236 47 -39 98 63 -39 38 -69 -172 34 37 -89 -42 -12 -51
2345 -51 57 -92 78 59 -115 -10 118 72 -197 60 110 34 6 54 62 69 -192 -84 -323 -47 -18 -60 67 -52
2369 -52 -130 40 165 214 104 -52 24 -35 -33 -14 -27 -97 229 -5 -4 91 -273 -34 133 10 -235 83 -112 46
2393 46 -107 79 71 -115 -50 56 -178 11 -70 -118 -183 -48 -93 -202 23 73 -166 34 117 -81 -169 -127 51 -132
2417 -132 17 -107 -112 -384 126 -117 216 1 -99 -81 -59 8 -64 113 -283 26 153 -5 -75 -216 -70 -18 -215
2440 -215 25 -224 -92 -117 -75 123 -53 111 -50 -250 24 146 -37 2 12 -252 -148 -57 221 -113 -214 47
2462D7J16m69L02J2Qnp8J36M3jM4k31K78nj38j82J83N8j8j08L6r2j00r5L53k17
2488a23j72M56k71K63m31J76MP7J71l34L1J06K96p5k33K09k08o2J31j30J95k02
2510a26N5j6M08l71J70p2j12K63q3l2M5q5k19k0L20j73K6j76K91j93J32j6q1O2
2534cJ1n0Q2O9q3LK4J03p8j42K28k32r3J36P2j69m3J29N2p7K3J52qk76P1K94l18
2561a23K83l11L42l81K17J83n12L81K5k0M9k47J8L75k91M5LM5J97j13k05L5q0
2584h5J65R9k90R6p7J20o4N4P5L8k34J20k9j68J75P7j60J55N1j87J8p7K22l78
2608b84M50j34j98K37k49J23K02j78R9l3k04K35J03k14j31J86q1K81l46J1M05
2629B80l84O3J03K72j73k54l7J62L1l00L56j30J9N3Jm0l7j33k1k0R7K93k14J5
$$ plain form
2462 47 163 -306 -4 8 16 11 -67 69 112 111 155 -76 202 197 59 -123 60 118 100 -8 28 -64 -164 -259 94 -123
2488 -123 -295 161 -110 153 -278 -102 -98 -21 150 -184 -153 -47 249 174 -59 150 -58 -120 11 -119 76 -126
2510 -126 -71 -87 321 -50 120 48 -64 199 116 84 129 44 -175 -195 125 -48 -22 -198 93 -100 32 16 -65 -3
2534 -3 8 -42 40 109 26 29 53 156 78 -64 164 -68 -161 -25 47 -122 -165 -36 16 -61 -38 114 106 -170 -99 195 -123
2561 -123 160 -151 191 -190 27 210 -302 79 104 84 133 -114 -96 279 -12 33 36 81 278 165 -40 -5 -85
2584 -85 80 179 -111 -15 -92 28 -36 18 93 131 -103 17 -12 -180 -5 72 -88 67 118 -69 -51 -128 94 -284
2608 -284 166 32 -166 71 -178 -55 147 -31 68 35 -169 66 169 -45 -176 10 -71 210 -136 -125 280
2629 280 -104 -41 62 334 161 -93 -130 32 63 -237 119 -11 8 61 62 22 -15 -148 -169 -189 -92 201 -13 2
2653BP8l66L30M6k74K14j7k27O62l07k37J6K08j17q6j21J69o6K20j12m1j35o3
2676b24K62l3n5K11j61K45k63P9J75l15M2J06P8j23N1j48q6R8j15M06j57k12Q8
2699e1k1J40j9J5nqNj74k36M15m2jj4L12m76K26j84K54J5Mj86J14j59L57l03P7
2725E5R4k59N7r8K79j65r3P5J69k66n2J98K6j76K1o2M49l20K59k15K70m0k2L4
2749B18j32Oj39k6R4K11k02j30P0L2%j88J96j8K3K20n2j29j29R5m0R5n2J44k61
2774i4P7o3L5j1n4K7K55l25K95k85K34j83J09J5P7l71J73K05k39L09j52R5k19
2797i0R1q3qP2J73j40j52L3N0J90o8j92J80j97J25k17L24j48Q0K7p3J28j72K09
2821A42k40j22K23jL9j46O6O1k21L63j77O4q1j16K91m54K67M8o0K53k86N4N9o4
$$ plain form
2653 2 80 -286 44 90 -184 30 13 -214 448 141 -96 -80 128 11 -75 -196 -27 -93 127 15 -26 -161 -224
2676 -224 38 5 -50 161 0 245 -18 61 236 -79 -37 69 147 24 75 -73 -159 -61 -176 230 73 -139 -51
2699 -51 -72 68 49 64 59 51 56 -118 -354 61 19 18 4 316 -160 66 -118 136 151 155 -31 83 -76 281 -22 55
2725 55 149 -110 -53 -151 128 -37 -130 -55 114 -152 -204 -6 20 -156 -135 -197 252 -68 191 -24 246 206 184 218
2749 218 86 92 -47 -73 21 232 30 -100 -30 2 2 -186 10 -8 15 235 183 54 -75 20 -20 75 23 167 -94
2774 -94 -17 -80 -45 -56 -110 -83 172 -153 142 -143 91 -92 17 32 109 -262 -89 116 -123 186 34 129 -90
2797 -90 1 -82 -90 -18 155 15 -137 -104 -54 136 68 -124 56 -141 -16 -233 91 -57 23 50 -23 105 -67 142
2821 142 -98 -220 3 2 41 -105 -39 22 -199 164 -13 51 -30 -146 145 -309 -42 6 -54 199 -87 -33 26 -38
2845c8o0L28j53k70K16o8k8J36p7p4L70l27r4j3L08p0k01J66L6k4r4J71j6k28
2869a04O8J45n2k1j1j39J20O2M6l05o6L82K27k42j53j3p0J54q6K10k35J85j14
2892a2k3K00o7J04Qk07Kk17K2J69N0jk0J12l75Q5L55k56j16L5J28j52J24J56q1
2917B3j88K71N3o0L9p7k17L8L6K1J82j6qq5M6K81m54R7j13q3J18J56J16q8R3r9
2943H2L0K63k23j76N4l7j68P0o0R0jJ9O9p1K4j16k33N36N4j73j09J14j13J37L8
2968A00k23j20L67QK2j13q8l6L29J10k96j33J12j05M6nJ81N9J00n22J83J30l76
2991b70K88J03O6j66N3j67K90k88m3J55m10N01k51J61K34j34l24Q9j58J70r0K33
3013D2q2J06j1j02k3K71n6j61p4J04K74j92j5j10K28k35l6j1k13L24ml0J67K14
$$ plain form
2845 -38 -98 230 77 -193 23 -45 -73 63 -14 -88 282 -45 -139 -152 156 86 -115 51 87 63 -31 140 124 -104
2869 -104 -36 109 57 36 25 -114 6 68 114 -191 -257 125 352 110 -43 -56 -126 28 -58 152 -83 102 -12
2892 -12 -35 165 98 202 210 3 5 -212 -190 -21 29 28 8 120 -255 -170 185 -71 -187 -152 -24 -176 -52 104 23
2917 23 -165 106 159 99 138 61 -156 -118 -82 -61 121 105 97 12 58 339 -115 -18 -131 -214 -96 60 176 88 181 82
2943 82 112 375 152 -24 30 -7 -175 -105 -165 -75 -76 -57 12 -59 -35 -151 -384 152 206 33 -76 38 -75 62 100
2968 100 -123 -243 124 132 154 41 -47 -83 246 356 60 -73 39 -66 -20 -25 156 215 315 -207 -24 106 -270
2991 -270 18 121 187 21 74 -93 197 -91 -134 21 -389 112 -139 22 256 122 -202 -113 -271 -101 -191 42
3013 42 -40 66 55 -47 -70 201 145 -16 -90 14 288 96 81 -29 199 -36 -72 -83 -296 28 24 -6 161 375
3037C75n02nK71m5pJ4k3l2o6L5J56J5l0o0k49o1J06K65r3q0Mq0K27k1n42M42r1
3064g7m4L77j58j87K66k2l70N3K02m2j4Q9k93M23k89J75k95K71k26K61K2k22J22
3087B2mk12J14K88j38M2J0j86K47j63K4j9j15nK43k77K96j03O9q1l71N50j82J21
3111A70l09K6K65n5r6K6L2j56R5L14n57K51PQ5k17m1M04k21n8P5L3k38K21k6K18
3136B48j72j34k2R1R5Pk99K61o4J42j85M0q0j38K09K15k7n1J1J04Nl49N6Q1j66
3161a22K06n8J19n56N59r7M3n1j41K83R4l18K11l20J41K19l37K57m69L46M1j40
3183i0K17k2o9J8j59Q0j39J77j8R2n6q3p5N6J44N5n9M2O6p4l34L54k58J24K24
3208B13j65n6O1R8j66J82k43K62j80O5k85K4J21L12r7m8L5j45J05l34L29l08M53
$$ plain form
3037 375 -127 -132 139 94 87 101 78 46 -20 15 171 186 156 96 -153 -214 -108 157 64 -16 -12 -92 135 114 -428 14 -77
3064 -77 -121 256 98 -89 177 155 -215 -162 40 -2 -16 73 -220 203 -86 89 -206 65 -161 100 122 -100 22
3087 22 18 -194 -80 208 70 112 122 -64 183 20 44 25 -90 -95 148 -129 167 64 133 52 -319 231 49 170
3111 170 -139 -113 152 97 1 27 59 -97 -2 312 -245 6 13 98 -119 -160 244 23 -35 40 73 -165 56 30 248
3136 248 76 -58 -80 11 106 113 -186 75 11 153 -32 8 -72 -210 -1 214 187 136 147 251 256 -93 -37 44 -122
3161 -122 84 26 145 -411 148 51 94 43 -98 185 279 -39 172 -148 -7 212 -125 132 -337 9 50 -90
3183 -90 127 105 36 54 -105 -25 -164 13 -5 87 31 -52 -127 -71 73 128 69 111 177 103 -231 123 -135 -11 213
3208 213 48 -8 53 151 -15 167 -76 186 6 71 -214 -190 -69 243 146 98 133 -12 93 -241 88 -220 233
3231B33n46M18o9k46J12k07M63P9M1k66P1j16j45J15N14n39j5M0n8K40J28m97
3253b50K22Lj32J90j10J62m9j68RL64m08J30J58j32q7K83j17K3l17K50J08l66
3275b34L69k32O6J99l37K11j27R5j76J73R0o4P7j91J61j29j01M94j74j41K0p5
3297b6M1p8k3K18k36J65K90m36k6j75K65R0j15L23k37k20M0K58k26L99n41J57
3319i3k63K47J14J84k08N4j86L58q2l56K07j20J94O6j09k52K73o3R7k05K02j18
3341e9J12k2j55K7J05M4P3k01J88R3l8k6j75n3L91l40J97q4K16m01R2J14l1k60
3365a93M6L94j23k71K40R6M7k5p0l00Q7K10j89J57k91K13j45r2J59j81J57k3J67
3388G0ml1J21j90O8j98K60k2k07n5q5K34Q4J18j81K08j10L7m55K91p6M36l09j88
$$ plain form
3231 233 -313 105 36 -210 -98 -305 158 237 278 12 83 -33 -178 -63 451 -88 -103 -63 -121 119 247 -250
3253 -250 -28 -25 -157 33 -77 85 36 -132 -123 241 -167 -37 121 -11 -98 185 68 91 -226 24 132 -234
3275 -234 135 -97 -31 168 -169 42 -85 10 -166 7 97 33 110 -81 80 -49 -150 344 170 29 49 -26
3297 -26 15 -63 -86 132 -104 61 351 -85 -111 -286 -21 69 -46 277 40 -180 -140 118 -108 291 -250 -93
3319 -93 -356 -109 5 189 -19 35 -151 207 125 -231 -24 -144 50 116 7 -245 28 -35 62 -143 59 -59
3341 -59 53 31 -124 -97 8 52 125 -76 112 205 167 141 -34 -87 304 -36 161 77 293 -108 -16 98 67 -193
3365 -193 -147 247 124 -147 93 189 236 211 141 -159 -72 138 -51 106 -185 28 -117 -209 -50 -231 -74 -97 70
3388 70 66 35 156 -34 34 -164 96 74 -133 -188 -273 -39 45 163 -18 190 80 117 -338 -47 -123 313 4 -184
3412a84M27k21M1k71K78j88k9L28k07J59j43p7n2K0Q8j76M66j96K37m43Q8J0k60
3435c05K02K24n6r2l1J42o6n5j13R9j26K34j18R1j7K12k87Np9R5M1j26J60l55
3459c21M13l21K56p8mj28K3J97k5j63K42J74k60k1j11M6m0L40k66Q8o7k0M5J08
3483A07r8NO7j9j21J01J03kl07L32j94k25J94K53j71J70k25r1M8j02L84k18K5
3506A6K8J1k2k97R8J30J91k62k4J92k04K61j98M8M1j44L59p1l78K99j9J69j34
3529I0j1j19M44m45p3J71j8m6k62L39J01j88k61M87l68J02O9R9j02J72j94J17
3551A04l25K95k34N3M1j1J17n0j28OL89m08K27J23j27O4k36J76q4M1j65j99M90
3574A59k19L41l34J41J17k81K09j58L9pJ23k33K55l60K74k26M04m59J8K90p7m1
$$ plain form
3412 -184 243 22 63 -208 70 -118 -147 181 -26 133 -10 -87 -139 -119 -31 -207 259 63 300 -143 -55 -45 -305
3435 -305 -103 121 65 -27 -58 84 18 -37 -150 -51 -177 57 -61 30 13 225 -62 -57 -136 -41 0 -126 34 -321
3459 -321 92 -229 27 -51 -55 -183 -160 37 12 -151 91 265 5 -16 -127 -81 -121 219 -47 41 -26 -46 -1 107
3483 107 9 14 81 62 -59 42 145 143 -164 168 -26 -251 -57 196 25 195 -30 -121 -73 -175 209 -9 16
3506 16 44 55 33 -264 -166 -36 155 -107 -131 61 -143 118 -80 -32 9 -135 224 153 -225 74 55 224 90
3529 90 79 -40 404 -41 -114 57 39 -7 -269 70 171 -17 -278 209 -159 -57 12 111 9 181 -13 104
3551 104 -221 74 -160 -107 -66 -77 40 -10 -138 -132 257 -151 76 199 72 136 -100 76 -8 33 -132 -331 159
3574 159 -60 281 -53 88 205 -76 133 -25 14 7 130 -103 152 -208 66 -160 244 -215 -197 93 16 -25
3596b5j00L12m11L03l3j44J0J4o8J04j05J73P9j72N8K28k86O0K20k81L2k0J47
3619I5k35L05j90Q2k17O4L32k55K1o9J05m3N0l0K24j46k58J34K41l93L34k47p6
3642a72N8j31K83M1N9K25n28K39j95J64J57l16j9j93J49J47j31l2N4qP1rQ9j70
3666a68K56k76N06k97k04L62k6j82l07M06J02l83K10j6J17l1k16K99Lj8m0N3K2
$$ plain form
3596 -25 -125 187 -224 79 46 -98 -88 -74 -142 -38 -143 30 109 -63 -5 223 -63 -3 217 -64 -32 -52 95
3619 95 -140 165 -25 57 -160 -96 236 -19 2 -67 38 -5 45 15 239 93 -165 -31 210 -183 151 -96 -172
3642 -172 -114 -245 38 79 138 363 -165 74 -121 43 200 -116 -135 -328 -179 -32 -163 -195 -141 -149 -78 -87 2 -168
3666 -168 88 -188 318 21 -183 179 153 -29 -336 70 172 -211 -1 -17 100 69 -147 152 155 137 97 150 172
$$ [...]
8191a8
##END NTUPLES=NMR FID
##END=
