##TITLE=1H_LR-724-R2-CR21
 200.13MHz, CDCl3,
 8 sc
 
 11.3.2025
##JCAMPDX= 6.0         $$ Bruker NMR JCAMP-DX V2.0
##DATA TYPE= NMR FID
##DATA CLASS= NTUPLES
##ORIGIN= UXNMR, Bruker Analytische Messtechnik GmbH
##OWNER= pz
$$ XWIN-NMR		Version 3.5
$$ Tue Mar 11 14:59:30 2025 Russian Standard Time (UT+4h)  she@DPX200
##.OBSERVE FREQUENCY= 200.1313
##.OBSERVE NUCLEUS= ^1H
##.DELAY= (6, 6)
##.ACQUISITION MODE= SIMULTANEOUS
##.ACQUISITION SCHEME= undefined
##.AVERAGES= 8
##.DIGITISER RES= 18
##SPECTROMETER/DATA SYSTEM= spect
##.PULSE SEQUENCE= zg30
##.SOLVENT NAME= CDCl3
##.SHIFT REFERENCE= (INTERNAL, CDCl3, 0, 14.3821)
##AUDIT TRAIL= $$ (NUMBER, WHEN, WHO, WHERE, WHAT)
$$ ##TITLE= Audit trail, XWIN-NMR		Version 3.5
$$ ##JCAMPDX= 5.01
$$ ##ORIGIN= Bruker BioSpin GmbH
$$ ##OWNER= she
$$ F:/spectra/data/she/nmr/H-C/1/audita.txt
$$ ##AUDIT TRAIL=  $$ (NUMBER, WHEN, WHO, WHERE, WHAT)
(   1,<2025-03-11 14:57:41.35 +0400>,<she>,<DPX200>,
      <created by zg, POWCHK disabled, PULCHK disabled
       configuration hash MD5:
       00 E9 B6 7A A2 85 ED C7 34 08 36 98 17 FE 4E 26
       data hash MD5: 16K
       A9 B0 21 BC 7A C4 B7 EC 69 C8 15 30 87 0D E4 04>)
$$ ##END=
$$ 
$$ hash MD5
$$ 1C 0C C6 69 49 C3 10 16 1B FF 1A 75 C8 E2 46 38
##$RELAX= 
##$RELAX= 
##$RELAX= 
##$RELAX= 
##$RELAX= 
##$RELAX= 
$$ Bruker specific parameters
$$ --------------------------
##$DU= <F:/spectra>
##$EXPNO= 1
##$NAME= <H-C>
##$PROCNO= 1
##$TYPE= <nmr>
##$USER= <she>
##$AMP= (0..31)
100 100 100 100 100 100 100 100 100 100 100 100 100 100 100 100 100 100 
100 100 100 100 100 100 100 100 100 100 100 100 100 100 
##$AQSEQ= 0
##$AQ_mod= 1
##$AUNM= <au_zg>
##$AUTOPOS= <>
##$BF1= 200.13
##$BF2= 200.13
##$BF3= 200.13
##$BF4= 200.13
##$BF5= 200.13
##$BF6= 200.13
##$BF7= 200.13
##$BF8= 200.13
##$BYTORDA= 1
##$CFDGTYP= 0
##$CFRGTYP= 5
##$CHEMSTR= <none>
##$CNST= (0..31)
1 1 145 1 1 1 1 1 1 1 1 1 1 1 1 1 1 1 1 1 1 1 1 1 1 1 1 1 1 1 1 1 
##$CPDPRG= <>
##$CPDPRG1= <>
##$CPDPRG2= <>
##$CPDPRG3= <>
##$CPDPRG4= <mlev>
##$CPDPRG5= <mlev>
##$CPDPRG6= <mlev>
##$CPDPRG7= <mlev>
##$CPDPRG8= <mlev>
##$CPDPRGB= <>
##$CPDPRGT= <>
##$D= (0..31)
0 0.7 0 0 0 0 0 0 0 0 0 0.03 0 0 0 0 0 0 0 0 0 0 0 0 0 0 0 0 0 0 0 0 
##$DATE= 1741690660
##$DBL= (0..7)
120 120 120 120 120 120 120 120 
##$DBP= (0..7)
150 150 150 150 150 150 150 150 
##$DBP07= 0
##$DBPNAM0= <>
##$DBPNAM1= <>
##$DBPNAM2= <>
##$DBPNAM3= <>
##$DBPNAM4= <>
##$DBPNAM5= <>
##$DBPNAM6= <>
##$DBPNAM7= <>
##$DBPOAL= (0..7)
0.5 0.5 0.5 0.5 0.5 0.5 0.5 0.5 
##$DBPOFFS= (0..7)
0 0 0 0 0 0 0 0 
##$DE= 6
##$DECBNUC= <off>
##$DECIM= 32
##$DECNUC= <off>
##$DECSTAT= 4
##$DIGMOD= 1
##$DIGTYP= 9
##$DL= (0..7)
0 120 120 120 120 120 120 120 
##$DP= (0..7)
150 150 150 150 150 150 150 150 
##$DP07= 0
##$DPNAME0= <>
##$DPNAME1= <>
##$DPNAME2= <>
##$DPNAME3= <>
##$DPNAME4= <>
##$DPNAME5= <>
##$DPNAME6= <>
##$DPNAME7= <>
##$DPOAL= (0..7)
0.5 0.5 0.5 0.5 0.5 0.5 0.5 0.5 
##$DPOFFS= (0..7)
0 0 0 0 0 0 0 0 
##$DQDMODE= 0
##$DR= 18
##$DS= 0
##$DSLIST= <SSSSSSSSSSSSSSS>
$$ [...]
##$SUBNAM0= <"">
##$SUBNAM1= <"">
##$SUBNAM2= <"">
##$SUBNAM3= <"">
##$SUBNAM4= <"">
##$SUBNAM5= <"">
##$SUBNAM6= <"">
##$SUBNAM7= <"">
##$SUBNAM8= <"">
##$SUBNAM9= <"">
##$SW= 18.0517328524113
##$SWIBOX= (0..15)
0 0 2 0 0 0 0 0 0 0 0 0 0 0 0 0 
##$SW_h= 3612.71676300578
##$TD= 16384
##$TD0= 1
##$TE= 0
##$TE2= 300
##$TE3= 300
##$TEG= 300
##$TL= (0..7)
0 120 120 120 120 120 120 120 
##$TP= (0..7)
150 150 150 150 150 150 150 150 
##$TP07= 0
##$TPNAME0= <>
##$TPNAME1= <>
##$TPNAME2= <>
##$TPNAME3= <>
##$TPNAME4= <>
##$TPNAME5= <>
##$TPNAME6= <>
##$TPNAME7= <>
##$TPOAL= (0..7)
0.5 0.5 0.5 0.5 0.5 0.5 0.5 0.5 
##$TPOFFS= (0..7)
0 0 0 0 0 0 0 0 
##$TUNHIN= 0
##$TUNHOUT= 0
##$TUNXOUT= 0
##$USERA1= <user>
##$USERA2= <user>
##$USERA3= <user>
##$USERA4= <user>
##$USERA5= <user>
##$V9= 5
##$VALIST= <valist>
##$VCLIST= <CCCCCCCCCCCCCCC>
##$VD= 0
##$VDLIST= <DDDDDDDDDDDDDDD>
##$VPLIST= <PPPPPPPPPPPPPPP>
##$VTLIST= <TTTTTTTTTTTTTTT>
##$WBST= 1024
##$WBSW= 4
##$XGAIN= (0..3)
0 0 0 0 
##$XL= 0
##$YL= 0
##$YMAX_a= 624908
##$YMIN_a= -767456
##$ZGOPTNS= <>
##$ZL1= 120
##$ZL2= 120
##$ZL3= 120
##$ZL4= 120
##$ABSF1= 10
##$ABSF2= 0
##$ABSG= 5
##$ABSL= 3
##$ALPHA= 0
##$AQORDER= 0
##$ASSFAC= 0
##$ASSFACI= 0
##$ASSFACX= 0
##$ASSWID= 0
##$AUNMP= <proc_1d>
##$AZFE= 0.1
##$AZFW= 0.1
##$BCFW= 1
##$BC_mod= 2
##$BYTORDP= 1
##$COROFFS= 0
##$CY= -3
##$DATMOD= 1
##$DC= 2
##$DFILT= <>
##$DTYPP= 0
##$F1P= 0
##$F2P= 0
##$FCOR= 0.5
##$FTSIZE= 0
##$FT_mod= 4
##$GAMMA= 1
##$GB= 0.15
##$INTBC= 1
##$INTSCL= 1
##$ISEN= 128
##$LB= 0.25
##$LEV0= 0
##$LPBIN= 0
##$MAXI= 10000
##$MC2= 0
##$MEAN= 0
##$ME_mod= 0
##$MI= 1.114404
##$NCOEF= 0
##$NC_proc= 0
##$NLEV= 6
##$NOISF1= 3.799351
##$NOISF2= 2.8
##$NSP= 1
##$NTH_PI= 0
##$NZP= 0
##$OFFSET= 14.38212
##$PC= 1
##$PHC0= -467.4301
##$PHC1= 11.99221
##$PH_mod= 1
##$PKNL= yes
##$PPARMOD= 0
##$PSCAL= 0
##$PSIGN= 0
##$REVERSE= no
##$SF= 200.129724274929
##$SI= 16384
##$SIGF1= 3
##$SIGF2= 2
##$SINO= 400
##$SIOLD= 16384
##$SREGLST= <1H.CDCl3>
##$SSB= 0
##$STSI= 0
##$STSR= 0
##$SW_p= 3205.1282051282
##$SYMM= 0
##$S_DEV= 0
##$TDeff= 0
##$TDoff= 0
##$TI= <>
##$TILT= no
##$TM1= 0
##$TM2= 0
##$TOPLEV= 0
##$USERP1= <user>
##$USERP2= <user>
##$USERP3= <user>
##$USERP4= <user>
##$USERP5= <user>
##$WDW= 1
##$XDIM= 8192
##$YMAX_p= 0
##$YMIN_p= 0
$$ End of Bruker specific parameters
$$ ---------------------------------
##NTUPLES= NMR FID
##VAR_NAME=  TIME,          FID/REAL,        FID/IMAG
##SYMBOL=    X,             R,               I
##VAR_TYPE=  INDEPENDENT,   DEPENDENT,       DEPENDENT
##VAR_FORM=  AFFN,          ASDF,            ASDF
##VAR_DIM=   8192,          8192,            8192
##UNITS=     SECONDS,       ARBITRARY UNITS, ARBITRARY UNITS
##FACTOR=    0.0002768,     1,               1
##FIRST=     0,             0,               0
##LAST=      2.2672688,     0,               0
##MIN=       0,             -767456,         0
##MAX=       2.2672688,     624908,          0
$$ Real data points
##PAGE= N=1
##DATA TABLE= (X++(R..R)), XYDATA
$$ [...]
$$ plain form
2035 208 -1539 -1789 -538 -922 -1798 -1082 -703 -1919 -1327 -624 -1108 -1831 -1533 -1278 -2143 -1243 -333 -1295 -1756
2054 -1756 -1692 -1893 -2173 -1110 -451 -1070 -1311 -682 -1109 -1471 80 669 -27 -118 412 -8 -1093 281 663
2073 663 369 517 1414 623 -70 888 573 104 1227 2710 1605 1197 1503 885 549 1423 2687 2183 1669
2092 1669 2035 674 -701 948 2298 1395 1468 2073 55 -1047 258 1415 414 981 1446 195 -1426
2109 -1426 -92 474 -854 -197 1166 -580 -1719 -152 -661 -1986 -940 -194 -1840 -1855 -296 -1404
2125 -1404 -2838 -1531 -576 -1852 -1918 73 -1184 -2579 -1445 -237 -1856 -1418 401 -683 -1966 -867
2141 -867 -232 -1666 -1254 380 -268 -1338 324 549 -1137 -631 1569 417 -252 1259 1511 -93 150
2158 150 1677 870 266 2137 1881 85 1047 1782 312 232 2017 1958 735 1238 1835 753 217 1914
$$ packed form
2035B08j747k50J251l84q76P16L79j216N92P03m84p23K98K55q65R00R10r62m61
2054a756O4k01k80J063O59o19k41O29m27l62J551N89o96r1N30m20j085J374L82
2073F63k94J48Q97p91o93R58l15m69J123J483j105m08L06o18l36Q74J264n04n14
2092A669L66j361j375J649J350r03P3O05k018j102J305J157j001N67M65j251j621
2109a426J334N66j328O57J363j746j139J567n09j325J046P46j646j5J559j108
2125a404j434J307R55j276o6J991j257j395J134J208j619M38J819j084j283J099
2141h67O35j434M12J634o48j070J662K25j686N06K200j152o69J511K52j604K43
2158A50J527q07o04J871k56j796R62P35j470q0J785n9j223N03N97j082n36J697
$$ plain form
2176 1914 1886 883 1392 1834 310 -114 1223 925 255 741 1348 -132 -737 41 -202 -1129 -159 383 -492
2195 -492 -1361 -138 -760 -1617 -847 186 -1144 -1393 -532 -1117 -1766 -1176 -482 -1160 -1579 -761 -1427 -2174 -1536
2214 -1536 -912 -1427 -1185 -269 -656 -1432 -902 -148 -886 -1164 -13 -189 -405 -224 18 -415 -254 477 273
2233 273 -195 811 977 -36 237 1062 1017 711 1191 1551 825 945 1435 1101 894 1476 1380 837 1231 1695
2253 1695 843 425 1037 1191 901 688 899 411 357 863 976 488 509 921 198 21 122 -24 -181 -164 -65
2274 -65 -406 -646 -632 -665 -1060 -861 -833 -1150 -1078 -1019 -920 -1367 -1284 -969 -1369 -929 -1156 -873 -894 -1284 -690 -1059 -1092
2297 -1092 -1003 -1111 -1095 -1017 -907 -629 -725 -362 -343 -523 -133 -37 -258 59 82 137 260 273 428 447 991 913 699
2320 699 635 1010 706 628 771 725 810 824 1235 1187 1077 1235 1189 1018 1382 1149 802 1056 1051 720 487 835 668
$$ packed form
2176A914k8j003N09M42j524m24J337k98o70M86O07j480o05P78k43r27R70N42q75
2195d92q69J223o22q57P70J033j330k49Q61n85o49N90O94o78m19Q18o66p47O38
2214a536O24n15K42R16l87p76N30P54p38k78J151j76k16J81K42m33J61P31k04
2233B73m68J006J66j013K73Q25m5l06M80L60p26J20M90l34k07N82r6n43L94M64
2253A695q52m18O12J54k90k13K11m88n4N06J13m88K1M12p23j77J01j46j57J7R9
2274f5l41k40J4l3l95J99K8l17P2N9R9m47Q3L15m00M40k27K83k1l90N94l69l3
2297a092Q9j08J6P8J10K78r6L63J9j80L90R6k21L17K3N5J23J3J55J9N44p8k14
2320F99o4L75l04p8J43m6Q5J4M11m8j10J58m6j71L64k33l47K54nl31k33L48j67
$$ plain form
2343 668 124 339 584 236 -110 261 138 -112 -217 -109 -383 -786 -51 -236 -750 -373 -629 -681 -938 -617
2363 -617 -799 -1161 -738 -1087 -1264 -1066 -751 -1001 -1163 -746 -838 -1219 -1113 -743 -1032 -787 -585 -706 -637 -180 -512
2384 -512 -364 -445 -78 -250 -287 -25 -130 -206 -118 357 318 394 441 364 653 388 720 835 775 1234 948 1031 1184
2407 1184 965 1189 791 997 915 1007 812 972 1048 653 669 1035 878 424 1107 691 276 267 699 270 234 566
2429 566 611 -83 -293 -4 -582 -870 -292 -298 -1173 -656 -491 -677 -1086 -562 -607 -1013 -760 -261 -1079 -1306 -172
2450 -172 -1163 -1294 -469 -602 -1664 -1241 -329 -995 -1347 -55 16 -1107 -1111 370 -693 -1089 223 407 -532
2469 -532 -286 738 -405 -373 653 665 -478 532 1109 225 -727 1379 871 39 1022 1519 358 106
2487 106 1253 824 117 1358 1924 563 514 1407 501 56 1017 1741 366 211 1137 -18 -951 916
$$ packed form
2343F68n44K15K45l48l46L71j23k50j05J08k74m03P35j85n14L77k56n2k57L21
2363f17j82l62M23l49j77J98L15k50j62M17r2l81J06L70k89K45K02j21O9M57l32
2384e12J48q1L67j72l7K62j05p6Q8M75l9P6M7p7K89k65L32J15o0M59k86Q3J53
2407A184k19K24l98K06q2R2j95J60P6l95J6L66j57m54O83m16m15rM32m29l6L32
2429E66M5o94k10K89n78k88N78oq75N17J65j86m09N24m5m06K53M99q18k27J134
2450a72r91j31Q25j33j062M23R12o66l52J292P1j123mJ481j063l96J312J84r39
2469e32K46J024j143L2J026J2j143J010N77q84r52K106n08q32R83M97j161k52
2487A06J147m29p07J241N66j361m9Q93r06m45R61P24j375j55R26j155r33J867
$$ plain form
2505 916 1022 -497 218 1000 -252 -1157 147 637 -777 -336 733 -579 -1381 182 -60 -1709 -777
2522 -777 428 -823 -1634 -158 -141 -2023 -1258 137 -1181 -1379 142 -508 -1886 -664 210 -1535 -1022
2539 -1022 681 61 -1471 -252 522 -1325 -1299 685 60 -1145 200 760 -740 -517 991 212 -638
2556 -638 1215 1380 -440 -26 1363 169 -171 1662 1658 -90 142 1415 246 -135 1613 1515 97 719
2574 719 1089 -288 -340 1522 1340 -8 928 919 -340 -722 980 578 23 780 956 -628 -617 283 -227
2593 -227 -851 658 481 -1040 -1052 219 -765 -1247 199 294 -842 -701 -30 -1193 -1439 -223 -143 -1107 -496
2612 -496 -444 -1427 -1413 -474 -579 -1023 -376 205 -927 -910 -42 -174 -863 70 476 -269 -426 203 220 -637 168
2633 168 689 13 261 882 -75 -312 402 666 -95 694 1148 787 83 508 857 266 927 1396 488 20
$$ packed form
2505I16J06j519P15P82j252r05J304M90j414M41J069j312q02J563k42j649R32
2522g77J205j251q11J476J7j882P65J395j318j98J521o50j378J222Q74j745N13
2539a022J703o20j532J219P74j847K6J984o25j205J345N60j500K23J508p79q50
2556f38J853J65j820M14J389j194l40J833mj748K32J273j169l81J748r8j418O22
2574G19L70j377n2J862j82j348R36rj259l82J702m02n55P57J76j584J1R00n10
2593b27o24J509j77j521j2J271r84m82J446R5j136J41O71j163k46J216Q0r64O11
2612d96N2r83J4R39j05m44O47N81j132J7Q68j32o89R33M06p45j57O29J7q57Q05
2633A68N21o76K48O21r57k37P14K64p61P89M54l61p04M25L49n91O61M69r08m68
$$ plain form
2653 20 983 896 18 622 1042 590 327 999 301 69 179 759 -240 261 702 50 -185 310 339 -481 -112
2674 -112 262 139 -781 -605 -352 -704 -619 -232 -452 -847 -449 -698 -990 -647 -303 -545 -489 -175 -581 -1166 -547
2695 -547 -142 -507 -437 -57 -432 -859 -336 -257 -576 -654 226 -320 -487 -50 34 -374 -140 319 610 -196 299
2716 299 177 -57 325 243 399 244 790 716 87 169 499 474 370 689 517 340 590 727 446 648 606 700
2738 700 344 579 896 631 254 632 588 191 210 515 -310 -325 -79 230 -223 -385 178 -244 -351 -155 -63
2759 -63 -119 -417 10 -656 -495 -55 -293 -494 -80 -214 -723 -991 -632 -321 -831 -633 -438 -515 -805 -227 -224 -619
2781 -619 -445 -192 -399 -266 -41 -144 -418 -150 118 -258 -127 281 70 -322 282 -98 67 245 616 165
2801 165 56 257 399 485 631 879 326 346 449 703 319 417 547 319 661 470 695 273 294 543 362
$$ packed form
2653B0R63q7q78O04M20m52k63O72o98k32J10N80r99N01M41o52k35M95K9q20L69
2674a12L74j23r20J76K53l52Q5L87k20l95L98k49k92L43L44k42N6L14m06n85O19
2695e47M05l65P0L80l75m27N23P9l19p8Q80n46j67M37Q4m08K34M59K91q06M95
2716B99j22k34L82q2J56j55N46p4o29Q2L30k5j04L19j72j77K50J37k81K02m2R4
2738G00l56K35L17k65l77L78m4l97J9L05q25j5K46L09m53j62N63m22j07J96R2
2759f3n6k98M27o66J61M40k38k01M14j34n09k68L59L11n10J98J95p7k90N78Ll95
2781f19J74K53k07J33K25j03k74K68K68l76J31M08k11l92O04l80J65J78L71m51
2801A65j09K01J42Q6J46K48n53K0J03K54l84R8J30k28L42j91K25m22K1K49j81
$$ plain form
2822 362 277 481 265 135 428 -74 55 247 313 238 76 -104 -125 -173 -403 -183 -128 -331 -275 -204 -186 -351 -458
2845 -458 -6 -241 -798 -673 -514 -271 -709 -102 -308 -653 -804 -521 -561 -254 -468 -362 -436 -300 -373 -297 -336 -204
2867 -204 -526 -54 -130 8 41 106 -48 -96 -185 -16 77 436 411 113 62 315 316 369 439 505 486 475 646 437 431 584
2893 584 350 597 500 518 675 747 196 340 445 193 173 305 434 11 110 89 97 62 83 -42 117 103 151 116
2917 116 -299 -84 -302 -329 -228 -126 -256 -209 -266 -427 -534 -605 -502 -526 -432 -616 -355 -553 -697 -420 -354 -531
2939 -531 -324 -414 -476 -122 -196 -280 -431 16 -332 -317 36 -263 -313 54 147 -101 -139 -45 254 20 117 475 281
2962 281 213 354 391 146 193 521 -14 228 519 508 515 576 399 228 308 159 371 212 331 433 381 551 361
2985 361 41 185 528 437 -24 134 -273 -163 184 -17 -153 82 104 -6 -127 -159 -229 -218 -304 -148 -424 -304
$$ packed form
2822C62q5K04k16j30K93n02J29J92O6p5j62j80k1m8k30K20N5k03N6P1J8j65j07
2845d58M52k35n57J25J59K43m38O07k06l45j51K83m0L07k14J06p4J36p3P6l9J32
2867b04l22M72p6J38L3O5j54m8q9J69R3L59k5k98n1K53JN3P0O6j9j1J71k09oJ53
2893E84k34K47r7J8J57P2n51J44J05k52k0J32J29m23R9k1Ql5K1j25J59j4M8l5
2917A16m15K15k18k7J01J02j30M7n7j61j07p1J03k4R4j84K61j98j44K77O6j77
2939e31K07r0o2L54p4q4j51M47l48J5L53k99n0L67R3k48l8R4K99k34R7L58j94
2962B81o8J41L7k45M7L28n35K42K91j1PO1j77j71Q0j49K12j59J19J02n2J70j90
2985C61l20J44L43r1m61J58m07J10L47k01j36K35K2j10j21l2p0J1q6J56k76J20
$$ plain form
3007 -304 -473 -281 -422 -446 -477 -413 -188 -285 -504 -854 -257 -278 -456 -281 -451 -243 -472 -288 -376 -144 -278 -25
3029 -25 -277 -185 -168 -48 101 -84 2 173 -121 -29 -1 -93 418 93 91 602 358 257 343 333 630 376 666 665
3053 665 387 490 434 241 413 454 621 317 255 225 174 170 542 346 452 105 56 53 61 123 -95 81 76 24 57 -406
3079 -406 -21 -10 -242 -170 -132 -122 -90 -213 -419 -553 -463 -326 -347 -492 -289 -321 -257 -101 278 -183 -360 -191 -291
3102 -291 -645 -389 -21 -202 -269 -121 -184 -479 -4 -22 -215 -215 -118 127 -330 129 93 -28 476 398 11 123 371
3125 371 362 538 455 516 270 83 476 571 425 281 645 504 317 370 424 634 332 264 350 199 434 237 289
3148 289 233 168 187 355 160 -164 87 103 113 1 131 -401 -138 -231 -190 -199 6 -307 37 -120 -69 -343 -328 -188
3172 -188 -454 -534 -334 -266 -427 -742 -34 -482 -572 -283 -142 -261 -433 4 -343 -553 -206 -58 -276 -260 -38
$$ packed form
3007c04j69J92j41k4l1O4K25r7k19l50N97k1j78J75j70K08k29J84q8K32j34K53
3029b5k52R2J7J20J49j85Q6J71k94R2K8r2N11l25kN11k44j01Q6j0K97k54K90j
3053F65k78J03n6j93J72M1J67l04o2l0n1mL72j96J06l47m9lQO2k18J76nn2L3m63
3079d06L85J1k32P2L8J0L2j23k06j34R0J37k1j45K03l2O4J56L79m61j77J69j00
3102b91l54K56L68j81o7J48o3k95M75j8j93%R7K45m57M59l6j21N04p8l87J12K48
3125C71rJ76q3O1k46j87L93R5j46j44L64j41j87N3N4K10l02o8Q6j51K35j97N2
3148B89n6o5J9J68j95l24K51J6J0j12J30n32K63r3M1rK05l13L44j57N1k74J5J40
3172a88k66q0K00O8j61l15P08m48r0K89J41j19j72M37l47k10L47J48k18J6K22
$$ plain form
3193 -38 144 -156 2 -267 -87 -126 227 -25 -147 403 308 25 107 278 330 7 581 266 120 330 163 267
3215 267 244 353 506 146 334 208 135 -242 327 379 -256 137 249 301 98 340 154 -261 432 384 54 -68
3237 -68 113 -278 -303 5 -59 -485 -359 -217 -418 -715 -354 -67 -364 -428 -5 -252 -472 -497 7 -680 -514 114
3259 114 -337 -302 -165 -28 -597 -159 -21 -49 -581 -253 -132 -274 -257 -33 28 -198 198 126 -86 59 118 277
3281 277 110 244 560 -189 20 260 83 181 364 290 91 211 463 354 556 328 315 133 160 426 579
3302 579 338 448 329 213 94 280 209 -18 -197 -75 -234 19 134 -228 -71 284 -8 -367 -205 82
3322 82 -158 -323 -167 -77 -352 -130 -200 -244 -368 -175 -476 -201 -220 -411 -401 -353 -313 -242 -494 -214 -90 -87 -164 89
3346 89 -90 -216 -229 -361 -236 -431 122 -160 -280 73 115 -22 -43 184 14 52 67 -56 125 391 273 -43
$$ packed form
3193c8J82l00J58k69J80l9L53k52j22N50r5k83Q2J71N2l23N74l15j46K10j67J04
3215B67k3J09J53l60J88j26p3l77N69N2o35L93J12N2k03K42j86m15O93m8l30j22
3237f8J81l91k5L08o4m26J26J42k01k97L61K87k97o4M23k47k20k5N04o87J66O28
3259A14m51L5J37J37n69M38J38k8n32L28J21j42J7K24O1k26L96p2k12J45N9J59
3281B77j67J34L16p49K09K40j77R8J83p4j99J20K52j09K02k28j3j82K7K66J53
3302E79k41J10j19j16j19J86p1k27j79J22j59K53J15l62J57L55k92l59J62K87
3322H2k40j65J56R0k75K22p0m4j24J93l01K75j9j91J0M8M0P1k52K80J24Lp7K53
3346H9j79j26j3j32J25j95N53k82j20L53M2j37k1K27j70L8J5j23J81K66j18l16
$$ plain form
3368 -43 519 221 371 115 401 591 193 57 71 503 290 293 257 47 225 213 258 424 108 128 205 113 279
3391 279 -64 265 272 0 -17 -79 -11 29 -241 -77 -199 103 -128 -194 -317 -287 -527 -82 -205 4 -398 -442 -61
3414 -61 -292 -266 -439 -175 -571 -331 -197 -236 -392 -361 -182 -435 -198 -173 -255 -47 -170 120 30 -80 -210 -149 36
3437 36 262 -26 -98 122 244 -2 -22 -15 204 60 395 269 425 188 274 65 499 234 429 -17 216 294
3459 294 -24 90 177 331 -17 215 168 88 60 196 -11 100 -27 106 7 -195 204 32 -146 21 -75 -320
3481 -320 -217 -49 28 36 -384 -230 -165 -432 -146 -117 -706 -501 -290 42 -52 -102 -46 -149 -423 -202 -435 -179 -248
3504 -248 41 -236 -418 121 -227 -183 16 106 12 0 259 -285 -12 182 250 178 255 282 58 43 216 288 162
3527 162 315 415 -66 191 528 325 329 395 345 306 414 214 434 -85 375 118 -63 272 350 395 169 -67
$$ packed form
3368d3N62k98J50k56K86J90l98j36J4M32k13Ll6k10J78j2M5J66l16K0P7r2J66
3391B79l43L29Pk72j7o2O8M0k70J64j22L02k31o6j23L0k40M45j23K09m02m4L81
3414f1k31K6j73K64l96K40J34l9j56L1J79k53K37K5q2K08j23K90r0j10j30O1J85
3437C6K26k88p2K20J22k46k0PK19j44L35j26J56k37Q6k09M34k65J95m46K33P8
3459B94l18J14Q7J54l48K32m7q0k8J36k07J11j27J33r9k02L99j72j78J67r6k45
3481c20J03J68P7Qm20J54O5k67K86K9n89K05K11L32r4n0N6j03k74K21k33K56o9
3504b48K89k77j82N39l48M4J99R0r4j2K59n44K73J94O8p2P7K7k24j5J73P2j26
3527A62J53J00m81K57L37k03MO6n0l9J08k00K20n19M60k57j81L35P8M5k26k36
$$ plain form
3549 -67 193 -188 70 257 -39 -541 11 -72 -60 -102 6 -76 -199 -284 -334 -516 -192 -5 -454 -352 -263 -166 -524
3572 -524 -417 59 -345 -619 -199 -64 -178 -340 -196 -330 -348 -179 31 -191 -237 -166 24 -427 -18 -39 -238
3593 -238 12 152 4 67 108 -210 -135 -76 218 245 -273 -44 93 263 193 418 250 98 290 380 -54 238
3615 238 332 241 227 286 311 -14 286 244 255 227 510 207 198 94 64 157 31 296 33 -18 -14 80 -148 -36 -126 -130
3641 -130 -124 -7 82 -319 -218 -44 -162 -127 -84 -36 -203 -127 -300 -239 -90 -107 -109 -164 -419 75 -306 -264 -181 -185 -305
3666 -305 107 -2 -436 -344 -312 -132 19 38 -168 -223 -70 -2 -21 -165 229 239 200 81 193 299 269 408 366
3689 366 174 112 78 58 -165 188 184 184 230 36 352 48 339 412 156 173 425 185 16 158 -202 -163 311 239
3713 239 34 -88 -73 168 -194 -229 57 -252 -371 -224 -142 -222 -126 -191 -316 -113 70 -127 -307 -306 -194 -288 -365
$$ packed form
3549f7K60l81K58J87k96n02N52q3J2m2J08q2j23q5n0j82L24J87m49J02Q9R7l58
3572e24J07M76m04k74M20J35j14j62J44j34j8J69K10k22m6P1J90m51M09k1j99
3593b38K50J40j48O3M1l18P5N9K94K7n18K29J37J70p0K25j68j52J92R0m34K92
3615B38R4r1j4N9K5l25L00m2J1k8K83l03rj04l0R3j26K65k63n1MR4k28J12r0m
3641a30OJ17Q9m01J01J74j18L5M3M8j67P6j73O1J49j7kn5k55M94l81M2Q3mj20
3666c05M12j09m34R2L2J80J51J9k06n5J53O8j9j44L94J0l9j19J12J06l0J39m2
3689C66j92o2l4k0k23L53m%M6j94L16l04K91P3k56J7K52k40j69J42l60L9M74p2
3713B39k05j22J5K41l62l5K86l09j19J47Q2q0R6o5j25K03J83j97j80JJ12r4p7
$$ plain form
3736 -365 -283 -48 -263 -175 -252 -427 50 -190 -390 -116 -407 -257 -99 36 -235 -75 -157 112 -110 -530 6
3757 6 119 -36 -16 180 142 -68 59 124 -113 258 398 248 181 105 299 188 202 483 302 228 324 80 42 451
3781 451 299 -18 469 246 235 288 321 100 49 295 147 248 100 130 174 -90 -70 45 -153 60 45 -110 10
3804 10 -297 -118 -369 -329 -201 -185 -224 86 64 -141 -193 -49 298 -243 -6 -190 -190 -120 -83 -216 -273 -355 -256 -236 -61
3829 -61 -82 -118 -120 122 6 111 -54 291 -61 -112 7 276 229 -98 149 80 149 60 201 27 10 152 388 69
3853 69 240 501 308 218 344 80 71 129 89 171 274 -25 185 227 151 299 258 189 180 20 -18 131 120 -46 -136
3878 -136 149 22 -23 -113 -58 -222 12 209 -44 -29 -33 -533 -308 -313 -115 -172 -116 -226 -140 -229 -157 -149 -59 -60 -70 -72 122
3905 122 68 -89 90 -99 -45 80 -182 30 17 135 -199 -25 -42 62 112 23 -37 -46 268 88 372 190 229
$$ packed form
3736c65Q2K35k15Q8p7j75M77k40k00K74k91J50J58J35k71J60q2K69k22m20N36
3757FJ13j55K0J96l8k10J27O5k37L71J40j50o7p6J94j11J4K81j81p4R6k44l8M09
3781D51j52l17M87k23j1N3L3k21n1K46j48J01j48L0M4k64K0J15j98K13j5j55J20
3804A0l07J79k51M0J28J6l9L10k2k05n2J44L47n41K37j84%P0L7j33n7q2R9K0J75
3829f1k1l6kK42j16J05j65L45l52n1J19K69m7l27K47o9O9q9J41j74j7J42K36l19
3853F9J71K61j93r0J26k64rN8m0Q2J03k99K10M2p6J48m1o9rj60l8J49j1j66r0
3878a36K85j27m5r0N5j64K34J97k53J5mn00K25nJ98n7N6j10Q6q9P2QR0jj0kJ94
3905A22n4j57J79j89N4J25k62K12j3J18l34J74j7J04N0q9o0rL14j80K84j82L9
$$ plain form
3928 229 432 171 136 124 208 189 341 148 158 -14 67 42 313 275 68 -105 34 -100 3 168 267 -256 79
3951 79 417 -52 -34 97 215 -201 -35 -91 -38 -162 73 -151 15 -91 -122 -266 -160 -196 -216 -369 265 -291
3973 -291 -56 -36 -175 -54 -161 -192 -145 -602 -228 -243 -620 37 -119 -281 -426 -109 -102 -514 -187 75 69 -227 68
3996 68 37 -122 -13 432 14 19 7 276 234 152 -61 -75 318 397 294 -20 455 374 151 -86 275 -30 182
4019 182 273 641 168 -120 524 44 51 458 146 45 65 325 137 -370 134 99 -148 -43 34 -18 -106 85 -21
4042 -21 -303 -155 294 -418 -222 9 -189 -188 -22 44 -366 -450 -142 -17 -477 34 -21 -298 -428 140 28 -276
4064 -276 -130 210 -48 108 143 -130 -365 123 28 -316 -399 6 81 -102 109 181 -29 -132 401 2 -306 427
4086 427 377 -58 161 311 -168 -2 256 256 -81 198 327 -25 -51 585 296 -70 444 235 -107 80 638
$$ packed form
3928B29K03k61l5j2Q4j9J52j93J0j72Q1k5K71l8k07j73J39j34J03J65R9n23L35
3951G9L38m69J8J31J18m16J66n6N3j24K35k24J66j06l1j44J06l6k0j53O34n56
3973b91K35K0j39J21j07l1M7m57L74j5l77O57j56j62j45L17Pm12L27K62ok96K95
3996F8l1j59J09M45m18Nj2K69m2q2k13j4L93P9j03l14M75q1k23k37L61l05K12
4019A82R1L68m73k88O44m80PM07l12j01K0K60j88n07N04l5k47J05P7n2q8J91j06
4042b1k82J48M49p12J96K31j98JJ66O6m10q4L08J25m60N11n5k77j30N68j12l04
4064b76J46L40k58J56L5k73k35M88r5l44q3M05P5j83K11P2k10j03N33l99l08P33
4086D27n0m35K19J50m79J66K58%l37K79J29l52k6O36k89l66N14k09l42J87N58
$$ plain form
4107 638 141 -215 -22 203 -152 66 247 4 -217 63 243 -306 -495 115 -181 -32 127 -8 -186 -145
4127 -145 -115 -250 -355 93 -9 -211 -322 -42 -421 -381 -51 -52 -404 -93 -27 -143 -464 151 -82 -158 -115 222
4149 222 -118 -382 125 204 1 146 394 72 -146 482 73 -55 421 -117 -142 -38 192 369 27 -106 662
4170 662 148 152 293 182 -23 318 548 12 -191 372 289 -243 -6 73 -211 -80 325 73 -382 122 264
4191 264 118 73 206 -359 -343 360 106 78 10 186 -115 -48 -182 37 -314 102 -6 -153 25 -81 -231 -683
4213 -683 -306 -85 -76 -247 -7 -221 -216 -101 -68 -104 55 -105 -152 -522 128 161 -129 -82 -238 247 -203 -31 1
4236 1 91 94 -50 208 136 264 424 143 151 304 539 66 -45 -102 98 -38 179 168 131 134 187 157 380 340 177
4261 177 280 252 240 240 180 -108 71 -69 -11 176 -80 38 84 16 -53 -103 75 -219 -165 -54 61 40 -15 -69 -120
$$ packed form
4107F38m97l56J93K25l55K18J81k43k21K80J80n49j89O10k96J49J59j35j78M1
4127a45L0j35j05M48j02k02j11K80l79M0L30jl52L11O6j16l21O15k33p6M3L37
4149B22l40k64N07P9k03J45K48l22k18O28m09j28M76n38k5J04K30J77l42j33P68
4170F62n14MJ41j11k05L41K30n36k03N63q3n32K37P9k84J31M05k52m55N04J42
4191B64j46m5J33n65J6P03k54k8o8J76l01O7j34K19l51M16j08j47J78j06j50m52
4213f83L77K21Rj71K40k14NJ15L3l6J59j60m7l70O50L3k90M7j56M85m50J72L2
4236AR0Lj44K58p2J28J60k81QJ53K35m73j11n7K00j36K17j1l7LN3l0K23m0j63
4261A77J03k8j2%o0k88J79j40N8J87k56J18M6o8o9n0J78k94N4J11J15k1n5n4n1
$$ plain form
4286 -120 -199 188 -365 -358 -217 -384 -413 -26 -346 -435 -250 189 -22 -116 -186 -33 -267 -159 117 -253 -210 -226 12
4309 12 -182 -181 -326 48 11 -285 -26 140 275 226 28 339 219 233 53 309 49 34 176 236 -33 274 96
4332 96 133 103 359 467 46 63 -52 127 26 137 244 -157 65 45 -97 -68 95 222 81 88 202 47 -140
4355 -140 -263 82 44 -197 -182 -58 -84 -112 -102 -7 -224 -64 159 -209 -86 -22 -37 -197 -189 -87 -37 -396 48 -164
4379 -164 -170 46 -213 -112 -188 -358 96 -18 -281 94 118 -302 84 -122 8 -86 128 -154 146 -62 70 -96
4401 -96 -121 57 243 300 298 -51 -14 50 54 349 -42 58 -70 173 127 160 133 34 137 10 -38 406 -112 44 164
4426 164 134 163 106 448 122 -161 81 18 62 -220 49 22 -402 -44 -171 -94 0 -28 76 -2 -251 -182 -153 -284
4450 -284 -275 -31 -70 -106 -416 -115 80 -380 -191 -85 -333 -30 87 -227 117 -140 -148 71 -236 -220 34 172
$$ packed form
4286a20p9L87n53PJ41j67k9L87l20q9J85M39k11r4p0J53k34J08K76l70M3j6K38
4309A2j94Jj45L74l7k96K59J66J35m9j98L11j20J4j80K56k60j5J42O0k69L07j78
4332I6L7l0K56J08m21J7j15J79j01J11J07m01K22k0j42K9J63J27j41PJ14j55j87
4355a40j23L45l8k41J5J24k6k8J0R5k17J60K23l68J23O4j5j60QJ02N0l59M44k12
4379a64oK16k59J01p6j70M54j14k63L75K4m20L86k06J30r4K14k82L00k08J32j66
4401i6k5J78J86N7kl49L7O4MK95l91J00j28K43m6L3k7r9J03j27m8M44n18J56J20
4426A64l0K9n7L42l26k83K42o3M4k82K69k7m24L58j27P7R4k8J04p8k49O9K9j31
4450b84RK44l9l6l10L01J95m60J89J06k48L03J17l14L44k57qK19l07J6K54J38
$$ plain form
4472 172 -127 3 115 -13 -78 -73 150 113 -184 176 51 -296 269 199 -76 64 266 -206 66 155 -8 109
4494 109 28 78 -92 -4 76 -288 -130 -2 273 71 237 160 64 146 102 153 -73 210 114 106 -150 156 -139 -193
4518 -193 -159 -21 -252 70 94 -516 -153 -198 -72 -214 39 -87 -76 -196 -276 -4 -547 -214 143 -175 -81 -142
4540 -142 -74 -429 131 25 -284 -91 34 -144 -148 -181 82 -168 -250 106 119 -115 23 211 -89 65 116 -227
4562 -227 -8 66 71 147 3 70 -45 -3 309 147 -80 120 256 190 222 393 233 -108 0 198 -111 -44 247
4585 247 76 -13 214 42 -43 124 -27 39 -105 158 -125 -48 72 262 210 -170 -32 247 -254 -208 -15 -381
4607 -381 -369 1 -191 -270 -58 193 -324 -406 -1 -37 -119 189 -248 -113 -269 42 -60 -181 60 -35 119 -320
4629 -320 -146 6 -44 -119 -63 113 -217 -45 -35 24 166 375 -171 -157 111 -67 48 225 304 203 23 534
$$ packed form
4472A72k99J30J12j28o5NK23l7k97L60j25l47N65p0k75J40K02m72K72Q9j63J17
4494A09q1N0j70Q8Q0l64J58J28K75k02J66p7r6Q2m4N1k26K83r6qk56L06k95n4
4518a93L4J38k31L22K4o10L63m5J26j42K53j26J1j20q0K72n43L33L57l18R4o1
4540a42O8l55N60j06l09J93J25j78ml3K63k50q2L56J3k34J38J88l00J54N1l43
4562b27K19P4NP6j44O7j15M2L12j62k27K00J36o6L2J71j60l41J08J98l09O7K91
4585B47j71q9K27j72q5J67j51O6j44K63k83P7J20J90n2l80J38K79n01M6J93l66
4607c81J2L70j92p9K12K51n17q2M05l6q2L08m37J35j56L11j02j21K41r5J54m39
4629c20J74J52n0p5N6J76l30J72J0N9J42K09n46J4K68j78J15J77P9j01j80N11
$$ plain form
4651 534 -61 125 105 7 284 -19 40 18 271 -6 114 0 216 136 268 84 233 136 -47 95 145 -238
4673 -238 24 151 -138 -44 -403 -46 -207 105 230 34 128 -3 -96 54 69 11 -115 -65 -237 -20 82 -100
4695 -100 144 -41 -133 53 -289 -256 -185 -77 -183 -93 -247 63 -45 -112 143 -45 -119 -308 94 150 96 127 -75
4718 -75 143 42 249 -98 57 234 -124 180 316 -130 -72 193 -106 282 -211 15 -6 153 122 29 42 -183
4740 -183 58 -44 -137 98 143 -98 -68 -19 319 30 303 -99 12 26 202 -133 -39 -169 -69 207 -87 -139
4762 -139 130 -247 216 91 -88 -79 -133 -215 -117 70 -81 -290 115 -50 32 54 -131 -162 4 -418 -95 -160 -97
4785 -97 -287 48 -180 116 -229 -36 -70 -156 -84 -296 306 177 68 113 62 65 247 335 56 155 215 114 90 -243
4809 -243 220 -27 157 61 42 -187 -169 -90 83 8 311 47 110 145 62 370 -198 301 289 -34 -172 235 60
$$ packed form
4651E34n95J86k0r8K77l03N9k2K53k77J20j14K16q0J32j84J49r7j83J42N0l83
4673b38K62J27k89R4l59L57j61L12J25j96R4j31r3J50J5n8j26N0j72K17J02j82
4695a00K44j85r2J86l42L3P1J08j06R0j54L10j08o7K55j88p4j89M02N6n4L1k02
4718g5K18j01K07l47J55J77l58L04J36m46N8K65k99L88m93K26k1J59l1r3J3k25
4740a83K41j02r3K35M5k41L0M9L38k89K73m02J11J4J76l35R4j30J00K76k94n2
4762a39K69l77M63j25j79Rn4q2R8J87j51k09M05j65Q2K2j85l1J66m22L23o5O3
4785i7j90L35k28K96l45J93l4q6P2k12O02j29j09M5n1LJ82Q8k79R9O0j01k4l33
4809b43M63k47J84r6j9k29J8P9J73p5L03k64O3L5q3L08n68M99j2l23j38M07j75
$$ plain form
4832 60 -41 -243 176 166 -119 14 -176 -318 -50 -28 69 -163 216 -348 -111 -135 -191 -191 -78 -140 -542 -64 -135
4855 -135 -97 -159 211 -5 -160 -78 -38 144 58 112 -207 -376 30 -205 12 -27 55 -98 -41 42 109 302 -64 -50
4879 -50 -41 0 29 296 199 279 134 -16 -88 -22 239 322 148 366 76 166 41 131 -158 -33 -30 165 41 199 78
4904 78 -6 -183 70 -89 159 -291 -17 62 -92 -94 204 209 -35 -295 -157 80 -186 112 24 -464 -162 -27 -276
4927 -276 -119 -14 -56 -220 -150 -183 144 -82 40 -250 -134 -194 39 -25 -100 221 -286 -104 -67 -70 -45 46 69 -64
4951 -64 -329 -119 -1 -88 -44 71 -5 -23 34 150 316 -22 233 -160 39 -129 43 -91 320 125 178 -52
4973 -52 298 194 296 -22 198 128 -145 110 30 150 141 205 -47 87 236 229 -89 36 33 289 2 -115 -257
4996 -257 -19 -115 -134 -113 -262 157 -183 -62 -75 121 -103 3 105 -23 -304 129 -47 103 -221 -60 -104 -289
$$ packed form
4832F0j01k02M19j0k85J33j90j42K68K2R7k32L79n64K37k4n6%J13o2m02M78p1
4855a35L8o2L70k16j55Q2M0J82q6N4l19j69M06k35K17l9Q2j53N7Q3O7J93l66J4
4879e0RM1K9K67r7Q0j45j50p2O6K61Q3j74K18k90R0j25R0k89J25LJ95j24J58j21
4904G8q4j77K53j59K48m50K74P9j54kK98Nk44k60J38K37k66K98q8m88L02J35k49
4927b76J57J05m2j64P0l3L27k26J22k90J16o0K33o4p5L21n07J82L7lK5R1K3j33
4951f4k65K10J18q7M4J15p6j8N7J16J66l38K55l93J99j68J72j34M11j95N3k30
4973e2L50j04J02l18K20p0k73K55q0J20rO4k52J34J49pl18J25lK56k87j17j42
4996b57K38r6j9K1j49M19l40J21j3J96k24J06J02j28k81M33j76J50l24J61m4j85
$$ plain form
5018 -289 38 76 -28 117 151 -187 -40 49 -157 -7 266 28 173 -2 -119 -186 115 -268 26 -148 96
5039 96 86 195 -71 -12 239 223 101 38 19 85 58 233 -359 83 60 94 -130 213 202 -65 170 204 -137 323
5063 323 196 39 52 171 151 9 115 49 -43 10 -22 129 -86 -129 -138 -69 -253 -106 -24 -233 -24 219 -86 -99
5087 -99 -65 -47 -81 -57 45 100 25 95 39 52 -132 134 -111 -289 -89 -176 58 -138 67 -102 -205 182 -135 9
5111 9 -20 49 -98 -18 159 -377 64 37 -49 -22 241 -1 -42 -11 63 228 200 300 340 -197 311 24 240 176 15
5136 15 -6 277 71 21 -40 -87 127 127 72 261 35 160 158 -306 -151 -289 33 -2 100 -245 116 -18 203 197
5160 197 204 -11 -79 -19 -164 185 -135 -115 133 -121 -164 -120 53 -125 -165 -70 -35 98 127 -88 220 77 45 132
5184 132 89 -72 -32 17 -107 -100 -40 -287 101 168 167 -304 -61 119 228 104 371 -125 50 324 8 -40 70
$$ packed form
5018b89L27L8j04J45L4l38J47Q9k06J50K73k38J45j75j17o7L01l83K94j74K44
5039I6j0J09k66N9K51j6j22o3j9O6k7J75n92M42k3L4k24L43j1k67K35L4l41M60
5063C23j27j57J3J19k0j42J06o6r2N3l2J51k15m3rO9j84J47Q2k09K09K43l05j3
5087i9L4J8l4K4J02N5p5P0n6J3j84K66k45j78K00q7K34j96K05j69j03L87l17J44
5111Ik9O9j47Q0J77n36M41k7q6K7K63k42m1L1P4J65k8J00M0n37N08k87K16o4j61
5136A5k1K83k06n0o1m7K14%n5J89k26J25km64J55j38L22l5J02l45L61j34K21o
5160A97Pk15o8O0j45L49l20K0K48k54m3M4J73j78m0R5L5J33K9k15L08j43l2Q7
5184A32m3j61M0M9j24PO0k47L88O7jm71K43J80J09j24K67m96J75K74l16m8J10
$$ plain form
5207 70 -154 49 168 -28 -26 224 48 247 35 77 -49 143 63 -2 94 -186 191 -210 202 27 -182 156
5229 156 -49 -69 99 177 -218 -72 14 -42 323 -301 -88 -194 242 -83 -170 -193 -206 -71 -46 103 231 -242 -34
5252 -34 -14 -137 -181 -70 96 -16 7 -12 -118 37 -162 27 59 -138 289 0 -126 -67 80 -125 124 226
5274 226 119 173 117 -111 -95 111 24 11 106 131 -81 124 261 -28 -52 76 -62 -92 52 133 104 -126 29 -67
5298 -67 184 237 -45 34 173 19 -42 166 234 98 98 403 14 -66 -176 -11 285 197 217 87 -32 17 74 139
5322 139 -124 -61 0 -26 -33 -116 -223 78 121 72 -161 1 78 230 74 -117 -127 -104 122 -305 -66 -37 -470 184
5346 184 159 17 202 -75 -63 -61 5 39 164 134 143 -232 147 211 217 -10 229 -186 -279 -13 224 -125 -14 160
5370 160 -11 -8 157 -54 -55 120 260 101 173 119 50 121 -209 -133 -160 180 241 4 -191 171 -8 299 -13 9
$$ packed form
5207G0k24K03J19j96KK50j76J99k12M2j26J92q0o5R6k80L77m01M12j75k09L38
5229A56k05k0J68P8l95J46Q6n6L65o24K13j06M36l25q7k3j3J35K5J49J28m73K08
5252c4K0j23m4J11J66j12K3j9j06J55j99J89L2j97M27k89j26N9J47k05K49J02
5274B26j07N4n6k28J6K06q7j3R5K5k12K05J37k89k4J28j38l0J44Q1k9k30J55r6
5298f7K51N3k82P9J39j54o1K08O8j36%L05l89q0j10J65K96q8K0j30j19M9N7O5
5322A39k63O3O1k6pq3j07L01M3m9k33J62P7J52j56j91j0K3K26m27K39K9m33O54
5346A84k5j42J85k77J2KO6L4J25l0Rl75L79O4Ok27K39m15r3K66K37l49J11J74
5370A60j71LJ65k11jJ75J40j59P2n4o9P1l30P6k7L40O1k37j95L62j79L07l12K2
$$ plain form
5394 9 2 -149 -235 -14 110 20 -96 108 93 -84 228 -216 15 9 -9 -435 -306 95 159 -153 -55 -190 -180 -77
5418 -77 42 -121 -355 -214 -36 -69 -159 -68 91 -15 -209 -43 71 -61 131 78 23 278 -17 262 -93 140
5440 140 378 31 150 112 170 182 -88 -188 -105 -125 157 215 83 60 -139 -192 39 -5 274 85 195 28 -172
5463 -172 184 -323 46 66 29 132 -155 -126 -129 -14 -120 -94 185 133 -85 -112 -61 -111 80 -151 12 -25 138 -91
5487 -91 151 -163 -194 150 -285 -151 -217 -17 -340 -365 -169 78 -266 -122 -116 -373 -242 100 191 -55 -114 -120 378
5510 378 -120 -171 115 -319 37 286 82 -178 -87 -83 -249 239 -77 304 164 -10 -14 223 -39 -131 -27 -122 71
5533 71 95 268 -51 -82 329 143 64 -123 162 103 102 63 -191 6 -68 66 216 -64 -243 -38 151 -49 -76
5556 -76 -155 -125 173 -158 -148 -89 -145 -148 -64 125 71 95 -211 -161 25 186 -150 65 -74 113 -88 -235 -167 36
$$ packed form
5394Ipj51q6K21J24r0j16K04j5j77L12m44K31oj8m26J29M01O4l12R8j35J0J03
5418g7J19j63k34J41J78l3r0R1J59j06j94J66J14j32J92n3n5K55k95K79l55K33
5440A40K38l47J19l8N8J2k70j00Q3k0K82N8j32k3j99n3K31m4K79j89J10j67k00
5463a72L56n07L69K0l7J03k87K9lJ15j06K6K79n2k18k7N1n0J91k31J63l7J63k29
5487i1K42l14l1L44m35J34o6K00l23k5J96K47l44J44Ok57J31L42R1k46n9oM98
5510C78m98n1K86m34L56K49k04k60R1Mj66M88l16L81j40j74mK37k62r2J04r5J93
5533G1K4J73l19l1M11j86p9j87K85n9jl9k54J97p4J34J50k80j79K05J89k00k7
5556g6p9L0K98l31J0N9n6lQ4J89n4K4l06N0J86J61l36K15j39J87k01j47O8K03
$$ plain form
5580 36 -61 -41 17 -359 -39 -8 -83 157 57 187 258 115 -19 170 42 -115 26 265 151 180 142 157 295
5603 295 -67 159 -24 191 -12 272 106 -36 132 14 110 -70 189 95 117 -20 33 -7 -246 278 -119 -11
5625 -11 159 136 -25 80 203 -229 -147 121 -100 -174 -155 70 -278 35 14 -24 -6 65 226 3 -58 52 293
5648 293 -68 -127 213 241 142 -67 -517 -217 159 -62 -114 -186 -62 -302 -65 92 153 -303 21 142 -137 -222
5670 -222 386 108 -47 -39 20 -101 -263 387 13 -29 -36 194 164 168 211 4 -118 -10 227 -136 185 176 -141 -18
5694 -18 71 167 -52 246 210 54 196 323 75 -14 213 -118 -145 62 -53 225 -167 -5 201 -101 -139 -237 -103
5717 -103 94 -72 -96 56 8 50 51 5 346 265 50 125 -81 -36 -479 -1 147 -314 -247 134 -62 -122 -185 -69
5741 -69 17 201 -57 9 -20 52 -116 -174 82 98 -111 -18 243 -51 -6 59 222 138 -90 -30 50 -15 271 293 167
$$ packed form
5580C6r7K0N8l76L20L1p5K40j00J30P1j43j34J89j28j57J41K39j14K9l8J5J38
5603B95l62K26j83K15k03K84j66j42J68j18R6j80K59r4K2j37N3m0k39N24l97J08
5625a1J70k3j61J05J23m32Q2K68k21p4J9K25l48L13k1l8J8P1J61k23o1J10K41
5648B93l61n9L40K8r9k09m50L00L76k21n2p2J24k40K37J57O1m56L24J21k79q5
5670b22O08k78j55QN9j21j62O50l74m2pK30l0MM3k07j22J08K37l63L21rl17J23
5694a8Q9R6k19K98l6j56J42J27k48q9K27l31k7K07j15K78l92J62K06l02l8r8J34
5717a03J97j66k4J52m8M2Jm6L41q1k15P5k06M5m43M78J48m61O7L81j96o0o3J16
5741f9Q6J84k58O6k9P2j68n8K56J6k09R3K61k94M5O5J63q4k28O0Q0o5K86K2j26
$$ plain form
5766 167 -197 91 -112 314 68 44 105 -53 115 -91 97 -259 203 110 231 -106 98 -113 -42 76 38 -204
5788 -204 204 154 13 112 -192 -260 110 192 -118 -68 -250 51 -296 -128 -90 -57 -208 -2 -6 319 -38 -241 -29
5811 -29 -193 -131 -95 -51 -131 -74 -31 215 -211 -291 -8 66 -84 232 -116 4 165 -3 62 18 -84 -110 178 78
5835 78 248 38 164 -67 -40 281 -156 71 -96 234 205 116 -178 221 10 -421 245 224 250 221 198 6 154
5858 154 40 127 -27 -186 -4 -186 89 134 105 167 94 67 -64 45 162 30 -121 35 -92 245 -48 36
5880 36 98 -171 36 -83 215 -117 -177 215 253 38 26 -96 15 -270 -174 15 232 -159 -20 -47 -11 -122 -233
5903 -233 -113 -107 -271 -116 86 77 77 327 -208 101 96 -10 266 -104 -116 23 47 116 240 225 -244 -98 249 95
5927 95 21 -39 3 210 20 97 98 76 73 -201 61 180 343 -44 6 -117 -106 138 -195 -22 138 -83 -75 155 100
$$ packed form
5766A67l64K88k03M26k46k4O1j58J68k06J88l56M62r3J21l37K04k11P1J18l8k42
5788b04M08n0j41R9l04o8L70Q2l10N0j82L01l47J68L8L3j51K06mL25l57k03K12
5811b9j64O2L6M4q0N7M3K46m26q0K83P4j50L16l48J20J61j68O5m4j02k6K88j00
5835G8J70k10J26k31K7L21m37K27j67L30k9q9k94L99k11m31O66k1K6k9k3j92J48
5858A54j14Q7j54j59J82j82K75M5k9O2p3k7j31J09J17j32j51J56j27L37k93Q4
5880C6O2k69K07j19K98l32o0L92L8k15j2j22J11k85R6J89K17l91J39k7L6j11j11
5903b33J20Oj64J55K02r%K50n35L09nj06K76l70j2J39K4O9J24j5m69J46L47j54
5927I5p4o0M2K07j90P7Jk2lk74K62J19J63l87N0j23J1K44l33J73J60k21QK30n5
$$ plain form
5952 100 20 2 70 250 -45 53 58 -9 96 103 -196 -94 -139 61 15 -351 0 133 58 -267 -139 -126 -123 -196 -54
5977 -54 84 -229 -64 -258 90 15 287 -86 -280 -12 -201 101 -62 25 -46 -21 196 30 68 -48 -155 135
5999 135 214 300 -401 54 228 -118 -41 281 -170 101 7 172 316 26 -164 92 -69 44 133 222 101 207
6021 207 -62 -201 -156 123 173 -225 -46 121 157 -21 301 124 265 99 -104 -90 110 -32 -39 37 -91 98
6043 98 -131 141 -119 -148 24 134 -70 -22 -20 51 -89 -38 225 86 54 -26 -85 32 -18 -44 -176 108 -119 -48
6067 -48 167 -147 126 84 -22 273 -50 -30 -55 177 178 -1 82 79 -95 325 -8 189 -161 219 -157 -250 104
6090 104 -63 227 -123 73 -51 -30 307 -48 37 -220 175 -13 0 172 129 -264 87 -10 243 -106 -156 214
6112 214 114 9 34 -37 -222 -179 214 -81 32 12 4 88 309 174 -36 60 -366 -262 -74 45 136 112 -16
$$ packed form
5952A00q0j8O8J80k95R8No7J05Pk99J02m5K00m6l66L51J33p5l25J28J3Lp3J42
5977e4J38l13J65j94L48p5K72l73j94K68j89L02j63Q7p1K5K17j66L8j16j07K90
5999A35P9Q6p01M55J74l46P7L22m51K71r4J65J44k90j90K56j61J13Q9Q9j21J06
6021B07k69j39M5K79N0l98J79J67L6j78L22j77J41j66k03J4K00j42pP6j28J89
6043I8k29K72k60k9J72J10k04M8KP1j40N1K63j39l2q0n9J17n0k6j32K84k27P1
6067d8K15l14K73m2j06K95l23K0k5K32Jj79Q3lj74M20l33J97l50L80l76r3L54
6090A04j67K90l50J96j24K1L37l55Q5k57L95j88J3J72m3l93L51r7K53l49n0L70
6112B14j00j05K5p1j85M3L93k95J13k0qQ4K21j35k10R6m26J04J88J19R1k4j28
$$ plain form
6135 -16 -87 105 54 45 47 95 -218 1 62 -161 118 -155 -166 -133 -42 -208 -96 -208 2 -99 -107 -26 260 131 -16
6160 -16 141 -141 44 38 57 -157 61 76 21 210 -50 -51 61 -43 19 -24 23 61 56 35 34 36 298 216 -144 159 -179
6187 -179 49 58 -53 -29 -55 -15 198 -36 -76 -51 -111 -70 264 -10 -168 41 -80 -29 -79 14 -19 83 -109 -266
6211 -266 -115 -137 -145 166 -67 -119 -15 39 115 -64 193 95 28 -39 -70 -156 60 290 48 53 -16 141 136 255 -130
6236 -130 318 -147 -54 49 -8 -109 -132 198 45 296 132 246 6 80 -24 -43 168 37 -47 203 75 293
6258 293 61 150 -187 -406 -41 -212 111 161 -66 38 -78 33 93 -107 84 61 -59 11 -132 -28 4 21
6280 21 221 -105 -101 190 -11 -54 -8 225 -201 114 -175 -172 -48 29 58 -135 -405 -63 195 -113 -130 103 -55
6303 -55 -120 102 -159 263 -13 -10 306 191 134 -151 -163 -336 119 11 -71 11 -154 192 256 97 -54 199 173
$$ packed form
6135a6p1J92n1rKM8l13K19O1k23K79k73j1L3R1j66J12j12K10j01qQ1K86j29j47
6160a6J57k82J85oJ9k14K18J5n5J89k60jJ12j04O2m3M7L8nk1jKK62q2l60L03l38
6187a79K28Rj11K4k6M0K13k34m0K5o0M1L34k74j58K09j21N1n0R3l3J02j92j57
6211b66J51k2qL11k33n2J04N4P6j79K57r8o7o7l1q6K16K30k42No9J57nJ19l85
6236a30M48m65R3J03n7j01k3L30j53K51j64J14k40P4j04j9K11j31q4K50j28K18
6258B93k32Q9l37k19L65j71L23N0k27J04j16J11O0k00J91k3j20P0j43J04L2J7
6280B1K00l26MK91k01m3M6K33m26L15k89LJ24P7K9j93k70L42K58l08j7K33j58
6303e5o5K22k61M22k76LL16j15n7k85j2j73M55j08q2Q2j65L46O4j59j51K53k6
$$ plain form
6326 173 -125 -98 -68 -207 -121 300 -26 87 115 36 219 -118 291 2 -89 -66 41 56 -179 -33 -44 9 -253
6349 -253 -178 -40 93 -143 -121 -290 29 145 205 128 26 12 -202 -55 115 -4 -153 40 -3 -98 -190 322 121
6372 121 -176 -215 -79 -29 3 -277 181 114 -200 -10 26 47 -198 -256 -33 -257 -237 17 1 59 151 91 -90 57
6396 57 -37 199 523 134 -132 164 -48 34 203 226 118 125 179 -284 258 -44 -22 100 110 147 189 -194 37 91
6420 91 -203 -36 163 -73 101 18 38 37 65 -136 64 -115 -129 -41 -289 42 37 -120 -105 7 25 -184 -41 200
6444 200 10 114 362 121 -30 157 -77 -434 124 263 -6 -323 120 -48 -24 24 8 -113 -22 198 7
6465 7 -77 44 -130 -69 -187 -40 88 83 129 182 101 90 176 107 -179 285 -274 369 35 40 -231 -1 244 112 -16
6490 -16 -316 89 48 83 121 22 106 -177 204 103 -417 22 -24 67 55 -80 20 246 -114 212 58 -43 66
$$ packed form
6326A73k98K7L0j39Q6M21l26J13K8p9J83l37M09k89r1K3J07J5k35J46j1N3k62
6349b53P5J38J33k36K2j69L19J16O0p7j02j4k14J47J70j19j49J93m3r5r2N12k01
6372A21k97l9J36N0L2k80M58o7l14J90L6K1k45n8K23k24K0K54j6N8R2o0j81J47
6396E7r4K36L24l89k66K96k12Q2J69K3j08PN4m63N42l02K2J22J0L7M2l83K31N4
6420I1k94J67J99k36J74q3K0jK8k01K00j79j4Q8k48L31nj57J5J12J8k09J43K41
6444B00j90J04K48k41j51J87k34l57N58J39k69l17M43j68K4M8j6j21R1K20j91
6465Gq4J21j74O1j18J47J28nM6N3q1j1Q6o9k86M64n59O43l34Nk71K30K45j32j28
6490a6l00M05m1L5L8r9Q4k83L81j01n20M39m6R1j2j35J00K26l60L26j54j01J09
$$ plain form
6513 66 194 -82 -16 -29 308 190 1 -138 -22 -186 -16 80 85 -96 -24 -33 6 -136 143 46 -77 202 163 53
6537 53 151 117 125 -139 -188 -297 91 -153 216 22 -139 135 -14 77 -106 -224 35 -17 26 85 -3 16 137 -111
6561 -111 10 173 -66 -118 -31 189 17 -171 -196 141 104 23 201 520 33 109 82 -131 -94 23 133 -123 -145
6584 -145 -150 186 -108 123 45 74 -64 186 -66 -193 280 22 -1 -107 21 -292 -189 -68 179 -46 -15 -97
6606 -97 -29 -129 -174 68 -7 -44 21 18 -140 -53 -24 -29 -307 -106 60 -22 -115 -51 -93 -1 35 159 -20 -157 -109 113
6632 113 158 34 301 17 37 174 -259 -59 117 154 212 54 49 38 59 202 -139 76 -45 -277 -7 -65 141
6655 141 -37 -112 114 -298 -61 81 -27 105 -72 -134 -44 104 -51 152 -243 -111 -39 215 -7 -236 -82
6676 -82 10 24 -210 54 -115 85 -59 -175 89 -143 -140 -104 -15 -180 -221 -261 -130 -164 -364 -84 9 -114 24 -151
$$ packed form
6513F6J28k76O6j3L37j18j89j39J16j64J70R6Nj81P2rL9j42K79r7j23K79l9j10
6537E3R8l4Qk64m9j09L88k44L69j94j61K74j49R1j83j18K59n2M3N9q8J9J21k48
6561a11J21J63k39n2Q7K20j72j88k5L37l7q1J78L19m87P6k7k13L7J17J10k56k2
6584a45nL36k94K31p8K9j38K50k52j27M73k58k3j06J28l13J03J21K47k25L1q2
6606i7O8j00m5K42p5l7O5lj58Q7K9nk78K01J66q2r3O4m2R2L6J24j79j37M8K22
6632A13M5j24K67k84K0J37m33K00J76L7N8j58nj1K1J43l41K15j21k32K70n8K06
6655A41j78p5K26m12K37J42j08J32j77o2R0J48j55K03l95J32P2K54k22k29J54
6676h2R2J4k34K64j69K00j44j16K64k32LL6Q9j65m1m0J31l4k00K80R3j23J38j75
$$ plain form
6700 -151 3 7 10 61 77 43 112 87 210 -33 -218 108 -202 68 239 -104 21 96 -126 279 437 -36 111
6723 111 74 -97 146 68 164 71 28 -112 -184 10 66 115 230 188 234 -276 60 -8 48 -139 216 120 -40 251
6747 251 -9 -260 -13 126 132 146 0 -210 -12 -207 -58 -93 -126 -36 113 143 -53 -73 -91 -95 -91 98 196 -151 75
6772 75 168 91 -17 -296 88 -172 -117 -1 27 -6 193 -7 25 -139 -87 -97 -217 95 -4 -78 103 -208 -243 -222
6796 -222 267 190 -49 -155 85 -6 -206 -74 -4 -24 81 -47 -121 26 27 46 220 87 85 63 -230 334 -139 -114
6820 -114 253 -40 -108 72 157 -95 113 165 -67 -27 166 21 19 155 219 106 31 101 -153 28 -97 -89 -7 137
6844 137 -53 1 35 -195 41 22 -161 51 1 177 42 30 -17 123 -159 -126 -126 15 196 -190 -63 -164 20
6867 20 -141 -305 -99 -210 234 137 -64 62 56 41 41 164 -20 -389 -49 -197 -99 99 27 140 -19 -137 29
$$ packed form
6700a51J54MLN1J6l4O9k5J23k43j85L26l10K70J71l43J25P5k22M05J58m73J47
6723A11l7j71K43p8R6r3m3j40p2J94N6M9J15m2M6n10L36o8N6j87L55r6j60K91
6747B51k60k51K47J39OJ4j46k10J98j95J49l5l3R0J49L0j96k0j8mMJ89R8l47K26
6772G5R3p7j08k79L84k60N5J16K8l3J99k00L2j64N2j0j20L12r9p4J81l11l5K1
6796b22M89p7k39j06K40r1k00J32P0k0J05j28p4J47JJ9J74j33kk2k93N64m73K5
6820a14L67k93o8J80Q5k52K08N2k32M0J93j45kJ36O4j13p5P0k54J81j25QQ2J44
6844A37j90N4L4k30K36j9j83K12n0J76j35j2m7J40k82L3%J41J81l86J27j01J84
6867B0j61j64K06j11M44r7k01J26oj5%J23j84l69L40j48R8J98p2J13j59j18J66
$$ plain form
6890 29 90 166 110 -174 35 -214 -74 18 8 -114 -261 44 -37 249 53 -13 -107 165 52 144 -51 249 60
6913 60 -68 -128 -145 -108 -200 -55 -142 -79 -116 -152 17 29 -248 36 184 -21 142 31 135 7 -65 -99 105 -104
6937 -104 -1 114 158 -245 -142 99 -83 -159 -99 -470 -89 -48 -365 -95 87 181 -7 -218 -118 29 154 -138
6959 -138 -57 -19 66 268 -4 -23 206 -123 50 77 -81 -154 -9 49 126 95 265 -66 136 49 -53 260 -39
6982 -39 -234 -55 -55 111 163 -170 -138 267 -31 -97 -133 -315 28 152 -59 -217 59 21 -19 -16 -143 218 -23 -137
7006 -137 61 185 123 -46 -63 -169 -41 -276 -106 53 30 52 -22 -186 139 -63 43 -44 74 -191 152 316
7028 316 -149 -359 203 -98 205 82 -17 133 90 -213 318 -151 196 77 152 62 -8 131 109 -37 -89 -150 -84
7051 -84 -36 -200 293 -66 -154 97 -80 149 -199 154 48 -121 28 255 90 125 -115 -74 58 15 12 13 119
$$ packed form
6890B9O1P6n6k84K09k49J40R2j0j22j47L05q1K86j96o6r4K72j13R2j95L00j89
6913F0j28o0j7L7r2J45q7O3l7l6J69J2k77K84J48k05J63j11J04j28p2l4K04k09
6937a04J03J15M4m03J03K41j82p6O0l71L81M1l17K70J82R4j88k11J00J47J25k92
6959a38Q1L8Q5K02k72j9K29l29J73K7j58p3J45N8P7l1J70l31K02q7j02L13k99
6982c9j95J79%J66N2l33L2M05k98o6l6j82L43J24k11j58K76l8m0Lj27L61k41j14
7006a37J98J24o2j69j7j06J28k35J70J59k3K2p4j64L25k02J06q7J18k65L43J64
7028C16m65k10N62l01L03j23r9J50m3l03N31m69L47j19P5r0p0J39k2j46n2o1O6
7051h4M8j64M93l59q8K51j77K29l48L53j06j69J49K27j65L5k40M1J32m3lJJ06
$$ plain form
7074 119 -198 -78 89 -239 118 -121 14 -124 -155 98 -50 109 -72 88 -160 -202 -20 -372 40 123 -19
7095 -19 -208 -117 81 19 -12 -55 -8 -150 251 -213 -185 42 -332 -145 -301 -138 -78 98 62 -191 61 24 3 -85
7119 -85 84 -30 -63 28 -124 31 -143 155 93 -98 38 30 179 -220 -60 -190 -50 -74 195 -38 164 81 304
7142 304 142 29 3 27 -49 -108 -193 357 -35 -37 73 -402 -241 71 -156 116 -95 14 188 -117 -10 -154
7164 -154 68 59 43 -103 -50 313 -93 -44 221 -21 -17 -52 44 280 -124 -113 -27 -78 196 -77 139 20 -166 16
7188 16 -110 151 375 167 80 -59 -226 156 -228 76 47 5 127 -24 -21 -65 229 106 71 -103 -20 12 63 -139
7212 -139 -25 165 192 41 -40 73 167 185 -6 25 -55 342 -296 123 249 33 92 138 -51 -28 -77 38 344
7235 344 240 -233 52 -136 -96 -17 -83 -176 127 -118 107 203 121 -174 -232 109 42 -112 190 28 -107 -77 -94
$$ packed form
7074A19l17J20J67l28L57k39J35j38l1K53j48J59j81J60k48m2J82l52M12Q3j42
7095a9j89R1J98o2l1m3M7j42M01m64K8K27l74J87j56J63O0J76l6k53K52l7k1q8
7119h5J69j14l3R1j52J55j74K98o2j91J36qJ49l99J60j30J40k4K69k33K02q3K23
7142C04j62j13k6K4p6n9q5N50l92kJ10m75J61L12k27K72k11J09J74l05J07j44
7164a54K22rj6j46N3L63m06M9K65k42Ml5R6K36m04J1Q6n1K74k73K16j19j86J82
7188A6j26K61K24k08q7j39j67L82l84L04k9m2J22j51Lm4K94j23l5j74Q3L2N1k02
7212a39J14J90K7j51q1J13R4J8j91L1q0L97o38M19J26k16N9M6j89K3m9J15L06
7235C44j04m73K85j88M0P9o6r3L03k45K25R6q2k95n8L41o7j54L02j62j35L0j7
$$ plain form
7258 -94 -151 -55 -13 311 -72 79 232 -164 -62 -1 14 -134 26 -211 -90 -105 -253 -61 -49 -45 -271 150 98 -125
7282 -125 165 -100 -273 -35 -23 -14 -55 -103 201 183 -164 164 -264 82 -18 172 245 179 180 -176 -64 79 -80
7305 -80 168 196 -179 -172 137 -30 101 82 -28 68 -24 -339 -249 -309 130 104 40 82 -248 -7 118 154 -282 -34
7329 -34 -99 250 149 -60 -48 111 -28 274 76 -193 -416 -285 -122 -196 -34 -35 -55 69 107 90 -117 -93 122
7352 122 16 -195 100 146 -237 380 -19 -56 328 150 159 164 -72 -80 -50 -81 -153 -77 -126 -183 127 149 -123 -103 178
7377 178 -189 179 15 66 70 -152 132 -54 -170 -4 -114 2 -75 -108 -116 160 41 232 62 101 75 -208 -205 -108
7401 -108 45 72 117 87 -32 23 -135 -253 -28 -114 91 -95 -43 197 120 117 141 -104 -453 230 -86 -150 58 -66
7425 -66 207 -119 -69 4 141 -260 -269 102 -66 -56 12 231 -206 -83 65 -63 252 -1 -133 1 244 -244
$$ packed form
7258i4n7R6M2L24l83J51J53l96J02O1J5j48J60k37J21j5j48J92J2Mk26M21n2k23
7282a25K90k65j73K38J2Rm1m8L04j8l47L28m28L46j00J90P3o6Jl56J12J43j59
7305h0K48K8l75PL09j67J31j9j10R6r2l15R0o0M39k6o4M2l30K41J25L6m36K48
7329c4o5L49j01k09J2J59j39L02j98k69k23J31J63p4J62jk0J24L8j7k07K4K15
7352A22j06k11K95M6l83O17l99l7L84j78RNk36qL0l1p2P6m9n7L10K2k72K0K81
7377A78l67L68j64N1Mk22K84j86j16J66j10J16p7l3qK76j19J91j70L9k6k83LR7
7401a08J53K7M5l0j19N5j58j18K25q6K05j86N2K40p7lK4k45l49O83l16o4K08j24
7425f6K73l26N0P3J37m01rL71j68J0O8K19m37J23J48j28L15k53j32J34K43m88
$$ plain form
7447 -244 -240 244 -170 104 -103 142 -144 -97 264 11 -17 96 215 -150 -100 -165 -139 -6 179 259 203 137 -358
7470 -358 1 -200 15 -64 32 22 169 99 24 92 -111 60 -78 207 -349 -99 -40 -114 -37 66 -130 -324 -240
7493 -240 157 -92 -409 132 -168 -19 -231 -312 -161 133 187 -50 -180 -279 -118 247 -162 120 -43 -38 -352 -75
7515 -75 -77 -158 81 -232 -93 9 -8 101 -214 -243 65 12 -8 -117 -65 6 -43 482 152 -121 -3 -168 105 -92
7539 -92 -128 -117 -228 -34 -185 -425 -44 -105 7 -154 69 89 -325 -39 62 -190 -38 -207 77 38 -6 28 -39
7562 -39 -146 -79 143 -186 56 -86 196 37 69 22 -195 -3 122 252 33 -97 -10 -114 -93 122 -6 38
7584 38 26 -287 110 -161 -359 -4 -362 -22 -13 -189 -339 -46 -120 48 120 44 -13 66 206 86 26 -183 -9
7607 -9 -216 59 -144 -67 -161 -144 -186 -11 -159 373 191 -71 -6 -17 149 285 -109 65 -49 -113 6 138 -80
$$ packed form
7447b44MM84m14K74k07K45k86M7L61k53k8J13J19l65N0o5K6J33J85Q0n6o6m95
7470c58L59k01K15p9R6j0J47p0p5O8k03J71j38K85n56K50N9p4P7J03j96j94Q4
7493b40L97k49l17N41l00J49k12q1J51K94N4k37j30r9J61L65m09K82j63Nl14K77
7515g5kq1K39l13J39J02j7J09l15k9L08n3k0j09N2P1m9N25l30k73J18j65K73j97
7539i2l6J1j11J94j51k40L81o1J12j61K23K0m14K86J01k52J52j69K84l9m4L4o7
7562c9j07O7K22l29K42j42K82j59L2m7k17J92J25J30k19j30Q7j04K1K15j28M4
7584C8j2l13L97k71j98L55l58L40Rj76j50K93p4J68P2p6n7P9J40j20o0k09J74
7607ik07K75k03P7r4J7m2J75j48N32j82k62O5j1J66J36l94J74j14o4J19J32k18
$$ plain form
7630 -80 -54 -433 322 6 54 240 81 -60 7 -89 68 191 320 172 198 52 -43 140 -31 103 -97 -129 99
7653 99 -98 114 -20 -136 53 19 73 131 -206 75 -104 -2 271 54 -111 -186 -18 400 -43 -86 -10 1 89
7676 89 235 103 -21 134 112 319 -115 157 -117 90 322 96 -26 163 -339 137 -44 -43 257 -77 -22 -58
7698 -58 -256 -79 50 74 39 161 11 234 97 89 -154 197 -42 -110 -70 192 142 33 136 53 128 -191 -107 -58
7722 -58 -86 -90 14 126 -57 -192 -124 -115 -25 -250 14 -114 -85 16 -8 85 -36 -69 -16 16 -216 84 234 51 -58
7747 -58 -125 -117 206 -151 247 87 -37 157 69 -21 69 -114 71 25 -103 29 203 -149 291 129 -67 12 -192
7770 -192 149 -99 74 52 -4 46 -165 31 76 -178 202 36 135 4 -6 -10 -201 431 -28 68 -27 24 100 118
7794 118 67 193 155 181 174 25 -17 67 148 -297 -112 -91 250 278 95 -100 -4 -27 226 -220 -376 204 -132 72
$$ packed form
7630h0K6l79P55l16M8J86j59j41O7r6J57J23J29j48K6j46r5J83j71J34k00l2K28
7653I9j97K12j34j16J89l4N4N8l37K81j79J02K73k17j65p5J68M18m43m3P6J1Q8
7676H9J46j32j24J55k2K07m34K72k74K07K32k26j22J89n02M76j81JL00l34N5l6
7698e8j98J77J29K4l5J22j50K23j37qk43L51k39o8M0K62n0j09J03q3P5l19Q4M9
7722e8k8mJ04J12j83j35O8RR0k25K64j28K9J01k4R3j21l3N3L2k32L00J50j83j09
7747e8o7QL23l57L98j60j24J94q8r0R0j83J85m6j28J32J74l52M40j62j96P9k04
7770a92L41k48J73k2n6N0k11J96M5k54L80j66R9j31j0mj91O32m59R6r5N1P6J8
7794A18n1J26l8K6pj49m2Q4Q1m45J85K1L41K8j83j95R6k3K53m46j56N80l36K04
$$ plain form
7818 72 -244 -331 -89 133 131 51 -156 -61 104 18 -127 -197 -40 -58 29 46 76 -95 -20 -73 -117 -170 95 -127 502
7843 502 45 43 8 -158 137 -182 219 -14 57 1 -113 54 -69 -268 -6 36 -40 75 209 -77 171 -22
7865 -22 119 76 -9 51 -93 160 153 -49 270 140 179 -85 43 -35 -230 5 -309 -86 35 131 -30 273 -21
7888 -21 -126 45 185 116 28 -321 -52 -336 -25 28 -292 116 -129 11 125 -91 -69 -57 30 80 68 -30 27 -41
7912 -41 76 227 8 205 -51 -47 -35 -262 -104 -39 135 -104 94 -67 -110 49 98 -110 -88 -35 -253 182 54
7935 54 -144 -120 -16 29 123 -74 -69 137 160 -133 -2 72 238 112 200 -182 87 -69 -23 182 64 78 39 -20
7959 -20 -56 -53 36 51 -317 -8 -71 -69 61 -177 23 8 235 47 13 59 -41 -31 210 -27 -62 65 -160 101 -226
7984 -226 34 -171 -181 -79 -45 -191 42 -48 -20 -157 96 115 -67 -97 92 2 -81 142 160 -99 30 -71 178
$$ packed form
7818G2l16q7K42K22kq0k07R5J65q6j45p0J57j8Q7J7L0j71P5n3m4n3K65k22O29
7843E02m57kl5j66K95l19M01k33P1n6j14J67j23j99K62M2p6J15J34k86K48j93
7865b2J41m3q5O0j44K53pk02L19j30L9k64J28p8j95K35l14K23J21R6j61L03k94
7888b1j05J71J40o9q8l49K69k84L11N3l20M08k45J40J14k16K2J2Q7N0j2r8N7o8
7912d1J17J51k19J97k56MJ2k27J58O5J74k39J98j61m3J59M9k08K2N3k18M35j28
7935E4j98K4J04M5R4j97NK06K3k93J31P4J66j26Q8l82K69j56M6K05j18J4l9n9
7959b0l6LQ9J5l68L09o3KJ30k38K00j5K27j88l4M6j00J0K41k37l5J27k25K61l27
7984b26K60k05j0J02L4j46K33r0K8j37K53J9j82l0J89r0q3K23J8k59J29j01K49
$$ plain form
8007 178 -31 37 -149 26 -191 314 59 -185 203 -93 227 -78 -196 248 82 -19 122 102 112 115 288 -153
8029 -153 -60 -125 -33 -18 -144 -11 -53 59 89 108 214 -37 -18 -14 -106 -34 111 -129 -154 25 49 -212 -68 32 -154
8054 -154 -124 144 0 35 -244 -78 -38 -162 -19 52 -107 -99 16 -70 -103 38 66 105 -102 -129 -118 -156 -31 -98 -91
8079 -91 -8 -58 -63 -47 94 40 -313 52 -95 139 325 94 -75 252 -90 -55 -36 -49 -67 -96 -110 128 -130 124
8103 124 -203 64 -44 -231 256 -30 -92 -51 -33 -3 -145 -13 84 -26 -98 -127 -34 -16 -92 43 175 9 -81 -282
8127 -282 31 7 -152 23 -23 74 63 -75 -322 18 194 -3 31 -45 232 84 -147 134 22 138 48 34 -305
8150 -305 -229 77 -240 -131 226 -249 -232 -208 -117 -51 -77 209 -173 295 321 193 18 137 -60 215 45 113 113
8173 113 94 72 106 -73 -34 63 -85 44 48 185 -208 46 77 72 65 -59 -71 -26
$$ packed form
8007A78k09O8j86J75k17N05k55k44L88k96L20l05j18M44j66j01J41k0J0LJ73m41
8029a53R3o5R2J5j26J33m2J12L0J9J06k51J9Mr2P2J45k40k5J79K4k61J44J00j86
8054a54L0K68j44L5k79J66M0j24J43P1j59QJ15q6l3J41K8L9k07k7J1l8J25o7P
8079i1Q3n0nJ6J41n4l53L65j47K34J86k31j69L27l42L5J9j3j8k9j4K38k58K54
8103A24l27K67j08j87M87k86o2M1J8L0j42J32R7j10p2k9R3J8p6J35J32j66r0k01
8127b82L13k4j59J75m6R7j1j38k47L40J76j97L4p6K77j48k31K81j12J16r0j4l39
8150c05P6L06l17J09L57m75J7K4R1O6k6K86l82M68K6j28j75J19j97K75j70O8%
8173A13j9k2L4j79L9R7j48J29MJ37l93K54L1npj24j2M5
8191b6
$$ Imaginary data points
##PAGE= N=2
##DATA TABLE= (X++(I..I)), XYDATA
$$ plain form
0 0 0 0 0 0 0 0 0 -8 8 -8 8 -16 24 -24 32 -40 48 -57 72 -86 104 -124 145 -173 200 -237 276 -320 366 -420
30 -420 481 -550 623 -705 797 -900 1009 -1130 1263 -1410 1571 -1745 1934 -2142 2369 -2617
46 -2617 2889 -3184 3509 -3867 4261 -4693 5172 -5707 6306 -6984 7749 -8630 9655 -10861
60 -10861 12310 -14083 16318 -19227 23189 -28932 38036 -54728 95344 -408857 -228034 499629
72 499629 -158415 -66781 388578 -90282 -657019 -32758 203814 -247984 -9947 475745
82 475745 -133049 -520066 90599 224210 -306751 -28943 398001 -59765 -294282 204086
92 204086 90124 -372785 -8978 353096 -96516 -134098 382798 148996 -368852 -17943
102 -17943 270138 -140037 -89733 422666 177235 -275942 27586 218445 -150406 -41419
$$ packed form
0@%%%%%%%qJ6j6J6k4M0m8N6p2Q8j05J29j58J90k28K69l18L73m37N13n96O86p86
30d20R01j031J173j328J502j697J909k139K393k673K981l316L679m076M511m986
46b617N506o073O693p376Q128q954R865j0879J2013j3290J4733j6379J8285k0516
60a0861K3171k6393L0401l5545M2416n2121O6968r2764J50072n04201J80823P27663
72D99629o58044R1634M55359m78860n66737O24261K36572m51798K38037M85692
82D75745o08794l87017O10665J33611n30961K77808M26944m57766k34517M98368
92B04086j13962m62909L63807L62074m49612l7582N16896k33802n17848L50909
102a7943K88081m10175N0304N12399k45431m53177L03528J90859l68851J08987
$$ plain form
112 -41419 380919 110485 -230675 87687 178431 -192032 -50355 331905 84560 -165150
122 -165150 123025 145724 -178377 -41274 209484 -46516 -153703 172248 127419 -189280
132 -189280 -28700 170654 -104590 -184818 121598 73147 -186496 -28255 117181 -130532
142 -130532 -158234 110978 33609 -175171 -6090 92954 -148270 -154444 76885 -7234 -162221
153 -162221 11247 89833 -107875 -100775 52647 -58801 -154262 24053 61311 -99866 -38201
164 -38201 86868 -51673 -122632 51192 70747 -65412 -2706 79944 -49738 -79148 73520
175 73520 63276 -32995 52728 96045 -40828 -47716 78556 44592 -24514 65909 91457 -15531
187 -15531 2952 91161 34925 -8121 77411 72636 -19195 18844 81006 14406 -6221 72204
$$ packed form
112d1419M22338k70434l41160L18362R0744l70463J41677L82260k47345k49710
122a65150K88175K2699l24101J37103K50758k56000j07187L25951m4829l16699
132a89280J60580J99354k75244q0228L06416m8451k59643J58241J45436k47713
142a30532k7702K69212p7369k08780J69081R9044k41224o174K31329q4119j54987
153a62221J73468P8586j97708P100J53422j11448r5461J78315L7258j61177O1665
164c8201J25069j38541p0959J73824J9555j36159O2706Q2650j29682k9410J52668
175G3520j0244r6271Q5723M3317j36873o888J26272l3964o9106R0423K5548j06988
187a5531J8483Q8209n6236m3046Q5532m775r1831L8039O2162o6600k0627P8425
$$ plain form
199 72204 53183 -18125 23660 55650 -14601 -19576 45972 17276 -30681 19889 37921 -25237
211 -25237 -20102 25327 -10774 -38863 8405 7975 -46592 -29904 6413 -30745 -48267 -5190 -12093
224 -12093 -53587 -34704 -15753 -50475 -51086 -11473 -24000 -54018 -27295 -9690 -39872 -39846 -12189
237 -12189 -24477 -38895 -13092 -9751 -35679 -22603 3625 -14362 -25874 -1203 2140 -18566
249 -18566 -6319 11945 -3840 -6271 19834 17669 -399 17224 33489 14749 9216 30591 28400
262 28400 13942 27953 38470 21148 19423 38210 30394 14430 28719 37539 18813 16883 34490
275 34490 28606 14272 24215 31557 16920 14930 26280 16289 4200 16562 19334 453 -1387
288 -1387 11791 4018 -9892 -4142 -1346 -11605 -13023 -7504 -16224 -20935 -9800 -11878 -26424 -23115
$$ packed form
199G2204j9021p1308M1785L1990p0251m975O5548k8696m7957N0570J8032o3158
211b5237N135M5429l6101k8089M7268m30n4567J6688L6317l7158j7522M3077o903
224a2093m1494J8883J8951l4722o11L9613j2527l0018K6723J7605l0182K6K7657
237a2189j2288j4418K5803L341k5928J3076K6228j7987j1512K4671L343k0706
249a8566J2247J8264j5785k431K6105k165j8068J7623J6265j8740n533K1375k191
262B8400j4458J4011J0517j7322j725J8787p816j5964J4289Q820j8726j930J7607
275C4490n884j4334R943P342j4637j990J1350r991j2089J2362K772j8881j840
288a387J3178p773j3910N750K796j0259j418N519q720m711J1135k078j4546L309
$$ plain form
302 -23115 -12672 -19569 -26463 -20608 -21696 -27616 -21950 -19326 -30600 -29972 -17849 -21936 -31433 -23401
316 -23401 -17849 -25722 -22401 -12510 -18552 -22875 -7940 -4037 -17411 -13018 4313 -760 -9944 1101
330 1101 6401 -2256 3031 13563 4387 -60 16097 18200 3899 10066 25018 16569 9249 23211
344 23211 26297 14543 20164 30489 20949 16841 29752 27297 14331 21162 29555 16554 11451 23922
358 23922 20896 7294 13255 20244 8768 4846 14721 10304 91 6471 8563 -3417 -3436 7882
372 7882 1173 -11781 -5159 -1327 -14106 -16303 -6407 -11139 -21516 -17069 -13959 -22410 -21750 -12803 -18959
387 -18959 -26544 -18681 -14809 -24398 -23123 -13211 -15543 -21789 -16394 -12246 -16467 -16298 -13349 -16390 -15414
402 -15414 -8217 -9342 -13616 -5915 -877 -7780 -9552 -582 2173 436 5014 6797 4147 7164 12215
$$ packed form
302b3115J0443o897o894N855j088n920N666K624j1274O28J2123m087r497Q032
316b3401N552p873L321R891o042m323J4935L903j3374M393J7331n073r184J1045
330A101N300q657N287J0532r176m447J6157K103j4301O167J4952q449p320J3962
344B3211L086j1754N621J0325r540m108J2911k455j2966O831Q393j3001n103J2471
358B3922l026j3602N961O989j1476l922R875m417j0213O380K092j1980j9J1318
372G882o709j2954O622L832j2779k197R896m732j0377M447L110q451O60Q947o156
387a8959p585P863L872r589J275R912k332o246N395M148m221J69K949l041R76
402a5414P197j125m274P701N038o903j772Q970K755j737M578J783k650L017N051
$$ plain form
417 12215 8818 9585 19210 18807 9456 10656 17134 16427 14422 16882 19434 20740 19421 12999 11550 18986
433 18986 19828 14557 18748 23196 14735 9419 14157 11464 8648 17669 16116 521 1575 11572 -478
448 -478 -9078 7162 9950 -9206 -7876 3500 -10843 -18010 671 -1376 -19023 -6967 3013 -20961
462 -20961 -26268 -2378 -9312 -29580 -10782 2027 -24437 -28611 -6136 -17442 -33955 -9806 -659
475 -659 -24558 -19171 -333 -21255 -32184 276 6114 -20004 -8512 9499 -16250 -23877 9010
488 9010 8334 -13861 6274 18190 -15222 -16657 21097 14342 -10931 13460 28365 -4921 -6958
501 -6958 26860 19452 5 22306 28320 -1454 4778 33411 18487 2054 24463 23756 -5082
514 -5082 5872 31716 15143 4120 23065 12487 -14511 6235 29952 7729 -1152 22790
$$ packed form
417A2215l397P67R625m03r351J200O478p07k005K460K552J306j319o422j449P436
433A8986Q42n271M191M448q461n316M738k693k816R021j553j5595J054R997j2050
448d78q600J6240K788j9156J330J1376j4343p167J8681k047j7647J2056R980k3974
462b0961n307K3890o934k0268J8798J2809k6464m174K2475j1306j6513K4149R147
475f59k3899N387J8838k0922j0929L2460N838k6118J1492J8011k5749p627L2887
488I010o76k2195K0135J1916l3412j435L7754o755k5273K4391J4905l3286k037
501f958L3818p408j9447K2301O014k9774O232K8633j4924j6433K2409p07k8838
514e082J0954K5844j6573j1023J8945j0578k6998K0746K3717k2223q881K3942
$$ plain form
526 22790 9926 -21745 -4195 21613 2897 -6098 12996 176 -28263 -12377 9213 -7403
538 -7403 -14615 3629 -3657 -28222 -22033 -7616 -14272 -12359 -1969 -11738 -22717 -10644 -9258 -25014
552 -25014 -18483 -3186 -11251 -17017 -3993 -8316 -24020 -15063 -4887 -16079 -10716 11323 580
565 580 -24242 -13696 1813 -7253 -2345 19109 12784 -7058 -4729 -695 -3965 9927 24018 12092
579 12092 4231 11326 2506 -6110 14479 26608 9873 8697 19652 6080 -2005 21321 24817
592 24817 3798 12934 28639 6486 -4764 22117 23122 -3020 4568 22149 5545 -2243 15339
605 15339 7866 -9901 3253 10238 -8429 -3566 15132 -2220 -18532 788 4498 -16085 -6885
618 -6885 8636 -10954 -19288 1799 -5963 -27261 -7866 5908 -21795 -24801 4394 -5907 -31717
$$ packed form
526B2790j2864l1671J7550K5808j8716q995J9094j2820k8439J5886K1590j6616
538g403p212J8244p286k4565O189J4417o656J913J0390r769j0979J2073J386j5756
552b5014O531J5297q065n766J3024m323j5704Q957J0176j1192N363K2039j0743
565E80k4822J0546J5509r066M908K1454o325j9842K329M034l270J3892J4091j1926
579A2092p861P095q820q616K0589J2129j6735j176J0955j3572q085K3326L496
592B4817k1019R136J5705k2153j1250K6881J005k6142P588J7581j6604p788J7582
605A5339p473j7767J3154O985j8667M863J8698j7352j6312J9320L710k0583R200
618f885J5521j9590q334K1087p762k1298J9395J3774k7703l006K9195j0301k5810
$$ plain form
631 -31717 -12796 1750 -20932 -19547 5070 -6814 -23174 -3496 -1053 -24763 -11734 14215
643 14215 -4107 -19208 3070 2718 -20488 -7260 14992 175 -7588 10651 2247 -16466 4868
656 4868 21743 513 -932 22384 11477 -10122 7621 23958 6759 4908 22267 12746 -1909
669 -1909 13640 18930 1012 6609 23802 9987 -3010 14292 17890 -528 3522 18038 7412
682 7412 -442 12069 9704 -5427 2902 12777 -346 -3764 10085 2753 -13920 -5391 4801 -6667
696 -6667 -8953 2418 -4465 -16332 -7407 -2093 -12794 -9855 -147 -10392 -19290 -6657 -2293 -14297
710 -14297 -11972 -2625 -10080 -16826 -7881 -6531 -14111 -8499 -3376 -12144 -12519 -1027 -2791 -11025 -5122
725 -5122 789 -5945 -6292 2161 1443 -2165 3322 3821 -2071 2473 8922 3323 -259 6970 7330 1848
$$ packed form
631c1717J8921J4546k2682J385K4617j1884j6360J9678K443k3710J3029K5949
643A4215j8322j5101K2278l52k3206J3228K2252j4817p763J8239q404j8713K1334
656D868J6875k1230j445K3316j0907k1599J7743J6337j7199j851J7359r521j4655
669a909J5549N290j7918N597J7193j3815j2997J7302L598j8418M050J4516j0626
682G412p854J2511k365j5131Q329R875j3123l418J3849p332j6673Q529J0192j1468
696f667k286J1371o883j1867Q925N314j0701K939R708j0245q898J2633M364j2004
710a4297K325R347p455o746Q945J350p580N612N123q768l75J1492j764q234N903
725e122N911o734l47Q453p18l608N487M99n892M544O449n599l582P229L60n482
$$ plain form
741 1848 6234 11279 7329 6336 10983 8280 5267 11582 13046 6034 7264 13530 10402 6861 11181
756 11181 11069 5259 6717 9095 4010 2901 8165 5779 -311 3075 5742 830 89 2798 -620
771 -620 -3348 473 174 -5145 -3023 895 -3596 -7919 -4555 -4625 -9020 -7660 -6126 -10189 -10915 -6010
787 -6010 -7105 -11323 -8466 -5910 -9750 -10705 -6861 -7176 -9421 -6667 -5275 -7339 -6296 -3029 -4328 -6869
803 -6869 -4969 -3431 -4735 -3804 -1539 -2462 -2174 1124 1321 291 1517 3240 2606 2777 4542 5006 5185
820 5185 6691 7098 6674 7167 7809 7217 6347 6691 7390 7116 6882 7820 7598 7681 7707 7508 7382 5765 5954 6920
840 6920 5918 4892 5183 5759 4093 3387 3850 2379 69 254 -35 -1896 -1779 -1244 -2410 -3607 -2694
857 -2694 -3069 -5073 -4813 -4571 -6399 -6530 -4534 -5520 -7583 -5454 -5062 -8008 -7692 -5398 -7405 -10065 -7572
$$ packed form
741A848M386N045l950r93M647k703l013O315J464p012J230O266l128l541M320
756A1181j12n810J458K378n085j109N264k386o090L386K667m912p41K709l418
771f20k728L821k99n319K122L918m491m323L364p0m395J360J534m063p26M905
787f010j095m218K857K556l840r55L844l15k245K754J392k064J043L267j299k541
803f869J900J538j304R31K265r23K88L298J97j030J226J723o34J71J765M64J79
820E185J506M07m24M93O42n92q70L44O99k74k34R38k22Q3K6j99j26j617J89R66
840F920j002j026K91N76j666p06M63j471k310J85k89j861J17N35j166j197R13
857b694l75k004K60K42j828j31J996r86k063K129L92k946L16K294k007k660K493
$$ plain form
874 -7572 -6277 -8664 -7366 -5064 -6453 -7121 -3681 -4133 -6694 -3986 -1510 -3762 -3537 -68 -325 -1453
890 -1453 757 1822 -747 1128 3055 917 197 4912 5183 1313 3941 7347 5093 3955 7593 7388
906 7388 4604 6490 8504 6049 6899 9620 7762 4743 6666 8122 5247 4177 5656 5410 3797 4441
922 4441 3887 2516 3476 3705 1402 423 2519 2067 -1325 -774 1232 -261 -2771 -1967 -1841 -3859 -4368
939 -4368 -3423 -4622 -5937 -4990 -5226 -7406 -6740 -4324 -5424 -7436 -5727 -5029 -7248 -7267 -4803 -4666 -5897
956 -5897 -4999 -5209 -6533 -5110 -2910 -4110 -4577 -1991 -3354 -5965 -3759 -252 -343 -1327 540 95 -237
973 -237 2022 2066 1610 3709 5261 2394 2168 4760 5052 3746 5298 5351 4703 5548 6157 3282 4504 8042
991 8042 5969 3424 6485 8054 4953 4516 6130 4377 4805 7065 4306 1132 4660 4370 -1372 798
$$ packed form
874g572J295k387J298K302j389o68L440m52k561K708K476k252K25L469k57j128
890a453K210J065k569J875J927k138p20M715K71l870K628L406k254j138L638k05
906G388k784J886K014k455Q50K721j858l019J923J456k875j070J479k46j613O44
922D441n54j371R60K29k303r79K096m52l392N51K006j493k510Q04J26k018n09
939d368R45j199j315R47k36k180O66K416j100k012J709O98k219j9K464J37j231
956e897Q98k10j324J423K200j200m67K586j363k611K206L507r1r84J867m45l32
973b37K259M4m56K099J552k867k26K592K92j306J552N3o48Q45O09k875J222L538
991H042k073k545L061J569l101m37J614j753M28K260k759l174L528k90n742K170
$$ plain form
1007 798 6443 2086 -2660 973 -283 -4892 -300 3544 -3533 -5465 1550 -1928 -9328 -2389 2929
1022 2929 -5932 -8566 -1499 -4945 -10179 -2872 -411 -8755 -7872 -2485 -8186 -10558 -967 -971 -10090 -6253
1038 -6253 -1137 -7947 -8023 3018 1605 -7722 -2734 1280 -7355 -6074 5567 2544 -5836 1110 5324
1053 5324 -4232 -4186 6474 4126 -1864 4266 7164 -392 592 7564 4565 1884 9106 10514 2062
1068 2062 2325 6656 2688 2038 9544 10115 3803 4236 5680 -421 -470 8349 8972 2093 3406 5385 -1565
1085 -1565 -3874 4898 7521 1258 1888 3386 -3601 -6732 447 2397 -2498 -534 1670 -4907 -8732
1100 -8732 -2964 -1854 -6127 -3738 -462 -5605 -7380 -3289 -4578 -7764 -3217 -289 -5813 -6963 -1896
1115 -1896 -4895 -9364 -3492 -296 -5529 -5001 -729 -4544 -7236 -1426 765 -4941 -2757 3071 -1226
$$ packed form
1007G98N645m357m746L633j256m609M592L844p077j932P015l478p400O939N318
1022B929q861k634P067l446n234P307K461q344Q83N387n701k372R591mr119L837
1038f253N116o810p6J1041j413r327M988M014q635J281J1641l023q380O946M214
1053E324r556M6J0660k348n990O130K898p556R84O972k999k681P222J408q452
1068B062K63M331l968o50P506N71o312M33J444o101m9Q819O23o879J313J979o950
1085a565k309Q772K623o263O30J498o987l131P179J950m895J964K204o577l825
1100h732N768J110m273K389L276n143j775M091j289l186M547K928n524j150N067
1115a896k999m469N872L196n233N28M272l815k692N810K191n706K184N828m297
$$ plain form
1130 -1226 -4002 2116 3584 -1382 896 4216 222 -160 5616 4516 -335 3487 6239 625 1299
1145 1299 7746 5605 1520 4724 5840 1073 3552 9017 5919 2634 7008 5551 -138 3052 7984
1160 7984 3696 1301 5624 3687 -2220 1131 4437 591 106 3734 91 -4426 -206 1968 -2952
1175 -2952 -2625 2299 -1124 -5996 -1834 -567 -4748 -3741 -812 -4718 -6564 -1914 -2826 -8204 -5445
1190 -5445 -1304 -5601 -7184 -2007 -2727 -7176 -4807 -2162 -5450 -4169 707 -2094 -6570 -2227 -236
1205 -236 -4606 -3437 2294 33 -3911 -668 495 -2361 -11 4395 1103 -745 3079 3251 -514
1220 -514 2578 7351 3954 853 4658 5244 2072 4306 6972 3366 2430 5902 4729 1467 4221 6775
1236 6775 2212 1474 5295 4177 1358 3558 4728 1458 1043 3809 1936 -667 2489 2752 -1181 -1442
$$ packed form
1130a226k776O118J468m966K278L320l994l82N776j100m851L822K752n614O74
1145A299O447k141m085L204J116m767K479N465l098l285M374j457n689L190M932
1160G984m288k395M323j937n907L351L306l846m85L628l643m517M220K174m920
1175b952L27M924l423m872M162J267m181J007K929l906j846M650r12n378K759
1190e445M141m297j583N177p20m449K369K645l288J281M876k801m476M343J991
1205b36m370J169N731k261l944L243J163k856K350M406l292j848L824J72l765
1220e14L092M773l397l101L805N86l172K234K666l606r36L472j173l262K754K554
1236F775m563p38L821j118k819K200J170l270m15K766j873k603L156K63l933k61
$$ plain form
1252 -1442 1345 -1096 -3037 -244 -354 -3802 -3068 -748 -3091 -4533 -1699 -2098 -5121 -3669 -1873 -4254
1268 -4254 -5213 -2434 -2867 -5418 -3990 -2686 -4684 -5023 -2771 -3259 -4840 -3071 -2026 -3929 -3809 -1448
1284 -1448 -1472 -2914 -1043 110 -1365 -753 967 12 -436 1253 1630 88 1038 2673 1854 913 2370
1301 2370 2945 2326 2766 3844 2990 2917 4324 3998 3564 4009 4473 3814 3590 4250 3789 3235 3436 3450 2790 2694
1321 2694 2819 2210 1811 1718 1962 1261 691 923 839 171 -101 178 -368 -1086 -784 -923 -2104 -2012 -1908 -2507
1341 -2507 -3571 -2488 -2608 -3519 -4148 -3148 -3292 -4163 -3471 -3393 -4106 -3751 -2886 -3311 -3735 -2424 -2440 -3722 -2805
1360 -2805 -1909 -2670 -2854 -1372 -1504 -2267 -1253 -109 -1759 -1480 451 233 -902 562 2003 880 774
1377 774 2759 2352 1616 2966 3467 2088 2662 3464 3029 2665 3561 3615 2719 3436 3694 2856 3371 4124 2747
$$ packed form
1252a442K787k441j941K793j10l448P34K320k343j442K834l99l023J452J796k381
1268d254r59K779m33k551J428J304j998l39K252m88j581J769J045j903J20K361
1284a448k4j442J871J153j475O12J720r55m48J689L77j542R50J635q19r41J457
1301B370N75o19M40J078q54p3J407l26m34M45M64o59k24O60m61n54K01J4o60r6
1321B694J25o09l99r3K44p01n70K32q4o68k72K79n46p18L02j39j181R2J04n99
1341b507j064J083j20r11o29J000j44q71O92P8p13L55Q65m25m24J311j6j282R17
1360b805Q96p61j84J482j32p63J014J144j650K79J931k18j135J464J441j123j06
1377G74J985m07p36J350N01j379N74Q02m35l64Q96N4q96P17K58q38N15P53j377
$$ plain form
1396 2747 2101 3453 3802 2447 2577 3520 2626 1468 1924 1777 846 919 923 58 -354 -252 -353 -762 -1199 -1610
1416 -1610 -1410 -1580 -2075 -2129 -1744 -2114 -2662 -2201 -2428 -3176 -2967 -2476 -3116 -3981 -3358 -3223 -3995 -3176 -2924 -3176
1436 -3176 -2976 -2430 -3467 -3694 -1840 -1403 -3065 -1723 53 -1263 -1819 455 -28 -1582 213 1677
1452 1677 -538 -698 1607 1005 -739 2096 3599 1197 892 2780 1642 586 3783 4760 2384 3329
1468 3329 5054 2444 1010 4358 4471 1709 2996 4310 1662 526 3652 3069 907 2890 3690 116
1484 116 -1008 1936 1651 -259 1362 2485 -776 -749 835 -451 -2437 -66 376 -2809 -2908 -176 -2273
1501 -2273 -4702 -1741 -501 -3756 -3583 -892 -3333 -5724 -2703 -1243 -3532 -2954 3 -2426 -5316
1516 -5316 -2486 -917 -3799 -2854 226 -2291 -4644 -1422 -210 -2866 -1239 1405 -1204 -2981 730
$$ packed form
1396B747o46J352L49j355J30R43q94j158M56j47r31P3Mq65m12J02j01m09m37m11
1416a610K00j70m95n4L85l70n48M61k27p48K09M91o40q65O23J35p72Q19K52k52
1436c176K00N46j037k27J854M37j662J342J776j316n56K274m83j554J795J464
1452A677k215j60K305o02j744K835J503k402l05J888j138j056L197R77k376R45
1468C329J725k610j434L348J13k762J287J314k648j136L126n83k162J983Q00l574
1484A16j124K944k85j910J621J123l261K7J584j286j986K371M42l185r9K732k097
1501b273k429K961J240l255J73K691k441k391L021J460k289N78K957k429k890
1516e316K830J569k882R45L080k517k353L222J212k656J627K644k609j777L711
$$ plain form
1531 730 1433 -1452 877 3745 286 -1301 3696 3652 -184 2189 4630 -105 -1021 4719 4527 436
1547 436 3501 5628 64 -1042 4978 4577 844 4171 5929 383 -37 4770 3006 335 4257 4542
1563 4542 -690 -696 3322 270 -2241 2655 3538 -1769 -803 2249 -2567 -4323 1225 1538 -2952 -1018
1579 -1018 1826 -3637 -5863 -191 418 -3695 -1423 627 -4850 -6571 -1820 -1529 -4472 -1268 572
1594 572 -4795 -5790 -1133 -1559 -4412 -1119 1096 -3162 -3504 498 -909 -3257 394 1722 -2032 -1362
1610 -1362 2461 196 -2847 717 2732 -801 -237 3810 1888 -825 2067 3557 444 1931 5388
1625 5388 3092 27 2882 4245 780 1866 5258 2891 122 2796 3629 870 1906 4487 1684
1640 1684 -590 2743 3106 -92 1530 3719 302 -1993 1365 2173 -663 520 1960 -1695 -3390
$$ packed form
1531G30P03k885K329K868l459j587M997m4l836K373K441m735r16N740j92m091
1547D36L065K127n564j106O020m01l733L327J758n546m20M807j764k671L922K85
1563D542n232oM018l052k511M896Q83n307R66L052m816j756N548L13m490J934
1579a018K844n463k226N672O09m113K272K050n477j721M751K91k943L204J840
1594E72n367r95M657m26k853L293K215m258l42M002j407k348L651J328l754O70
1610a362L823k265l043L564K015l533N64M047j922k713K892J490l113J487L457
1625E388k296l065K855J363l465J086L392k367k769K674Q33k759J036K581k803
1640A684k274L333L63l198J622K189l417k295L358Q08k836J183J440l655j695
$$ plain form
1655 -3390 -52 -464 -2810 -679 566 -3100 -4744 -1272 -1181 -3524 -1399 213 -3302 -4527 -1704 -2155
1671 -2155 -4055 -1061 -138 -3359 -4175 -1122 -1961 -4217 -1222 -18 -2838 -3012 -586 -1476 -2384 -192
1687 -192 759 -1553 -740 1769 -126 -1123 1339 2196 -70 507 2969 1249 320 2079 2281 220 1780
1704 1780 3330 1675 1211 2974 3221 990 2075 3890 2463 1835 3010 2426 1047 2308 3306 1991
1720 1991 1582 2630 1633 -56 684 1640 164 -132 882 -107 -680 -193 643 -619 -841 -22 -751 -1720
1738 -1720 -1058 -827 -2138 -1930 -1120 -1823 -2610 -2251 -1821 -3137 -2719 -2005 -2325 -2805 -2050 -2046 -2751 -2217 -1307 -1882
1758 -1882 -2206 -1090 -1294 -1753 -1551 -720 -834 -836 -351 -455 -626 -479 27 107 67 552 772 653 1201 1576 1328
1779 1328 1681 1860 2186 1767 2292 2371 2144 2215 2310 2273 2325 2092 2151 1783 2446 1582 1338 2361 1975 1773 1801 1956
$$ packed form
1655c390L338m12k346K131J245l666j644L472R1k343K125J612l515j225K823m51
1671b155j900K994R23l221q16L053q39k256K995J204k820j74K426q90r08K192
1687a92R51k312Q13K509j895r97K462Q57k266N77K462j720r29J759K02k061J560
1704A780J550j655m64J763K47k231J085J815j427o28J175n84j379J261R98j315
1720A991m09J048r97j689P40R56j476k96J014r89n73M87Q36j262k22Q19p29r69
1738a720O62K31j311K08Q10p03p87L59M30j316M18P14l20m80P55Mp05N34R10n75
1758a882l24J116k04m59K02Q31j14kM85j04j71J47N06Q0m0M85K20j19N48L75k48
1779A328L53J79L26m19N25P9k27P1R5l7N2k33N9l68O63q64k44J023l86k02K8J55
$$ plain form
1801 1956 1268 1154 1299 1228 899 834 660 127 83 170 -168 -472 -360 -687 -1320 -920 -1105 -1981 -1998 -1262 -1498
1822 -1498 -1933 -1406 -1494 -2107 -2330 -1733 -2304 -2071 -1919 -1953 -2332 -1819 -1672 -2269 -2125 -1535 -1841 -2385 -1472 -1257
1842 -1257 -1779 -1020 -70 -607 -882 309 44 -501 285 842 271 325 1227 954 492 1070 1597 774 1232 1743
1862 1743 1248 1113 2148 2163 1692 2265 2062 1768 2341 2725 1812 1464 2479 1976 1180 1485 2271 973 1057
1881 1057 1416 1043 262 637 1153 165 48 575 59 -332 92 -237 -825 -361 -286 -1372 -1230 -350 -1297 -1815
1901 -1815 -1325 -1205 -2440 -2167 -916 -1760 -2536 -1364 -1475 -2564 -1746 -1010 -1895 -2019 -1021 -1440 -2078 -1441
1919 -1441 -483 -1546 -1457 -707 -787 -1450 -1017 -197 -340 -790 335 192 -453 710 1264 381 379 1750 1678 727
1939 727 2077 2223 857 1047 2323 1974 971 1977 2148 922 955 2485 2003 705 2005 2501 677
$$ packed form
1801A956o88j14J45p1l29o5j74n33m4Q7l38l04J12l27o33M00j85q76j7P36k36
1822a498m35N27q8o13k23N97n71K33J52l4l79N13J47n97J44N90l06n44R13K15
1842a257n22P59R50n37k75J191k65n45P86N57n71N4R02k73m62N78N27q23M58N11
1862A743m95j35J035J5m71N73k03k94N73L84r13l48J015n03p96L05P86j298Q4
1881A057L59l73p81L75N16r88j17N27n16l91M24l29n88M64P5j086J42Q80r47n18
1901a815M90J20j235K73J251q44p76J172j11j089Q18P36q85j24R98m19o38O37
1919a441R58j063Q9P50q0o63M33Q20j43m50J125j43o45J163N54q83kJ371p2r51
1939G27J350J46j366J90J276l49j003J006J71j226L3J530m82j298J300M96j824
$$ plain form
1956 677 964 2475 1629 815 2040 1865 59 811 1911 331 -706 1005 884 -1066 -267 1173 -1213
1973 -1213 -1956 11 -392 -2042 -519 624 -1916 -2447 -360 -1534 -2785 -617 345 -2516 -3002 -1252
1989 -1252 -2293 -2838 -611 -177 -2575 -2230 -894 -2263 -2779 117 156 -2137 -1323 343 -1388 -1797 858
2006 858 712 -797 149 1070 -684 -614 1374 381 -748 1246 1878 -47 224 1898 780 67 1829
2023 1829 2512 1160 1582 2504 979 549 2408 2457 1084 2101 2342 773 453 1950 1640 724 738 1133
2041 1133 3 411 1501 827 -268 59 731 123 209 918 -75 -1274 -434 -709 -1057 -337 294 -1454
2059 -1454 -1784 -1099 -1435 -2201 -1276 -552 -1640 -2264 -1531 -1888 -2039 -1058 -256 -1182 -1461 -480 -1366 -2142 -1297
2078 -1297 -934 -1331 -613 451 -542 -1532 -1128 -1220 -1266 96 1535 338 -150 122 -520 -963 1045 2560
$$ packed form
1956F77K87J511q46q14J225j75j806P52J100j580j037J711j21j950P99J440k386
1973a213p43J967m03j650J523J143k540n31K087j174j251K168R62k861m86J750
1989a252j041n45K227M34k398L45J336j369n16K896L9k293Q14J666j731m09K655
2006H58j46j509R46R21j754P0J988r93j129J994O32j925K71J674j118p13J762
2023A829O83j352M22R22j525m30J859M9j373J017K41j569l20J497l10r16J4L95
2041A133j130M08J090o74j095L27O72o08Q6P09r93j199Q40k75l48P20O31j748
2059a454l30O85l36p66R25P24j088o24P33l57j51R81Q02r26k79R81q86p76Q45
2078a297L63l97P18J064r93r90M04r2m6J362J439j197m88K72o42m43K008J515
$$ plain form
2096 2560 1468 710 760 286 -565 1391 3086 1558 1196 1833 518 -408 1475 2490 1399 1307 2506
2113 2506 1531 -60 1710 2168 519 1121 2277 1141 -129 1058 1002 -388 3 1428 -15 -479 813
2130 813 -8 -1642 -684 693 -856 -842 465 -217 -2086 -1025 -175 -1524 -1350 -110 -655 -2266 -1164
2147 -1164 -200 -2344 -2424 0 -1180 -2256 -964 -503 -2257 -1934 -155 -730 -1638 18 -91 -1565 -980
2164 -980 441 -549 -1153 695 878 -600 -511 728 -235 -998 1036 1273 142 610 1474 458 49 1529
2182 1529 1886 827 1458 2187 1076 109 1249 1843 822 1329 2208 1135 316 1241 1197 165 1262 2018
2200 2018 902 308 1039 822 -121 302 1161 351 -72 350 -32 -1139 -463 480 -569 -900 -27 -633 -1793
2219 -1793 -885 -475 -1295 -1416 -682 -724 -1605 -862 -775 -1693 -1829 -666 -956 -1556 -1093 -769 -1563 -1611 -582 -749
$$ packed form
2096B560j092p58N0m74q51J956J695j528l62O37j315r26J883J015j091r2J199
2113B506r75j591J770M58j649O02J156j136j270J187n6j390L91J425j443m64J292
2130H13q21j634R58J377j549J4J307o82j869J061Q50j349J74J240n45j611J102
2147a164R64k144q0K424j180j076J292M61j754L23J779n75r08J656j09j474N85
2164i80J421r90o04J848J83j478Q9J239r63p63K034K37j131M68Q64j016m09J480
2182A529L57j059O31P29j111r67J140N94j021N07Q79j073q19R25m4j032J097P56
2200B018j116n94P31k17r43M23Q59q10m23M22l82j107O76R43j049l31Q73o06j160
2219a793R08M10q20j21P34m2q81P43Q7r18j36J163k90o00M63L24p94m8J029j67
$$ plain form
2239 -749 -1317 -929 -509 -1459 -758 -234 -611 -540 -29 98 -105 -163 619 398 4 658 983 611 943 845 465
2260 465 687 1229 1044 697 620 990 1012 778 1421 1436 1249 1340 1560 1282 1175 1281 1143 735 870 968 1046 796
2282 796 599 606 182 237 344 200 73 274 -175 -351 -242 -67 -327 -461 -485 -677 -739 -733 -669 -646 -737 -825 -792 -1411
2306 -1411 -1145 -1168 -1412 -1198 -1123 -1427 -1356 -1215 -1036 -1156 -765 -414 -705 -1002 -564 -531 -665 -443 -768 -464 -423
2327 -423 66 -390 -389 -136 167 -92 29 109 113 181 773 674 749 943 1108 827 575 1098 1110 744 902 1138 1129 1178
2351 1178 1052 730 637 1049 946 555 1023 1207 848 867 989 483 504 388 365 -73 180 143 -135 -220 -3 -406
2373 -406 -368 -339 -489 -794 -671 -674 -864 -1004 -766 -559 -1056 -1139 -558 -934 -925 -847 -753 -1106 -968 -826 -914 -885 -803 -925
2397 -925 -803 -853 -961 -757 -501 -790 -698 -194 -391 -73 -96 -212 36 82 450 381 341 309 221 121 631 589 464
$$ packed form
2239g49n68L88M20r50P01N24l77P1N11J27k03n8P82k21l94O54L25l72L32r8l80
2260D65K22N42j85l47p7L70K2k34O43J5j87R1K20k78j07J06j38m08J35R8P8k50
2282G96j97Pm24N5J07j44j27K01m49j76J09J75k60j34k4j92o2OO4K3r1q8L3o19
2306a411K66k3k44K14P5l04P1J41J79j20L91L51k91k97M38L3j34K22l25L04M1
2327d23M89m56JK53L03k59J21Q0MO8N92r9P5J94J65k81k52N23J2l66J58K36rM9
2351A178j26l22r3M12j03l91M68J84l59J9J22n06K1j16k3m38K53l7k78q5K17m03
2373d06L8K9j50l05J23lj90j40K38K07m97q3N81l76RP8R4l53J38J42q8K9Q2j22
2397i25J22n0j08K04K56k89R2N04j97L18k3j16K48M6L68o9m0l2q8j00N10m2j25
$$ plain form
2420 464 768 800 672 889 1034 990 706 978 1557 603 719 1409 1238 696 1161 1225 667 682 1173 351 46
2441 46 721 791 60 128 814 31 -424 388 316 -221 -105 283 -789 -803 245 -507 -864 -109 -73 -1374 -1379 -522
2463 -522 -729 -1465 -509 -275 -1533 -1370 -393 -989 -1613 -602 -193 -1329 -909 -103 -1223 -1476 -156 57
2481 57 -941 -323 300 -850 -1654 -95 345 -1008 43 861 -284 -623 565 644 -499 866 1572 -5
2499 -5 136 1108 785 -306 1110 1643 141 236 1681 753 -460 999 1722 436 541 1683 682 -443
2517 -443 1015 1448 -189 232 1824 517 -585 1004 1020 -864 -401 1221 53 -1045 308 246 -1318
2534 -1318 -582 543 -542 -1233 558 71 -1665 -715 -141 -1242 -1371 330 -126 -1649 -1018 -88 -1530
2551 -1530 -1725 652 -373 -1644 -398 189 -1616 -1748 516 -279 -929 408 302 -1001 -1136 501 -89
$$ packed form
2420D64L04L2j28K17J45m4k84K72N79r54J16O90j71n42M65O4n58J5M91q22l05
2441D6O75P0p31O8O86p83m55Q12p2n37J16L88j072j4J048p52l57P55L6j301nQ57
2463e22k07p36R56K34j258J63R77n96o24J011M09j136M20Q06j120k53J320K13
2481E7r98O18O23j150q04J559M40j353J051Q18j145l39J188P9j143J365P06j577
2499eJ41R72l23j091J416N33j502R5J445r28j213J459P23j286J05J142j001j125
2517d43J458M33j637M21J592j307j102J589J6j884M63J622j168j098J353o2j564
2534a318P36J125j085o91J791m87j736R50N74j101j29J701m56j523O31R30j442
2551a530j95K377j025j271J246N87j805j32K264p95o50J337j06j303j35J637n90
$$ plain form
2568 -89 -663 1112 987 -839 -364 755 -244 -472 1276 1138 -311 211 827 -27 -166 1485 1394 52
2586 52 1031 1219 153 -183 1254 1064 -16 1206 1738 195 -218 937 532 -125 1172 1302 -27 -159
2604 -159 579 -85 -238 749 1107 -99 -241 590 -255 -785 334 354 -601 25 -106 -1102 -1224 151 -376
2623 -376 -987 -415 57 -873 -1108 -375 -656 -738 -549 -87 -911 -511 -175 -770 -1323 -418 -190 -480 -738 -22
2643 -22 -619 -1185 -371 65 -365 -54 585 -119 -286 -89 377 154 533 647 456 -334 563 316 0 575
2663 575 848 471 288 785 654 66 368 759 519 665 1118 734 -12 572 600 210 539 855 435 87
2683 87 83 254 9 216 828 145 -96 134 -100 -568 -246 588 -47 -283 -151 -127 -869 -367 116 -405 -399 -192
2705 -192 -223 -974 -549 -164 -697 -631 -265 -218 -589 -671 -515 -1097 -952 -100 -141 -601 -273 -33 -867 -472 209 -312
$$ packed form
2568h9n74J775j25j826M75J119r99k28J748j38j449N22O16q54j39J651r1j342
2586E2R79J88j066l36J437j90j080J222N32j543m13J155m05o57J297J30j329j32
2604a59P38o64j53R87L58j206j42Q31q45n30J119K0r55O26j31r96j22J375n27
2623c76o11N72M72r30k35P33k81q2J89M62q24M00L36n95n53R05K28k90k58P16
2643b2n97n66Q14M36m30L11O39p04j67J97M66k23L79J14j91p90Q97k47l16N75
2663E75K73l77j83M97j31n88L02L91k40J46M53l84p46N84K8l90L29L16m20l48
2683H7mJ71k45K07O12o83k41K30k34m68L22Q34o35k36J32K4p42N02M83n21OK07
2705a92l1p51M25L85n33O6L66M7l71q2J56n82J45Q52m1m60L28K40q34L95O81n21
$$ plain form
2727 -312 -229 76 182 -306 -267 330 74 -222 391 291 -95 250 389 402 310 394 615 568 440 563 667 247
2749 247 426 863 639 553 860 331 429 475 655 284 699 698 472 84 370 509 277 237 367 95 -46 404
2771 404 142 -234 -20 173 -200 -394 -97 -169 -553 -364 -153 -225 -621 -442 -464 -366 -292 -244 -431 -531 -425 -432 -933
2794 -933 -654 -349 -536 -534 -282 -526 -578 -243 -300 -393 -496 -165 -281 -478 -372 -20 62 31 229 118 222 -71
2816 -71 190 311 220 262 89 80 369 240 80 319 296 572 711 299 484 585 639 602 538 478 369 700 598
2839 598 290 480 500 425 486 421 154 371 180 408 164 32 299 5 -120 275 78 -46 -257 -144 21
2860 21 -288 -195 -155 -235 -414 -489 -443 -582 -626 -395 -573 -302 -536 -134 -254 -249 -827 -589 -300 -674 -237 -167 -112 -398
2884 -398 -176 -342 -214 -250 -192 -384 -282 -49 365 -137 -29 68 389 67 178 309 207 328 330 95 596 587
$$ packed form
2727c12Q3L05J06m88L9N97k56k96O13j00l86L45J39J3r2Q4K21m7j28J23J04m20
2749B47J79M37k24q6L07n29R8M6J80l71M15jk26l88K86J39k32m0J30k72j41M50
2771D04k62l76K14J93l73j94K97p2l84J89K11p2l96J79k2R8P4M8j87j00J06pn01
2794i33K79L05j87KK52k44n2L35n7r3j03L31j16j97J06L52Q2l1J98j11J04k93
2816g1K61J21r1M2j73rK89j29j60K39k3K76J39m12J85J01N4l7o4o0j09L31j02
2839E98l08J90K0p5O1o5k67K17j91K28k44j32K67k94j25L95j97j24k11J13J65
2860B1l09R3M0q0j79p5M6j39m4K31j78K71k34M02j20Nn78K38K89l74M37P0N5k86
2884c98K22j66J28l6N8j92J02K33M14n02J08R7L21l22J11J31j02J21Kk35N01r
$$ plain form
2906 587 352 640 560 521 483 333 374 210 280 319 481 554 91 385 425 493 558 331 200 413 423 443 365 47
2930 47 -121 273 17 129 -87 -276 33 -290 -39 -282 -312 -151 -206 -356 -229 -176 -206 -344 -189 -299 -502 -356
2952 -356 -364 -260 -521 -386 -423 -667 -598 -323 -703 -442 -15 -62 -181 -378 56 -401 -27 -11 -140 -148 -211 235 -178
2975 -178 -135 79 130 -67 93 90 -81 156 194 305 92 486 552 218 582 538 424 437 388 406 425 504 369 572
2999 572 395 312 309 142 346 -135 293 210 398 -79 264 270 -48 346 20 93 53 358 119 163 -377 -77 -383
3022 -383 -360 -225 -589 -265 -461 -391 -69 -445 -221 -541 -663 -189 -439 -381 -254 -296 -441 -331 -325 -226 -277 -159 -250
3045 -250 -440 -348 -360 -411 -547 236 -130 27 -121 310 -91 206 318 426 485 184 219 65 270 78 570 36
3067 36 401 207 147 -78 488 441 334 587 597 256 124 383 636 629 188 414 327 357 152 171 304 211 293 124
$$ packed form
2906E87k35K88q0l9l8j50M1j64P0L9J62P3m63K94M0O8O5k27j31K13J0K0p8l18
2930D7j68L94k56J12k16j89L09l23K51k43l0J61n5j50J27N3l0j38J55j10k03J46
2952c56qJ04k61J35l7k44O9K75l80K61M27m7j19j97M34m57L74J6j29qo3M46m13
2975a78M3K14N1j97J60lj71K37L8J11k13L94O6l34L64m4j14J3m9J8J9P9j35K03
2999E72j77q3lj67K04m81M28q3J88m77L43Ol18L94l26P3m0L05k39M4n40L00l06
3022c83K3J35l64L24j96P0L22l76K24l20j22M74k50N8J27m2j45J10OR9n1J18r1
3045b50j90R2j2n1j36P83l66J57j48M31m01K97J12J08N9l01L5j54K05j92M92n34
3067C6L65j94o0k25N66m7j07K53J0l41j32K59K53pm41K26q7L0k05J9J33r3Q2j69
$$ plain form
3091 124 46 -52 -60 -155 76 -70 -54 -165 -216 -548 10 -154 -93 -131 -197 -327 -339 -496 -87 -313 -556 -550 -225 -356
3115 -356 -678 -318 -254 15 -377 -148 -534 -304 -391 19 -81 -334 139 -188 319 -60 -119 -74 -184 85 -192
3136 -192 51 -130 -10 98 -128 300 146 46 380 193 359 558 189 235 305 418 429 360 357 215 441 401
3158 401 523 27 331 462 171 311 371 333 365 315 265 244 31 291 103 200 11 38 -55 77 -200 -385 -118
3181 -118 -163 -308 -346 -42 -349 -280 -274 -96 -347 -413 164 -306 -499 -391 -102 -428 -318 -67 -486 -355 -234 -64
3203 -64 -419 -351 52 -291 -284 -109 -48 -380 -57 45 -68 133 428 207 27 233 230 249 52 549 109 19 -32
3226 -32 511 205 300 323 349 241 74 411 201 193 584 597 324 351 450 347 -69 203 212 52 322 131 -59 20
3250 20 116 91 72 96 420 -33 181 167 89 -138 156 -131 -264 -372 -28 -214 -702 -359 -131 -713 -304 5
$$ packed form
3091A24p8r8qr5K31j46J6j11n1l32N58j64O1l8o6j30j2j57M09k26k43OL25j31
3115c56l22L60O4K69l92K29l86K30q7M10j00k53M73l27N07l79n9M5j10K69k77
3136a92K43j81J20J08k26M28j54j00L34j87J66J99l69M6P0J13J1o9lj42K26m0
3158D01J22m96L04J31k91J40O0l8L2n0n0k1k13K60j88R7j89K7r3J32k77j85K67
3181a18m5j45l8L04l07O9OJ78k51o6N77m70j93J08K89l26J10K51m19J31J21J70
3203f4l55O8M03l43PJ75O1l32L23J02j13K01K95k21j80K06lJ9j97M97m40r0n1
3226c2N43l06R5K3K6j08j67L37k10qL91J3k73K7R9j03m16K72Rj60K70j91j90P9
3250B0R6k5j9K4L24m53K14j4p8k27K94k87j33j08L44j86m88L43K28n82M09L09
$$ plain form
3272 5 -245 -555 -522 -341 -387 -258 -139 -103 -502 -198 -10 -166 -90 -48 -199 -441 63 168 -195 -169 6 116 -93
3295 -93 51 85 194 189 136 213 119 52 274 124 -45 128 306 222 278 336 151 165 380 161 215 561 436 25
3319 25 305 462 371 18 683 547 234 168 192 309 106 479 439 -98 259 168 120 10 226 76 -226 -70
3341 -70 -27 -146 -542 -49 -477 -291 -128 -318 -417 -246 -314 -124 -61 -711 -165 -158 -212 -445 -417 -224 -427 -271 -590
3364 -590 -165 -197 -347 -257 -122 -114 -483 -68 -152 49 -68 -85 187 -147 -33 44 29 -235 217 203 -29 63 248
3387 248 35 63 329 198 173 454 474 328 326 317 337 250 240 263 331 385 267 154 208 176 289 -106 227 -13 74
3412 74 98 96 -86 29 218 131 -316 252 -172 -9 -60 -92 -306 -221 -333 -27 -184 -231 -201 -400 -244 -393 -308 -421
3436 -421 -337 -454 -65 -222 -180 -87 -356 -129 -68 -363 -221 -260 -76 -34 -261 -28 -98 -35 -127 -32 -184 47 166
$$ packed form
3272Ek50l10L3J81m6J29J19L6l99L04J88j56P6M2j51k42N04J05l63K6J75J10k09
3295i3J44L4J09nn3P7r4o7K22j50j69J73J78q4N6N8j85J4K15k19N4L46j25m11
3319B5K80J57r1l53O65j36l13o6K4J17k03L73m0n37L57r1m8j10K16j50l02J56
3341g0M3j19l96M93m28J86J63j90r9J71o8J90O3o50N46Pn4k33K8J93k03J56l19
3364e90M25l2j50R0J35Ql69M15q4K01j17j7K72l34J14P7j5k64M52j4k32R2J85
3387B48k13K8K66j31k5K81K0j46krK0q7j0K3O8N4j18j13N4l2J13l95L33k40Q7
3412G4K4kj82J15J89q7m47N68m24J63n1l2k14Q5j12L06j57m7L0j99J56j49Q5j13
3436d21Q4j17L89j57M2R3k69K27O1k95J42l9J84M2k27K33p0O3r2R5j52K31J19
$$ plain form
3459 166 53 -27 94 285 287 350 306 198 302 436 327 24 157 150 422 404 525 110 179 457 39 192 288
3482 288 299 -95 51 338 408 236 169 187 -161 -49 69 -63 30 -109 158 -443 -146 68 -213 -89 115 97
3504 97 -135 -195 -196 -115 -206 -272 -54 -115 -401 -120 -267 -315 -286 -318 -554 -520 -420 -215 -441 -249 -61 -53 -214 54 -206
3529 -206 -12 14 124 -98 -158 256 -291 98 -94 156 -1 206 -97 101 228 443 159 80 269 398 -148
3550 -148 125 338 209 457 380 395 258 74 282 157 96 515 193 309 193 185 83 204 209 370 5 294
3572 294 153 -2 32 267 313 -56 -195 0 -228 -356 -35 210 -304 -221 -21 -50 -288 -4 -498 -159 -298
3593 -298 -267 -376 -436 249 42 -529 -417 -54 -321 -389 -135 -72 -546 -367 -96 -311 -147 -40 -3 37 -41 50 -77
3616 -77 187 22 -2 215 54 549 114 187 468 413 260 177 353 295 220 262 364 239 91 131 189 319 527
$$ packed form
3459A66j13q0J21J91KO3m4j08J04J34j09l03J33pK72j8J21m15O9K78m18J53R6
3482B88J1l94J46K87P0j72o7J8l48J12J18j32R3j39K67o01K97K14k81J24K04j8
3504I7k32o0jQ1r1o6K18o1k86K81j47m8K9l2k36L4J00K05k26J92J88Qj61K68k60
3529b06J94K6J10k22o0M14n47L89j92K50j57K07l03J98J27K15k84p9J89J29n46
3550a48K73K13j29K48p7J5j37j84K08j25o1M19l22J16j16qj02J21NJ61l65K89
3572B94j41j55L4K35M6l69j39J95k28j28L21K45n14Q3K00k9k38K84m94L39j39
3593b98L1j09o0O85k07n71J12L63k67o8K54O3m74J79K71k15J64J07L7M0p8R1j27
3616g7K64j65k4K17j61M95m35P3K81n5j53q3J76n8p5M2J02j25j48M0N8J30K08
$$ plain form
3639 527 326 155 181 363 47 236 159 106 335 -121 30 -117 195 170 -2 123 -15 -114 270 -301 -136 -118
3661 -118 -161 66 -192 -45 -135 -433 -224 -280 -89 -136 -168 -258 -611 -172 -249 -315 -105 -276 -289 -243 -173 -404 -195 -107
3685 -107 -225 -196 23 -101 -283 -168 -400 -59 53 -22 89 7 -40 48 -32 82 117 33 176 -272 306 56 134
3708 134 249 205 428 36 171 232 179 18 232 242 174 356 35 21 222 102 201 264 208 120 202 32 379 -17
3732 -17 -69 -193 391 78 -298 117 6 -174 -282 -113 108 -98 -175 -48 -275 -261 -384 -86 -283 91 129 -242
3754 -242 -410 127 -242 -383 -114 -246 -81 -346 -277 -238 -373 5 30 -150 189 -123 -48 76 -294 254 114
3775 114 -192 -9 -202 -142 487 74 239 519 162 -210 47 124 -107 119 340 433 122 305 433 331 290
3796 290 352 223 269 231 517 151 346 245 176 53 132 34 17 73 278 227 18 -76 11 38 51 177 -98 -55 -242
$$ packed form
3639E27k01j71K6J82l16J89p7n3K29m56J51j47L12k5j72J25j38r9L84n71J65J8
3661a18m3K27k58J47r0k98K09n6J91m7l2r0l53M39p7o6K10j71j3M6P0k31K09Q8
3685a07j18K9K19j24j82J15k32L41J12p5J11q2m7Q8q0J14L5q4J43m48N78k50P8
3708A34J15m4K23l92J35O1n3j61K14J0o8J82l21j4K01j20R9O3n6q8Q2j70L47l96
3732a7n2j24N84l13l76M15j11j80j08J69K21k06p7J27k27J4j23K98j97L74L8l71
3754b42j68N37l69j41K69j32J65k65O9L9j35L78K5j80L39l12P5J24l70N48j40
3775A14l06J83j93O0O29m13J65K80l57l72K57P7k31K26K21R3l11J83J28j02m1
3796B90O2j29M6l8K86l66J95j01o9j23P9r8j7N6K05n1k09r4Q7K7J3J26k75M3j87
$$ plain form
3821 -242 -107 -34 -21 74 11 -299 -172 -166 -157 -407 -135 -211 -197 -316 89 -306 -497 -131 25 -296 -112 -47 -182 117
3845 117 -217 -229 -231 -203 -121 -325 -204 -89 274 94 209 66 -97 331 -57 107 -60 -45 215 187 -16 442
3867 442 326 301 276 50 136 147 111 163 18 67 93 219 115 229 256 55 310 76 97 299 153 220 106 271
3891 271 201 18 -212 289 144 -64 32 -70 -60 -72 -142 -48 -80 26 113 -206 58 -4 -98 -181 -1 -39 -332 -341 -83
3916 -83 -289 -64 -155 -175 -21 -142 -136 -194 -501 -183 -90 -318 -195 -143 -156 -128 41 23 -179 231 -157 -235 -151 427
3940 427 49 127 48 136 -68 -40 139 65 13 317 55 353 322 235 234 -69 247 141 106 34 209 146 125 11 86
3965 86 -12 51 166 -64 36 120 279 -191 243 -14 -192 158 200 -26 -348 9 149 -291 -356 91 -178 -394
3987 -394 -173 -268 -427 -399 -115 -118 -191 104 -155 -218 -235 -287 -182 -161 80 123 -200 -294 106 -313 -206 176 -326 -159
$$ packed form
3821b42J35P3J3R5o3l10J27ORk50K72p6J4j19M05l95j91L66J56l21J84O5j35K99
3845A17l34j2kK8Q2k04J21J15L63j80J15j43j63M28l88J64j67J5K60k8k03M58
3867D42j16k5k5k26Q6J1l6N2j45M9K6J26j04J14K7k01K55k34K1K02j46O7j14J65
3891B71p0j83k30N01j45k08R6j02J0j2p0R4l2J06Q7l19K64o2r4q3J80l8k93rK58
3916h3k06K25r1k0J54j21On8l07L18R3k28J23N2j3K8J69j8k02M10l88p8Q4N78
3940D27l78P8p9Q8k04K8J79p4n2L04k62K98l1q7jl03L16j06l5p2J75o3k1j14P5
3965H6r8O3J15k30J00Q4J59m70M34k57j78L50M2k26l22L57J40m40o5M47k69k16
3987c94K21r5j59K8K84lp3K95k59o3j7n2J05K1K41M3l23r4M00m19J07L82n02J67
$$ plain form
4011 -159 44 371 -156 -29 -64 33 -113 70 47 -66 83 204 174 192 116 323 100 41 324 211 36 437
4033 437 226 49 62 211 391 9 391 204 232 190 407 -88 -42 150 413 8 100 -48 -228 -315 -86 -11
4055 -11 -390 213 490 -162 -134 269 -220 -376 -19 26 -10 -166 -195 35 -124 -222 -57 -19 -190 122 -226 -306 255
4078 255 140 -175 -111 194 -352 -509 193 -121 24 -366 380 23 -257 -68 145 -158 -62 172 89 -322 74
4099 74 -2 -61 -178 313 243 -132 474 423 70 117 584 -26 167 441 537 -79 200 543 290 13 479 425 275
4122 275 53 327 -150 -50 331 83 -185 160 256 -45 1 328 -9 -197 176 349 -88 -72 173 -7 -422
4143 -422 -26 -92 -209 -436 -93 -184 -474 130 206 -376 -79 184 -422 -499 -267 154 -370 -97 11 -199 -320
4164 -320 -73 -81 -626 -106 77 6 -283 17 -33 -424 281 370 -33 -140 299 171 -162 148 219 167 -214 165
$$ packed form
4011a59K03L27n27J27l5R7j46J83k3j13J49J21l0J8p6K07k23n9K83j13j75M01
4033D37k11j77J3J49J80l82L82j87K8m2K17m95M6J92K63m05R2j48j80q7K29P5
4055a1l79O03K77o52K8M03m89j56L57M5l6j56k9K30j59r8J65L8j71L12l48q0N61
4078B55j15l15O4L05n46j57P02l14J45l90P46l57k80J89K13l03R6K34q3m11L96
4099G4p6n9j17M91p0l75O06n1l53M7M67o10J93K74R6o16K79L43k53k77M66n4j50
4122B75k22K74m77J00L81k48k68L45R6l01M6L27l37j88L73J73m37J6K45j80m15
4143d22L96o6j17k27L43r1k90O04P6n82K97K63o06p7K32M21n24K73J08k10j21
4164c20K47qn45N20J83p1k89L00n0l91P05Q9m03j07M39j28l33L10P1n2l81L79
$$ plain form
4186 165 266 82 159 384 111 1 258 265 -9 236 49 101 92 415 169 111 193 350 203 250 236 276 83 -188
4210 -188 79 -35 -93 37 -61 -23 -131 102 -449 -179 89 -16 176 100 19 -106 -351 -175 -133 -164 -313 -34
4232 -34 -482 -283 25 68 -444 -69 -248 -313 -114 296 -245 -166 63 36 -210 -23 152 -286 -171 100 2 -189
4254 -189 148 115 59 54 160 195 -111 -276 29 -66 -181 284 271 -124 408 252 47 175 170 441 -20 333 296
4277 296 180 85 186 275 -150 440 82 342 -164 256 176 -52 319 2 -121 -21 240 -97 -96 -85 -337 27
4299 27 -72 211 -69 -198 -222 204 69 -185 157 -414 -374 -40 -476 -197 43 -113 -442 -47 -51 -280 98 -58
4321 -58 -192 -248 -13 -312 -27 -348 180 -104 -55 -51 17 -225 96 -118 -96 -41 182 -42 -69 -283 -71 322 180
4344 180 232 228 -32 331 32 162 103 166 0 117 56 124 -3 173 205 -172 57 -99 160 389 -225 208 -175
$$ packed form
4186A65J01j84P7K25k73j10K57Pk74K45j87N2rL23k46n8Q2J57j47M7j4M0j93k71
4210a88K67j14n8J30r8L8j08K33n51K70K68j05J92p6q1j25k45J76M2l1j49K79
4232c4m48J99L08M3n12L75j79o5J99M10n41P9K29k7k46J87J75m38J15K71r8j91
4254a89L37l3n6nJ06L5l06j65L05r5j15M65j3l95N32j56k05J28nK71m61L53l7
4277B96j16r5J01Q9m25N90l58K60n06M20q0k28L71l17j23J00K61l37JJ1k52L64
4299B7r9K83k80j29k4M26j35k54L42n71M0L34m36K79K40j56l29L95mk29L78j56
4321e8j34n6K35k99K85l21N28k84M9MO8k42L21k14K2N5K23k24k7k14K12L93j42
4344A80N2mk60L63k99J30n9O3j66J17o1O8j27J76L2l77K29j56K59K29o14M33l83
$$ plain form
4367 -175 163 184 -222 38 79 -189 38 52 133 1 56 -42 103 -165 121 279 -89 24 149 -298 -243 31
4389 31 -116 -161 -430 -200 -147 -105 -225 73 -195 -172 3 -155 42 70 -162 -128 -138 -263 -56 82 -82 -204 -196
4412 -196 174 24 51 17 -172 81 -57 -33 132 39 -352 12 299 196 177 -18 -36 5 218 143 111 -111 180
4435 180 -66 162 -57 235 219 -153 365 82 348 118 41 164 266 -46 141 -11 -193 179 121 7 168
4456 168 -43 -59 122 -316 -162 10 347 -86 -74 -27 -137 -55 -372 183 36 -46 -107 138 -281 -351 -176 115
4478 115 -163 -204 -34 -24 -48 -59 -64 -85 -85 -219 70 -285 -40 -214 -44 38 189 8 -77 -30 36 15 89 156 -60
4503 -60 -92 255 -213 90 231 275 -248 86 185 0 336 93 93 218 142 62 121 -44 120 349 -186 75 453
4526 453 128 -112 132 43 -92 159 285 -270 -77 139 -16 -116 111 75 -81 22 16 -237 -139 175 -218 -387
$$ packed form
4367a75L38K1m06K60M1k68K27J4Q1j32N5r8J45k68K86J58l68J13J25m47N5K74
4389C1j47m5k69K30N3M2j20K98k68K3J75j58J97K8k32L4j0j25K07J38j64j22Q
4412a96L70j50K7l4j89K53j38K4J65r3l91L64K87j03j9j95j8M1K13p5l2k22K91
4435A80k46K28k19K92j6l72N18k83K66k30p7J23J02l12J87j52j82L72n8j14J61
4456A68k11j6J81m38J54J72L37m33J2M7j10Q2l17N55j47q2o1K45m19p0J75K91
4478A15k78m1J70J0k4j1nk1%j34K89l55K45j74J70Q2J51j81q5M7O6k1P4O7k16
4503f0l2L47m68L03J41M4n23L34R9j85L36k43%J25p6q0N9j65J64K29n35K61L78
4526D53l25k40K44q9j35K51J26n55J93K16j55j00K27l6j56J03ok53R8L14l93j69
$$ plain form
4548 -387 7 -73 -52 -350 -44 -101 -367 13 36 -53 -77 -47 -13 -328 -370 -123 -217 -265 -75 95 -32 -91 28 -99
4572 -99 -119 195 -7 -263 51 116 99 -81 153 76 -43 122 306 -154 215 75 38 61 289 105 50 249 408
4595 408 121 51 68 307 -49 -15 347 -386 154 -31 38 -33 142 307 -93 -98 -6 0 -79 93 115 -184 -221 257
4619 257 41 -396 8 -171 -75 -7 199 -325 -440 198 -230 -149 -13 182 143 22 291 -134 87 -57 107
4640 107 -17 -366 -85 67 -235 -166 328 -69 -401 -109 -73 -270 116 209 111 -126 34 335 46 72 60 18
4662 18 159 69 -43 231 348 63 50 215 289 178 285 32 247 147 264 -39 -62 317 274 41 -140 -87
4684 -87 206 40 180 172 110 180 160 -47 -148 -141 -26 101 -83 57 -262 -213 -18 -158 -15 39 -104 22 -240
4707 -240 -253 -49 406 27 -197 -154 -100 -143 -72 -117 -237 -235 9 -94 -103 -111 -264 -106 -192 4 24 -152 106 -108 -240
$$ packed form
4548c87L94q0K1k98L06n7k66L80K3q9k4L0L4l15m2K47r4m8J90J70j27n9J19j27
4572i9k0L14k02k56L14O5j7j80K34p7j19J65J84m60L69j40l7K3K28j84n5J99J59
4595D08k87p0J7K39l56L4L62p33N40j85O9p1J75J65m00nR2Op9J72K2k99l7M78
4619B57k16m37M04j79R6O8K06n24j15O38m28Q1J36J95l9j21K69m25K21j44J64
4640A07j24l49K81J52l02O9M94l97l32K92L6j97L86R3r8k37J60L01k89K6j2m2
4662A8J41r0j12K74J17k85j3J65P4j11J07k53K15j00J17l03k3L79m3k33j81N3
4684h7K93j66J40qo2P0k0k07j01PJ15J27j84J40l19M9J95j40J43N4j43J26k62
4707b40j3K04M55l79k24M3N4m3P1m5j20KK44j03rqj53J58q6J96K0j76K58k14j32
$$ plain form
4732 -240 27 247 -433 -33 79 46 -77 0 175 92 131 368 -98 -74 95 -128 -108 222 281 136 -28 146
4754 146 -151 -115 174 28 241 189 86 35 -10 230 267 266 -150 -92 -55 250 139 -74 -151 -10 15 139 -407 -76
4778 -76 -165 31 86 7 -42 -23 236 14 115 -213 -2 -199 93 -232 -127 -35 146 -219 134 -146 107 -209
4800 -209 -102 -343 -69 46 -68 -63 120 -150 37 39 -253 -42 -64 -226 -146 -167 40 -54 154 -107 130 -149 226
4823 226 348 61 297 146 -61 -36 30 72 143 43 -139 242 286 137 147 156 177 -20 120 41 -19 412 -110 23
4847 23 183 -67 306 16 18 -101 123 111 200 16 -216 -30 47 232 143 -210 -35 36 -176 -276 21 -83 -91
4870 -91 -154 -2 -367 144 150 -40 0 10 -220 8 -65 -386 -279 26 -142 -362 -133 219 -19 -28 94 -235 182
4893 182 -57 -221 -243 128 -104 -203 -288 212 -7 -77 -16 -168 67 42 24 106 6 -11 49 -154 52 287 198 304
$$ packed form
4732b40K67K20o80M00J12l3j23P7J75q3L9K37m66K4J69k23K0L30N9j45j64J74
4754A46k97L6K89j46K13n2j03n1m5K40L7jm16N8L7L05j11k13p7J41K5J24n46L31
4778g6q9J96N5p9m9J9K59k22J01l28K11j97K92l25J05R2J81l65L53k80K53l16
4800b09J07k41K74J15j14NJ83k70J87Kk92K11k2j62Q0k1K07r4K08k61K37k79L75
4823B26J22k87K36j51k07K5O6M2P1j00j82L81M4j49J0RK1j97J40p9o0M31n22J33
4847B3J60k50L73k90Kj19K24j2Q9j84k32J86P7J85q9l53J75P1k12j00K97j04q
4870i1o3J52l65N11Oj90M0J0k30K28p3l21J07L05j68k20K29L52k38rJ22l29M17
4893A82k39j64k2L71k32r9q5N00k19p0O1j52K35k5j8Q2j00j7O0k03K06K35q9J06
$$ plain form
4917 304 -35 -129 292 -135 -40 130 215 185 149 -21 141 245 64 17 -3 -127 -103 24 132 78 -173 -85 -175 36
4941 36 -131 184 -35 10 -190 20 -393 -19 -270 -15 -174 42 -186 -158 119 -517 -182 83 -143 -186 -75
4962 -75 -222 140 126 -121 -199 14 -27 74 -95 -32 19 49 61 39 -253 54 31 -57 34 -1 69 65 102 222 273 -143
4988 -143 238 37 148 76 -56 204 131 92 -62 -465 64 222 180 101 221 191 15 411 -4 291 225 34
5010 34 -16 75 54 -7 -17 -79 221 24 -323 -272 119 -328 -206 -44 377 -82 107 -83 -130 5 31 91 67 -125
5034 -125 140 280 -297 -68 121 145 81 124 33 -4 -293 -10 246 -23 126 -104 -115 -52 -11 -160 123 -112 80
5057 80 -105 119 96 137 158 74 28 -13 121 -5 22 94 -272 56 289 -44 93 67 -72 52 -104 -32 -233 179
5081 179 343 48 -2 12 185 59 -62 195 -51 93 -24 -4 -22 -76 -97 153 -64 -47 -225 -88 141 315
$$ packed form
4917C04l39r4M21m27R5J70Q5l0l6j70J62J04j81m7k0j24K4J27J08n4k51Q8r0K11
4941C6j67L15k19M5k00K10m13L74k51K55j59K16k28K8K77o36L35K65k26m3J11
4962g5j47L62j4k47p8K13m1J01j69O3N1L0J2k2k92L07k3q8R1l5P0mL7J20N1m16
4988a43L81k01J11p2j32K60p3l9j54m03N29J58m2p9J20l0j76L96m15K95o6j91
5010C4n0R1k1o1j0o2L00j97l47N1L91m47J22J62M21m59J89j90m7J35K6O0k4j92
5034a25K65J40n77K29J89K4o4M3r1l7k89K83K56k69J49k30j1O3M1j49K83k35J92
5057H0j85K24k3M1K1q4m6m1J34j26K7P2l66L28K33l33J37k6j39J24j56P2k01M12
5081A79J64k95n0J4J73j26j21K57k46J44j17K0j8n4k1K50k17J7j78J37K29J74
$$ plain form
5103 315 203 367 -131 197 -108 28 -155 -194 70 -196 -29 -71 -252 34 -211 -14 172 -101 -89 -336 67
5124 67 180 10 -258 81 -35 -163 -260 101 2 42 -162 -140 -136 -17 -27 -102 96 -195 213 278 86 27 -142 35
5148 35 163 -128 -28 145 150 -77 27 126 -96 -120 59 44 150 -46 241 97 74 236 117 75 329 -105 56
5171 56 262 3 -199 9 -101 -143 -86 -324 -59 26 50 -75 220 113 96 -374 -16 -331 -121 280 42 -459
5193 -459 60 -86 -243 -172 58 -166 210 27 -103 -170 -86 103 -110 66 -120 -59 -184 -41 -155 -8 51 -11
5215 -11 -62 -79 17 93 -21 129 17 396 119 72 45 147 -165 5 -114 -106 128 155 15 -71 223 -51 91 122
5239 122 200 33 -82 -98 9 -104 127 27 -43 -100 302 110 48 373 251 -64 -52 -53 -132 115 212 -24 175
5262 175 258 -128 112 -74 -176 -1 22 -177 30 94 86 438 -58 82 -12 -251 78 -117 -284 -49 -256 83
$$ packed form
5103C15j12J64m98L28l05J36j83l9K64k66J67m2j81K86k45J97J86k73J2k47M03
5124F7J13j70k68L39j16j28r7L61r9M0k04K2MJ19j0p5J98k91M08O5j92n9j69J77
5148C5J28k91J00J73Nk27J04R9k22k4J79j5J06j96K87j44k3J62j19m2K54m34J61
5171E6K06k59k02K08j10m2N7k38K65Q5K4j25K95j07j7m70L58l15K10M01k38n01
5193d59N19j46j57P1K30k24L76j83j30o7Q4J89k13J76j86O1j25J43j14J47N9o2
5215a1n1j7R6P6j14J50j12L79k77m7k7J02l12J70j19QK34K7j40q6K94k74J42L1
5239A22P8j67j15j6J07j13K31j00p0n7M02j92o2L25j22l15J2jp9K47R7k36J99
5262A75Q3l86K40j86j02J75K3j99K07O4qL52m96J40r4k39L29j95j67K35k07L39
$$ plain form
5284 83 -108 -94 -121 -2 -68 -151 12 -63 -79 122 -354 63 -207 116 -61 -40 41 -290 105 -158 199 20 -146
5307 -146 193 185 -93 -350 108 -29 244 17 180 54 55 254 -178 -76 305 -27 233 338 -74 203 -7
5328 -7 87 49 -91 272 74 -244 -191 43 273 -41 95 -184 -54 9 27 -48 133 -26 -34 -107 63 -60 144 47
5352 47 -345 109 -250 106 -201 30 63 -191 -185 -187 -302 -23 199 -130 -40 -220 -134 -108 12 -170 -96 -89 3 -3 131
5377 131 23 -158 127 211 -60 180 -159 -84 -127 126 231 16 243 182 270 54 -70 256 7 121 295 72
$$ packed form
5284H3j91J4k7J19o6q3J63p5j6K01m76M17k70L23j77K1Q1l31L95k63L57j79j66
5307a46L39qk78k57M58j37K73k27J63j26JJ99m32J02L81l32K60J05m12K77k10
5328gR4l8j40L63j98l18N3K34K30l14J36k79J30O3J8p5J81j59qp3J70j23K04r7
5352D7l92M54l59L56l07K31L3k54Okj15K79K22l29R0j80Q6K6J20j82P4PR2oJ34
5377A31j08j81K85Q4k71K40l39P5m3K53J05k15K27o1Q8k16j24L26k49J14J74k23
$$ [...]
8191b02
##END NTUPLES=NMR FID
##END=
