##TITLE=1H_LR-724-R2-C1
 CDCl3
 8 sc, 
 11.10.2024
##JCAMPDX= 6.0         $$ Bruker NMR JCAMP-DX V2.0
##DATA TYPE= NMR FID
##DATA CLASS= NTUPLES
##ORIGIN= UXNMR, Bruker Analytische Messtechnik GmbH
##OWNER= root
$$ XWIN-NMR		Version 3.5
$$ Fri Oct 11 16:09:00 2024 Russian Standard Time (UT+4h)  she@DPX200
##.OBSERVE FREQUENCY= 200.1318
##.OBSERVE NUCLEUS= ^1H
##.DELAY= (6, 6)
##.ACQUISITION MODE= SIMULTANEOUS
##.ACQUISITION SCHEME= undefined
##.AVERAGES= 8
##.DIGITISER RES= 18
##SPECTROMETER/DATA SYSTEM= spect
##.PULSE SEQUENCE= zg30
##.SOLVENT NAME= CDCl3
##.SHIFT REFERENCE= (INTERNAL, CDCl3, 0, 15.7039)
##AUDIT TRAIL= $$ (NUMBER, WHEN, WHO, WHERE, WHAT)
$$ ##TITLE= Audit trail, XWIN-NMR		Version 3.5
$$ ##JCAMPDX= 5.01
$$ ##ORIGIN= Bruker BioSpin GmbH
$$ ##OWNER= she
$$ F:/spectra/data/she/nmr/H-F/1/audita.txt
$$ ##AUDIT TRAIL=  $$ (NUMBER, WHEN, WHO, WHERE, WHAT)
(   1,<2024-10-11 16:07:31.03 +0400>,<she>,<DPX200>,
      <created by zg, POWCHK disabled, PULCHK disabled
       configuration hash MD5:
       00 E9 B6 7A A2 85 ED C7 34 08 36 98 17 FE 4E 26
       data hash MD5: 16K
       89 91 E1 8E 85 E4 83 79 5A 19 F9 08 30 AD 3E FA>)
$$ ##END=
$$ 
$$ hash MD5
$$ 5A D3 87 EB 36 86 7C DA C7 B6 AE 4E 56 98 58 DE
##$RELAX= 
##$RELAX= 
##$RELAX= 
##$RELAX= 
##$RELAX= 
##$RELAX= 
$$ Bruker specific parameters
$$ --------------------------
##$DU= <F:/spectra>
##$EXPNO= 1
##$NAME= <H-F>
##$PROCNO= 1
##$TYPE= <nmr>
##$USER= <she>
##$AMP= (0..31)
100 100 100 100 100 100 100 100 100 100 100 100 100 100 100 100 100 100 
100 100 100 100 100 100 100 100 100 100 100 100 100 100 
##$AQSEQ= 0
##$AQ_mod= 1
##$AUNM= <au_zg>
##$AUTOPOS= <>
##$BF1= 200.13
##$BF2= 200.13
##$BF3= 200.13
##$BF4= 200.13
##$BF5= 200.13
##$BF6= 200.13
##$BF7= 200.13
##$BF8= 200.13
##$BYTORDA= 1
##$CFDGTYP= 0
##$CFRGTYP= 5
##$CHEMSTR= <none>
##$CNST= (0..31)
1 1 145 1 1 1 1 1 1 1 1 1 1 1 1 1 1 1 1 1 1 1 1 1 1 1 1 1 1 1 1 1 
##$CPDPRG= <>
##$CPDPRG1= <>
##$CPDPRG2= <>
##$CPDPRG3= <>
##$CPDPRG4= <mlev>
##$CPDPRG5= <mlev>
##$CPDPRG6= <mlev>
##$CPDPRG7= <mlev>
##$CPDPRG8= <mlev>
##$CPDPRGB= <>
##$CPDPRGT= <>
##$D= (0..31)
0 1.2 0 0 0 0 0 0 0 0.06 0 0.03 0 0 0 0 0.0002 0 0 0 0 0 0 0 0 0 0 0 0 
0 0 0 
##$DATE= 1728648450
##$DBL= (0..7)
120 120 120 120 120 120 120 120 
##$DBP= (0..7)
150 150 150 150 150 150 150 150 
##$DBP07= 0
##$DBPNAM0= <>
##$DBPNAM1= <>
##$DBPNAM2= <>
##$DBPNAM3= <>
##$DBPNAM4= <>
##$DBPNAM5= <>
##$DBPNAM6= <>
##$DBPNAM7= <>
##$DBPOAL= (0..7)
0.5 0.5 0.5 0.5 0.5 0.5 0.5 0.5 
##$DBPOFFS= (0..7)
0 0 0 0 0 0 0 0 
##$DE= 6
##$DECBNUC= <off>
##$DECIM= 24
##$DECNUC= <off>
##$DECSTAT= 4
##$DIGMOD= 1
##$DIGTYP= 9
##$DL= (0..7)
0 120 120 120 120 120 120 120 
##$DP= (0..7)
150 150 150 150 150 150 150 150 
##$DP07= 0
##$DPNAME0= <>
##$DPNAME1= <>
##$DPNAME2= <>
##$DPNAME3= <>
##$DPNAME4= <>
##$DPNAME5= <>
##$DPNAME6= <>
##$DPNAME7= <>
##$DPOAL= (0..7)
0.5 0.5 0.5 0.5 0.5 0.5 0.5 0.5 
##$DPOFFS= (0..7)
0 0 0 0 0 0 0 0 
##$DQDMODE= 0
##$DR= 18
##$DS= 0
##$DSLIST= <SSSSSSSSSSSSSSS>
$$ [...]
##$SUBNAM2= <"">
##$SUBNAM3= <"">
##$SUBNAM4= <"">
##$SUBNAM5= <"">
##$SUBNAM6= <"">
##$SUBNAM7= <"">
##$SUBNAM8= <"">
##$SUBNAM9= <"">
##$SW= 24.0689170037331
##$SWIBOX= (0..15)
0 0 2 0 0 0 0 0 0 0 0 0 0 0 0 0 
##$SW_h= 4816.95568400771
##$TD= 16384
##$TD0= 1
##$TE= 0
##$TE2= 300
##$TE3= 300
##$TEG= 300
##$TL= (0..7)
0 120 120 120 120 120 120 120 
##$TP= (0..7)
150 150 150 150 150 150 150 150 
##$TP07= 0
##$TPNAME0= <>
##$TPNAME1= <>
##$TPNAME2= <>
##$TPNAME3= <>
##$TPNAME4= <>
##$TPNAME5= <>
##$TPNAME6= <>
##$TPNAME7= <>
##$TPOAL= (0..7)
0.5 0.5 0.5 0.5 0.5 0.5 0.5 0.5 
##$TPOFFS= (0..7)
0 0 0 0 0 0 0 0 
##$TUNHIN= 0
##$TUNHOUT= 0
##$TUNXOUT= 0
##$USERA1= <user>
##$USERA2= <user>
##$USERA3= <user>
##$USERA4= <user>
##$USERA5= <user>
##$V9= 5
##$VALIST= <valist>
##$VCLIST= <CCCCCCCCCCCCCCC>
##$VD= 0
##$VDLIST= <DDDDDDDDDDDDDDD>
##$VPLIST= <PPPPPPPPPPPPPPP>
##$VTLIST= <TTTTTTTTTTTTTTT>
##$WBST= 1024
##$WBSW= 4
##$XGAIN= (0..3)
0 0 0 0 
##$XL= 0
##$YL= 0
##$YMAX_a= 660407
##$YMIN_a= -722795
##$ZGOPTNS= <>
##$ZL1= 120
##$ZL2= 120
##$ZL3= 120
##$ZL4= 120
##$ABSF1= 10
##$ABSF2= 0
##$ABSG= 5
##$ABSL= 3
##$ALPHA= 0
##$AQORDER= 0
##$ASSFAC= 0
##$ASSFACI= 0
##$ASSFACX= 0
##$ASSWID= 0
##$AUNMP= <proc_1d>
##$AZFE= 0.1
##$AZFW= 0.1
##$BCFW= 1
##$BC_mod= 2
##$BYTORDP= 1
##$COROFFS= 0
##$CY= 11.3945322036743
##$DATMOD= 1
##$DC= 2
##$DFILT= <>
##$DTYPP= 0
##$F1P= 15.6554695791079
##$F2P= 12.8336369535428
##$FCOR= 0.5
##$FTSIZE= 0
##$FT_mod= 4
##$GAMMA= 1
##$GB= 0.15
##$INTBC= 1
##$INTSCL= 1
##$ISEN= 128
##$LB= 0.24
##$LEV0= 0
##$LPBIN= 0
##$MAXI= 10000
##$MC2= 0
##$MEAN= 0
##$ME_mod= 0
##$MI= 1.114404
##$NCOEF= 0
##$NC_proc= 0
##$NLEV= 6
##$NOISF1= 3.799351
##$NOISF2= 2.8
##$NSP= 1
##$NTH_PI= 0
##$NZP= 0
##$OFFSET= 15.70392
##$PC= 1
##$PHC0= -26344.05
##$PHC1= 14.78743
##$PH_mod= 1
##$PKNL= yes
##$PPARMOD= 0
##$PSCAL= 0
##$PSIGN= 0
##$REVERSE= no
##$SF= 200.130013532006
##$SI= 16384
##$SIGF1= 3
##$SIGF2= 2
##$SINO= 400
##$SIOLD= 16384
##$SREGLST= <1H.CDCl3>
##$SSB= 0
##$STSI= 0
##$STSR= 0
##$SW_p= 3612.71676300578
##$SYMM= 0
##$S_DEV= 0
##$TDeff= 0
##$TDoff= 0
##$TI= <>
##$TILT= no
##$TM1= 0
##$TM2= 0
##$TOPLEV= 0
##$USERP1= <user>
##$USERP2= <user>
##$USERP3= <user>
##$USERP4= <user>
##$USERP5= <user>
##$WDW= 1
##$XDIM= 8192
##$YMAX_p= 0
##$YMIN_p= 0
$$ End of Bruker specific parameters
$$ ---------------------------------
##NTUPLES= NMR FID
##VAR_NAME=  TIME,          FID/REAL,        FID/IMAG
##SYMBOL=    X,             R,               I
##VAR_TYPE=  INDEPENDENT,   DEPENDENT,       DEPENDENT
##VAR_FORM=  AFFN,          ASDF,            ASDF
##VAR_DIM=   8192,          8192,            8192
##UNITS=     SECONDS,       ARBITRARY UNITS, ARBITRARY UNITS
##FACTOR=    0.0002076,     1,               1
##FIRST=     0,             0,               0
##LAST=      1.7004516,     0,               0
##MIN=       0,             -722795,         0
##MAX=       1.7004516,     660407,          0
$$ Real data points
##PAGE= N=1
##DATA TABLE= (X++(R..R)), XYDATA
0@%%%%qJ7j7K4l3M1n6Q0j04J20j45J81k21K68l22L76m38N19o12P08q12R32j067
27e69J222j396J581j783K008k257K534k839L169l526L920m359M841n367N942o573
43c452P276q062Q934r903J0994j2237J3662j5314J7253j9562K2379k5910L0473
56A6531l6621M5409n9133Q4254j93006Q02973k74961q91282O02447k05906o0372
67a69667P53176m94114q03169Q46993K60196o19191K91524L4800n82702O91441
77B09287L16715r67932K65740O04269p02536K25019N39766q57317J4051Q50277
87D97339m95519k82819M92549l50259p2976O78246m26614n18815O66132J3440
97B00704m59774M97626j46881o37824P20258K77943p94792K74328K83274n21645
$$ y = [0, 0, 0, 0, 0, -8, 9, -8, 16, -17, 24, -32, 48, -56, 64, -81, 100, -121, 147, -175, 201, -237, 282, -330, 378, -434, 498, -569, 653, -743, 838, -945, 1063, -1194, 1340, -1499, 1670, -1856, 2064, -2295, 2546, -2821, 3121, -3452, 3824, -4238, 4696, -5207, 5787, -6450, 7212, -8102, 9151, -10411, 11968, -13942, 16531, -20090, 25319, -33814, 50440, -142566, 660407, 385446, -505836, 96611, -109295, -169667, 583509, 89395, -713774, 133219, 393415, -225776, 65748, 100548, -482154, 209287, 526002, -441930, -176190, 428079, -274457, -49438, 490328, -366989, -352938, 497339, 1820, -280999, 211550, -138709, -211685, 466561, 39947, -478868, 187264, 200704, -259070, 238556, 91675, -546149, 174109, 452052, -342740, -68412, 214862, -306783]
107c06783M37601L26627q25716O4638O53744l10271j18382K21914m43872J29958
117a70542P07109n15728n07450O45856K907l30729M16007k66070m20305O97546
127B58601N4215o47215L04609J81301l63870L29735J28958n46506K00758L87294
137B87880l75216L3826K61684m51082R0999N64523m46988l00374M88866j12833
147D1285j39325L40768l28056k31534N66801n2611m34352K50426N5793k34167
157a64972L05731J9842m43024K42676K71487l54144J00779K04246l88359J18008
167h7730L79497l44276j08517K79673j88795O616K83664k92889j56566L91452
177A62129n6987k45677K11237l9788j85549K90191j5591l37298K28088J29708
$$ y = [-306783, 130818, 457445, -368271, -303633, 350111, 39840, -78542, 143372, -300500, -170542, 536567, 20839, -486611, 159245, 162152, -168577, 247430, -18640, -438945, 258601, 312816, -334399, -29790, 151511, -212359, 117376, 246334, -300172, -99414, 287880, -87336, -53510, 208174, -242908, -151909, 412614, -34374, -334748, 154118, 41285, -98040, 242728, -85328, -316862, 249939, 197328, -237024, 13402, 69195, -164972, 140759, 160601, -282423, -39747, 231740, -122404, -21625, 182621, -205738, -87730, 291767, -52509, -161026, 118647, -70148, -63532, 220132, -72757, -229323, 162129, 105142, -140535, 70702, 30914, -154635, 135556, 119965, -217333, 10755, 140463]
187A40463k72440J58909R8193k99897J47907K16792k50780n224J44817j66529
197h7789Q3405J98178k92593j02511L39859n0902j83151J34006q2324n4058K78796
208A80916j18184k56927K30367O6140j79653J11696J723j61087J54884P4041j95152
219i1236P5116J16203j78795M5140J73028j81047n3084J78846r3909l8326J24290
230G6226j35467k0074K02601j07125j27787J51705O342q4565P9500l1893r6440
241h6977J24738L3849j53507O6860Q1545j31384N4969J01017j34309Q794R0577
252E6172q2849L3840N7609j35420J1676J41070o1466q3843O3069J0564j9733N7234
264D7923m8053p2843J17407J5914j29956O0787N0313q1160M4716J6638o6036O2463
$$ y = [140463, -131977, 26932, 125125, -174772, -26865, 189927, -60853, -66077, 78740, -87789, -4384, 193794, -98799, -201310, 138549, 87647, -95504, 38502, -43822, -97880, 180916, 62732, -194195, 36172, 102312, -77341, 34355, 36078, -125009, 29875, 103916, -91236, -16120, 100083, -78712, -33572, 139456, -41591, -94675, 84171, -9738, -48064, 76226, -59241, -79315, 123286, 16161, -111626, 40079, 46421, -38144, 41356, 9463, -86977, 37761, 71610, -81897, -15037, 66508, -64876, -9907, 91110, -43199, -34405, 56172, -26677, 7163, 64772, -70648, -58972, 82098, 20632, -63211, -142, 10422, -9311, 47923, -130, -72973, 44434, 60348, -69608, -8821, 41492, -39668, 5048, 21686, -44350, 18113]
276A8113J4850p8241N0088N0730p3929j8369O6082j0639m2401K5018j2752o335
288a7785O6158n3151n8982J02481M430p5277L6190R3j6022L9547l4726l0874N0750
301A2832P098m1595M927L9426j4533k7634K8651j631p879K0051m7814M270P1647
314D7816n0367m0890N2073K332p060n93k0829K5927J8548k9118j6296J7510K4037
327B3090k6419k5142L3466J732r286N770k3597K9829K6063n6381M159L9463j7224
340E523j2008r998Q860K8637k4301j9205J9836J6024M140k9980j709L8705j5304
353I220j9454M771j914K4797j3648l6398L4170J8249k1194m643j525K4659K261
366A9351l9485J1533K2987r315j1869j5640K2277K1243l2681k474J9941M287M511
$$ y = [18113, 32963, -45278, 4810, 55540, -18389, -36758, 29324, 18685, -23716, 1302, -11450, -17785, 48373, -4778, -63760, 38721, 43151, -32126, 4064, 4157, -11865, 27682, -7044, -37918, 12832, 19930, -21665, -16738, 22688, 8155, -19479, 9172, 7541, -338, 19713, -28101, -23831, 47816, -2551, -43441, 8632, 10964, 3904, 3311, -17518, 8409, 26957, -2161, -18457, -947, 23090, -3329, -28471, 4995, 6727, -2559, 3211, -20386, 9443, 35506, -20875, -16716, 22747, 5523, -6485, -16483, -7623, 21014, -3287, -22492, -2656, 13368, 17508, -12472, -14181, 24524, 9220, -10234, -5463, -7377, 17420, 3772, -32626, 1544, 19793, -1401, -6044, -7569, 17090, 19351, -20134, -8601, 14386, 5071, -6798, -22438, -161, 21082, -11599, -14073, 5868, 10155, 14666]
379A4666k5365k692L3912j5160j8900N358O473J6946k1564j8976L7444P484k0700
392a074o900K716K5527q283l2440J5950J3927q124p931j1752K3422J3709k9240
405a0493J216J7315M791l715k6643Q170K9187j8342j7818M647J4186J2461k4396
418i434o257L1784k390j7477m138O215K0835j5899k5357J9456J2837p825j1956
431i606l620K6000L607k4640J971J1742P896r419k4072J7920J8717k3939q513
444a5956J0980J3043N298k3644k115K6908Q22j8425j2047J4580J7175k1292j1018
457a5691J4841M500J739j1586k565K8204q814k7164J4576J5390m633j4339j1767
470a7309J5894J2904j1497j2715N205K3376o340k5010J5823J4282j0964p439j1643
$$ y = [14666, -10699, -13391, 20521, 5361, -13539, -8181, -1708, 15238, -6326, -25302, 12142, 19626, -1074, -7974, -5258, 20269, 11986, -20454, -4504, 9423, 1299, -6632, -18384, 5038, 18747, -10493, -9277, 8038, 12829, 9114, -17529, -9359, 19828, 1486, -16332, -11685, 2501, 14962, -9434, -15691, 16093, 13703, -3774, -7912, -1697, 19138, 3239, -22118, -2662, 10175, 2350, -9606, -13226, 12774, 16381, -8259, -6288, 5454, 13350, 3931, -20141, -2221, 16496, -7443, -15956, -4976, 8067, 13365, -10279, -12394, 14514, 15336, -3089, -15136, -556, 16619, -4673, -15691, -850, 3650, 5389, -6197, -8762, 19442, 10628, -16536, -1960, 13430, 8797, -5542, -17309, -1415, 11489, -8, -12723, -7518, 15858, 9518, -15492, 331, 14613, 3649, -3790, -15433]
483a5433J4722K0523k9442j3392K8640P520j3191o396Q456Q294q954o402K674
496b381J1630K861l1383k182L9858l664k2566l936J711K8398N390m0457J176L0116
510A4571n009j9491O13J3571m966q649Q848K981M496k836j9254J9810J7179l1127
524i263j722J6701n498K769j0463q909K8265Q703l0172j2725K9530K2170k7215
537B171k0405J3170R141R839j4260k2494K4942P305k0926J8367M004j9990N666
550c470O872M576K699j8406j2420J6051K5249j4045l5921J9057L0717j0587j0408
563c6j4200P561L5740k2176l2581K5170R408j2265K197j114n58K156K895J911
577D108j91K751j6050j845L5595j3409l9241J5045J8090J0864j993m4763N887
$$ y = [-15433, -711, 19812, -9630, -23022, 5618, 13138, -53, -6449, 2007, 10301, 1347, -5055, -2381, 9249, 12110, -19273, -21455, 18403, 14739, -7827, -11763, -10052, 18346, 23736, -16721, -15545, 14571, 9562, -9929, -9316, 4255, -711, -9360, -512, 2469, 6965, 4129, -15125, 4685, 21864, -9263, -10985, 5716, 218, 2987, -7476, -16385, 11880, 20583, -9589, -22314, 7216, 29386, 2171, -18234, -5064, 4077, 13916, -344, -22838, 2104, 9409, -11517, 6850, 10854, -9136, -3470, 3402, 7978, 10677, -7729, -20149, -4098, 21151, 7106, -28815, -9758, 20959, 10372, -36, -14236, -6675, 29065, 6889, -25692, -522, 8886, -3379, -1182, -2296, -2854, -698, 2197, 4108, 3917, 6668, -9382, -11227, 24368, 10959, -28282, -13237, 4853, 15717, 13724, -31039, -25152]
590b5152O0765n994m6839p299K6993J9276j0794k2903j3823K1611L1466k4559
602B748j9212J9668r929Q764K8000l4084j7397K5021k598O933M259l4560j335
615b3722M1002P430l4717j0342K3114Q991M654j3671l4578L1708L2063m6078j965
628a6111K5674k2665J4349K1264l2236o48J8993q689Q642R296l5370j6434N1293
641A7358J7313m7988q347J0586R217M7064k9439p4976N1563N4100m2172j3314
653i035j006j3837L7601J5244m5726n336L2027q790k375K6274l2173k5192N3940
666B1616j763l7528K3794j8930j3275O7987k2335p1892M4227M2410k4480o957
678B874j5954j6360N0603K2711o8606j2545N4127j4275k317K9454n9248r857Q3886
$$ y = [-25152, 35613, 29619, -17220, -24519, 2474, 21750, 10956, -11947, -25770, -4159, 27307, 2748, -16464, 3204, -6725, 2039, 30039, -4045, -21442, 3579, 981, 7914, 12173, -22387, -23722, 17280, 24710, -10007, -20349, 2765, 11756, 16410, 2739, -31839, -131, 31932, -14146, -16111, 9563, -13102, 1247, 22511, -9725, -10373, 8620, -69, 8573, 17869, -17501, -33935, 17358, 34671, -13317, -21664, -11078, -1861, 45203, 15764, -59212, -7649, 46451, 4279, -9035, -10041, -23878, 13723, 28967, -16759, -22095, 9932, 1142, -1233, 25041, -7132, -32324, 21616, 19853, -17675, 6119, -12811, -26086, 41901, 19566, -52326, -8099, 34311, 9831, 2874, -13080, -29440, 21163, 43874, -24732, -37277, 16850, 2575, 258, 29712, -29536, -39393, 44493]
691D4493k2694m4470L0949k5161m772O9403k9066p2634L8992M2637k1256P17j2650
704e512l5185N9513L8967q7530l941O5065l7791p42L7663n9084J209O4813l8157
717g12j8841M5396l4898k2734O7418p529o5769K6663K2736j9837L8335k6281p6422
730g2475Q3499O1638r6724r034M6427k4476L5854J4323r1237J5911Q8208l9270
742A2644m2448L7216k0785o979P1057l6069o7574O4805J0723m3474N3436k5869
754F683p5870Q4221M1357q5034P056L1756k6090L8819J4604q2745J6992Q1791
766E3540m9398l7455N1014k8836j1788O4990m7284l8178P6823k3490m1810O7591
778C5719k2656o2204O2804K0891n5893J6554O599l5102N6646K5925r6646J1480
$$ y = [44493, 21799, -22671, 8278, -16883, -21655, 47748, 18682, -53952, -14960, 27677, 6421, 7138, -5512, -40697, 18816, 57783, -29747, -33688, 31377, -6414, -7156, 30507, -28577, -27368, 37445, -712, -19553, 25843, -9055, -31789, 35629, 28100, -37669, -11006, 11730, -8107, 30228, 3947, -72475, 11024, 72662, -24062, -33096, 13331, -11145, 24709, 39032, -52205, -36294, 51914, 12644, -29804, 7412, -13373, -20352, 50705, 14636, -52938, 11867, 22590, -20884, 32552, 6683, -69187, 15034, 56391, -28643, -21587, 10169, -15921, 22898, 37502, -45243, -28251, 53540, 4142, -33313, 17701, -11135, -22923, 42067, -5217, -43395, 33428, 9938, -31872, 35719, 13063, -49141, 13663, 34554, -21339, -4785, 1814, -33288, 23358, 49283, -47363, -35883]
790c5883Q6882m1137k2314K7829n1586K4959P2361p5700l6068P5251j7827k5848
802a9081M8684k8792m0341O0785O693n3125L2400M136n1406N6338K6818q7222
814d4113K2147N8634m4585R974J7485n7439L7286N5498p2251k1525O1529j6897
826E743k1442L4850k8994k2437O4164j3050n3603N0183L98n1974N6034J0693o7358
839c6793K9635K3898l3238L2306J394o0404L7827N5625n5047k4816M3508j4498
851f03m329L4633m7150j9577P0864k2167m3871M9465j1306l1551M8643q894m0172
864b6015L5312R19l2242L4759O227n4857K5705M7745m4971j2313L4589k5578J1560
877H40L4402n8708o169O5350k9900k9133L3704j7038p254L8869k2516k8435L9240
$$ y = [-35883, 50999, 9862, -12452, 15377, -36209, -11250, 61111, -14589, -50657, 24594, 6767, -19081, 29603, 811, -39530, 21255, 27948, -25177, 7223, 11359, -40047, 16291, 43109, -44113, -21966, 36668, -7917, 2057, 19542, -37897, -611, 54887, -17364, -38889, 22640, 5743, -15699, 19151, -9843, -32280, 31884, 18834, -34769, 15414, 15812, -36162, 19872, 30565, -36793, -7158, 16740, -16498, 15808, 17202, -43202, -5375, 50250, -4797, -29613, 13895, -603, -4932, 29701, -17449, -37026, 33838, 11671, -32200, 17265, 5959, -25592, 23051, 14157, -26015, 9297, 10216, -22026, 12733, 18960, -35897, -10192, 37553, -7418, -19731, 14858, -10720, 840, 35242, -23466, -29635, 35715, 5815, -23318, 10386, -6652, -13906, 24963, 2447, -25988, 13252]
890A3252J174l4960L2419R868n1890K3099L4531l9460N648J6484l4494L0489K8064
903C4224n6413J978M5899k1569j3074J6067j7364J100L1558k4900k6902M3766
915A4370K769l9127K7516J0066l2358K3679N656k9789K5798J648l5588K7534K0753
928B2927l5749j827K4796p170k154Q905k1026O54L6355k3627k9571L6282J22k2927
942a4010K1403p769j2494K7506j0238j9230K5110K08k4000J0786J5145j6693m774
955i050J3460q006L511J3128k5804K253L5178k2330j8162K2530n109l540Q461
968F520j6730J826K0449j0527j4578J4437J0951j4867k632J1368o898J914K635
981C868j7502J3369J5499k6953J323K1757r065m147J678k726J0046j6j4025j373
$$ y = [13252, 14426, -20534, 11885, 21753, -30137, -7038, 27493, -11967, -6319, 10165, -24329, 6160, 34224, -22189, -20211, 25688, 4119, -8955, 7112, -10252, -9152, 22406, -2494, -29396, 14370, 17139, -21988, 5528, 15594, -16764, 6915, 12571, -17218, 8580, 10228, -25360, 2174, 22927, -12822, -14649, 10147, 2977, 823, 9728, -11298, -10644, 25711, 2084, -27487, 8795, 8917, -14010, 7393, -376, -12870, 14636, 4398, -14832, 10278, 10486, -13514, -2728, 12417, -4276, -9050, 4410, -3596, -85, 13043, -12761, -10508, 24670, 2340, -15822, 6708, 1599, -1941, 6520, -10210, -8384, 12065, 1538, -13040, 1397, 12348, -2519, -5151, 6217, -681, 1233, 3868, -13634, -265, 15234, -11719, -10396, 11361, 2296, -1851, -173, -2899, 7147, 7131, -6894, -8267]
995h267J3622K208j6402J939J3218o402L28O44o504J4556j760j9630J3179Q826
1009I555j2547k426J349N777L339r498m17P465N197n721j0827J1478P494j4470
1023d252q32L758R56O864j1514m655J7508k102r332J815L788N752p910q098Q881
1038F27L589l284o541k216J4292j260j2663O969M649m91k065q894Q274P927j3620
1053d707k803O280N104N12j1424K540J2452m389m330j800L203O915j0997m515
1067g959J1798l76n219m111Q55J4293l386j2986N675N743K87m819o695Q920K250
1082D270j0223J591M471M577k544j0933P977J1273p536n340k368M773P642j0735
1096c105m312R753j64m153k096M949Q703r267p261P657M324M67r160o016J3174
$$ y = [-8267, 5355, 7563, -8839, -6900, 6318, -84, 244, 888, -5616, 8940, 7180, -12450, 729, 9555, -2992, -5418, -4069, 1708, 5047, -4451, -4868, 2597, 7794, 2073, -8754, 2724, 10218, -4252, -5084, -1326, -370, 6494, -5020, -9675, 7833, 5731, -3601, -1786, 2002, 7754, -156, -8254, 627, 4216, 932, -5609, -7825, 6467, 5207, -7456, -487, 4162, 3671, 1606, -7288, 986, 8913, -4707, -7510, -1230, 3874, 4386, -7038, -4498, 7954, 3565, -765, -2565, 638, 7553, -3444, -7959, 3839, 3463, -1756, -5867, -5012, 9281, 5895, -7091, -1416, 4327, 4614, -205, -6900, 2020, 4270, -5953, -4362, 109, 4686, 2142, -8791, -814, 10459, 2923, -2417, -4785, -12, 7630, -3105, -7417, 2336, 2172, -1981, -4077, 872, 9575, 308, -6953, 704, 5028, 5495, -3665, -9681, 3493]
1111C493Q45r235K722J962L099m72p572O693P133q405o770K265R993k41j3657
1126h147K341P868Q58q7p135L234R843j0045m123R843j660l951l840K33Q728L63
1142D323q418k055Q060P787j0612o367J1652n88n770p5k755P669J968j3944M788
1157d337J2469n247o129J300N176J513m753l118K74O259n21j2298P525J1551j2092
1172b428k635P478j21M384o878j0459J3638P479j4011n772Q426N384m186j244
1186i45l88r54Q585l604j0054J3283k56j6546J0218O686q267R31l434N39J3834
1201I628m179j4698N378J4618o515j2269P428L205m153M531r584m72J9416r794
1215B540j4056J5212J546o507M323m289j944O030m000l887Q574K023j5707J636
$$ y = [3493, 4338, -4897, -2175, -213, 2886, 2414, -5158, 1535, 8668, 263, -6507, -4242, 5751, 5510, -8147, -5806, 2062, 2920, 2833, -4302, -1068, 8775, -1270, -5393, 4450, 2790, -1161, -5001, -4768, 3960, 4323, -4095, -6150, 1910, 9697, -915, -7282, 4370, 3782, -1988, -2063, -4818, 2851, 4819, -9125, -4337, 8132, 2885, -3244, -1944, 3232, 4745, -8, -3126, -2852, 3407, 2886, -9412, -1887, 9664, -2428, -5063, 2415, 2294, 6678, -200, -10659, 2979, 10458, -3553, -9325, -899, 4485, 299, -945, -1333, -2287, 6298, 2694, -7360, 5923, 5667, -10879, -661, 6025, -2242, -1311, -4745, -4206, 9628, 5449, -9249, -3871, 10747, 4232, -8037, -609, 2596, -1557, 2974, -6610, -7082, 12334, 2540, -11516, 3696, 5242, -1265, 3058, -1231, -3175, 2855, -1145, -5032, 3542, 5565, -10142, -8506]
1229h506K1755o095j3684M044j777J0431R201k5727m764K3350k672q746J750k121
1243c561L521O118n019m209O607O53j2024P891J0739j8069j406J4766o279J332
1257A060M41j1997J5715J0303k1825n160J5298M945o454r357k371Q519J2656p117
1271D656j8989J1703J3005j1306M564Q13j5015R790P614q173L826o169q718J6390
1285C991J0678j4294j3315R311J4505k412q859j1081K136K4218n602k6025J0759
1298e990J1566l503L790q784n532J4746N30q695J153n98l365L786Q470o864j2352
1313a1642R466P990L75O45j8841N14K9622o381k4044K627P077R589L659j7378
1327f722p702J6043J1365q434r925K921m38M600J0020j4699q901J1427J85O286
$$ y = [-8506, 13249, 7154, -6530, -2486, -4263, 6168, 15369, -10358, -15122, 8228, 5556, -3190, -1440, -3561, -40, 6078, 1059, -3150, 3457, 4110, -7914, -23, 10716, -7353, -8759, 6007, -272, 1060, 1501, -10496, 5219, 15522, -6303, -11463, 3835, 8780, 2326, -7031, -9402, -883, 11773, 4656, -14333, -2630, 10375, -931, 3633, 4446, -10569, -779, 6835, -1338, 2488, -3681, -12399, 3991, 14669, 375, -12940, -3629, 10876, 8464, -395, -11476, -9340, 14878, 9276, -16749, -5990, 5576, 2073, 5863, -2921, -8453, 6293, 6823, -1872, -719, -1317, -4682, -896, 7574, 710, -11642, -2176, 5814, 6189, 6834, -12007, -11493, 18129, 11748, -12296, -9669, -2592, 6997, 10656, -6722, -14424, 1619, 12984, 4550, -5375, -2454, -2892, 1708, 11728, -2971, -11872, -445, -260, 6026]
1341F026M048k3394O29K6266N1j6820p741N297J4762K227j5954j2085J3817J7937
1355A5066j2230j1190M672J394J1695J233k0916L515J2537n700K869m3j3587K496
1369h189J6022L792j3178r885O952J2310O826j3848k0794J5318K0563j1128r178
1382d417m783L03K0033J447k0784m44J1779K258j658j859o068m512J0673P638
1396I606j0791n978O66O240J6002j0871k2344J3082J7321m785j0396j0013M286
1409g975J8398K112j9855q931J7716J2039r831o385m117K070J5212k931j3381
1422e859J273j180M949J4616j0224k0074Q476J9851Q90j3944r269K517J5244R989
1436A7255k1878j6346K1045J1739p996o301q003P925J7108r791j3073P186K977
$$ y = [6026, 10074, -13320, -12691, 13575, 13626, -3194, -10935, -5638, 9124, 11351, -4603, -16688, -2871, 15066, 2836, -8354, -3682, -2288, 9407, 10640, -10276, -6761, 5776, 76, 2945, 2902, -10685, -8189, 7833, 11625, -1553, -11438, -4486, 7824, 14650, 802, -19992, -4674, 15889, 4761, -4417, -9200, -8897, 11136, 12583, -8201, -8645, 3134, 5392, 3734, 1875, -4193, -8705, 1968, 9606, -1185, -7163, -6497, -257, 15745, 4874, -17470, -4388, 12933, 8148, -2248, -12261, -7975, 10423, 12535, -7320, -16251, 1465, 13504, 3673, -2712, -6829, -4759, 10453, 7522, -5859, -4586, -5766, -817, 13799, 3575, -16499, -8023, 11828, 12718, -1226, -10495, -7978, 7266, 17255, -4623, -20969, 76, 11815, 3819, -2482, -10485, -2560, 14548, 4757, -8316, -1130, 1847]
1449A847l352M778O19j1941Q1J4728n61p035j386o174J1025J5139j8843j3761
1463a4836J3243P760K022p603j6016P795K1470m092j8389J072J1621m36P84l37
1477D058j3298L579J2093n053r0k774j1002J4261J3404j4968r147N842O729N463
1491I097n669j4333O40K0079J585k1362M11J3886o3J173o678p570J3347K456j0895
1506c896M777m57p726O976O058m951n032R73L538M786L833j2705r185J8143O883
1521A2015j5148l971Q56P742J0203j4561q272J5035K607o127J44j666j260K925
1535E22L148m624m038N022j109R75P176r884m924J2351K29k446l077q865J0377
1550H33J0728j4550o898R376N489k772m748J993R50J201J924o412J995M422q369
$$ y = [1847, -1505, 3273, 3892, -8049, -7968, 6760, 6199, -836, -2222, -8396, 2629, 17768, -1075, -14836, -1593, 6167, 8189, 586, -15430, -7635, 13835, 9743, -8646, -7574, 4047, 3611, 4395, 4058, -9240, -5661, 6432, 1379, 1289, -1485, -12487, 1774, 15178, 210, -8937, -3095, 3634, 9097, 3428, -10905, -10265, 9814, 11399, -9963, -9552, 4334, 4271, 5444, -1234, -8804, 4543, 6999, -3896, 881, 424, -7302, -326, 5732, 781, -4251, -3278, 260, 5046, 8879, -3826, -13011, 5132, 12015, -3133, -7104, -6248, 1494, 11697, -2864, -11136, 3899, 6506, 379, 523, -1143, -2403, 522, 3670, -954, -4992, 30, -1079, -104, 7072, -2812, -7736, 4615, 4844, 2398, -679, -9544, 833, 11561, -2989, -9887, -511, 4978, 2206, -2542, -549, 401, 1602, 3526, -2886, -891, 3531, -4838]
1565d838L282O594q610J685K844l150Q327k769j1813P346R853n591r950Q26J0122
1580D158k66n134l011m69J0691m03j1214O467K420n958N847k306m988O249l137
1595a054l465P272M82o126j069P726K527q845j143M361J370K122r247k739J4910
1610G082l964r143O410K52N50L120o583k8N488j773l942M48M608j988n473N548
1626F12J791k153J257o016N080Q194j1665l112R710k281k656j085q95N607P25
1641C113n311n78M502L749o531k756O530k203j649J211l410N404Q69r420O199
1656b81O738o238k890J114L720K245n851k190K837L167q90o664M001O267n992
1671i07p55K576p3L536n453m535P899J006n671o58J912L714k210k902M006J109
$$ y = [-4838, -1556, 5038, -3572, -1887, 957, -2193, 6134, 3365, -8448, -1102, 8751, 3160, -6790, -5964, 4158, 3892, -1242, -4253, -4722, 5969, 5566, -5648, 819, 3239, -2719, 3128, 822, -4166, 2083, -1054, -4519, 2753, 3235, -2891, -3960, 3766, 6293, -2552, -3695, 666, 2036, 4158, -5089, -7828, 7082, 3118, -6025, 385, 637, 1187, 4307, -2276, -2304, 3184, 1411, -2531, -2083, 2525, 537, -4936, 612, 2403, 250, 1507, -4509, 571, 8765, -2900, -6012, 3698, 1417, -1239, -2324, -3219, 2388, 3113, -2198, -2776, 1726, 5475, -1056, -3812, 2718, 515, -1134, 77, -3333, 2071, 2940, -6480, -281, 6457, 219, -2671, -1557, 2163, 4408, -1443, -3633, -796, 2371, 1481, -5183, -1182, 5085, -907, -1662, 914, 841, 4377, -1076, -5611, 2288, 3294, -2377, -3035, -1123, 2591, 381, -2521, 1485, 2594]
1687B594j423k847j479P286o26q898K383L876O88m31n057K927N518m110k000J612
1703A3K510n22o116J933N324k138l067j604L025O368n399m072N110J102j234k348
1719a115j166M949j765n516K795L228J427l810l320O338K797n096j283K44L234
1734A941L26o359J778N097k886j794m91M115L074o417j203M803P78j700m285N62
1750b661O115l434l320K835J373J854l424k432O290J90m916q00J508L823k328
1765F73n821L991M185k129k211j064N001J451o370J033K705q39k61l829J716N840
1781D071m520k840L061K388J180m557j988O213k85m054j319J240M385l953l668
1796d646O709J28k717j4j141M528J108p049N48L486J07q50l440K175L523k988
$$ y = [2594, 1171, -1676, -3155, 4131, 3505, -5393, -3010, 866, 1554, 1123, -3934, -1007, 4511, 401, -1599, 13, 2523, 2001, -4115, -2182, 3142, 1004, -2063, -3667, -642, 5726, 327, -3745, 1365, 2467, 1233, -1115, -2281, 2668, 903, -4613, -1818, 1410, 2837, -973, -4293, 2045, 4842, -254, -1537, -1293, 1941, 2267, -4092, -2314, 2783, -103, -1897, -2388, 1727, 4801, -1616, -2819, 1984, 2762, 1062, -3223, -2661, 3454, 20, -3300, -465, 908, 2762, -662, -3094, 3196, 3386, -1530, -2330, -822, 3001, 673, -5148, -1157, 3028, 899, -1312, -2376, 2625, 4076, -2294, -1261, 1444, 605, 344, -3485, -1769, 4071, -449, -3289, -228, 2160, 3340, -1217, -3205, 3008, 2723, -1331, -2650, -1410, 2975, -978, -4646, 2063, 2191, -526, -540, -1681, 2847, 3955, -3094, -2546, 940, 1047, 197, -3243, -1068, 2455, -533]
1812e33p93J711K635m83o936L202P069o030l152J702J34M541k241m924M638K424
1828B964k517q28N55K034j932k742J344Q77K605k785o002Q526L778r089K096L294
1844B178j914J434l001n60M899k657m671K363M927n77n123J662K057l01L910n270
1860f44m825R367k015p007O438J26m886K978P56J005K074m832k581O955K971q670
1876b790l012Q781j686l875M537n143J001R427r152l523J1081l219n545L758j189
1891e49m84L218l843k635P230M22r075N473Q375j1099j449R583n915O77L087j0614
1907g598N746J0762j0757m490P964m06k15K983o069k714R862j877j0033Q845K347
1922D350j2898Q917P535j2173L433L371o634R271Q81j4818N469J1669q830n079
$$ y = [-533, -1326, 385, 3020, 2537, -4399, -1197, 5872, -158, -3310, -1608, -1474, 3067, 826, -4098, 540, 2964, 447, -381, 174, 2208, 276, -2466, -1122, -245, 2360, -425, -6427, 2099, 5877, -3212, -1116, 2178, 264, 1698, -1303, -1863, 3036, 379, -4292, -1929, 2998, 2421, -2702, -1040, 1017, 716, 4626, -644, -5469, 3898, 1883, -5124, 1314, 1440, -3446, -468, 288, 1293, 3367, -1465, -4046, 2909, 5880, -2790, -5802, 2979, 1293, -2582, 1955, -3188, -2187, 7240, -1912, -5435, 5646, 2427, -3118, 640, -549, -1033, 2185, -1658, -4293, 2937, 3359, -5716, -243, 8132, -2967, -4416, 5167, -748, -71, 3016, -7598, -1852, 8910, -1847, -6337, 1627, 1221, 1006, 3989, -2080, -4794, 5068, 3191, -6842, 2003, 4350, -8548, 369, 7904, -4269, -836, 2535, -4099, 5172, 6053, -8765, -3296, 8373, -457, -5536]
1936e536O619k173k51P706q903n438J6615l386j4361J1593J279r807R696j829
1950A824r052J0022k35r143J0410L132j4977M232J3278q474n085N803o852L729
1964a388J3401j6418q386K0234k592r064Q201o251k935J3653n764j1316J0624
1977A999J748j1079R314N536j5225L721J2761j0408J90P076j3104O206J4401j8345
1991e209n330J6968m605m592O210q665J19J6505p027j5902J3043O281j3101O549
2005A244L435j4439J0221P734j5142P210O602j6399R281J3182j6662m052J2392
2018D607m793r08P897j2849m899K1485l666j7803J2505K699j0010J2860l150j5569
2032a1594J4755L835j4860R428L956j5470Q859J2610j4638l401J1631n614MJ0024
$$ y = [-5536, 1083, -1090, -1341, 6365, -2538, -7976, 8639, 5253, -9108, 2485, 3764, -6043, 3653, 1824, -7228, 2794, 2559, -6584, 3826, 6958, -8019, -3787, 9491, 1017, -4068, 1735, -5117, -1388, 12013, -4405, -12791, 7443, 4851, -4213, 3988, -2263, -5198, 8455, 2691, -8625, 1999, 3747, -7332, 1982, 7518, -7707, -3986, 8775, -1633, -1443, 5633, -7471, -1265, 13136, -5209, -10539, 6429, 1824, -2768, 3442, -5223, -5104, 11401, 4374, -11528, 1515, 7796, -5305, 1244, 4679, -9760, 461, 8195, -6947, 263, 6865, -9534, -253, 12929, -3733, -7785, 4607, -186, -1094, 6803, -6046, -10945, 10540, 6874, -10929, 1576, 4275, -5735, 7125, 3975, -11594, 3161, 6996, -7864, 1564, 5520, -9950, -1091, 11519, -3119, -6520, 5111, -503, -499, 9525]
2046I525j6920m833K4978o946j7414J1821L8k624J3910j1971j4272K0262N673
2059A1227j7332M114N145j0144Q128Q275j6393J014J3667j0992J539J2939j7418
2072f231k677J9971r007q778J0827p313k670J5903q252j4172J5260N921j3721
2085d939N419L768j1843R232Q077j7550L899J0517j3400O631J1406j8740q59J7850
2099I468n783o561M925p794J297J7005r403j8157J4237R741j0561L402k758r017
2113i959J7686L466k1377O530J0546j0586M055N273j2721K135J2612o995m575
2126c910P611o196k418J5272p510j4619J3028L426p911P481o216q316J7490K104
2140I316j6829M045Q571n994J794L150r247J613R835p824k190Q749q295j874J4518
$$ y = [9525, -7395, -12228, 12750, 5804, -11610, 211, 249, -2375, 11535, -436, -14708, 5554, 11227, -6105, -1991, 3154, -6990, 1138, 9413, -6980, -5966, 7701, -3291, -1752, 11187, -6231, -8908, 11063, 2056, -6722, 4105, -3208, -5878, 10025, 1773, -12399, 2861, 8782, -4939, 480, 4248, -7595, 1637, 9714, -7836, -3937, 6580, -6820, -189, 11217, -7523, -8382, 9468, 3685, -2876, 2049, -5745, -4448, 12557, 3154, -15003, -766, 8975, -1586, 1816, -942, -9959, 7727, 11193, -10184, -3654, 6892, -3694, 361, 5634, -7087, -4952, 7660, 665, -3910, 3701, -2495, -4913, 10359, 2849, -11770, 1258, 4684, -3227, 4254, -1962, -10278, 7212, 9316, -7513, -3468, 5103, -891, 903, 4053, -5194, -3581, 6254, -1570, -3760, 4989, -3306, -5180, 9338]
2155I338p639r212J0103j248k842P666q872p090J4084L724j2440l56O322j363
2169A75L645K24j1204N356J0157j0663j490P934q330P94J0075o855l677N967l040
2184i32L42O689o197p402R179M787q809r37K457j641P503j781j2661Q855Q962
2199H414r443j362L652l560L239K280o334K42N346k865j556N474k358n283N895
2214A781J577m883K908k986l409R852j530j0047N116N310l258k46r19j504M360
2229B122J372n808o10N466k417k927N419l173l304O307j544j724M322n275j699
2244c473Q221j884o428P13L080J446m85k928j788N329L341p321j119P288l031
2259I61k971K952l005J941K943n618Q79M849l070j332K497O07j762q18R78J10
$$ y = [9338, 1699, -7513, 2590, 1342, -1500, 6166, -2706, -9796, 4288, 8012, -4428, -4784, 1538, 175, 3820, 4044, -7160, -1804, 8353, -2310, -3800, 4134, -4196, -3402, 6673, -182, -3859, 2108, -932, -590, 6099, -98, -7500, 1679, 6466, -2343, -3280, -823, -2464, 5039, 3258, -9403, -548, 8414, -1029, -2391, 1261, -2299, 940, 3220, -3114, -2872, 2474, -391, -1947, 3527, 1169, -4114, 1781, 3358, -1525, 1383, -1603, -5012, 4840, 3310, -6737, -1621, 3689, 431, 185, -734, -2238, 2122, 3494, -2314, -2924, 2542, 125, -2802, 2617, -556, -3860, 2447, 903, -821, 3501, -1774, -3473, 4748, 2864, -3564, -2851, 229, 1675, 1190, -1738, -3526, 1803, 5144, -2177, -3296, 3992, 961, -2010, 942, -2063, -122, 2821, -2797, -1918, 2931, -139, -1471, 1026, 1633, -129, -947, 31, 141]
2275A41J450j447n361M899N306o232j320L255n41K169r03m030K813J363k872K31
2291a079J832k87k039P60K396r96K60o36k571M747M4n918K513L019k757j74p08
2308a594J314K965k936k409K981K663j793l854J594L079k213J5p81n18L635j855
2324B93k588M305l4k887L98J54K051o73l609Q18K679N45k373j600L989J003l741
2341a270J339L05K1N59k890J024L002k509j676J549J212J255k803o38L236l01
2357A415r95j721J95L302k542k277K605J111j026r54n13L321L94l904K37J719
2373C67P56m33l329J910K022j695n25M43J630L88k902N07L393j348j895j386J888
2390b09K527k989j766K469R86j56j252n28K907r28k660J270J402pk441j544L059
$$ y = [141, 1591, 144, -5217, -318, 4988, -1244, -2564, 691, 150, 2319, 1416, -2614, 199, 1562, -1310, -1079, 753, 466, -1573, -813, 1583, 587, 847, 211, -2360, 2387, 2431, -3487, -974, 2045, -712, -886, -1594, -280, 2685, -251, -2660, 321, 2984, 1191, -2663, -1069, 2010, -203, -188, -969, -1487, 2148, 293, -2295, 2010, 1976, -911, -513, -359, 1692, 1019, -2590, -1772, 907, 1452, -921, -2521, 1468, 2471, -1270, 69, 374, 395, 954, -1936, -912, 2090, -419, -2095, -546, 666, 1921, -882, -1520, 1716, 1415, 420, -1301, -1106, 2196, -346, -2623, -18, 1093, 67, -887, -1400, 1921, 2315, -1589, -1352, 367, 1123, 690, -2639, -729, 1293, -402, -927, -484, 1146, 1534, -1368, -861, 2532, 1184, -711, -2097, -209, 2318, -671, -2437, 32, 1018, 862, -390, -918, 1989, 1061, -1599, -329, 1073, 1066, -1375, -2919, 140]
2407A40J823j948j455N02K687N3l144J235J408j471p49j80J476J213k937p41K950
2424H62J100q23k356K50L149j106k381L59R41Q86k124o97L473q8k371N2Q44K552
2442B522j319l629J554K233r20j134j280K437Q51k207Q1J871M56j104k484K126
2458E4K647l060j760R14J762J196l041m47L282o87q40r4J50J565j709k196K348
2475H4J079j362j662j2L832Ml050J99J400J120j078k737K979O55l252L07J897
2492D03L56N95l070l0L860n93j380j495J129K196j841j677J149M53L23j509k21
2509a352M193k063l094K933R25p31r08k226K053J891k646l63J044J530l46k399
2525a559J970J212j375J38k211J544L309m555j145L811q53L2j5j086J947p10j423
$$ y = [140, 1963, 15, -1440, -938, 1749, 1802, -1342, -107, 1301, -170, -919, -1099, 377, 1590, -1347, -2088, 862, 1962, 1139, -1217, -967, 2182, 1076, -1305, -946, -5, 881, -1243, -1940, 1533, 1445, -926, -874, -30, 2522, 1203, -2426, -872, 1361, 441, -693, -1973, 464, 1315, -892, -811, 1060, 1516, 412, -2072, 54, 2701, -359, -2119, -1205, 557, 1753, -1288, -1735, 1547, 860, 20, -74, 76, 1641, -68, -2264, 84, 1163, -199, -1861, -1873, 1959, 1963, -1087, -888, 512, 1632, 554, -2183, 796, 1451, -1801, -1494, 403, 759, 1354, -1716, -1746, 2114, 1521, 141, -1354, -225, 1971, 130, -1547, -398, 55, 378, -1131, -1352, 2841, 778, -2316, 617, 1542, 811, -97, -2323, -270, 1621, -1025, -1388, -344, 1186, 840, -1559, 411, 1623, 248, 386, -1825, -281, 3028, -1527, -2672, 1139, 286, 318, 303, -783, 1164, 454, -969]
2542i69J651Q04j174k761N80L814j448k026P39n00L236Q76n670K349L008k771
2558b62J36j83n29J667j140o30J217M35p91j262K604J414m439J046K150k133J191
2575D91j263k115N151l14n180K213K405M21j398k054Q15J796O91k310k465L755
2591F39K75k912L211j41l313L308j13q95K163l757j559M999O77m024r85K102K165
2608A840l77j609k386K028M805m174l566M955j149j794K724k616k89L660k851
2623g99l0L298k270k337K921J607k971j626K230J08J009k11n364L291O655n203
2639C08l176K703o5K467L9n553P46N072j572k214J321k51j887L016K187m227N96
2656d90O43j837M719p93p634L631N388l077j309l98n4M091M62n575j243N998M1
$$ y = [-969, 682, 1486, 312, -2449, -1869, 1945, 497, -1529, -790, -1290, 1946, 2822, -2848, -499, 2509, -262, -126, -309, -838, 829, -311, -941, 276, 711, -80, -1342, 1262, 2676, -1763, -717, 1433, -700, 491, -772, -2887, 2264, 1950, -3230, -1017, 1388, 1809, 411, -1643, -828, 968, 1659, -651, -3116, 639, 914, -1998, 1213, 1072, -2241, 1067, 954, 59, 2222, -1535, -3094, 1905, 2582, -1442, -2427, -325, 1840, 1463, -146, -2532, -504, 4301, 127, -3439, 1516, 367, -1427, 1297, -1319, -1608, 2052, -799, -829, 2469, 199, -2138, 783, 2390, -581, -2207, 23, 131, 1140, 929, -4435, -1144, 5511, 308, -2868, -165, -230, 2237, 2276, -3277, -2531, 2541, 969, -1245, 76, -175, -2062, 954, 3141, -1086, -490, 153, -1684, 3035, 2242, -5392, -1761, 3627, 550, -759, -1157, -1211, 2880, 3342, -2233, -3476, 2522, 2563]
2673B563m339J075p6p58M053j536m253M282j72j953L997j436n607L387L755k195
2689G87j633r95q51M500L019p031k631P262M10l043Q28l189J028N700m292l447
2705c578M657n93k088L333M5m302J913K803k203M38J38m808M428N336p286k714
2721d481N413R9J213m67o100K512P218l833n475K784J884j147J872j229m175M367
2737D55K857m500J930N07n014N044L274o841m25L006o48K149J85n527P66P647
2753D865k003o365K737J568j665L680l127m735O570O76m895M407o29m863M762
2768I83K727m656j83J220j319K239K363o571j545Q627r03n409K114p27P38N914
2784E612o643m644P917K19m088J869p62k152M149J562m536R8L063k919J363M180
$$ y = [2563, -1776, -701, -777, -1535, 2518, 982, -3271, 1011, 839, -1114, 2883, 1447, -4160, -773, 2982, 787, -846, -1841, -2692, 1808, 4827, -2204, -4835, 2427, 2837, -206, 622, -2567, -1539, 4161, -131, -3578, 1079, 486, -1602, 1731, 1776, -2526, -613, 2190, -13, 425, 563, -4245, 183, 5519, -1767, -4481, 932, 1031, 2244, 1777, -4323, -1811, 5407, 1574, -3901, -1117, 767, -380, 1492, 263, -3912, 455, 3312, -1188, 742, 1249, -3765, 1279, 4553, -2288, -2713, 293, -355, 1794, 1979, -3548, -2782, 4865, 2862, -3503, -766, 802, -863, 2817, -310, -5045, 1525, 2201, -2694, 1713, 1084, -3779, 983, 3710, -946, -1129, 91, -1228, 1011, 3374, -3197, -4742, 3885, 2982, -2427, -313, -1040, -302, 5612, -1031, -5675, 2242, 2461, -1627, 242, -520, -2672, 1477, 3039, -1497, -1399, 1664, -1255, 108, 4288]
2800D288p040j428P460k606j855K369m681K626O778o210l825N509J108k752L06
2815D7n25k375L667J969n321J245L658m289K242L907p027N64N140l503Q59Q13
2831A071m806K523N712l926m738L670K703j826O04j439k864N590Q24o895L366
2846d31K490m476L279J080m530K695J488k801J975J166l994j71N055j454m724
2861c353K643J743j289K717l415l340P393K17o061K281J055k029L249j106l368
2876b663K524J530k291M75K613l034j291M475j069l128K436j707j55M744m477
2891a018k602N815j01l152J089j59J4K095j553l218K156L037l420o52L147k300
2907h22j92L101k637K49J862l161R93M089m157k268L152R79q64l56o00o68L324
$$ y = [4288, -2752, -4180, 3280, 674, -1181, 1188, -3493, -867, 5911, -299, -4124, 1385, 2493, -259, 47, -478, -2853, 814, 2783, -2538, -1293, 2365, -1924, 318, 4225, -2802, -2238, 2902, -601, 258, 1071, -3735, -1212, 4500, 574, -4164, -494, 2209, 383, 987, -452, -3316, 2274, 3098, -3797, -431, 2059, -2417, 862, 1942, -2588, 107, 1595, -1206, 769, 1935, -2059, -2230, 2825, 1371, -3353, -710, 1033, -256, 2461, -954, -4294, 3099, 3316, -2745, -464, 591, -1438, 1811, 705, -2663, -139, 1391, -900, -425, 2188, -846, -2137, 2338, 1269, -1859, 577, -1130, -1285, 3459, -1018, -3620, 2195, 2094, -1058, 31, -128, -114, 1981, 428, -2790, -634, 2403, -1017, -1669, 1478, -822, -1014, 2087, -550, -301, 1561, -1600, -607, 3482, -675, -2943, 209, 1188, 324, -32, -632, -1300, 2024]
2924B024Q7m532J741L023l191K54J103k132K026O69l036K276J934l306K97K574
2940A811j255j836J134N89r85J066j142j587L960r5l797J936J796j610N32j014
2956d97j091L053l47k902P85K198q43j599J922n6j148J060p26r0K241k628j761
2973b429L426K83k272L17K16Q10Q83j178j366J470J344k257n74K382m83j497Q44
2990h1p68J038J304k306k26K783j128j262O75Q4j76l90j68K32P75J08j942J005
3008d43K610j953j286J486k77O18n84j588J482Q66j802M08J094J44j047m58J539
3025H09j17k92o63j172J774P78k500M00J569n34N34p73QJ364r17j295P57J071
3043H01j30j912J10K077r31j99o7j50J469k16j767J407L09j434L68k18Q35K01
$$ y = [2024, 2111, -2421, -680, 2343, -848, -594, 509, -1623, 403, 1072, -1964, 312, 2246, -1060, -763, 1811, 556, -1280, -146, 443, -542, 524, -618, -2205, 1755, 1660, -2137, -201, 1595, -15, 517, -497, -1588, 1465, 1118, -1784, -999, 1199, 356, -1243, 679, 623, -525, 535, -191, -281, 1960, -668, -2429, 997, 1280, -992, -675, -459, 351, 1234, 56, -1310, 160, 1504, -753, -1327, 1055, 572, -925, -81, -849, 189, 1493, -813, -1039, 1744, 616, -646, 29, 113, -63, -453, -621, -389, 386, 494, -1448, -443, 2167, 214, -1072, 414, 137, 755, 171, -1417, 65, 931, -871, -463, 631, 775, -272, -730, 809, 692, 400, -263, -1435, 339, 1117, -1383, -983, 586, 52, 586, -187, -179, 1185, 268, -1027, -270, 801, 671, -1241, -1131, 946, 15, -184, -251, -401, 1068, 852, -915, 492, 801, -633, -265, -483, 352, 553]
3061E53j637O28J274J22o34j355J337R47j534j12M70k20L48j090J31K157j453
3078f8q14R50N19N76j270j282J798k4l89m28q08J868j97j470J364Q39r55q2r03
3097g76J205Q53k094j64Q81J71M26j380M01J139m26m86K82N7Q45j482n68K103
3115I87p50r06n2L41J703o96j975J730L92n61j19q95J198J46j567M79P78JL5j596
3135a327J354J752j673p04M85j3Q12j261l16J283l53o86K22M37J273j119j033
3152h67J469K93m28n82j099K090l39j775J076M42k81N66j063M86J474j306r50
3169g94P94Q74m04j601J71J350k02k9o41K46J874j699j024K080o04j053L53k85
3187e94Q48K78j225J70J106M50j307o50J614J04p72M4j079R39J177k590P85K179
$$ y = [553, -1084, -456, 818, 940, 306, -1049, 288, 1235, -299, -411, 59, -161, 187, -903, -772, 1385, -68, -882, 68, 587, 1163, -107, -1389, 409, 385, -4, -432, -1240, 628, 431, -1039, 325, 1164, 209, 127, -776, 429, 1282, -812, -976, -95, 76, 502, -878, -477, 662, 236, -250, 32, 89, 934, -548, -1116, 987, 237, -669, -721, -380, 1323, 627, -1348, 382, 774, 213, 94, -801, 397, 543, -1024, -545, 233, 234, 269, -1327, 27, 1779, 106, -598, -113, -126, 686, -575, -891, 392, 39, -647, -425, 12, 1285, 166, -867, 602, 895, 467, -115, -1214, 876, 537, -1238, -162, 280, -1, 565, -498, -12, 1462, 156, -794, 0, 874, 470, -1131, -960, 390, 188, 159, -482, -236, 1638, -61, -1085, 995, 391, -662, -309, -594, 254, 532, -693, -523, 583, 1033, -274, -924, 690, 794, 22, 66, -1013, -74, 1103, -1487, -702, 1477]
3205A477j630l88J060k54K11l99o28M38N96m74j464J445J234j878M47O34n96R22
3223G53k61k287K277J111k876L33J217j63j87J71o46L53J102q50o33J601q83j725
3241a593K141L87j637P75n94p68K780n77k981J977J725j408o44P49o96K30N69
3258D35j586K2K778j730j381K608r62j326K337p61j369J563p36r37K051j91k624
3275a809J101K447j298m58L55j529J795J782l944n3L609k227r06K163j608j95
3291g75K103j244r52J852n12j970K045Q77l051Q90K063k083Q89M43k810K889K499
3308C153m510j08L271j631k64M34j515L9K818j414k095K285L94k326K590J69l342
3325b052K359P14k527K517l91l297K863K532l623o98K374j27j8L00k338j31L877
$$ y = [1477, -153, -541, 519, 265, 476, 77, -551, -113, 483, 9, -1455, -10, 1224, -654, -207, 427, -169, 753, 492, -1795, 482, 1593, -1283, -950, 267, 104, -83, 88, -558, -205, 897, 47, -586, 1015, 132, -1593, 548, 935, -702, 73, -521, -1289, 1491, 914, -2067, -90, 1635, 227, -417, 332, -364, -134, 435, -1151, -1129, 1649, -81, -1462, 1146, 184, -1142, 1195, 434, -935, 628, -108, -1045, 1006, 815, -1809, -708, 1739, 441, -17, 338, -1191, 604, 2386, -1558, -1611, 1998, -229, -1135, 1028, -580, -775, 1328, 84, -868, 984, 472, -1498, 547, 1424, -1627, -737, 1326, -757, 132, 575, -2235, 654, 3153, -1357, -1465, 1806, 175, -89, 345, -1170, -1131, 1687, 273, -1822, 463, 857, -1469, 1121, 1290, -2052, 307, 1021, -1506, 1011, 620, -2677, 186, 2718, -905, -1603, 771, 644, 626, 926, -1412, -1543, 2334]
3342B334j788l013K910j75j556L320j539k509L298j61k222K272o88k811K291K235
3358B198k671r28J694n56R06J421l914j74N205k613k468K636j385N48K077k815
3374h39j546L762l36j946J421M89k475J564J865k946L29J313k492K684J743n342
3390b752R90M364k214j027J217k261J699K388l164j732L151M94k155J349j28k078
3406a859K921O61l671K450K89k974L078J387m654R71K683r26k8j67j705J367L286
3423C109l033k493L130K90k046K068j723j750M473q91l089L003j02k412K403O44
3439A581k895O86J236j123Q47L72k614J108M093l278k150L034p22j03K045l649
3455a532q75M767j601k597J994o8q73K269q57k006J297J537k465J395J158m208
$$ y = [2334, 546, -2467, 443, 268, -1288, 2032, 493, -2016, 1282, 1121, -1101, 1171, 483, -2328, -37, 2198, -473, -1401, 293, -263, 643, 2064, -1850, -2024, 3181, 568, -1900, 736, -649, -101, 1976, -839, -2385, 1377, 1041, -905, 516, 1005, -1470, 94, 1959, -987, -658, 655, -1837, 847, 2590, -2752, -1762, 2602, 388, -639, 578, -1683, 16, 2404, -760, -2492, 659, 1153, -1002, 347, 219, -1859, 1062, 1723, -1948, 502, 791, -2183, 895, 2282, -2372, -1401, 1282, 356, 328, 161, -1544, -177, 3109, 76, -2417, 713, 1003, -1043, 1025, -698, -2448, 2025, 1134, -1955, 1048, 946, -1466, 937, 1581, -1314, -628, 608, -515, 332, 704, -1910, -802, 3291, 13, -2137, 897, 175, 72, 2117, -1532, -2407, 2360, 759, -1838, 156, 88, -785, 1484, 627, -1379, -82, 1455, -1010, 385, 1543, -2665]
3471b665J566L738l234p47K416j979J421J673l742k9L491j228j981J469k67q08
3487i06J870o50k519K955P46l015K095Q66l214J565J656k278P31M07j973K105
3503D41J625k926j015L083j88j560P54j322j09L223j507l267L316M57k062K091
3519A034m55j898K423R4k219J162Q71k277J031J665k217n67K506q46o33J290j687
3536g23l4L091k550j661K668l87j315J261n88m07J417k59j619J614Q96k630J002
3553b24K129k478n49J461j295J342J418l455N08L184j354j401P20p1O75P7j085
3570c98j096K087O35k614R81J167j335P66N24j629J322K88j943J076J046k064
3586a187P13J384o55n57L02k3L80O52j004j360K220K10k394J327K42r38J428n46
$$ y = [-2665, -1099, 2639, -595, -1342, 1074, -905, 516, 2189, -1553, -1582, 1909, 681, -1300, 169, -98, -906, 964, 314, -2205, 750, 1496, -1519, 576, 1442, -1772, -207, 1449, -829, -98, 309, -1664, 441, 2066, -860, -1875, 1208, 1020, -540, 214, -1108, -1217, 2006, 499, -2768, 548, 1005, -1057, 1034, 579, -1319, 1104, 1198, -1021, 141, 1012, -1265, -234, 1431, -786, -1353, 1153, 307, -326, 964, -723, -757, 2334, -216, -1877, 791, 404, -911, 350, -238, -645, 772, 513, -1106, 508, 1404, -1226, -224, 1905, -573, -1122, 339, -956, 386, 1804, -1651, -1143, 2041, 687, -714, 6, -65, 610, 687, -398, -1494, 593, 1228, -1386, -405, 762, -573, 193, 717, -912, 410, 698, -1245, -169, 877, -1187, -474, 910, 255, -302, 0, -23, 357, 1009, 5, -1355, 865, 1075, -1319, 8, 250, -688, 740, 194]
3604A94j159J752l23j242R18N91j099k06O88J7j81oo97J90K098j483j184J873
3622G41k16q60P79j181L64J187j152m44J025L74p32l10P73K4m96J85o71P05O00
3641F95j907O70J523j271l34O00J38L64R9j150L27J287m12j313N2J121o31J25
3659a7N9n24R89J84j464J299K99j557O69M76m49K68o75K6N84J98m29k91R62k33
3679C74q81O58L52o67L60o66m38J644l54j394J055J76K89m20m73N41j33k68l3
3698b78K97N34p47r93J408K17l92K85r51P82O59j184m18Q63K51l72l02K47N89
3717D95m79k29M47K60J99j134l5Q58k24l28q8k09P67k13o78P97K02k82k55j43
3737b72N99K97j637P03L37j30Ko09P81N97r97J51N08r0j55q81M63P22m03m17m3
$$ y = [194, -965, 787, 464, -778, 140, 731, -368, -574, 114, 131, -50, -56, -753, -563, 1535, 52, -1132, 741, 525, -335, 444, -737, -373, 814, -338, -782, 243, 617, -115, -425, 348, 372, -124, 61, -610, 95, 695, -1212, -542, 981, -290, -624, -24, 114, 478, 577, -573, -246, 1041, 629, -684, -632, 489, -142, -17, 42, -482, 507, 691, -773, 526, 825, -732, -63, 413, -36, 232, -443, -417, 167, 365, -64, -355, 607, 374, -507, 151, 503, -164, 196, -470, -908, 736, 382, -1012, 43, 219, 508, 88, -385, 156, 23, -245, -278, 19, 553, -194, -1187, 221, 438, 46, 331, -620, 162, 821, -363, -781, 82, 333, -39, -341, -94, 495, 16, -213, 234, 494, 693, -441, -476, 382, 158, -170, -258, -467, 300, 87, -591, 206, 408, 126, -129, -272, 327, 624, -1013, -310, 27, -103, -101, -710, 71, 668, -329, -178, 330, 240, 85, -796, -333, 389, -14, -431, -474]
3758d74N11O76r71j09Q83J06o10Km30Q78k45j104Q59K17k12q4k01R23Q7o94k76
3779b68N37q8J0r10L66O35o04J12LJ53P40p09l66J076l67o32Q5J30M52m89m96
3800f30M58K52J69k54n94J108k88o55M52nP6k14p91N42J330r47k62k9M43L80n66
3821b5O3J17Q2l83k69M36O46j174j35J121n0j01l08l96P15J75p46R6N57l37k80
3842a96j73N38K88n07k16L5Q10M79j418J46Q34j149N83j89k07M82k09l47Q38J11
3862E33k77q95O28P86r62k28J32lJ055n57j077J134K59q79M39K15k58L86n41m35
3882e45R29J23r86l38J121o0r13R09j50oL85j007O3J582j062j131J318q1m17L93
3902A27l89j09J006M2j358O65P50j018k94J231r65J02P38j056N86Q85j488N6J758
$$ y = [-474, 37, 713, -258, -367, 516, 622, 12, 14, -416, 462, 217, -887, -28, 189, -23, -107, -308, 615, 702, 8, -268, 269, 181, 191, -719, -353, 282, -322, -210, -207, -54, 686, -23, -389, 687, 320, -312, -227, -97, 355, -134, -630, -172, 80, 249, -5, -599, 509, 221, -434, 18, 13, 89, -125, -916, -374, 956, 9, -253, -282, 161, 541, -25, 38, 155, 237, -146, -415, 21, 667, -507, -642, 479, 429, 328, 20, -376, 339, 514, -232, -136, 421, 84, -196, -369, 169, 457, -50, -266, -231, 579, 1058, -360, -214, 620, -529, 54, -135, -342, 140, -69, -416, 422, 533, 256, -639, -11, 775, -187, -415, -283, -286, 769, 212, -865, 269, 528, -351, 88, 303, 45, 431, -110, -545, 384, 507, -479, -817, 304, 244, -669, 240, 90, 84, 469, -538, -475, 1107, 45, -1086, 232, 151, -266, 127, -262, -371, 635, 677, -681, -16, 734, -284, -578, 653, -312, -210, 528, -528, 58, 943, -545, -489, 1269]
3921A269j044j146Q23J39m10P64o77r19J897L47k039R29R70j231O40M29j502R27
3939A66P69j987Q74R95j123n47J538l44q60R46k37r21J639r33j558K263L27j994
3957i87Q38M20r13J174M9j343P56R82j604j7J524j299l27J495q69n40J400r24
3975a85n80K380j658j540K487j30j798J286k49p76J327m2j667R30J302j360l01
3992e74J587j712M04J522k105M4J992j651m82K745j639j313J873k50q50J020m62
4009A49j315J819M50k503R67J628j851P20J097k645J721J463k812K52K305k089
4025f44p9J879j113j009J463l18r29J815q21k187L090J97l287J867Q30j883J686
4042E57K16k534J903J372k385L48J882j579m98J850j344q75J965j120n50K283
$$ y = [1269, 225, -921, -98, 41, -369, 395, -282, -1201, 696, 1043, -996, -67, 903, -328, 312, 741, -761, 166, 935, -1052, -178, 817, -306, -853, 685, 341, -519, 427, 190, -731, 908, -25, -1583, 680, 1007, -987, -149, 271, -642, 532, 581, -762, -6, 976, -628, -645, 879, -420, -747, 748, -121, -661, 739, -185, -765, 1615, -43, -1583, 904, 774, -1024, 262, 13, -763, 564, 522, -1145, -215, 1087, -273, -574, 1013, -699, -295, 1227, -878, -834, 1158, -493, -975, 1770, 131, -1182, 691, 441, -409, 611, 149, -1166, 653, 1103, -1400, -433, 1195, -656, 64, 1161, -1484, 237, 1700, -1112, -860, 1445, -644, -723, 1156, 43, -966, 497, 179, -750, 1065, 244, -1943, 1147, 1344, -1943, -76, 754, -1129, 557, 773, -1761, 142, 1514, -871, -523, 1359, -220, -718, 1132, -212, -1087, 878, -242, -792, 1491]
4058A491j255k051K942K1k509K007o70o97J777p22k358K115J513k354J31J670
4074A051j513K62J478k048l73K918k203r69K831j739j031K240m67j233J883j082
4090Er54J938r2k576J334J674j944M65J059k277J259J959l052J45K603j873l7
4107c64J891k139j88J931j412r57K115q71q33J936m58k303J891J228k378R48M71
4124E08k267K248J021l006Q02K019j670M97J006j864O1K190j621j389K357j004
4140a12j646K802j43k231J645O2j255K320r30k453K412R35k524P17J124j203O23
4157A43Q84k065L07K329j554j328K413r91j145K208j310j165J975o86r34K141
4173A222r12j713J630J120k291O01J345j653N64J480k489j8K574j628m30J433
$$ y = [1491, 236, -1815, 1127, 1148, -1361, 646, -24, -721, 1056, 334, -2024, 91, 1604, -750, -619, 1051, -462, -200, 1278, -770, -1143, 1775, -428, -1397, 1434, -305, -1336, 904, 437, -796, 1087, 5, -949, 989, 897, -1679, -345, 1329, -615, -150, 909, -1368, -109, 1850, -1202, -1057, 1546, -327, -364, 1527, -612, -800, 1131, -281, -1238, 877, 6, -827, 1109, 651, -1652, 239, 1467, -911, 37, 508, -1759, 489, 1510, -1496, -694, 1325, -345, 152, 1158, -706, -645, 1545, -76, -1465, 892, -112, -1758, 1044, 901, -1330, 315, 377, -878, 1442, 512, -1941, 471, 1406, -1118, -401, 723, -480, 143, 1027, -1038, -731, 1598, 44, -1284, 1129, 138, -1007, 1201, -109, -1274, 701, 15, -919, 1222, 310, -1403, 227, 1347, -944, -343, 1002, -651, -87, 1393, -1096, -1114, 1460, -168, -598, 835]
4189H35j322K46J745j538q80J566p36q01J621j98k065J943O19j710O36O92j395
4206g42J291O50k703J129J795j761k87J044j150P36J180j752l99K021n32j186
4222f66J041q9j129J337l2j458J661k30j485J751L23j771O84O77p65J55mr56P05
4241b51J280j067o93J344m27p41J186q61n20J288n58o98J401p77p17J300L7r13
4259c87K11M66l88K80J80j061L74J241j316k27J003o59K36P05j289L03J211q74
4277In38R45k99m03K87J55o88K79N86p94Q46L11j385N24J144j162n3L74o98P39
4297A79L68r19l8P71n4n81L87L30n26o2K65o20R80j73j045Q16K98q43O98O4l20
4318b5L40k90k10O06j16o14j94P12l5n49P22l37j20P54n70m11Q91m22n55P53m64
$$ y = [835, -487, -241, 1504, -34, -914, 652, -84, -885, 736, 538, -1527, 416, 1035, -675, -39, 653, -742, 549, 1199, -1504, -375, 1420, -341, -628, 416, -734, 2, 1182, -570, -969, 1052, 520, -666, 375, 286, -843, 494, 462, -996, 665, 435, -1050, 701, 1024, -747, -63, 614, -151, 4, 0, -956, -251, 1029, -38, -731, 613, 186, -555, 631, -230, -750, 538, -20, -718, 683, -94, -811, 489, 526, -387, -176, 290, -98, 182, 362, -699, -325, 916, -400, -627, 376, -283, -47, 658, -631, -328, 883, 9, -529, 416, 117, -286, 1, 156, -532, -253, 333, -461, 385, 696, -689, -165, 979, -183, -236, 138, -560, 179, 547, -372, -410, 361, 307, -274, 113, 443, -83, -145, 120, -500, 480, 307, -738, 78, 376, -467, 231, 295, -25, 315, 25, -185, 421, 305, -309, -503, 209, 174, -375, 347, 10, -110, 644, 74, -337, 554, 132, -423, 330, -134]
4339a34j59K68r8J65N9j95q0K13M37k72p52Q35k50k76O36o75K84O45q23J82O7
4360G7n9k0k52n9M47q7k47k84N86J52l07l48Q08k59m64K76k12N47K9q49M44K49
4382A68m89M71m44M56L43o39J35r2J43P1k69k4N56m84j48K43j08M55o44P9N03
4403B82L9l07J97q8K03l23j95J78J41l56K47j46L73P5n95J77K66Qk84k60L08J09
4425D9l97J99J51L8k4l36K06N22m37J60k70K03M18o04j38L43J25j90K24k97J72
4446A17K2k34K69j90J96k20l02K68L84m77N2j41M29J8l77P9L29j76j71o6L75P1
4468B55k73l01L90nj37K0L14J22k96l16K25q5J87k67k58Q04o2n89L41N6L96l18
4490B03q3j66K23j74j65j88N15n7l70K14K71P9k11k16J11L39o10l31O82j36j34
$$ y = [-134, -293, -25, -123, 42, 101, -94, -174, 39, 476, 204, -548, 287, 37, -239, 397, -278, 6, 651, -172, 10, 77, 18, -2, -254, -313, 134, 47, -200, -484, 102, 254, -53, -401, 407, 148, -316, -40, -252, 295, 324, -525, -81, 168, -321, 150, -294, 162, 505, -134, 1, -91, 52, 123, -146, -170, 386, -98, -246, -3, -111, 344, -300, -221, 282, 321, 14, 211, 123, 326, 3, -192, -14, 127, -229, 18, -128, 245, 320, -275, -98, 168, 176, -108, -368, -60, 49, -348, -149, 2, 40, 16, -320, -114, 408, -29, 131, -139, 64, 482, -122, -260, 83, 208, 18, 242, -55, 117, 139, -95, 174, -16, 180, -40, -342, -74, 310, -167, -115, -256, 173, 191, -186, -107, 222, 46, -125, -191, 184, 255, -18, -319, 71, 66, -71, -51, 263, 385, 89, -227, -2, -87, 100, -167, -425, 379, 317, -272, 69, 125, 521, 203, 120, -46, 177, 3, -162, -350, 165, 108, -262, -48, 223, 302, 91, -125, -14, 325, -285, -616, 66, -70, -204]
4511b04L4J00K67k20R2J23l23L94l05l3J25k06o5J10l12O90k87j46J31K48pl03
4533i7K3K93k43l88K97k6L77lp01L90N38k47l17R5j3M9j01r7M07m14J98j33K66
4556A53m5k45NL84l20K42j23l95N03j3l67K72K98l68O9k57R0M56j64j11m82M92
4578G4L0m82K38R5k81M06k3n28J012o37k63L46L41n87k33L95L06r1k51j79P7P41
4600E06l79o75Q34R8l41K26l57k06P93n81j99Q19o18k8J58R3J25m76K96K2n7N5
4622A08p77J96J178n61n71M61J46r1L51o76J22K12R9l20k63N28k99N3J78Q3j66
4643iL11m08J45L15r10L31R65q83k87J54k87R80j20l45l26N49J57m43q0M02k50
4664c9J03n8m31O35K0o92N74M86o17m7L41l32K82m24k14O04J97k47o51O53J87
$$ y = [-204, -170, -70, 197, -23, 69, 192, -131, 263, -42, -75, 50, -156, -221, -111, -423, 267, -20, -166, -35, 213, 206, -97, -74, 219, -24, -412, -115, -141, 236, 233, -468, -78, 460, 213, -104, -9, -22, 27, -74, -171, 236, -178, 20, -113, 153, 108, -137, -132, 252, -68, 174, 51, -344, 159, 146, -221, 51, 349, -19, 50, -207, -117, 339, 175, 64, -418, 74, 104, -378, -140, -45, -326, 80, 57, -471, 541, -96, -359, -13, 328, -259, -492, -97, 209, 118, -133, -312, -235, 506, 127, -548, 286, 384, 43, 269, -88, -294, 499, -82, -281, 538, -80, -108, 50, 143, 268, -208, 88, 110, 53, 108, -669, -473, 705, 144, -427, 34, 180, 89, 440, -236, -114, 98, 197, -123, -386, 142, -157, -104, 74, 157, -9, 302, -106, 39, 354, -556, -225, 740, -143, -430, -276, -563, 417, 297, -48, -374, 175, 332, -111, -191, 211, -39, 64, 6, -425, 210, 230, -462, 112, 598, -19, -66, 275, -57, 225, -199, -413, 191, 388, 141, -510, 143, 330]
4685C30n37K04k5l99R84m12q17O56M0k65M60q0k06k45O26j63k08p8J93k16P26
4706E68o36j71M30Q8j97j84k17o6R00k16n80P3O01j70j04ol45J47K42j56J1L00
4728C12k70j74O08o49r0K97k57K14K68m50m1O05M6n68j09L91J75j76l6n52M54
4749bM93o93j63M69j48J11J55m17M0M05k57K37Q1n03j98N94K81q34l5M57j1L92
4771D54m49m79L73L54l93m9K70m24M17J63j39k49J63K7j27J81o0m49P03J96o07
4792a24j32M2K73M44k95n12M37L54l33k61n6L39K58j69n24j22N56p4k56K75J9
4813A39l02N88m05k80N84m67k99O72r3m85Q5P25l49j37M2m03M42M54o16j12O56
4834D39m43k0J64l48j76O57k45j26K71j07j33M98n8p57J51K88j15K42j92j7L15
$$ y = [330, -207, -3, -28, -427, 557, 145, -672, -16, 24, -241, 219, 139, -67, -312, 314, 151, -57, -135, 58, -158, 568, -68, -239, 191, 279, 82, -102, -319, -385, 515, 299, -281, -208, 393, 223, 119, 113, -232, -85, 157, 1, 12, 312, 42, -132, 476, -173, -263, 34, -223, -9, 259, -191, -232, 373, 419, -149, -258, 133, 308, 132, 96, -456, -2, 491, -202, -365, 104, -44, 67, 222, -195, -155, 250, -7, 230, 311, -192, -390, 204, 485, -349, -384, 73, 62, 454, 5, -474, -101, 253, -140, -189, 81, -343, 74, 237, 98, -151, 12, 39, -88, 93, 33, -416, 287, 483, -124, -256, -214, 59, 503, 208, -304, 133, 487, 154, -107, -163, 176, 434, 265, -259, -381, 175, 101, -155, 120, 139, -163, 425, 20, -260, 324, -143, -442, 230, 137, -348, -263, 462, 113, -24, 18, -385, 57, 511, -105, -217, 439, -4, -24, 140, -208, -384, 273, 28, -98, 173, 66, -67, 431, 373, -384, -233, 55, -60, 182, -10, -27, 288]
4855B88J39p28k29J026k48o5k86l49M27K69l14k94K38J40k14L28K19n23m0L58
4875A42n8L21k57r31O84N81o05K1j8J22K36o4m95j04P46k47k83K98K8m35P53j91
4897B44o16J112n79n39O58l4n80N70J83p96J19K04L4j38O50r22Q1P85o9o96N55
4918B26k48k5K47l91J7N79l10r1J19K78l12j57J23o1l8L22n38J21N87p26J18K45
4940H5K1P7R8k47q1N93m84l28M10o0m07M52j86J5R0L57o09K84J69o27M95J46o15
4963c52J83L26m56L80M4m46J99N03l35j31l6L44j39j93J20k90M85k90o8M81p3
4984B56m57K63J29j20j8l74J63M2M81l78l9QK57p66N48J41k82L15j3m37P73n59
5006f7k86N00n6k15M0K43k07N8J56j84NL60m55k24M37q2k59L20m00M29J35m80
$$ y = [288, 427, -301, -530, 496, 248, 183, -103, -452, -25, 244, -70, -364, -126, 14, -200, 128, 347, -176, -216, 142, 84, 405, 148, -783, -99, 482, -123, -102, -120, 2, 238, 174, -321, -425, 321, 74, -209, 89, 117, -318, 435, 244, -372, 740, 161, -378, 280, 246, -334, 236, 419, -377, -258, -54, -20, -158, 492, -430, -349, 436, 367, -329, 226, -22, -47, 200, -191, -174, 405, 95, 4, 123, 401, 89, -68, 55, -6, -44, 278, -260, -139, 448, -278, -160, 85, 106, 183, 281, 34, -47, 546, 62, -266, 144, 84, -323, 129, -57, -42, 48, 405, -204, 80, 249, -378, 117, 263, -352, -169, 157, -299, 81, 125, -321, -122, 381, 46, -85, -121, 223, 84, -109, 11, -279, 206, -84, -152, 329, 256, -201, 62, 191, 71, 53, -321, -158, -116, 365, -13, -52, -44, 213, -553, -5, 136, -146, 169, 156, -281, 492, -67, -353, 147, 91, -124, -84, 159, -48, 10, 166, -18, -13, 347, -108, -332, 105, 23, -236, 84, -316, 113, 248, -232]
5028b32L37n2J13j22o7r7J03r9N6M2l6K76n90M43L61n08L5J28k72J81k51Q4J16
5051e1J35k37J47K50lk05k17K19J01M3m73j07M20J16l80J14M15k07L7j21j0J39
5073A25J18l15q3M67l48k8j98N27k28L8K71n73L40j11p9P7k36KK7J04J63ok15
5096a61K01j60L27j0l86J99K84l59q4K29MJ09j73l05O04l28MK52k01J01k68O2
5118e9O6kj70k20J8M56J15l57K21l07L48o4k61J74L28l73J92j20j02J04j04K5
5140i2J76m7%M0n1O1k69J4J65j33J08N6k40K29J92m46L61J80j66K4l03K64o0k08
5164a45K26j64K20j44K77l15J59j24L3m9N9J59k77j44K97j51j55k0L11m3J10k73
5186a53Q9p3K26l18j84O25p5p4k6j50K41%k81L05j42j01J06k9M5k88J87P7M4l30
$$ y = [-232, 105, 53, 166, 44, -23, -120, -17, -116, -60, -18, -54, 222, -368, 75, 436, -72, -37, 91, -181, 0, -251, -167, -51, 84, -153, -6, 244, 241, 36, -181, 38, 139, 182, -291, -398, 22, 138, -242, -128, 287, 80, 117, -4, -14, 125, 243, -72, -155, 312, -36, -64, -262, 265, 37, 75, 346, -227, 113, 2, -77, 0, -236, -234, -207, -103, 60, 54, -161, 40, -120, 207, 197, -189, 10, 294, -65, -149, 80, 84, 193, 20, -285, 319, -9, -5, 247, 46, 147, -121, -59, 7, 5, -165, -385, -367, 89, 204, -153, 68, -239, 109, 45, -216, -42, 286, -87, 105, -15, -117, -13, -117, -92, 84, 37, 37, 77, 26, 87, -182, -168, -3, -136, -28, 28, -212, 17, 209, -237, 124, 304, 138, 162, -141, 123, 63, -145, 81, -83, 137, -7, 270, -45, 114, -10, 23, -26, 33, 192, -85, -229, 68, -83, -238, -258, 53, 10, 120, -153, -64, -137, 89, -229, -413, 212, 137, 63, 37, -113, 128, 128, -153, 152, 10, -91, 15, -14, 31, -257, -70, 7, 51, -279]
5210b79L51l51J97M27l37j24K39j32M2K44k19j17R0j09J8Q6K75l26J56K32n60
5231a97J35J0k67K57J2j58L61L7k04p4p2L83k2Ql2j80k3r7j77L02K05k54K35j45
5255D3k59L91o7Q6k10m4m5Q3N6K0j05q0R1K7J77l07M5M99j70j29k04l6L66r5j00
5280C3k48J8L82j51K7K49j92l25J8K85K9j30m09J22N59k91q7K40j5k10J84j90
5302a02l4K72j86q8J97J13k60J9l3j11J1N01l99J53O4l27J42L40m04q9K12J47
5324A38k15J67J4l71M82Q8m19M7K42k78p%pM47k74j7r4K03m32J84J95k53J49j1
5348b2O8j26J84l00J53J61L12o95K79N3k58M78j7l53K23J16n25L13J62k85P0K98
5370B89j00k12j03J32l08L39p3l49K72K90n05K88j54R0M51k72l06L42O4m06J03
$$ y = [-279, 72, -279, -82, 345, 8, -116, 123, -9, 33, 277, 58, -59, 31, -78, -60, 26, 301, -25, 131, 363, -197, -62, -52, -319, -62, -50, -208, 153, 190, -14, -88, -160, 223, 201, 209, 177, -3, -26, -123, -300, 2, 207, -47, 188, 43, -216, 175, 108, 194, -16, -60, -105, -22, 34, 54, -51, -131, -40, -13, 164, -143, -98, 401, 231, 102, -102, -138, 228, 133, 33, -215, -197, 185, 34, 61, 310, 118, -207, -189, 96, 125, -5, -414, -292, 267, -24, -111, 129, 114, -96, 88, -102, -136, 136, -50, -138, 59, 172, -88, -69, -102, -213, -202, 299, -100, 53, 117, -210, -68, 272, -132, -221, -9, 138, -77, 90, 104, -267, 215, 303, -116, -69, 173, -105, -112, -112, -119, 328, 54, 37, -57, 146, -286, -102, 93, -160, -11, -22, 46, -80, 104, -196, -43, 118, 430, -265, 14, 67, -191, 287, 270, -83, 140, 256, -269, 44, 206, -79, -9, 289, 189, -23, -126, 6, -302, 37, -36, -385, -113, 177, -328, -40, -194, -104, 347, 75, -231, 111, 175, -231, -128]
5391a28K54j78J46P1j01j61J19j05P3J62j84j49K45k20K9L78m69J98J96m4l67
5412b35J51K64j06K0P4k41J8K51m48K6L27k82J76K12l12N4K42p4l24K66l97J62
5434a76K31J2l32K15J33J02r1r9pJ12L69o94Q6K70j89j04L38n29J73K45Q7q4P6
5457A44k15j42L66R7n06L89n9j80L60l39k20K20K68l43J13K83j75N7j08J26m90
5478c54N43o4m05M71k19O7J22j17J1q7J23j28R3j14j62L60J78k38K4p6kj26P3
5501b7k37q1Q06m26j08J26k85R7K95k75oK87j12j09n1J21n5j07K23l05K66J98
5523B35l81L2K85j43m4O8J71l59J90l48J51M9J3k83M39j8k37K25J03m27Q8L39
5545A48n41N64m43O2N17j01k79M1N1%l3j35P3N4K61n69J21L05j08k3J00l38J93
$$ y = [-128, 126, -52, 94, 165, 64, -97, 22, -83, -10, 152, -32, -181, 64, -156, -127, 251, -218, -20, 176, 132, -235, -84, 180, 74, 94, 168, -73, -55, 196, -252, -226, 101, -181, -5, 207, -105, -51, 191, 117, -207, 59, -338, -176, 55, 67, -265, -50, 83, 185, 94, -5, -12, 100, 469, -225, -139, 131, -58, -162, 176, -353, -180, 65, 152, 68, 144, -71, -213, 153, 250, -256, 133, 74, -106, 254, -85, -305, -85, 183, -160, -47, 236, 61, 118, 10, 136, -354, 189, 125, -280, 191, -28, 39, 161, 44, 55, -32, 91, -37, 56, -58, -220, 140, 318, 80, 104, 28, 26, -100, -27, -264, -345, 461, 35, -73, 53, -232, -135, 160, -115, -121, 166, 54, -55, -106, 15, -40, -147, 76, -229, 37, 235, -146, -114, 171, 28, -16, 52, 223, -136, 54, -294, -143, -94, -81, -364, 75, 57, -180, 45, 148, -279, -191, 148, -393, 171, -272, -210, 307, 206, -73, -32, 19, 19, -14, -149, -76, -22, 239, -330, -209, 96, -12, -35, 65, -273, -80]
5568h0J66o3m1K38k94j87M1M40l24q7K07l6R7N3n02K86L80n28P8Q5J75j32J58
5591A30k76J88K39j07l0J09l32L14l03J38j40n0lJ47pJ08j46OK56k25j77J77l6
5614b0N0j62K78m45P1J71J0m7J79k4j7P0l18Q7P8l0J23L17o86K32J70J6k58N1
5638a04O7J4K17k8j0j11J7k33J02l0q7K98Q0k07J45N4k02K4L05l42P0J1j04j77
5662b31J84p4k1J18K2j25L16K3l95K1L72k56Q2r3j82Q3M00n34K96N9l5N2k50J09
5686e9KK7k11L12P0k23j6K68kk39J54l9o9K68j15n7j22J67j70L3j45K46j13o0
5710i3J28pj28O3j51L10q7n8N8q7R3L87o25J91J56K71k17j60M47m58N0k64M1N2
5734h8K1k93L54J6m5K31k11QJ00q5l6q8K25j93J00r9m2m0J86o1J62Qm6kk94K31
$$ y = [-80, 86, 23, -18, 220, -74, -261, -220, 220, -104, -191, 16, -20, 77, 130, -372, -86, 294, -234, -156, -71, 104, -28, 130, -146, 42, 281, 174, 144, 253, -79, 235, -68, 70, -70, -120, -123, 24, 17, 125, -21, -15, 241, 16, -161, 16, -20, 30, -132, 146, -299, -228, -57, -47, -94, 85, 61, 44, 114, -204, -117, -39, -69, 54, 371, -315, -83, 87, 103, -155, -104, -37, -23, 194, 166, 156, 45, 62, -171, -69, -99, -186, 112, 192, -15, 130, 184, -18, 6, 311, -31, 39, 50, -54, -231, -47, -121, -142, -24, -2, -127, 189, 212, -183, -162, 210, -46, 36, -57, -239, -156, 244, -290, 6, 65, 30, 82, -168, -59, -57, -30, -241, 71, 141, -82, -98, 170, 168, -71, 83, 44, -25, 243, 128, 71, -51, 116, -54, -21, -166, 80, -33, -93, 35, 28, -100, -37, -188, 122, 35, -23, 35, -52, 41, 428, -197, -6, 150, 421, 204, 44, 491, 33, 83, -181, -140, -88, -67, -360, -6, 10, -35, 196, -15, -7, 93, 8, -28, -116, 109, -84, 16, -83, -125, -165, 21, -40, 122, 130, 84, 82, -212, 19]
5760A9l0K53k37j7J4j6j58J93r8J11j68K97K8m5j72j3M4l0K34j30J49L2l98L7
5784a01J58o9Rop4L01k30J32l09K35j28M8j18L00j04Qj2p9K45m05M1J43jJ60k26
5809h2K04m12L69j63K1O7j78J42n0K03l37J20J95q8j32J6o6K45j63J68j08p8J84
5832G7j91l9J19j97K00J56j29J24m6m3l9K41l43J27K2j68L9o1O1L0K06p3k64J4
5856a77J71J81r1k0PK22k73l73N51l30J87N4p2j83L40l65k1R4J96k45k71M84L5
5879A01K0L0k00M5J75R0j46j70k0J5p1j0K26m5j2M5m2NL6k88L26j47nK79l68K19
5905H8K16m35K04K68l39K25k69P2m7O1J69k32p3J24j05P1o4k72N81l7k65P0J4
5928B5LJ05j8k67J89J63J94m44J99r6l7Q5j81j3K08J43m07K50j47J89k45J32k3
$$ y = [19, -11, 242, 5, -12, 2, -14, -172, 21, -77, 34, -134, 163, 191, 146, -26, -39, 5, -25, 209, 79, 228, 260, -138, -101, 57, -12, -3, -9, -83, 218, -12, 120, -189, 46, -82, -34, -152, 148, 44, 52, 40, -39, 206, -199, -158, -15, -16, 144, -82, 122, -290, 79, -84, -63, 4, -174, -32, -82, 121, -216, -96, 99, 11, -121, -105, -171, 74, -89, 79, -29, -107, 77, -114, -153, -34, -231, -31, 125, -4, 120, 74, 31, -8, 233, -110, 17, 39, -129, -90, -151, -90, -60, 146, 73, -191, -177, -6, 175, 84, 64, 71, 293, 20, -353, 198, -132, 55, 109, 37, -146, 194, -171, -192, -98, 98, -147, -418, 66, 101, 121, 151, -49, -4, 171, 261, 115, -55, -75, -60, -131, -141, 85, 40, 28, 73, 31, 36, 72, -216, 110, -37, -42, 237, -131, 88, 304, -131, 73, 341, 2, 227, -42, 30, -17, 44, 213, -19, -92, 32, -73, -2, -66, -338, 243, 206, -59, 11, 25, 28, 133, 115, -152, 37, 200, 394, -50, 149, 53, 16, 101, -80, -93, 115, 258, -149, 101, -46, 143, -102, 30, 7]
5951GL3J9j63l8M8J24k53L80q8p7L5k71J23J92q7j55J32n4J59p3N8j32N4j1J51
5976A13M1n0m5n2J63k96m6L23j85l9J92l27K65J27k22j72K90m0m0K86k74j24L60
5999B48J6l86J52j06Q0O0M6l32J97K57m20J78K01p9m1Jm44K91J77p7L0J25j32
6022D2k28K79M0m53K16K96k96K68k41r7K83O6l54J09L53r2m23N45m57n3L38j24
6044A7m1j3j53Q0K79Q3l15K60j17j97M20l06o9j18N40l54J1J38k43L61m7m31K42
6067B7R2r4j75M31k79j83N10n17R1J77l5m03Q05l50l90L35mr8j14J42k35L11R4
6090A38k16r6K39O3j10L25m75K30j45K18l53M90m78j65L81J19m76N09J27l45K5
6111EK08k87J38J95l29J61J86l64N2K54j78R6K88m49k25M13k15n3M97l48n21P09
$$ y = [7, 40, 59, -104, -142, -94, 30, -223, 157, 69, -8, 27, -244, -121, 71, -16, -171, -39, -93, 66, -7, 51, -81, -27, -38, 113, 154, 104, 59, 7, 170, -126, -172, 151, -34, -73, 119, -208, 57, 184, -38, -210, 80, 40, 0, 286, 12, -112, 248, 264, -122, 30, -76, 4, 64, 110, -222, -25, 232, -188, -10, 191, 112, 71, 72, -372, -81, 96, 19, 49, 174, 42, -186, 93, 133, -320, -104, 192, -104, 164, -77, -174, 109, 175, -179, -70, 283, 191, -232, 313, -144, -197, 141, 17, -24, -37, -190, -110, 169, 252, -63, 197, 80, -117, 303, -3, -72, -190, 350, -4, 7, 145, -98, 263, 216, -215, 27, 119, 25, -150, 281, 2, -181, 329, -188, -97, 80, 45, -358, 447, 97, -293, 42, 38, -60, -174, -32, -267, 44, 138, -78, -174, 65, 128, 18, 343, -132, 98, -47, 171, -182, 308, -170, -335, 46, 165, -311, 198, 325, -20, 5, 213, -74, 64, 259, -70, 91, 277, -87, -35, 219, 41, 137, 425, -24, -249, 164, -51, -104, 393, 45, -476, 233]
6133B33k09l50N92J1l84K49j5m02L93j04j6k6K28m46K45K35j96j24L66k42l17
6154b79M38l59j14Q04l88l78M04pm90M82J21k33N2J93l67J41K33m38J29N22m75
6175il26M56m96M6Q08q40K67L52k59k31L69o2j67L24o7m25K81j37j42M13jj99
6197d5p7L05k43k02L05l33k5N98l62l65O95K9r4j48j80k70N87L8m29M81r4m48
6219b77M66j2n15M20J76o5k82k7J0J15K56p1l49K85n5j30N5n9J4L64qk63J90l90
6243a52L9K48j97j94N57l85j38K8M61j19j87J13N0k34K47J3l32L32n77K00M82
6264B55k66k23P3n7J83J31qj03%R6k92Q4J46l13L98Q4k45q5J52K25k34P7n2j79
6288a53Q6J01n6N7mq4R4j80q5J62P4j61q9J05J30j03K57j27Qj52J44Q3J44j90
$$ y = [233, 24, -326, 266, 277, -107, 142, 127, -275, 118, 14, -2, -28, 200, -246, -1, 234, 38, -86, 280, 38, -279, 159, -200, -314, 490, 102, -276, 128, 121, -369, 113, 234, 1, 53, 246, -121, 20, 253, -185, -56, 466, -9, -335, 121, -375, -329, 479, -361, -94, 258, -1, -232, 137, 75, -92, 232, 165, -260, 21, -116, -258, 155, 154, -45, -122, 183, -60, -262, 43, -290, -315, 283, -79, -444, 251, 280, 186, 38, -142, -412, 175, 213, -216, 265, 171, -277, 189, 177, -338, 82, 258, 193, -89, -116, -106, 9, 265, 194, -155, 130, 75, -55, 0, -59, -45, 319, 311, 48, 238, -152, -113, 135, -62, -256, 301, -84, -222, -194, 267, 148, -39, 74, 124, -110, 137, 150, -182, 150, -427, -227, 255, -11, -234, -161, -218, -35, 96, 88, -15, -15, 81, -211, -127, 19, -294, 104, 188, -57, -142, 10, 235, 1, 78, 26, -153, -67, 34, -22, 35, 31, -53, 41, -139, -224, -62, 12, -149, -238, -133, -3, -106, 151, 24, 32, -120, 24, 107, 251, 61]
6312F1k38L38m92J54K7J3Q3J82J12o09M77P2k05K67k71J03o0k2k1N9J03l55N17
6335B95k13r4j03L52j1j82J95m01K63r8n9j47M22m69L41j58k23K35J94m24L21
6356C6j10J43j76K82J9k80m9J81p4k92M60j12J70o3j97j92J44l6M5j2o4J80J32
6379A35l49n8M03K2q4k40J72K16j25j56j77J41l43N15k0n9L3k08J59P6k33L87
6401B07l15j02J79Mj3M1K39l43K68l63J70j7J04k89K90O2m03M25k17K86k54q8
6423a29O9n8L10k20j51L72j96P0j29m9n3M6K44k34K12j44K42j28k64K9k09M22
6445E2O6l48K17p0o4J03RN4j06K20j19K66k93m3K41j70j78P9P4oj5N6J98O7m60
6470a70J05l7L67j07l42K25p3k6J68l9o9J73j82N7k6J0l42J88J69j00K82n51K60
$$ y = [61, -177, 161, -331, -177, -150, -137, -54, 128, 240, -369, 108, 180, -25, 242, -29, 74, 14, -8, -29, 30, 133, -222, 295, 82, -12, -115, 237, 226, 44, 239, -162, 101, 3, -56, -203, 219, -250, 91, -67, -290, -55, 139, -285, 36, -74, 69, -107, 175, 194, -86, -135, 46, -28, -320, 140, 28, 198, 135, -62, -254, -110, -146, -101, -113, -177, 3, 135, -214, -272, 131, 153, 69, -171, 1, 217, 92, -64, -241, -100, -443, 72, 52, -7, 26, -182, -23, 53, -180, 207, -108, -210, -31, -27, -40, 1, 240, -103, 165, -198, -28, -45, 59, -230, 60, 122, -281, 144, -73, 213, -41, -129, -60, -118, 192, -28, -179, 193, -3, 67, -62, -111, -164, -118, 126, -108, 104, -40, 202, 74, -190, -161, -370, 52, 118, -230, -13, -83, -147, -44, -35, 19, -87, 133, 14, 280, -13, -56, 185, 15, -163, -84, -10, -16, -31, 25, 223, 290, -170, -65, -102, 265, 158, -184, 41, -32, -58, 110, 71, 2, 175, -7, 50, 24, 34, -308, -120, 49, -51, 231, -320, -60]
6493f0J44j86k8K21L3k0Q9j57l88J60M20k57J06p4J71k03M4J43j49n0L20k90N1
6516D0r7J16j59O1j7J84k20K31K7Q6k85l18P00m65J09k32L88k42m4O4lK31k19
6539f4M6O1k4k20P9J33j61L22m5L0o9l1j18J39l7q2R1j22J48j06L3Q4j00L2l27
6564c08J23N8K6J85j24P6k49K10K05q0P0p8l86J96K73j54j60K60j05m2J37k86
6586a53p8K04J0l24K53J28j72L39p5j12R2K74o89L31L13m84J63k64L69k08K2K3
6608c8J44J12j95j96M93k53q1J70m1o9k58K83k65J64j09O0J44Q3k64L88n60M18
6630A30o9K9k47L69j10j54O8l9j6mK36k95o1K09J45j18j46p7j26L71O7k49J14
6653B7Q1l55K71J47k80j05K84l58J24L10k89j37N39l34M0J79m26J12K49K2j24
$$ y = [-60, 84, -102, -130, 91, 124, 104, 193, 36, -352, -192, 228, -29, 77, 3, 174, -29, 15, 158, 9, -41, 279, -11, 40, -57, 59, -100, -39, -56, 128, -92, 139, 166, 252, -33, -351, 349, -116, -7, -239, 149, -93, -137, -73, -76, 155, -64, -18, 43, 19, -201, -122, 11, -150, 172, 127, 157, 88, 57, -61, 78, 41, -41, 50, -72, 76, -30, 3, 87, -13, 19, -308, -185, -127, -101, 84, -40, 36, -213, -3, 202, 122, 192, 114, -272, -76, 197, 43, -117, 143, 38, -4, 133, -153, -231, -27, -17, -341, -88, 40, -132, 207, 132, 20, 112, 386, -303, 28, 341, -143, 20, -244, 125, -83, -61, -38, 106, 218, 23, -173, 320, 67, -14, 156, 115, 46, -212, 71, -194, -30, -139, -79, 65, 148, -116, 272, -288, 130, 61, 90, -157, 212, 102, -52, 16, -23, -39, -43, 193, -102, -163, 46, 191, 73, -73, -150, -276, 95, 162, -87, 27, 108, -247, 24, 171, -109, -214, 70, -288, -164, 146, -143, -280, 259, -75, -35, 144, -282, -170, 79, 101, -23]
6674b3k06M20l20J4L33m59J91N95q93K52K23k64N7K24k30O9L55l33j48L32j40
6695D9k20K04n3j94K53K58p47O01j63m3K56j07l22J51K30k34J26P9k9k33N15m36
6717e9l5K08k53j66M17k44j25L32k77K41J65l5k25J11j83J8J88O8j82j21M08l21
6739g0J09M37m21P7o4l65K56Q6j83k64L73k31O4L03q4l44K95%j75L9R8k37L85
6762H4J36n46L33j14q3L26J11k27j62J69O9r8J30o5l72N93k76j06J58M6m23N11
6784A94l12lJ09J09j98K43p3k42K65%j89K14N7k58L0L11k65r8M16n10r5M94k09
6807a0rL90l29k63L87j1k74k51L06k26O40k59n26N92K2l53R8Q1k12K92L02m16
6829b9j02K53p1l05K55j53p1L63j21k38L63O8m10K37J38n38M32j4k91K07L15n69
$$ y = [-23, -229, 191, -129, -115, 218, -241, -50, 545, -348, -96, 127, -137, -80, 144, -86, -17, 338, 5, -143, 189, 49, -171, 33, -20, -214, 39, 297, -450, 151, -12, -55, 201, 94, -228, -77, 153, -81, 45, 124, 95, -138, 377, -59, -94, 114, -139, -305, 112, -132, -257, 75, -202, 39, 204, 169, -56, 55, -128, -110, 78, 146, -36, -157, 251, -70, 39, 476, 55, 132, 68, -297, -41, 45, -138, -402, -29, -260, -196, 107, 23, -321, -26, -26, -201, -162, -64, -301, 84, 220, -326, 7, -107, -190, 136, 247, 20, -142, 27, 96, -2, 128, 63, -309, 284, 8, -98, 60, 106, -317, 194, -118, -121, -12, 97, -101, 142, 69, -173, 92, 92, -97, 117, 174, -84, -54, 257, -8, -106, 310, -200, -295, 199, -10, -19, 371, 42, -221, 166, 155, -119, -370, -64, -290, 350, 91, -435, 157, 179, -174, -76, 5, -207, 85, 387, -29, -131, 122, 51, -254, 1, -152, -223, 140, 19, -219, 144, 212, -198, 39, 177, -361, 71, 57, -234, -27, 288, -281]
6851b81L86J78m23J52m2p0j34L84q4j63K69k54R6K28rn93M79L59o22J03J02k08
6873a47K72n8l16K08K12r2q7J14r7j41L07q0k42K00m6n4L41o41J96M5Q8O5O4J54
6897B65k78p7J35k22L16j0pk07J07j48J37N09o22q2L99k32k83N36k07j80L14k06
6919d3q2R0J34k49J67K13m43L22J46k90j27O43n42J6K82l46J31J31l72J25J43
6940D9K6l08K37q4M3K03J72n31L01Nk63J47J81j06p8k9k19L11K31m23r9PJ46Q3
6964Bm3M5J14L08m98J37J4j70l5J50M7o1j15L98l39j21P5k16K69J63K55n18L15
6987A76r2k53J62N4k21N04l53j07J57k6k09N04j66p8o0J63N9m60J61K39k72J20
7009Bj54L89L2l15L91m06L2j14K37k67J69q4L73l32L61l76L9J45J19p0k04q3N9
$$ y = [-281, 105, 283, -140, 12, -30, -100, -234, 150, 66, -97, 172, -82, 14, 242, 233, -360, 119, 478, -144, -41, 61, -147, 125, 67, -249, -41, 171, 79, -8, 106, 9, -132, 175, 95, -147, 53, 7, -47, 294, -347, -151, -106, -18, 47, 111, 265, -13, -90, 45, -177, 139, 129, 122, -85, 22, -126, 11, 520, -102, -184, 215, -17, -300, 236, 29, -151, 163, -43, -125, -35, 99, -150, 17, 230, -213, 109, 255, -35, -162, 481, -61, -45, 237, -109, 22, 153, -219, -94, 49, 75, -233, 4, -80, -37, 166, 338, -193, 108, 113, -150, -3, 178, 72, -6, -35, -254, 57, 288, -135, -234, -227, -81, 2, -41, 4, 118, 426, -72, 65, 79, -91, -126, 24, 71, 10, -105, 293, -46, -167, -92, -308, -39, 124, 379, -139, 176, 84, -169, -7, 47, -174, 330, -23, -130, 27, 1, -208, 296, 130, 52, -8, 155, 214, -246, -85, 154, -118, 2, -152, 237, 269, -46, 345, -61, -29, -143, 94, -173, -4, -88, 285, -47, 314, -62, -23, 122, 241, 171, -33, -116, -57]
7032e7J86j06k75J24J39jn5k1kk12K62j0J83l37K09J8j99J17K0l3L9M9j82K11
7056F7j3J37j52mk45K6L78j48j54J43n8L2K30k60j58R6k28M88k63j47L14j70p0
7079a59J90o7J7J82l60P7R2j44L13k42l7KJ1j38R2J36l7k5P0K39k53J95j85j77
7103b08L16L1k31J51kNO5j70L44l25K4N9j71J05j50j12M71j57q8j4J47l6J00o6
7127H8J8q4k28L20j65J64r7%j66L70j76q2O5j48O8J20k45Q2K44l8m0q0K9P4j11
7152a8m2J33j60J75k25J18J51j27K43j53j29J39k87J79J21k84O8M5L2J17j11n
7174b0K9P9L2orr1m8R2L0j19jJ3q2J09j43J78q8J74n2p3j01J98r6M9j9M8j04j32
7202a53O3Q4J26k08j1P9R5J67l38J99j49L37k84J21j34J14j16k0R6p3K0LJ55M9
$$ y = [-57, 129, 23, -252, -128, 11, 10, -45, -66, -68, -280, -18, -28, 155, -182, 27, 45, -154, -37, -17, -50, -11, 38, -144, 67, 54, 191, 39, 35, -210, -184, 194, 46, -108, 35, -23, 9, 239, -21, -179, -83, -311, 177, -86, -233, 81, -89, -159, 31, -36, -19, 163, -197, -120, -28, -172, 141, -101, -138, -136, -125, -263, -171, -35, -72, -97, -27, 212, -41, 154, -31, -208, 108, 139, -92, 59, 57, 62, 127, -43, 301, -24, 0, 59, -112, -7, -157, -269, 202, 45, -43, -57, 90, 54, 154, 88, 106, 22, -206, 114, -51, 113, 16, 16, -150, 220, 44, -38, 27, -121, -53, 67, -178, -96, 148, 110, 70, -10, 19, 93, -18, -60, 73, -87, 88, -137, -19, 132, 5, 248, 95, -34, 105, -182, -3, 118, -166, -98, -53, -21, 96, -15, -20, 9, 88, 120, 114, 105, 14, -34, 58, 88, -31, -32, -19, -101, 8, -135, 43, -45, 129, 77, 4, -97, 101, 5, 54, 35, 83, -21, -153, -90, -6, 120, -88, -99, -20, 75, 242, -96, 103, -46, 291, 7, 128, -6, 108, -8, -28, 68, -5, 15, 18, 173, 222]
7226B22q9l63K90q0K30k28J19j32R8Q7j73p1J91j88N7l1K09l02m2M11j65j4k9
7249GR3m0J36j93j26N0J41k19J04O5K9L17l95j39N06k35k89K49J28l34L57k46
7271c4k7k73J67K49k6k9r1j52K32j00n6K15k38J20K08p3N0j75o2K10m9R1L8q4
7295A11L4k25J91j02m2j03L47k76R2J38m06L04J13j11j19J05L7q3q2J8k86P57
7317D12l39j27L08j78k42L46k05j42K26K43o04K71k29K11K28L4j33j89M90n63
7337a82L10m8q1o28N24Q0j85K29j02j64M80k93n0J27Rk6o1M6j20J67o2p3m9N7
7361i5J60J2l4k96K98K23l17N8p7J61j37M12m09K03j11j77J35j0R5m5J24r3o2
7384A8l7J52k25M6L22m37R7L29m06P0O5j30J92K56k65l00M48j43j79K68j22p0
$$ y = [222, 133, -230, 60, -20, 210, -18, 101, -31, 67, 154, -19, -90, 101, -87, -30, -61, 148, -154, -196, 215, 50, 36, 7, 100, 60, 196, 3, -123, -73, 68, -151, -47, 18, 47, 364, -31, -170, 336, 101, -188, 61, 189, -145, 212, -34, -61, -334, -167, 82, 56, 27, -64, -216, 16, -84, -140, 75, -163, -43, 165, 92, 142, -33, -95, 115, 66, 157, 195, 111, 145, -80, 111, 9, -33, -136, 211, -65, 27, 165, -241, 63, 176, 65, -54, 51, 88, 5, -77, -59, -345, 412, 73, -54, 254, 76, -166, 180, -25, -167, 59, 302, -302, -31, -260, -49, 179, 213, 80, -109, 381, -182, 128, 80, -1, -629, -105, -25, -210, 19, -83, -247, 233, -60, -110, 17, 26, 0, -61, -15, -135, 32, -30, -103, -152, -95, 65, 77, 43, -253, 45, 268, -49, 9, -68, 93, -44, 368, -41, 162, 51, -126, 9, -1, 94, 49, 173, 80, 18, -19, 133, -92, -46, 276, -161, -64, 265, -141, -71, -6, -136, 56, 312, 47, -253, 195, 52, -127, 141, 19, -51]
7406e1r2M49n18L82k44l8K71K30o17j37M50j20O1K35n08L49K59l22j17N9j3j85
7428b17K43k1k01L29K3n43L30Q0m1K24m04J4K13K30j60j78K10l17J87K90j43k79
7450a31J34NJ68l8j24l93M46j2j87L24m69K96K72m47k8J08L78j95j20J24j31o0
7472h0J42o5j64K43m66J64M24l25M0K84l29Q4L04l72J41J53n5j65k01L94m13L27
7494F5J15n00L53K63l13J78l48J8K64J59l46l3J45Q4k55K3J87j15J4Ll26K75K47
7517A57l43L06j02l06M61K1l01L6K19l32J64K76o07N9L73p2M9j7j39j19M72m04
7539a49j3L91j49l01M33l09l77P49K5j77q0K89o05K28K73l28o8N72n45kL84j81
7561F0j91K06p9j87K11k4j19J01J61l61L3L94k10Q7j06j00J50K01m57L22J09k90
$$ y = [-51, -143, 306, -212, 170, -74, -112, 159, 389, -228, -365, 85, -35, 26, 261, -247, 102, 361, 39, -78, -19, -32, -217, 26, 5, -196, 133, 156, -387, -57, 23, -18, 206, -198, -184, 29, 259, 99, -79, 131, -186, 1, 291, 148, -131, 3, 8, 176, 138, 14, -379, 67, 55, -132, 192, -277, 19, 291, -156, -184, -76, 302, 107, -13, 111, -20, -80, 62, -3, -167, 76, -390, -226, 198, -127, -87, 197, -132, -48, 256, -116, 25, 178, 123, -42, -243, 151, -262, 65, 180, -320, 33, 296, -17, 161, -187, -169, 95, 254, -92, -125, 20, 104, -151, -128, 59, -56, -42, -39, -365, -90, 157, -186, 120, 18, -288, 173, 194, -107, -71, 148, -184, -20, 256, -351, -292, 81, 9, 58, 41, -98, -217, 255, -149, -162, 229, 80, -221, 212, -97, -474, 275, 300, 123, 43, 332, -273, -45, 228, -100, -168, 404, -141, -143, 241, 60, -131, 75, -4, -191, 20, -4, -123, -22, 139, -222, -189, 205, -5, 82, -24, -124, 26, 227, -230, 92, 201, -89]
7583h9j13J72po2J26k08L1J37l8m4M05l36k12K64R2k33J71j23L14j94l37j31L37
7606g8P4Qj52L50o3k10K53%k54k8L83m46K81l5j49L87m08L09j86j4o5L3O7o1q2
7631h6K63Pk14q3J2J11J40k09J99K5l17J87K51k13j76M99m90k2Q3K66k32P5K61
7654C37l08o8K84l80lK11k28L1J55p8J6J92l60J72K31k81J62k12K69r3j64J34
7676A9n8J99qj35k46K44j03K5j3J93k0k2k08N4J09o3L04k83J75j8j0j84j50M87
7700B88m10j2J64m5L8k70M10k10l7K68j45M2j31j44J96K34k55J42n6o4K1j65j8
7723a59j14K32L0q3r7P9O3J71pk32K53j13M13j92k71m2J86k48L41j72q5m7J7M61
7747C84m77J58m2j9RK36l34l7J83j56J31j27p1K18p5PJ3L52k47k20J51k01J12
$$ y = [-89, -202, -30, -37, -99, 27, -181, -150, -13, -51, -95, 310, -26, -238, 26, 118, -115, 56, -67, 247, 53, -284, -415, -78, -4, 4, -148, 202, 139, -71, 182, 182, -72, -100, 283, -163, 118, 83, -66, 321, -87, 222, 36, 22, -43, -10, 57, -4, -86, 177, 184, -30, -113, -101, 10, 150, -59, 140, 165, -152, 35, 286, 73, -103, 396, -94, -116, -33, 233, 1, 76, 337, 29, -39, 245, -135, -138, 73, -155, -124, 31, -47, -31, 161, -199, -27, 204, -77, 85, -127, 142, 49, -115, 19, -39, 160, 152, 17, -229, 15, -88, -63, -76, 117, 97, 75, -133, -79, 30, -33, 271, -12, 163, 145, 135, -49, -199, 288, -122, -134, 30, -15, 23, -247, 163, -47, -84, 184, 39, 81, -50, -194, 2, 236, -19, 123, 67, 3, 24, -141, -159, -273, -41, -11, -94, -191, -112, -49, 122, 115, -117, 136, 23, 436, 244, -27, -69, 117, -131, 210, 38, -47, -94, -77, 384, -93, 65, 23, 4, 13, 249, -85, -122, 61, -95, 36, -91, -162, 56, -19, -12, 1, 353, 106, -114, 37, -164, -52]
7770e2k0J23k12K43j36N1J25k84L07l0k12J45J21j65j32n8k86O22k76J19K97m12
7792a22p4L0K72P9k71r7J98j07J12n0q7J95q6R1j40K8J03O9k63J74j80J90rl12
7816b57L71k47m3J26K6q7P4o4K76r3l08M46l10pJ16k07J57K39k43K93R2k81k44
7839a75K01k84L19n6L34k14j15M8q3M1n5R2k51L23mk0Q1l41L98k15j41J5R8p2
7863g6J93j50j25J47J00J10l04r3L42j7O6q7N7l80J85j8J8M76n73M5J11L26k92
7886F1j85J21j62J08j08K49J08j70j44J04Ln1j64R5qJ05l5o2K64kl2j41p3J4K48
7911A43k78K43Q3k89L5J46J66r9l37M18l35j8J80j11J54M1j01k66L89k10J83j55
7933a8K7J6j00K22J3ko8p3j41K37J97m14J56o1O1l3P0j37J00J05k6j38J23j12
$$ y = [-52, -72, 51, -161, 82, -54, -3, 122, -162, 145, 115, -97, 48, 169, 4, -128, -186, -472, 150, -126, -7, 290, -122, -196, -166, 106, 185, -86, -183, 15, -92, 20, -30, -117, 78, -8, 83, -57, -29, 74, 143, -120, 54, -126, 64, 55, -257, 114, -133, -176, -50, -24, -111, -37, -101, 175, 82, -226, 220, -90, -97, 19, -188, -31, 208, -35, 258, 350, 69, -175, 26, -258, 61, 5, 339, 125, 10, 58, -25, 16, -39, 53, -198, 125, 121, 101, 182, -159, 239, 24, -117, -102, -4, -76, 117, -33, -158, -11, 89, 199, -105, -198, 144, 127, 193, 106, 163, -217, -32, -50, -32, 444, -129, -84, 27, 353, 61, -124, -3, -165, -57, -165, 84, 192, 22, -122, -18, -15, -66, -230, -135, -143, -38, -73, -135, 129, 127, 95, -46, -119, -105, 143, -135, 108, 191, -98, -63, 83, 249, 150, -187, 231, -104, -122, 58, -53, 101, 142, 41, -225, 164, -46, 137, -18, 9, 25, -75, 147, 160, 158, 90, 17, -124, 113, 310, -104, 52, -9, 52, 19, 89, -48, 52, 157, 131, -7, 116, 4]
7957DO4J66l07J77l9J61l90L67l18mR7k32M2K68R8k16K5m8N5j1J60j62k20M01
7981A38p5J06l2k26J62Q7k88J23L1Rq1J4M6j21L57l20L0J98j93j87K57Pj32J42
8005E2m29N31j28n5q9LL92j81l74K68j7Q4K7k51L5L70j2k41L6r5l00L67p8L44
8029B59l55J08k10Q3J71j39K58j26J37j34q1M2n93N82Q7%Q7k20k13J17K54k59
8051a45M43j48k16L1J61k81M77k08r5K06j80l02J97N1q1K55j85r5L69l56J71j82
8073a13j6O0j46K55J3j67p8K30j61J22n6P6J31k4m25M10m2K06m73L37j41J7M4
8096E9k8k73M56l26k8L90l30M5R1J9J16q1j61N3K14n2l76J92K47k72K53k12O0
8119E6J09Lr4J05k92nL8K24k35J14P9j99O2J32j75n1K13Q0p0k25L35l03N1M4l52
$$ y = [4, 68, 234, -73, 104, 65, 226, -164, 203, -115, -119, -22, -254, -212, 56, 154, -62, -37, -85, -30, -41, 119, -43, -263, 138, 63, 169, 137, -89, 73, 160, -128, -5, 26, 35, -46, -32, 14, -107, 250, -70, -40, 158, -35, -222, 35, 42, -90, 52, -377, 154, 26, -29, -118, -115, 277, 96, -278, -10, -27, 57, 84, -167, -132, 238, 226, -15, 21, -74, -374, -7, -85, 259, -96, 12, -198, -115, 56, -83, 175, 49, 186, 52, -29, 13, -580, 2, 89, 89, 176, -44, -257, -140, 114, -145, 298, 150, -66, -35, 126, -155, 322, 114, 19, 225, 45, -257, -60, -9, -90, 165, -20, -115, 254, -102, 69, -113, -129, -69, -215, 40, 53, -114, -192, 38, -123, -1, -57, 19, 150, 126, -299, 111, 69, 275, -198, 139, -2, 15, 59, 31, -242, 214, -112, -140, 250, -80, -35, 56, 75, 191, 110, -51, 2, 216, 164, -212, -20, 227, -45, 208, -4, 56, 165, 168, 74, 179, -113, -118, -80, 144, -91, 23, 102, -97, -35, 97, -78, -129, 84, 164, 94, -131, 204, -99, -48, -4, -356]
8144c56M71r0k52M57j64Pm8j13j67K41J92k58J07J86j88j57K13p0j74K46k2k12
8166a51M87l64l18M88k20m0j5J79j59J44l5N8j40L8J22j78R7j5j21L23m36J06
8188a50K10J52k47
$$ y = [-356, 115, 25, -227, 230, 66, 73, 25, -88, -255, -14, 178, -80, 27, 213, 25, -132, 81, 11, -163, 83, 61, -151, 336, -28, -346, 142, -78, -118, -133, 46, -113, 31, -4, 54, -86, -48, 74, -104, -7, -22, -143, 180, -256, -150, 60, 212, -35]
8191c5
$$ Imaginary data points
##PAGE= N=2
##DATA TABLE= (X++(I..I)), XYDATA
0@%%%qK4k6K6m0N6p2R5j19J36j62K04k52L01l57M20m93N82o82P89r06J039j190
26f35J363j553J755j978K229k509K815l150L513l910M351m838N369n947O584p285
42c826Q065q936R901j0976J2190j3574J5163j7009J9180k1773K4945k8935L4111
55A8526m1120N1194o6949R5115j60025N45236J62913j304806O21445K65039l34449
66a47881N08213j95402q87725P54166N49144p76478J7213L81024n08642L60128
76E3760N03235q97992n1025Q75873n49295k04310O90110n99029k90417R48023
86D78933l01144o03851N57985m9480l19393N72399j93142o56351N92912K92053
96C70921o25889K68032J85714o29955M71081N12664q37166Q590N97175m56483
$$ y = [0, 0, 0, 0, -8, 16, -10, 16, -24, 32, -40, 55, -64, 72, -90, 114, -138, 163, -194, 226, -267, 315, -367, 422, -484, 555, -635, 728, -825, 930, -1048, 1181, -1328, 1487, -1663, 1850, -2060, 2291, -2547, 2822, -3125, 3459, -3826, 4239, -4697, 5204, -5772, 6418, -7156, 8007, -9002, 10178, -11595, 13350, -15585, 18526, -22594, 28600, -38349, 56766, -103259, 441977, 604890, -699916, -78471, 186568, -147881, 360332, 164930, -722795, 31371, 580515, -195963, -178750, 202274, -306368, 53760, 556995, -340997, -392022, 483851, -65444, -269754, 420356, -178673, -469090, 478933, 177789, -426062, 131923, 82443, -236950, 335449, 142307, -514044, 78868, 370921, -254968, 13064, 198778, -431177, 39904, 552568, -284598, -276008, 321167, -135316]
106a35316Q6493M69915o99509j32514Q03876k23608m11019L09029j81026o6832
116a80511O29707l35571o63697O29902K72020n43938K43190M1904m77958N30008
126A45056K63551p38482J51408M46795l77381R5196K73793m86250M0561N10558
136C24805l20423j96211L55947k64073j04971N57385k89316m70706N21181R0666
146B04284l52094K66861j04110l24380M91719R2776n44509J74107K59763k71021
156a06604J42701J45481m11294J18649L94687l27572r4298L11716k73117n0329
166a49980M25224k60906k65050L50298n4576j51220K68271j63389k40667L73263
176A31268N1148l45950J50284J09613k24975J80843R8665l47189J33509K58577
$$ y = [-135316, -48823, 421092, -278417, -410931, 392945, 169337, -241682, 67347, -113679, -180511, 449196, 113625, -550072, 79830, 351850, -192088, 51102, 93006, -384952, 145056, 408607, -329875, -178467, 268328, -109053, -13857, 259936, -226314, -185753, 324805, 4382, -191829, 164118, -99955, -204926, 352459, 63143, -407563, 113618, 204284, -147810, 119051, 14941, -309439, 182280, 275056, -269453, -95346, 164417, -106604, 36097, 181578, -229716, -111067, 283620, -43952, -138250, 173466, -99651, -149980, 275244, 14338, -250712, 99586, 45010, -106210, 162061, -1328, -241995, 131268, 182416, -163534, -13250, 96363, -128612, 52231, 150896, -196293, -62784, 195793]
186A95793k78565K0993K07786k57531L0873K83541k25793j16685K20555r4788
196a3821l8103K00988k00303j62757L42497K6182k83700J10324N4572j14124K01730
207A23485l0397k97758J90836J71525k27132L4467R8164j54973Q8006J31444j90655
218f2988J4J69187j38403m0729J91378j25250j24887K00307k6628j20953J29298
229E0346n3741q3654J88733m8203j78604J43908O6047j29696M3472K7162r8242
240g2472Q4056P3896j49829J6468J30990j08552j4168J29674j08489n0008J27174
251E8740n7528l3266Q1222r4674k3273J50041m1558j16025O8887M7877m5539K6255
263B1159j2051p4622Q5361N1783j35367K5052R9148q1802K556N7382o6622K7709
$$ y = [195793, -82772, -61779, 146007, -111524, -80651, 202890, -22903, -139588, 80967, -13821, -51924, 149064, -51239, -213996, 128501, 154683, -129017, -18693, 35879, -78245, 123485, 93088, -204670, -13834, 157691, -69441, -34974, 63190, -91783, -3777, 127667, -62988, -62974, 106213, -32190, -72919, 118459, -6791, -131678, 68629, 42001, -78952, 50346, -3395, -87049, 101684, 53481, -125123, 18785, 84832, -44864, -1392, 25770, -72472, 11584, 85480, -64349, -47881, 83109, -25443, -39611, 90063, -18426, -68434, 58740, 1212, -32054, 49168, -45506, -68779, 81262, 39704, -76321, -7434, 40443, -5096, 21159, 9108, -65514, 19847, 71630, -63737, -38685, 60463, -21339, -18783, 38599, -28023, -314]
275c14M6587p8974K0232O6817o8119l4337P1827K792n7229K1047J8273k1022M3814
288C1394j9604p1203Q4422L4155r9737K1645L7685l4110K7011j0060l9877M8986
300A0707J8567m6423R06M0235q760l6228K3219J3635k4721J4782j9540j3447O7233
313D0165k8658o1251N9427J9254l1528M186j1954J3037K2010l2381j5921K1985
325a629J9035j8984k7361L2819J5351k4778P032p961Q342K9704m7538j3058N2230
338B3204j5882k4084O363O771K3294j6308k5457K6457J4768o680k2124p536L7129
351A9915q630l2146J4377N350R921j325l4652K6630L0139l1459q122Q351J1703
364A0052N110l6116M191L3786j4399j4321k222J5435K3322k9482j2392L0117q68
$$ y = [-314, 46273, -32701, -12469, 54348, -13771, -48108, 23719, 26511, -30718, -9671, 8602, -12420, 31394, 11790, -59413, 25009, 59164, -40573, -18928, 18757, -15353, 11658, 1598, -38279, 10707, 29274, -17149, -16243, 23992, 15232, -20996, 2223, 15858, -8863, 5919, -13621, -27068, 40165, 11507, -49744, 9683, 28937, -2591, 1595, -10359, 2678, 24688, -7693, -23614, -1629, 17406, -1578, -28939, 3880, 19231, -5547, 1485, -6476, 1866, 31570, -15968, -29026, 23204, 7322, -16762, -10399, -3628, 19666, 3358, -22099, 4358, 19126, 12446, -9678, -17214, 19915, 11285, -20861, -6484, -1134, 8787, 7462, -27190, -560, 29579, -1880, -10002, -1651, 10052, 15162, -20954, -16763, 17023, 2624, -11697, -13919, 1516, 24838, -4644, -17036, 13081, 12213]
377A2213o332j4727p787L2597p622k8532J4227J0119P048j0801k0958L2440J3699
390B5584l2455m566R018J4798l316l2888J3566K4505j4582p721j690J5059J6197
403B1509k8926n515K4709k138r031j6559L492L1239j5040k3819J4850J4193O232
416A5196j7874j2048L0868j01k6135O68Q785J2533r937k5653K0325J9655j4928
429A354r178O82J9450N443k8296j68J7831M78r124j7498J3157K3849k2478j2126
443a6624J9932R051q88j8608n411K6930q04k3276n629J4433J5744j7534j5248
456a7932K0802P364n973o067m670K0664l259l0429J3686K0081j1631j3219m925
469a5508J5974J4070j4156j1330Q263J7839m393k6437J1096K0116j6524r006J02
$$ y = [12213, 5881, -8846, -16633, 15964, 8342, -20190, -5963, 4156, 11204, 403, -20555, 11885, 25584, -6871, -11437, -2419, 12379, 9063, -23825, -10259, 14246, -336, -8057, -9747, 5312, 21509, -7417, -12932, 11777, 9639, 608, -15951, -12459, 18780, 3740, -20079, -5229, 8964, 15196, -2678, -14726, 16142, 16041, -10094, -9426, -641, 11892, 1955, -23698, -3373, 16282, 1354, -7824, -7142, 12308, 17751, -10545, -10713, 7118, 7596, -1528, -19026, -5869, 17980, -4498, -16624, 3308, 12359, 11471, -7137, -12548, 14382, 13578, -9698, -15327, -894, 14850, -2684, -17932, 2870, 10234, 4261, -1806, -6476, 14188, 10929, -19500, -5814, 14267, 2636, -10583, -15508, 466, 14536, 380, -10950, -2687, 15152, 10759, -15678, -4582, 15534, -990, -9996, -9894]
482i894Q987J9035k2337j8429L2388R924k0836o405Q932P643r481p796O457O893
496E081N06k0648l309L9130j544l3376K648J1355J5694L565l7714k937L6688m752
510A0387k4085L059J6096j315j1065Q918O016l958r82j3562R652K0717k8225j0082
524a8429K6121m151n716j35p321K0873Q932l0570r428K9104J7839k9608k3601
537b6090K1286J4464j751r611j9003K0682J8419k5099O899J3154k2778L053J3725
550G350k926j599j2964o873J8564J8579j3353l1683J7032L6166j7327k0667p63
563a0464N669K6468j4277l8244K6203K1779j9932j058M387j714L537J459M74l440
577H47l83o369n000K6743n500m0449J7982L0290m824o827k8780K702N6603p868
$$ y = [-9894, -907, 18128, -4209, -22638, 9750, 19674, -1162, -7567, 1365, 9008, -473, -8269, -1812, 5081, 5587, -15061, -18370, 20760, 19216, -14160, -11512, -157, 15537, 19102, -18612, -21549, 15139, 10387, -13698, -10639, 5457, 4142, -6923, 1995, 8011, 4053, 3071, -10491, -839, 19878, -8347, -18429, 7692, 3541, -2175, -2310, -9631, 11242, 20174, -10396, -19824, 9280, 27119, -2489, -26090, -4804, 9660, 7909, -1702, -20705, -23, 18396, -6703, 196, 13350, -9428, -6375, 7350, 4424, 2825, -10139, -17012, 1552, 20131, 6778, -24905, -7873, 28293, 10966, -9701, -10464, -4795, 21673, 7396, -30848, -4645, 17134, -2798, -3856, 531, -1183, 2354, 3813, 4287, 847, 464, -5905, -10905, 15838, 10338, -30111, -12129, 18161, 13337, 6510, -22270, -19568, 37035, 29167]
591B9167n6795M16L6207J3526j9295k2120l73K2319K5387k2682k8403K4319N019
604F692p711K2094k4779k6183L4131O069j0249N440k2597k045M0792M137l8553
617a2762r949L0474R521j1433r928k2057K1672L7996m1739j8301M0853j2865m874
630c392K5343k7548j1182K8065n977o012Q671k3050j2575M5071J8613n2719j2981
643b9673L3732O390J8583j7201o7319M2322O9263n2355l3460K2580l504K2370
655A1728J7257m5164j0644M1761r30j8686J7735j5072k9436M6117J3434n1576
667b3476J5763J1954k2993M7925l424p5809L7872N9306l9063k3701M167o805L4506
680A6222K1740o2457k0081O6484N3l1849K5433k9571k3911P9196p545p1209L1291
$$ y = [29167, -27628, -27212, 8995, 22521, 3226, -18894, -19267, 3052, 28439, 5757, -22646, 1673, 6692, -1019, 21075, -3704, -29887, 4244, 10313, 64, 5504, -17093, -19138, 21654, 25791, -12762, -22711, 7763, 17284, 5851, -4077, -26134, -4462, 33534, -8205, -26506, 14347, 1482, -3392, 21951, -5597, -16779, 11286, 5309, -703, 7968, -15082, -27657, 17414, 36027, -16692, -29673, 4059, 10449, 29032, 11831, -55488, -13166, 56097, 3742, -29718, -7138, -10642, 11728, 28985, -16179, -26823, 14938, 14008, -4678, 13057, -2015, -31451, 14666, 28100, -23476, -7713, 4241, -18752, 29173, 25749, -50060, -12188, 47118, 8055, -15646, -11479, -18284, 16222, 37962, -24495, -44576, 21908, 21961, -9888, 15545, -14026, -37937, 41259, 33714, -37495, -6204]
693f204R231k0924N2462j3655p6065L8067O0994l2577k1454O705k0774L5675M1897
706E3378p8542k5432Q3237j9624l6016M4365l3154k0832P0128k2483m5616M5956
718A5365r295l6806N4434P059p1891J9789M8307k7565Q179J251o2848N7112P6321
731G9412r7987l6691P8334j3336n315K3673p0008j26R7213k9754o9166M2206J1556
744A0011k4886N0524j4261p7817N4192M4187o2279K3909J1649p2015O0581O4092
756F7887r2542j5466O3518k1158M517K3633o6297k26Q7467l4806o4215N4949M729
769A1990l5911N3997j8225n8753O9523Q287o6688N0575R116p1265M8025M3129
781D3800o5491Q2L5155k8558K6022L4802q1681r424R9461l0296n9892M0576j8118
$$ y = [-6204, 3027, -17897, 34565, 20910, -55155, -17088, 43906, 11329, -10125, -3420, -24194, 11481, 53378, -25164, -50596, 32641, 13017, -22999, 21366, -11788, -32620, 37508, 15025, -30591, 15365, 6070, -30736, 23698, 30757, -41134, -21345, 26962, -603, 7576, 8827, -54021, 3091, 79412, -18575, -55266, 23068, 9732, 4417, 28090, -41918, -42044, 55169, 25415, -43751, -1545, 10011, -14875, 35649, 21388, -56429, -2237, 41950, -20329, 3580, 15229, -56786, 3795, 67887, -24655, -40121, 23397, 2239, 6756, 30389, -35908, -36134, 51333, 16527, -47688, 7261, 11990, -23921, 30076, 11851, -46902, 22621, 30908, -35780, 14795, 23911, -47354, 671, 43800, -21691, -21609, 13546, -15012, 11010, 45812, -35869, -45293, 54168, 23872, -36020, 4556, -13562]
794a3562m447P0325n4508n8772Q3518Q426n4019L7896l292m9141M8833K4982o2430
807b6191J3904L2140m6315K7162M5013p8137j921Q0410l9217k5751L6831l9641
819b1713R380O1858o0036m0508P2365R07m4030K9746l664l2391N0921P073o5876
832c5968L3572L0585n7465L0817L4568o9397J3213N0636l7155O239K0749n1345
844c0951J9708O2136n0272m2721N2515M298k6928K8581k2343l1999O5109K31o3350
857c5986M0616J7073m5911L4810J1703n0479K5383K2262l7737J8444K1302m7364
869b5884J0569N5138l7788l2418M4741q775j4738L4647l8212k3489O7815j3694
881A7912n0552L6838M533k2499L2069q418l7015L3115J6133l9685J5628K4186
$$ y = [-13562, -18009, 52316, -2192, -60964, 22554, 30980, -23039, 14857, 11565, -37576, 11257, 36239, -26191, -12287, 19853, -26462, 700, 45713, -32424, -34345, 46065, 6848, -18903, 17928, -21713, -12333, 49525, -10511, -51019, 21346, 22253, -21777, 7969, 4305, -28086, 22835, 29908, -35968, -2396, 28189, -29276, 1541, 36109, -33288, -20075, 30561, -6594, -355, 20394, -30951, -11243, 50893, 621, -42100, 10415, 14713, -12215, 16366, -5977, -37976, 27133, 27364, -35986, 4630, 21703, -24208, 10602, 22305, -28174, -2791, 19471, -18266, 178, 21480, -25884, -15315, 39823, 2035, -30383, 14358, 5583, -9155, 25492, -12720, -36209, 31606, 17912, -32640, 4198, 8731, -13768, 18301, 9883, -27132, 5983, 22116, -17569, -1941, 22245]
893B2245m5796O769M7813l5016j5094L3030k3534O491L6130m7824j3853N5381
905B6742j5165l0860K1190l537q580K7135j2562l1344L6052J6656m4662J3700
917e235K6684l4404Q614K1353l1919J1551J8318l4458J5217L0239l4457j0467
929a8964L2223l471j4699Q832r517o409L0299j1547l6271L2535J6156l2640J3776
942C03Q586k0493K0944J316k6568J9452R535k6508O243J9913j4642r792J6866
955E155j132o561J2555j5221p530L3599j3667k9840K5335N322j4701R552p464
968d598m056K0785o318j8060J3182J2643j5056p809J3933k645o209O866j1086
981h428M874J9341k1968o762K7100p896j2577O666j403M574J510j3378J5J3833
$$ y = [22245, -23551, -16782, 31031, -3985, -19079, 13951, -9583, -3092, 33038, -14786, -28639, 26742, 11577, -19283, 1907, -1630, -10210, 16925, 4363, -26981, 9071, 25727, -18935, -5235, 21449, -12955, -4341, 17012, -14907, -3356, 14962, -19496, -4279, 25960, -8497, -18964, 13259, 9788, -4911, 3921, -5596, -12005, 18294, 6747, -29524, 3011, 19167, -13473, 303, 8889, -11604, 9340, 10656, -15912, 3540, 13075, -13433, -7190, 12723, -1919, -11711, 5155, 4023, -2538, 10017, -5204, -12734, 20865, 7198, -22642, 2693, 8015, -6686, 2866, -4598, -8654, 12131, 5813, -12247, 935, 13578, -1478, -9287, 4646, 2001, -4208, 2658, -8428, -3554, 15787, -6181, -12943, 14157, 6261, -6316, 350, -1053, 3521, 5031, -8347, -8332, 5501]
995E501K356j5131o78J6441m720o661N403n695O850M089j9888P975J5397j4810
1009c571m450P695L174K614q248j552R245J664o301q464P383J0431j4297m055
1023h732J0425o78K939n387o985J6269M85j4301L474M934J403m585q526R419N748
1038E902p098l441K13J0741J675j4776M924Q493n351k075m995M242R753j2126
1052c919m911J0903K797j184p893r7J3218m316q821J598K245M843o756o906J3093
1067C894J635q807k62K320R465j584j5299N431R177m032m174m322O644N557j0601
1082d958J037P756O33k314q323N070J1921r272q372K961L762O200q170o277J1380
1097C034J486o375J10L305N972p193r128R252M848l910n902m508J1892M527j1913
$$ y = [5501, 7857, -7274, -7952, 8489, 3769, -2892, 2511, -3184, 3666, 7755, -12133, -4158, 11239, -3571, -8021, -326, 2848, 5462, -2786, -4338, 4907, 6571, 270, -8194, -811, 9620, -4677, -8732, 1693, 1015, 3954, -1433, -8418, 7851, 8336, -5965, -2491, 2443, 3846, -739, -9265, 154, 5902, -1196, -4637, -4424, 6317, 7992, -6784, -1860, 6633, 1282, -793, -5788, -1546, 8207, -3919, -8830, 2073, 4870, 3686, -4207, -4304, 8914, 4598, -4223, -2625, -380, 4463, -2293, -9199, 3894, 5529, -3278, -3540, -1220, 8245, 6661, -8638, -3207, 5970, 1938, -2236, -6558, 86, 5643, -4958, -3921, 3835, 4468, 2154, -6169, -1099, 10822, 1550, -6822, -3861, -99, 6101, -2069, -8346, 3034, 4520, -1855, -1745, 1560, 7532, 339, -8789, 463, 5311, 1401, -4501, -9009, 2883, 7410, -4503]
1112d503K167N239k65L3o285L069P800q756o693N322P950P3j2572J269J2207j323
1128D732l424l798K03R340p309p573J0877J04p177n1J732P072J49q794k25P397
1144C255N046q783q680J1575L024j0170J630J196L088M028j1323K120J4157o012
1158D151r205L297M546M98n297k561K302M308R02r299L554J3711j0992p130J1154
1173C939l87j518k638r211J1133R091j4749n987J1419O160o248l761K884m46M050
1188C731Rj1025Q465N690j6907O362J2628j0540k086L089j118J0044k662j4977
1202i297M998J4371o091j4340P079Q393o687J616j991l801J5842l699j9198J4351
1216A546P637j2500K712n4l975O324j022n101O859K945j1534m18J9592m530j9397
$$ y = [-4503, -2336, 2903, 2638, 2671, -3614, -545, 7255, -1501, -8194, -2872, 5078, 5151, -7421, -6152, 6055, 4732, 1308, -2490, -2287, 7053, -256, -7829, 3048, 3152, -4025, -4076, -2344, 4728, 4877, -3917, -4142, 3255, 8301, -482, -9162, 2413, 5437, -4733, -3103, -1907, 1181, 5209, -6114, -3994, 10163, 4151, -5054, -1757, 2789, 3287, -2010, -4571, -2269, 2039, 2941, -6358, -2804, 10907, -85, -7215, 3939, 3552, 2034, -604, -9815, 1318, 10409, -4340, -10327, 1092, 7252, 1004, -2757, 127, -319, 3731, 3740, -7285, 1180, 6870, -10037, -3675, 8953, -1587, -3673, -584, -1702, 8342, 5680, -9297, -4299, 10072, 3981, -10359, -3280, 5113, -1574, 42, -1949, -5750, 10092, 6393, -12805, 1546, 9183, -3317, -605, -659, -4634, 1690, 668, -4433, 2426, 5371, -6163, -6581, 13011, 8481, -10916]
1231a0916O673N792J560P147j9496p968K7083L42j6152L581K228R89M921m896
1245H88n139M792K932r722K884J2718j3539o536J8793l621o989N293q385P532
1259A901J2299k0542p726J9541M154j0679p579K410R644P495p308j6630R231J7705
1273A3916j2674m984P007j2041N470J2789j1118j115J727o705J2800R640j6462
1286a750j1619J1474J4419o492j2680l734M354J8750k333k7465R278K0250q871
1299C581k295k341p165J3362K887j2981Q92L619j953K481O254n267j1038R142
1313h22J1223o285l170r647j618K6237m029k9218O068J5875L160k42j4506n883
1327a2857J8196R341j2284j2006N670N185K99O076j0450j0887J5510M620l522
$$ y = [-10916, -4243, 1549, 3109, 10256, -9240, -17208, 9875, 10217, -5935, -2354, -126, 863, 5784, 888, -4251, 541, 3473, -6249, -3365, 9353, -4186, -10722, 8071, 4450, -2539, 2754, -5631, 1901, 14200, -6342, -14068, 5473, 9627, -1052, -8631, -6221, 3423, 10918, 3610, -13020, -3789, 13916, 1242, -3742, 3265, -8776, -3306, 9483, -1635, -2750, -1023, -7728, 5072, 14712, -1750, -13369, -1895, 12524, 6032, -6648, -10382, -6028, 12722, 10389, -17076, -7798, 12452, 3581, 1286, -1055, -8220, 5142, 8029, -4952, -4060, -441, -2394, 87, 6341, 1074, -9964, -822, 10401, 4116, 946, -8701, -10319, 15918, 11889, -17329, -11261, 4614, 7774, 7532, -6974, -12857, 5339, 14680, 2396, -9610, -3940, 1245, 1544, 7620, -2830, -13717, 1793, 6413, 2891]
1340B891L375j5947j946K6874j547k2528l704J0044J2367j463j5947p069J5103
1353E03J6553j3197j6085R525O486K537J374j8153J24J8882n350n123L519r413
1367g818K465J5757p9j4844p027J0633J1135q47j2910j5042J4924K2476j4352
1380D471j5217L976M269J3520J168k2321p51J6421J555o600k961k038j069Q656
1394C079O967j2005p016P111N608P985q380k0933J2794K0395r856j3640l005P205
1408c691J5360j128j9541n646J9565J1399j4694r799K985L294J0701k190j6587
1421i972L117P311J162R091q376j8072J0650K0374l988j8001n512Q377J2343M272
1435A2776j8943j4371K2695J5054j5061q646k97O024J4604r501j6731Q907Q341
$$ y = [2891, 6266, -9681, -11627, 15247, 13700, -8828, -12532, -2488, 9879, 8416, -7531, -14600, 503, 17056, 3859, -12226, -2701, 3785, 6322, 7696, -10457, -10333, 8549, 3199, -1924, 1595, -7818, -5353, 10404, 10325, -4519, -11546, -913, 10222, 9375, -3535, -18577, -3653, 18823, 4471, -10746, -6770, -2501, 11019, 12187, -10134, -10885, 5536, 7091, 491, -2470, -4508, -5577, 3079, 10046, -1959, -8975, -1864, 3744, 11729, 3349, -17584, -4790, 15605, 5749, -7891, -10896, -3691, 11669, 10541, -9000, -14646, 4919, 16318, 1624, -8175, -5190, -1896, 8805, 6615, -9972, -6855, 456, 1618, 10709, 2333, -15739, -5089, 15285, 11297, -6704, -12216, -3839, 8504, 12776, -6167, -20538, 2157, 17211, 2150, -6496, -6793, -769, 13835, 4334, -12397, -3490, 4851]
1448D851n448R12J876q479l2J4768o53j1816J43O40N410J1774j6065j5897J7833
1463a83J0598n981p414r471Q015K0153o228k0444K248J5345n51n933j92p854J776
1478f116J4543n003o841K421o065R152J3418j6426j1509J1206P009L7o303j0471
1492a0948L370J7868J089k1449n05J8993j132o316k679o044J0535N846j3695J616
1506c451N580p069M783P073o441n211K948M830J709m91q629p188J5838Q344j8045
1521e420m629R063M596O412j1332j0840J6385N090j1383p82J457n18K643J715
1535B457l321m148N346K410k703M837n419p406J2644J990q937n84l870O382J1410
1550A1088j3278r137J2622O541n560n705K191K996p63Q47m314j012O763n627r47
$$ y = [4851, -597, 315, 2191, -6288, -6320, 8448, 7795, -4021, -3878, -3238, 2172, 13946, -2119, -18016, -183, 10415, 4434, -2980, -12451, -4436, 15717, 9489, -10955, -8707, 6638, 6087, 154, -38, -7892, -6116, 8427, 3424, -3417, -996, -7061, 2091, 15509, -917, -12426, -1220, 5789, 5826, -477, -10948, -7578, 10290, 11379, -10070, -10575, 8418, 7286, 970, -1709, -7753, 2782, 8628, -5067, -3451, 2129, -4940, -157, 6916, 475, -4736, -1788, 3042, 4751, 4260, -4369, -11557, 4281, 12625, -5420, -10049, -986, 3610, 10022, -1310, -12150, 4235, 9325, -2058, -2840, -1383, -1901, 742, 2457, -864, -5012, 334, 2744, 41, 4878, -541, -7947, 4697, 6687, -2250, -2834, -6704, -322, 11088, -2190, -11327, 1295, 7836, 2276, -3429, -1238, 1758, 995, 1842, -2472, -3484, 3279, -2348, -3295]
1565c295R419p049k709O935l375L060M54j1163N488J0763p108r639L080J0330
1579E191pp863o65J760O772J093j2238L568P639p969K482K487p359N528J409n721
1595c893O381J395o508k65O376K272q970k313P261J46m14m889l537J3297lj3237
1611f901O111M650l707K593m416k121O517j435m492J292M076p40n301M283M124
1626D533m675M47k214R88Q200r317o265J1550j79o335J714J47L981J238n853l45
1642b385M471K403n539m487P064N02m963K897j209J973L116q221L003Q789p295
$$ y = [-3295, 6124, -925, -3634, 3301, -74, 2986, 3440, -7723, -2235, 8528, 1420, -8219, -5139, 5191, 5184, -2679, -3344, -1584, 5188, 6281, -5957, -2389, 5250, -2719, -237, 2250, -5109, 419, 1828, -3893, 2488, 3883, -2625, -2890, 3486, 5758, -3212, -5525, 1736, 1882, 1468, -3421, -6958, 6339, 6336, -6901, -790, 3860, 153, 2746, -1670, -3791, 2726, 1291, -3201, -1909, 2167, 1427, -3874, 409, 4533, -142, 305, -1909, -921, 7279, -2038, -8303, 3247, 3068, -3267, -1553, -1406, 2575, 3813, -2040, -2385, 2086, 4489, -1050, -5537, 1527, 2029, -2934, -37, -1246, 727, 3843, -4378, -1375, 7414, 119]
$$ [...]
8191F7
##END NTUPLES=NMR FID
##END=
