##TITLE=1H_LR-724-B2
 CDCl3, 8 sc, 
 1.10.2020
##JCAMPDX= 6.0         $$ Bruker NMR JCAMP-DX V2.0
##DATA TYPE= NMR FID
##DATA CLASS= NTUPLES
##ORIGIN= UXNMR, Bruker Analytische Messtechnik GmbH
##OWNER= root
$$ XWIN-NMR		Version 3.5
$$ Thu Oct  1 10:14:04 2020 Russian Standard Time (UT+4h)  she@DPX200
##.OBSERVE FREQUENCY= 200.1315066352
##.OBSERVE NUCLEUS= ^1H
##.DELAY= (6, 6)
##.ACQUISITION MODE= SIMULTANEOUS
##.ACQUISITION SCHEME= undefined
##.AVERAGES= 8
##.DIGITISER RES= 18
##SPECTROMETER/DATA SYSTEM= spect
##.PULSE SEQUENCE= zg30
##.SOLVENT NAME= MeOD
##.SHIFT REFERENCE= (INTERNAL, MeOD, 0, 15.7039)
##AUDIT TRAIL= $$ (NUMBER, WHEN, WHO, WHERE, WHAT)
$$ ##TITLE= Audit trail, XWIN-NMR		Version 3.5
$$ ##JCAMPDX= 5.01
$$ ##ORIGIN= Bruker BioSpin GmbH
$$ ##OWNER= she
$$ F:/spectra/data/she/nmr/H-F/1/audita.txt
$$ ##AUDIT TRAIL=  $$ (NUMBER, WHEN, WHO, WHERE, WHAT)
(   1,<2020-10-01 10:12:46.40 +0400>,<she>,<DPX200>,
      <created by zg, POWCHK disabled, PULCHK disabled
       configuration hash MD5:
       00 E9 B6 7A A2 85 ED C7 34 08 36 98 17 FE 4E 26
       data hash MD5: 16K
       1D 34 92 73 F0 0E 77 A9 EC B6 54 98 C4 32 A0 EB>)
$$ ##END=
$$ 
$$ hash MD5
$$ 63 83 08 58 DD 6A 98 05 61 58 B2 DE 98 7B 46 26
##$RELAX= 
##$RELAX= 
##$RELAX= 
##$RELAX= 
##$RELAX= 
##$RELAX= 
$$ Bruker specific parameters
$$ --------------------------
##$DU= <F:/spectra>
##$EXPNO= 1
##$NAME= <H-F>
##$PROCNO= 1
##$TYPE= <nmr>
##$USER= <she>
##$AMP= (0..31)
100 100 100 100 100 100 100 100 100 100 100 100 100 100 100 100 100 100 
100 100 100 100 100 100 100 100 100 100 100 100 100 100 
##$AQSEQ= 0
##$AQ_mod= 1
##$AUNM= <au_zg>
##$AUTOPOS= <>
##$BF1= 200.13
##$BF2= 200.13
##$BF3= 200.13
##$BF4= 200.13
##$BF5= 200.13
##$BF6= 200.13
##$BF7= 200.13
##$BF8= 200.13
##$BYTORDA= 1
##$CFDGTYP= 0
##$CFRGTYP= 5
##$CHEMSTR= <none>
##$CNST= (0..31)
1 1 145 1 1 1 1 1 1 1 1 1 1 1 1 1 1 1 1 1 1 1 1 1 1 1 1 1 1 1 1 1 
##$CPDPRG= <>
##$CPDPRG1= <>
##$CPDPRG2= <>
##$CPDPRG3= <>
##$CPDPRG4= <mlev>
##$CPDPRG5= <mlev>
##$CPDPRG6= <mlev>
##$CPDPRG7= <mlev>
##$CPDPRG8= <mlev>
##$CPDPRGB= <>
##$CPDPRGT= <>
##$D= (0..31)
0 1.2 0 0 0 0 0 0 0 0.06 0 0.03 0 0 0 0 0.0002 0 0 0 0 0 0 0 0 0 0 0 0 
0 0 0 
##$DATE= 1601532765
##$DBL= (0..7)
120 120 120 120 120 120 120 120 
##$DBP= (0..7)
150 150 150 150 150 150 150 150 
##$DBP07= 0
##$DBPNAM0= <>
##$DBPNAM1= <>
##$DBPNAM2= <>
##$DBPNAM3= <>
##$DBPNAM4= <>
##$DBPNAM5= <>
##$DBPNAM6= <>
##$DBPNAM7= <>
##$DBPOAL= (0..7)
0.5 0.5 0.5 0.5 0.5 0.5 0.5 0.5 
##$DBPOFFS= (0..7)
0 0 0 0 0 0 0 0 
##$DE= 6
##$DECBNUC= <off>
##$DECIM= 32
##$DECNUC= <off>
##$DECSTAT= 4
##$DIGMOD= 1
##$DIGTYP= 9
##$DL= (0..7)
0 120 120 120 120 120 120 120 
##$DP= (0..7)
150 150 150 150 150 150 150 150 
##$DP07= 0
##$DPNAME0= <>
##$DPNAME1= <>
##$DPNAME2= <>
##$DPNAME3= <>
##$DPNAME4= <>
##$DPNAME5= <>
##$DPNAME6= <>
##$DPNAME7= <>
##$DPOAL= (0..7)
0.5 0.5 0.5 0.5 0.5 0.5 0.5 0.5 
##$DPOFFS= (0..7)
0 0 0 0 0 0 0 0 
##$DQDMODE= 0
##$DR= 18
##$DS= 0
##$DSLIST= <SSSSSSSSSSSSSSS>
$$ [...]
##$SUBNAM2= <"">
##$SUBNAM3= <"">
##$SUBNAM4= <"">
##$SUBNAM5= <"">
##$SUBNAM6= <"">
##$SUBNAM7= <"">
##$SUBNAM8= <"">
##$SUBNAM9= <"">
##$SW= 16.880792210976
##$SWIBOX= (0..15)
0 0 2 0 0 0 0 0 0 0 0 0 0 0 0 0 
##$SW_h= 3378.37837837838
##$TD= 16384
##$TD0= 1
##$TE= 0
##$TE2= 300
##$TE3= 300
##$TEG= 300
##$TL= (0..7)
0 120 120 120 120 120 120 120 
##$TP= (0..7)
150 150 150 150 150 150 150 150 
##$TP07= 0
##$TPNAME0= <>
##$TPNAME1= <>
##$TPNAME2= <>
##$TPNAME3= <>
##$TPNAME4= <>
##$TPNAME5= <>
##$TPNAME6= <>
##$TPNAME7= <>
##$TPOAL= (0..7)
0.5 0.5 0.5 0.5 0.5 0.5 0.5 0.5 
##$TPOFFS= (0..7)
0 0 0 0 0 0 0 0 
##$TUNHIN= 0
##$TUNHOUT= 0
##$TUNXOUT= 0
##$USERA1= <user>
##$USERA2= <user>
##$USERA3= <user>
##$USERA4= <user>
##$USERA5= <user>
##$V9= 5
##$VALIST= <valist>
##$VCLIST= <CCCCCCCCCCCCCCC>
##$VD= 0
##$VDLIST= <DDDDDDDDDDDDDDD>
##$VPLIST= <PPPPPPPPPPPPPPP>
##$VTLIST= <TTTTTTTTTTTTTTT>
##$WBST= 1024
##$WBSW= 4
##$XGAIN= (0..3)
0 0 0 0 
##$XL= 0
##$YL= 0
##$YMAX_a= 223565
##$YMIN_a= -219550
##$ZGOPTNS= <>
##$ZL1= 120
##$ZL2= 120
##$ZL3= 120
##$ZL4= 120
##$ABSF1= 10
##$ABSF2= 0
##$ABSG= 5
##$ABSL= 3
##$ALPHA= 0
##$AQORDER= 0
##$ASSFAC= 0
##$ASSFACI= 0
##$ASSFACX= 0
##$ASSWID= 0
##$AUNMP= <proc_1d>
##$AZFE= 0.1
##$AZFW= 0.1
##$BCFW= 1
##$BC_mod= 2
##$BYTORDP= 1
##$COROFFS= 0
##$CY= 11.3945322036743
##$DATMOD= 1
##$DC= 2
##$DFILT= <>
##$DTYPP= 0
##$F1P= 16.9975609425685
##$F2P= -3.02152046262296
##$FCOR= 0.5
##$FTSIZE= 0
##$FT_mod= 4
##$GAMMA= 1
##$GB= 0.15
##$INTBC= 1
##$INTSCL= 1
##$ISEN= 128
##$LB= 0.24
##$LEV0= 0
##$LPBIN= 0
##$MAXI= 10000
##$MC2= 0
##$MEAN= 0
##$ME_mod= 0
##$MI= 1.114404
##$NCOEF= 0
##$NC_proc= 0
##$NLEV= 6
##$NOISF1= 3.799351
##$NOISF2= 2.8
##$NSP= 1
##$NTH_PI= 0
##$NZP= 0
##$OFFSET= 15.70392
##$PC= 1
##$PHC0= -10128.37
##$PHC1= 13.40089
##$PH_mod= 1
##$PKNL= yes
##$PPARMOD= 0
##$PSCAL= 0
##$PSIGN= 0
##$REVERSE= no
##$SF= 200.130013532006
##$SI= 16384
##$SIGF1= 3
##$SIGF2= 2
##$SINO= 400
##$SIOLD= 16384
##$SREGLST= <1H.CDCl3>
##$SSB= 0
##$STSI= 0
##$STSR= 0
##$SW_p= 3612.71676300578
##$SYMM= 0
##$S_DEV= 0
##$TDeff= 0
##$TDoff= 0
##$TI= <>
##$TILT= no
##$TM1= 0
##$TM2= 0
##$TOPLEV= 0
##$USERP1= <user>
##$USERP2= <user>
##$USERP3= <user>
##$USERP4= <user>
##$USERP5= <user>
##$WDW= 1
##$XDIM= 8192
##$YMAX_p= 0
##$YMIN_p= 0
$$ End of Bruker specific parameters
$$ ---------------------------------
##NTUPLES= NMR FID
##VAR_NAME=  TIME,          FID/REAL,        FID/IMAG
##SYMBOL=    X,             R,               I
##VAR_TYPE=  INDEPENDENT,   DEPENDENT,       DEPENDENT
##VAR_FORM=  AFFN,          ASDF,            ASDF
##VAR_DIM=   8192,          8192,            8192
##UNITS=     SECONDS,       ARBITRARY UNITS, ARBITRARY UNITS
##FACTOR=    0.000296,      1,               1
##FIRST=     0,             0,               0
##LAST=      2.424536,      0,               0
##MIN=       0,             -219550,         0
##MAX=       2.424536,      223565,          0
$$ Real data points
##PAGE= N=1
##DATA TABLE= (X++(R..R)), XYDATA
0 0 0 0 0 0 0 0 0 0 0 0 -8 8 -8 8 -8 16 -16 24 -24 32 -40 44 -53 64 -72 88 -102 117 -136 156 -177 204 -233
33 -233 263 -300 335 -378 423 -474 531 -592 658 -730 808 -896 991 -1092 1205 -1329 1464
50 1464 -1613 1775 -1956 2157 -2380 2630 -2914 3236 -3606 4039 -4552 5167 -5927 6888 -8153
65 -8153 9894 -12465 16707 -25421 82774 -174417 -67134 57521 -69252 223565 -119479
76 -119479 -133042 134925 -58019 94365 6830 -192261 176075 -18349 -78597 116540 -140784
87 -140784 37665 98341 -128484 100346 -45052 -77336 134565 -87847 34728 46686 -176203
98 -176203 120765 41637 -78649 81975 -129970 13560 143743 -105652 23771 -34082
108 -34082 -55114 160796 -78176 -55654 72956 -85364 89877 19972 -122010 83299 -21825
119 -21825 -4514 71613 -107975 35592 38957 -57589 86125 -59902 -45607 96089 -52244
130 -52244 26647 15093 -85162 79907 2226 -31518 48133 -73513 31612 54821 -65460
141 -65460 43671 -20219 -33147 74951 -42139 388 29096 -56126 47810 2523 -33035
152 -33035 43588 -44628 9976 42808 -51699 22885 -3807 -20796 53543 -39424 -17515 29901
164 29901 -21812 35848 -16195 -46509 43641 -6826 1367 11644 -48169 26076 14765 -23556
176 -23556 21587 -26315 -218 26595 -30799 14965 2722 -21815 25775 -16725 -4381 19409
188 19409 -24023 14679 3941 -19025 19141 -13871 444 21382 -21237 5366 1398 -9281
200 -9281 24939 -11495 -9876 13067 -10161 14608 2166 -17307 15191 -3032 -285 10944 -14668
213 -14668 8759 5823 -9805 12505 -7056 -2472 13069 -10237 5206 3358 -10195 11142 -2353
226 -2353 -3214 7242 -9577 5319 3710 -8774 8053 -4301 -4386 8571 -6924 311 2032 -6023
240 -6023 5903 -3472 -4177 4655 -5877 2300 1778 -8232 3642 -555 -3726 3266 -4055 -371 597
255 597 -4002 3582 -1824 -3320 3054 -3388 504 2362 -4199 1329 742 -1654 1706 -960 750 443
271 443 -1823 2902 151 -1019 2776 -933 -44 2381 195 1292 716 -168 827 847 2593 729 -1168
288 -1168 1721 811 183 2307 940 -235 -236 383 1620 897 405 -239 -992 694 862 69 684 -741
306 -741 -1433 -149 440 843 -730 -1795 -495 -623 -524 358 -593 -1407 -1629 -906 435 -444 -1065 -1040 -1822
325 -1822 -222 131 -1478 -175 -395 -1901 -479 145 -75 -728 -1274 380 -209 -652 1000 -715 -760 1106
343 1106 98 513 144 -932 813 968 1300 523 -1589 1229 1619 101 1934 373 -356 578 176
360 176 2916 1508 -937 672 -972 1483 3451 -1255 740 795 -1883 1745 587 1301 2138 -3285
376 -3285 -667 210 337 5179 -2295 -4616 733 -967 3718 1142 -4921 405 -2590 19 4007 -4223
392 -4223 1015 -675 -6469 4303 -52 -1870 2332 -6515 1153 1633 -5212 5788 -2024 -4125 3696
407 3696 -7124 2784 6423 -6306 1702 -4000 -2367 9461 -4422 383 1209 -8546 8601 1657
421 1657 -4520 6626 -7677 1125 8138 -6383 5087 -1495 -4197 10558 -6178 -425 6843 -6964
435 -6964 8067 -536 -9033 10804 -1322 -197 3832 -10456 8472 4873 -7627 6067 -5824
448 -5824 552 9565 -9759 3261 3057 -7584 7078 -3687 -824 8041 -11284 305 5901 -4229
462 -4229 5412 -6580 -5530 9093 -3691 -253 -35 -6497 7278 -2405 -6539 6051 -2520 496
476 496 -8 -7978 5301 2171 -3038 1899 -6298 1117 4418 -4734 4216 310 -6510 1975 55
491 55 3700 3845 -7567 -2590 3435 4294 2842 -6250 -1571 5617 798 -1066 -1335 2187 3710 -1622
507 -1622 -2075 -1044 4658 5131 -5003 -1492 1818 -409 4613 180 -1392 300 -4158 3846 4387 -1040
523 -1040 -97 -7453 1835 10066 -3635 -3074 -3806 146 10986 -5640 -6796 2892 -781 8428 -5570
538 -5570 -11908 10893 273 -1251 1291 -13505 8685 6962 -10851 4651 -6192 -971 10955
551 10955 -11427 2760 2951 -10838 10872 -3359 -4566 9475 -13268 3959 8861 -10064 7929
564 7929 -7045 -5065 16705 -9542 -62 3663 -11227 16000 -2310 -11275 13146 -8752 4306
577 4306 8834 -17055 11438 3228 -8820 12769 -11573 982 13490 -13681 9038 450 -12069
590 -12069 16361 -6804 -2067 11654 -15954 7171 5900 -9847 13198 -9994 -4998 14907 -11867
603 -11867 6334 2621 -15511 15298 -3328 -7554 11773 -13142 4879 7358 -15030 10238 -3041
616 -3041 -6013 13292 -14352 901 9859 -12951 9688 -2568 -11012 13395 -7423 24 7135
629 7135 -14285 8277 1507 -8018 11978 -10453 -2245 11606 -11153 6350 1666 -10201 11866
642 11866 -5432 -2868 9655 -9938 6345 2253 -10514 11965 -3222 -3311 9454 -10655 4317
655 4317 6320 -8256 8401 -3578 -3710 9615 -7695 3952 5058 -9643 7274 -1328 -3508
668 -3508 9595 -7221 -36 4920 -6350 6376 -1774 -4509 7999 -6177 -487 4892 -6156
681 -6156 5333 -1026 -6473 6128 -2911 68 2852 -7115 3861 390 -4636 4947 -4021 -976
695 -976 3853 -5891 2340 1149 -3931 3531 -3390 -991 3924 -4328 1433 484 -3386 3963 -2184 -1595
711 -1595 3464 -2923 1144 786 -2615 3501 -1180 -1502 2886 -1813 1368 1177 -2480 2637 32 -693
727 -693 2331 -1594 1006 1468 -1523 2138 127 -769 1883 -1056 658 1475 -988 1313 -180 -719
743 -719 1711 -422 243 642 -1110 694 -168 -499 1118 -826 -435 201 -994 575 158 -933 8
760 8 -660 -528 92 -474 199 -721 -1219 64 -488 -171 255 -926 -564 -477 -644 379 27 -391 -733 -894
780 -894 263 221 111 373 -897 -739 231 242 910 260 -774 -377 -101 843 1154 25 20 -684 -285 1526
800 1526 919 491 50 -1020 361 991 903 1323 -620 -751 441 288 1851 850 -1151 -57 -416 430
818 430 1982 -97 -224 -698 -1261 1542 865 -134 241 -1942 -457 1100 -192 1004 -654 -2126 151
835 151 -298 808 828 -2144 -348 -701 -890 1873 -833 -1072 119 -2403 850 1376 -1396 550 -1875
852 -1875 -1202 2100 -881 548 -14 -2767 1695 325 -695 1826 -2132 -124 1471 -1520 2093 -85
868 -85 -1460 1851 -1671 1033 2412 -2248 1412 -194 -1223 3369 -956 256 1376 -2822 2437 1262
884 1262 -1141 2602 -2610 -437 3331 -1426 1773 -202 -2818 2715 -502 670 1871 -3787 1199
899 1199 867 -1572 3093 -2098 -1239 2166 -2653 1197 498 -1791 2328 -2654 -1445 2049 -1810 2483
915 2483 -540 -4731 1712 46 1031 1630 -4989 -324 1250 -67 2658 -3540 -1731 2439 -1821 1883
931 1883 -76 -2914 2663 -1081 -629 1711 -2404 2276 910 -2725 1693 -1533 948 3989 -3039
946 -3039 -601 29 -386 5058 -1060 -2690 605 -1124 4600 1477 -4473 1218 -401 1987 3477 -4920
962 -4920 323 2321 -865 3128 -3306 -1488 4801 -2000 738 -585 -3417 5360 -518 -2756 2016
977 2016 -3773 2685 3023 -4713 1476 -1729 -872 4804 -3727 -268 330 -3962 5284 -818 -3727 2824
993 2824 -4365 2104 3768 -5833 1754 -860 -1290 5245 -5369 -635 3620 -4141 4061 -1608 -4825
1008 -4825 6602 -2076 -1033 2462 -5435 4263 1832 -3595 3751 -4435 491 6215 -4890 2079
1022 2079 80 -4245 6900 -1297 -2107 3015 -4455 4384 2165 -5125 4452 -2126 -534 5773 -5846
1037 -5846 934 3646 -3652 3983 -2071 -2699 5344 -2943 1118 1422 -5467 4735 545 -3234 3921
1052 3921 -4290 -458 4517 -3175 1335 -1646 -2942 5325 -2153 -1413 1557 -4473 3696 1449 -5241
1067 -5241 2631 -833 -760 2598 -4240 1022 1881 -2634 2402 -2448 -1520 4331 -2902 -84 1699 -3409
1083 -3409 2175 323 -1357 2357 -2583 -179 2116 -1465 2472 -991 -2938 3719 12 -848 1214
1098 1214 -1775 1723 1079 -1869 1338 -130 838 1405 -2840 1187 2247 -1567 941 -119 -714 1663
1114 1663 -697 69 914 -508 553 -1191 -255 2475 -993 -1296 624 -476 851 249 -1490 104
1130 104 413 34 -735 -1120 1019 524 -1444 -457 -334 22 882 -749 -1235 94 107 -267 -299 -13 -62 -809
1150 -809 -303 479 -62 -168 -120 -735 23 731 -204 -265 287 -136 -209 106 410 337 -194 108 17 -83 945
1171 945 381 -500 241 261 162 622 119 34 96 190 585 87 211 378 -328 383 660 -246 132 188 -4 292
1193 292 -45 67 104 -306 161 -14 11 290 -461 -432 191 -56 -20 -188 -516 -250 -175 33 -2 -508 -421 -361 -250
1216 -250 209 -52 -426 -436 -465 10 221 59 -286 -676 -340 126 248 145 -150 -549 -323 157 459 370 -159
1237 -159 -536 -250 292 671 392 -51 -286 -285 331 715 517 10 -316 -107 370 720 617 -27 -334 -34 211
1258 211 670 634 -65 -376 -183 260 642 402 -30 -310 -391 197 531 255 -82 -512 -390 86 275 236 -314
1279 -314 -467 -308 -305 284 260 -555 -420 -422 -219 269 -101 -376 -467 -472 165 -83 -165 83 -745 -320 311 -186 21
1302 21 -21 -421 -131 23 358 -61 -527 182 -62 -7 637 -244 -208 403 -91 232 363 40 105 -302 336 822
1324 822 -168 267 177 -486 759 594 -350 279 -28 118 427 111 364 -91 -211 620 -336 88 994 -698
1344 -698 -402 360 -200 566 5 -641 -23 -446 606 317 -1143 561 -335 -1025 1190 -419 -766 342
1362 342 -978 298 275 -658 427 -1049 -207 993 -1446 418 495 -1521 793 -189 -662 1169 -873
1379 -873 -65 49 -930 1715 -404 -1072 1207 -1075 498 1327 -1556 747 232 -650 1442 -728 419
1396 419 950 -1665 1270 623 -767 1507 -1117 -304 1747 -763 672 117 -978 1565 -561 -171
1412 -171 1440 -1232 630 364 -1498 1697 170 -1013 623 -1089 605 955 -1402 545 -363 -734
1428 -734 1227 -994 -38 880 -1442 101 158 -432 906 -1227 -745 768 -576 465 -301 -1239 890
1445 890 -254 -614 378 -719 453 27 -1208 602 211 -79 304 -1219 73 1135 -145 -93 -604
1462 -604 -58 1142 -11 -297 -44 -105 843 42 -431 326 398 252 -286 -74 723 379 53 -381 -235 975
1482 975 521 -210 -351 -131 766 80 -385 412 -99 200 -121 -736 954 455 -670 -585 -684 1177 651 -1416
1502 -1416 -172 -345 166 1068 -1405 -423 820 -696 156 -652 -315 1359 -1198 -635 265 -848 1324
1519 1324 -209 -1745 961 -455 -225 745 -1113 701 -223 -1425 1357 -158 65 630 -2035 870
1535 870 1447 -1013 611 -696 -96 1671 -1156 153 675 -752 1541 -710 -1079 1997 -399 179
1551 179 672 -1461 1247 428 -572 1167 -1076 194 1267 -1312 1034 315 -1339 1311 -432 -324
1567 -324 995 -1166 558 369 -1190 989 -675 -284 1352 -1369 -35 579 -1144 917 -248 -933
1583 -933 724 -938 234 664 -1302 565 -222 -830 1104 -823 -359 678 -999 358 -40 -786 928
1600 928 -557 -312 637 -1001 450 428 -840 628 -272 -249 811 -534 346 205 -702 943 -34 -397
1618 -397 740 -471 213 674 -481 357 35 -47 821 -433 43 432 -322 611 214 -431 570 -69 -62
1637 -62 339 -197 345 13 -329 334 -170 0 365 -435 -90 10 -275 286 -27 -276 -142 -469 134 162 -339
1658 -339 -127 -508 -436 272 -36 -225 -208 -443 -22 0 30 6 -370 -200 -74 -165 264 100 -298 -156 -119 116
1680 116 205 -7 -54 -199 -133 260 222 77 20 -237 44 353 207 185 -1 -193 169 202 232 195 -99 18 77
1703 77 204 274 64 2 15 -29 261 197 63 8 -140 106 232 -26 35 -173 -156 83 -24 83 -69 -297 -112
1726 -112 -9 -44 -28 -237 -226 -139 -88 35 -184 -275 -191 -160 43 31 -149 -184 -265 -66 31 -25 47 -235 -320 89 110
1751 110 80 21 -197 -117 84 135 170 -6 -116 -35 13 282 285 -113 -49 37 62 328 287 43 -145 70 231 232 197
1776 197 48 -173 44 246 148 169 133 -191 -2 171 118 140 -118 -133 52 -23 267 50 -268 -11 -186 -96 293
1799 293 -74 -290 -234 -156 167 72 -201 -169 -504 25 308 -230 -59 -306 -381 199 14 -119 -54 -330 -7 -146
1821 -146 -92 352 -288 -315 39 -357 243 343 -333 -2 -182 -110 471 92 101 -166 -400 468 423 103 171 -461
1843 -461 6 658 100 146 19 -167 359 79 28 390 -131 105 52 -293 552 325 -222 93 -315 106 472
1864 472 -164 99 -42 -462 320 11 39 251 -713 -99 349 -132 257 -455 -515 456 -128 -73 -19 -577 351
1885 351 6 -610 261 -332 23 311 -837 28 249 -285 274 -497 -394 528 -309 74 -6 -601 559 69
1905 69 -214 438 -492 -31 498 -259 297 -3 -301 542 -21 109 354 -409 400 315 -255 492 -160 -29 581
1926 581 -276 -32 249 -101 553 -193 -476 431 151 271 16 -845 382 555 -95 75 -451 -14 448 -298
1946 -298 -111 -65 -151 427 -374 -465 403 -97 -57 -98 -533 160 122 -314 64 -324 -72 69 -443 271 230 -549
1968 -549 -88 -125 43 385 -435 -329 166 79 204 -320 -302 438 -81 -121 66 -228 357 360 -359 -50 66 291
1990 291 385 -157 -19 78 23 485 155 -119 119 -105 120 453 -21 -56 33 20 258 25 -78 227 -12 124
2012 124 102 -301 220 232 -180 -59 -244 -50 341 -77 -273 -248 -139 375 11 -295 -107 -337 36 340 -343
2033 -343 -98 59 -223 65 -114 -179 117 -170 18 -28 -355 244 27 -205 111 -281 -89 412 -125 -44 -54
2054 -54 -100 392 -2 -70 34 -176 317 211 -264 163 16 -13 443 -25 18 164 -97 295 68 -45 329 -85
2076 -85 133 246 -189 230 185 -148 129 -122 21 311 -132 -17 -134 -156 362 19 -191 22 -305 91 116
2097 116 -202 11 -188 -161 134 -171 -31 -37 -381 35 -66 -227 193 -106 -157 -73 -227 70 76 -196 -77 -232
2119 -232 42 193 -172 -44 -26 -149 149 35 -70 84 -104 32 108 -55 153 -43 -75 117 1 134 42
2140 42 -129 112 127 33 125 -24 52 42 -73 228 155 -60 70 -78 110 165 24 4 -92 29 99 15 16 23 -148
2165 -148 16 14 -57 31 -101 -89 -71 -12 11 -111 -128 -75 -135 -19 40 -135 -92 -87 -102 24 -40 -50 -111 -182 -40 16 -36
2192 -36 -74 -129 -108 98 12 -11 1 -80 -98 48 77 113 -25 -55 13 32 116 94 -23 16 70 87 130 56 60 -9 52 143 50
2221 50 18 48 15 86 161 68 -54 -63 -19 81 52 106 88 -125 22 50 28 151 -44 -132 -4 6 73 22 -117 -118 -138
2248 -138 57 104 -61 -79 -173 -123 117 -38 -5 -106 -221 27 -52 -37 90 -229 -119 -22 -66 36 -16 -108 -115 -153 47
2273 47 104 38 54 -104 -85 179 134 7 18 -96 33 187 154 129 -114 21 165 24 154 160 -105 247 68 -25
2297 -25 165 15 50 42 -67 120 68 47 180 -171 -100 171 -70 124 -1 -208 86 109 -7 15 -233 11 96
2320 96 -179 99 -202 -143 211 -151 -116 14 -199 84 -10 -153 79 -214 12 113 -297 130 -22 -225 131
2341 131 -106 -100 103 -72 122 -50 -221 156 -21 40 161 -309 -13 261 -21 119 -57 -92 190 -3 136
2362 136 27 -172 241 47 -102 252 33 22 227 -94 73 132 72 199 -97 -123 158 0 202 76 -333
2383 -333 4 131 2 51 -137 -141 125 6 2 -133 -245 238 -27 -177 12 -169 49 194 -261 -205 -14 6
2405 6 118 -159 -175 -24 -132 115 -15 -335 63 67 -81 90 -177 -148 183 -6 -8 -185 -241 251 50 -78 34
2428 34 -236 161 331 -180 -11 -1 -26 256 -99 -29 187 -134 234 111 -191 259 4 -36 336 -100 0 146
2450 146 -94 262 -102 -235 283 -67 112 153 -432 116 153 -143 143 -299 -141 335 -227 -30 -50 -357 321
2471 321 -106 -228 229 -340 35 185 -360 62 -158 -224 350 -279 -142 120 -348 301 10 -397 180 -128
2491 -128 43 251 -431 122 97 -177 354 -265 -204 339 -177 82 22 -256 317 50 -51 219 -377 164 412
2512 412 -224 173 -153 -111 496 -54 -37 107 -165 386 24 -224 270 -30 74 184 -317 201 163 -109 129
2533 129 -179 -14 211 -212 130 -18 -221 188 -81 2 107 -384 -51 179 -44 85 -331 -193 226 -116
2553 -116 -94 -107 -227 191 -33 -192 -20 -145 28 -35 -313 89 58 -46 42 -233 -40 162 -86 78 -50 -166
2575 -166 105 -10 88 54 -175 -4 23 35 191 -109 -31 88 31 127 -22 -88 119 4 33 139 1 136 -18
2598 -18 -84 75 15 81 90 -131 29 -19 28 148 -77 -96 17 -53 133 26 -109 -100 -70 12 41 -121 -22 -99 -149 13
2624 13 -6 -2 -50 -169 -66 -26 16 52 -109 -108 -14 -77 8 -8 -89 -113 -23 -5 23 15 -11 -69 1 115 16 -58 -33 -37 87 132
2654 132 68 0 -102 74 62 88 88 16 -18 0 42 76 63 -5 -51 -14 69 55 -15 29 -31 -19 83 78 -17 38 -57 -63 29 81
2684 81 40 -73 -109 -36 -11 38 1 -78 -120 -29 13 39 22 -65 -125 -77 -2 13 -42 -27 -138 -93 20 -33 -28 -50 -84 -55 14
2713 14 2 19 -90 -78 -59 -28 55 32 18 -77 -28 54 29 31 -17 -27 -22 67 92 69 34 -45 72 24 62 96 8 36 77 6
2743 6 62 58 32 -2 -42 23 36 20 54 -53 21 53 11 47 -50 37 -3 -54 4 -10 -84 -12 -31 -57 27 -69 -48 37 -35 -6 -60
2774 -60 -49 7 -53 5 -30 -96 32 9 -57 -13 -104 10 51 -135 -8 -17 -92 81 -52 -108 122 -11 105 -13 -114
2799 -114 43 4 37 137 -65 -3 68 -25 88 14 -63 102 23 102 5 -111 104 45 20 116 -114 41 236 -66
2823 -66 23 -10 -84 180 -53 -90 38 -85 128 0 -254 69 -66 -43 128 -213 -2 55 -127 97 -155 -165 196
2846 196 -186 45 69 -279 78 -6 -83 119 -284 5 132 -114 110 -198 -188 236 -72 -143 21 -227 178 13
2868 13 -280 140 3 75 121 -324 100 85 -87 207 -176 -125 228 -51 82 34 -189 233 6 14 189 -141 100
2891 100 190 -70 206 -69 -58 285 -88 28 68 -160 189 -6 -146 138 -71 41 110 -190 88 -46 -65 208
2913 208 -194 -90 53 -147 130 -21 -252 32 -56 34 21 -258 71 53 -108 35 -158 -38 182 -145 -72 -35
2935 -35 -47 156 -123 -77 53 -50 110 -26 -189 143 -35 -23 100 -75 48 13 -3 146 -4 -18 92 -40
2957 -40 176 37 -74 86 55 18 1 -128 83 97 -43 81 -62 96 111 -82 59 62 4 56 -58 -85 115 -53
2981 -53 110 -33 -145 41 -101 14 93 -94 -3 12 -68 122 -66 -37 12 -121 2 -29 -165 104 -132 -119 13
3004 13 -56 76 -34 -113 57 -52 -1 21 -158 -12 18 -65 77 -5 14 -29 -87 47 60 7 73 -54 -8 115 -62
3029 -62 55 26 -19 67 -51 14 91 -4 8 -7 -41 135 -12 -24 16 -7 40 9 -15 62 -29 -20 8 22 26 -27 -81 18 -37
3058 -37 19 19 -16 -6 -67 -21 55 -46 -51 38 -51 -16 -12 -117 -58 -67 -43 -10 -39 -23 -56 -126 1 -62 -50 -30 -47 -4 -48 -43 67
3089 67 -58 -24 21 -71 51 -16 -65 32 -16 -40 91 -39 73 -1 -8 93 91 23 45 -38 28 1 68 69 -9 44 66 23 58
3118 58 18 -1 61 -97 -7 82 -54 54 29 29 63 -11 4 1 -1 24 57 -32 54 -33 -22 -59 -46 -42 -21 -55 7 -43 11 21 -26
3149 -26 -18 -70 -11 5 -18 -97 -26 13 -23 34 -11 2 -48 -76 -8 -8 -23 -15 -14 -11 -53 2 56 -8 2 63 -44 -14 38 42 62 50 21
3182 21 0 -27 16 16 35 14 1 -14 24 9 28 20 2 -6 25 16 61 26 34 39 -22 -26 14 -38 5 -7 43 32 -48 -7 -3 -62 -23 -36
3216 -36 -44 -1 -36 -47 -68 6 -3 -46 -36 -15 -62 -55 -2 -67 26 -32 -52 2 -77 -53 -50 -84 72 -67 3 -36 -44 -19 -11 1 38 -22
3248 -22 -38 38 -9 45 48 -12 42 -38 18 101 -18 65 47 -38 61 1 47 73 -29 40 80 -35 76 -5 -84 82 -7 34
3276 34 5 -23 -25 -45 -36 46 -38 -18 48 -106 18 -45 -138 -51 -69 18 29 -102 -9 -58 -132 81 -83 -45 70 -117 31
3303 31 -37 -58 32 -64 -42 43 -92 51 -31 -114 76 -18 -44 79 -152 80 72 -21 63 -58 45 52 -134 28 55 -33
3329 -33 101 -31 7 117 -3 32 -12 -83 161 -17 -48 99 -69 14 56 -57 158 9 -24 78 -67 59 24
3352 24 -98 64 -63 -11 72 -69 -37 37 -114 25 -39 -98 54 -139 -19 46 -68 58 -35 -103 73 -86 -28 -17
3376 -17 -127 0 -13 -47 97 -160 -31 1 -106 57 -11 -107 55 -32 -50 59 -84 38 -62 -47 105 5 -25
3399 -25 27 -21 101 108 -84 81 -57 36 47 -62 8 -8 29 52 -44 16 89 -46 68 57 17 54 -16 25 93 -78 32
3426 32 34 11 44 -70 17 32 12 45 -113 -83 41 -21 -19 -16 -154 26 25 -59 45 -88 -25 10 -181 37 33 -51 73 -136
3454 -136 -20 109 -60 -17 -73 -36 -6 -62 24 48 -70 44 2 -40 120 -21 -8 52 -49 30 46 -21 88 8 -12
3479 -12 56 -38 40 82 -114 67 -29 63 130 -12 69 1 2 118 -28 -18 31 -81 86 57 -48 13 0 -37 65 -55
3505 -55 33 49 -22 29 -20 -20 39 -56 40 -35 -115 4 -62 -80 -3 -83 4 47 -129 20 -49 -34 49 -76 -48 -28 -18 21 -19
3534 -19 -39 4 -45 13 16 -8 91 67 -14 51 11 -13 88 -25 -1 14 -16 60 -41 31 16 -25 -7 9 -8 22 17 3 26 15
3564 15 45 37 12 58 -28 -9 8 -32 -4 4 7 58 -43 -32 16 -6 9 21 -43 -21 -54 13 36 -82 -13 -13 23 24 38 -17 -61 -3
3596 -3 -10 16 -48 -12 3 -78 -51 -24 -60 -67 -27 -68 -20 -29 32 -52 -48 -21 -45 3 -62 18 45 -11 -5 22 45 42 -7 48 30 34 -13 32
3630 32 -1 57 5 53 2 34 3 -11 44 -17 4 15 47 -17 59 -4 56 -13 10 -23 -27 17 -21 26 -17 22 8 15 -8 -23 -8
3661 -8 -27 -20 30 -50 -12 -10 -21 -12 -75 -35 -42 -7 -15 26 9 16 -40 -50 45 3 -40 -41 6 -2 -5 -54 -2 -5 8 -5 -24 -4 -25 -32 -41 49 -10
3698 -10 1 57 -8 7 2 28 -27 -8 27 17 16 39 23 21 -9 90 54 0 21 -11 -29 48 -37 -12 15 -44 20 -33 4 -23 -26 27
3730 27 4 -51 22 -14 -19 -19 -27 -77 5 -85 3 44 -20 -11 -42 11 35 -71 31 -18 -57 20 -74 -54 -42 -14 -46 -1 -35 26 -23
3761 -23 -25 -46 -64 29 2 -28 -47 13 -4 47 -34 20 49 -47 63 18 -40 98 -11 84 20 -51 91 33 58 32 -42 14 37
3790 37 -6 81 4 -44 107 -12 -1 28 -74 60 0 -76 43 -21 -61 35 -57 30 22 -80 50 -48 -57 36 -71 23 -7
3817 -7 -78 50 -122 -38 83 -108 -20 16 -52 93 -63 -84 107 -43 -20 13 -114 76 13 -55 44 -109 -27 53 -102
3842 -102 79 -14 -91 109 8 -19 31 -37 76 9 -71 92 -11 37 116 -92 25 66 -40 98 -65 -64 103 15
3866 15 71 58 -45 68 -14 62 119 -101 37 58 -40 75 -53 -51 73 -86 9 45 -21 65 16 -57 69 -51 -19 39
3892 39 -112 -5 -66 -69 32 -11 10 -20 -109 49 -81 -128 73 -24 27 11 -99 42 75 -35 48 -68 14 16 -36 28
3918 28 22 -14 69 30 -21 11 -37 66 76 -19 44 39 -34 120 -85 34 35 -32 111 -21 -38 89 -21 19 64 -2 23 15
3946 15 -18 47 -30 29 39 -32 -16 -10 -53 7 -43 -26 2 -69 57 -6 -92 24 -36 -32 41 -93 -51 -61 -12 -4 -55 -13 35 -31
3976 -31 53 6 -55 -59 -56 -18 7 -25 39 -23 -50 38 -43 0 31 -18 -15 8 6 32 45 6 -25 -48 35 16 47 27 2 -16 87 48
4008 48 -51 46 1 74 -33 10 83 5 20 -30 -39 38 -9 -9 13 -42 8 -16 -26 26 -4 -11 17 -38 33 -2 -25 3 15 -3 -17
4039 -17 -24 -10 -15 -37 2 4 -28 -8 -58 -11 39 -63 10 32 -51 27 -66 12 79 -4 29 48 -37 24 -15 17 35 -3 17 41 37 28
4071 28 5 24 64 18 19 -3 1 52 45 30 55 -21 -10 46 47 68 21 33 19 -14 1 -2 -27 -38 -42 9 29 -20 9 -37 33 -6 2 -26
4105 -26 -27 -30 -33 6 1 0 -46 -29 33 -15 -10 -10 -57 -44 -9 1 13 -19 -47 26 16 -47 4 -10 -42 -7 -25 9 38 -43 5 37 6 -10
4139 -10 -7 17 -15 -3 22 -11 18 12 -7 -9 -10 -18 -10 -22 59 9 32 51 52 38 8 16 18 7 42 24 -5 -3 -10 20 -9 43 -46 -24 -9 6
4175 6 37 20 -4 -39 -8 -5 -18 -1 -32 -34 -26 -76 -7 -17 -13 -20 -5 7 -22 -1 -36 -29 27 -52 -45 -9 -15 26 -19 -19 -20 -78 -17 6 -31 -19
4211 -19 -51 -44 72 -13 29 29 4 27 -12 -32 -24 -1 26 36 34 68 2 -14 20 -14 46 33 3 70 8 -17 54 -3 -10 29 12 30
4243 30 3 -45 49 41 -12 20 10 -17 -2 -17 -32 -55 -77 44 -42 3 -15 -30 -6 -17 -6 3 -69 28 37 -30 26 12 -25 -20 -59 15
4275 15 12 21 -36 -5 -6 -54 3 -7 -77 -2 -11 14 21 11 -6 -4 36 -38 44 47 -38 11 -22 -36 4 -17 -5 4 -12 11 40 52 26 14
4309 14 -23 -1 55 2 32 9 17 -18 23 -19 12 -35 2 42 -25 31 -24 -4 -21 26 40 -4 -8 -35 -14 2 -46 -23 -32 -29 -65 -14
4341 -14 -70 -35 69 -9 -9 19 -43 -41 -73 -3 -10 -9 26 -26 -29 -27 -53 28 9 -10 -66 -16 -55 47 33 -42 -27 35 19 12 1 31 36
4374 36 -6 2 34 -14 -24 -7 59 -19 48 6 -14 23 13 1 0 -18 -8 30 -33 -38 5 -3 4 6 33 44 30 -51 -5 27 -3 -4 -30 8
4408 8 -51 32 42 -37 -24 -6 -24 -6 -35 -57 -15 -75 -56 -1 -45 -36 -2 -33 -3 -108 1 -1 -7 4 -24 -17 11 18 32 -9 49 -21
4440 -21 48 -49 27 33 11 128 18 -19 27 41 -14 -26 -27 17 11 22 11 22 20 4 39 58 -10 -46 29 9 11 -23 15 34 -7 -31
4472 -31 44 -6 14 -27 -12 -4 15 43 -4 -14 -2 -31 19 18 -19 -33 22 38 -3 -23 -47 6 -5 -43 -34 -64 -14 -25 -16 14 5 13 54
4505 54 -40 -43 -57 26 0 1 28 -38 -39 -19 -5 -21 18 60 45 31 7 20 37 10 43 43 -19 64 65 46 -2 -1 10 72 37 -23 22
4538 22 -25 60 -14 -33 -5 -21 50 -18 2 -2 23 -15 39 -8 -13 -18 -29 2 -12 -22 -23 -46 -10 -37 -29 5 -1 -50 -60 -59 -33 -40 7 5 6
4573 6 -18 -79 -15 -19 29 -32 -23 -60 -27 -34 -11 -20 -69 6 -15 0 48 -17 6 54 0 9 16 34 -5 -8 12 31 44 21 75 -7 93 51
4607 51 -31 5 -19 -2 50 22 3 34 27 23 -29 7 32 -4 58 -22 -17 7 -1 6 6 -76 35 27 -14 4 -38 -12 -53 -60 -14 -6 -10 -41 28
4642 28 -31 6 -7 -27 -6 -28 61 -32 -62 33 18 -12 -25 -7 -2 -81 -49 16 7 -9 -50 5 -33 0 -1 29 23 20 1 -2 -49 53 -25
4675 -25 69 80 20 55 -15 30 43 18 39 31 77 53 -8 15 9 -45 24 69 -16 6 11 -25 6 8 -4 -5 -28 -16 20 14 -22 -22 -60 -5
4709 -5 1 23 5 -29 -31 -42 -83 -13 -38 -21 -21 -35 17 -13 28 -6 -80 -16 -12 9 8 -5 -11 -24 11 8 -8 20 31 -24 19 -13 -31 -4
4743 -4 45 16 9 13 29 -2 -7 44 42 -24 60 -17 40 20 20 65 2 3 38 11 -2 31 -1 42 7 -6 13 -38 -13 7 -25 31 -16 -41
4777 -41 47 17 23 -27 -54 39 -23 -40 -19 -61 -16 10 -101 -40 -28 -9 13 -20 -18 -3 -37 -24 -12 -51 8 10 -31 0 -33 -2 52
4808 52 25 52 29 13 21 -29 27 36 -59 84 26 -31 93 -62 31 58 -23 40 24 -7 46 -72 -41 80 7 3 18 -31 61
4837 61 26 -65 47 -12 26 4 -2 4 -71 -7 8 -56 15 -12 -25 2 5 -43 12 -22 -33 25 -46 10 2 -51 14 -47 -44 -36 -44 -7 9
4870 9 43 -7 -45 -74 -27 -31 3 51 -2 23 -31 -50 55 33 18 0 -28 -44 43 -10 95 -9 16 76 2 27 5 -2 102 32
4900 32 57 37 30 26 38 -21 25 40 21 8 -24 -21 -18 -10 20 15 -19 -40 -19 -8 -6 -33 -2 34 -4 -61 33 -3 16 -3 -16 8 24 -9
4934 -9 -4 -37 27 -4 25 1 5 -33 12 16 -3 21 -50 6 -6 -14 -16 21 14 4 10 -14 -37 12 66 4 -34 -28 -30 62 32 2 29 -1 36
4969 36 38 4 50 22 3 -31 24 -18 50 8 33 20 0 35 57 15 29 18 -30 4 -39 2 20 -22 16 -19 -3 -16 -31 -47 24
5000 24 -5 -42 -14 -22 -3 -22 5 -13 47 2 -18 -22 -23 -66 0 2 -6 -25 47 13 9 20 -17 -7 -31 -11 14 -25 -43 36 -7 -18 -5
5033 -5 -20 52 23 12 -28 22 0 -9 -17 42 -6 99 35 17 14 0 -2 -18 37 77 38 12 38 5 16 -2 3 -9 -27 30 25 33 11 25
5067 25 9 29 -13 37 -35 -11 25 -30 6 -1 -5 -30 -11 5 -11 -38 -9 23 20 -52 -37 38 -29 -9 -50 -37 -9 44 16 23 4 -33
5099 -33 26 14 28 3 -24 18 -10 6 -43 -38 0 21 -19 13 44 -45 68 -63 39 73 15 11 -18 -42 49 69 -20 35 -8 26
5129 26 23 -8 3 24 12 27 26 -38 16 40 0 22 6 17 10 -9 33 -39 -16 -3 -14 -5 -40 -28 -16 5 -33 9 -48 -37 -17 -41
5161 -41 26 -40 -31 44 -50 -62 -30 -41 13 20 -86 68 8 12 -3 -43 -24 -25 -72 23 17 1 36 37 0 45 -8 50 -30 -32 0 19 55
5194 55 -1 -3 21 -56 -21 56 -23 2 1 -30 96 10 -4 26 -15 22 59 -54 49 11 -22 59 11 34 -10 -38 14 -38 -87 17
5224 17 0 49 -22 2 -31 19 -47 29 -33 -48 -33 -36 9 -43 -42 23 -4 -48 -66 -61 -9 18 -3 22 -92 -15 8 -90 31 -59 -2
5255 -2 61 -12 3 11 -22 81 65 -39 79 -36 40 34 -38 -21 21 35 42 -73 -11 67 -11 23 -6 -68 49 -7 3 26 -75
5284 -75 26 27 -37 29 -50 -17 99 -34 -48 34 -86 49 -21 -36 29 -15 24 61 -77 6 -22 -104 43 -78 -75 12 -22
5311 -22 44 -32 -119 28 -55 -15 -36 -125 31 -14 -105 65 -75 -15 61 -8 48 -21 -66 78 37 -27 56 -36 64 74 -106
5338 -106 59 19 -37 66 -64 3 22 -2 42 -19 -63 60 -39 -31 43 -70 41 66 -56 59 -70 24 72 -68 22
5363 22 64 -31 94 -12 -64 49 -40 27 38 -99 30 -28 -66 76 -89 -34 44 -127 19 10 -25 11 -23 -8 -22 -84
5389 -84 -15 -2 -94 10 -52 -31 20 -63 -32 -3 -71 -18 63 -82 45 -40 17 28 -29 -8 31 27 41 -12 -60 10 -71 12 16 -37
5419 -37 126 2 2 53 -15 82 41 -4 95 36 69 34 -8 23 -64 0 44 -55 -1 4 -41 -14 -19 -26 -11 -11 19 41 -36 -10 11 57
5451 57 -26 -7 -48 -20 -32 10 -37 -65 -48 18 27 18 10 -18 -20 -88 -29 -24 -20 6 32 -12 -34 -36 36 -30 -9 15 -29 5 -38 17 39 -9
5485 -9 33 2 13 -66 17 21 -3 -1 62 37 4 -3 0 35 5 52 -53 2 36 29 42 -25 3 7 -6 36 35 -21 27 -40 -43 -15 -67 8
5519 8 -15 -23 11 -59 15 -30 -53 1 -35 9 -14 -62 29 10 -48 13 -36 -61 56 -5 -51 -37 -4 -7 -42 -1 -11 -27 -20 12 -5 -8
5551 -8 -37 -21 11 23 4 -15 10 48 17 42 53 12 9 5 23 8 57 8 54 7 -3 65 -6 30 -31 -38 36 -32 0 14 -52 -34
5583 -34 1 4 29 -6 3 24 17 -23 24 -17 -71 -33 -44 -8 -16 -45 -13 -8 -3 -17 -40 10 -20 -15 76 -49 16 47 -41 15 -15 -5 18
5616 18 -30 -13 28 -35 28 -1 2 34 -41 -22 -12 4 8 -23 37 26 33 -23 81 -50 27 3 -36 17 -16 -7 36 -4 36 -36 -7
5647 -7 71 -20 -29 34 -22 45 72 -69 19 3 24 8 -29 81 0 -23 -10 -8 0 43 -14 0 -24 -47 18 -17 -51 -84 20 -53 20
5678 20 7 -19 -84 -66 -26 -32 -30 26 -31 12 25 -29 18 -26 -43 -7 -101 -9 13 -26 87 -17 30 34 -5 40 54 -40 2 25 10
5709 10 28 -33 12 3 -7 63 -2 -5 52 -1 21 -20 -54 51 57 -37 21 -5 49 66 -14 16 2 -3 45 -51 12 13 -18 78 -1 -26
5741 -26 -3 29 70 -6 13 26 -34 19 -11 -14 -47 -4 17 38 -5 -39 17 21 -36 -83 -58 18 47 -2 44 4 -36 72 40 -40 -46
5772 -46 -81 44 -23 -41 -1 -25 8 48 -48 46 13 52 39 21 55 75 -10 22 0 -7 40 28 47 60 -4 15 72 -24 -1 -30
5802 -30 12 47 -14 -7 -30 -74 23 23 -42 37 -66 36 46 -28 33 15 -20 58 -2 -10 18 -64 21 -40 -34 10 6 -44 64 -30 23
5833 23 6 -3 48 -17 -9 60 12 11 -6 -87 -19 0 -14 -12 -6 24 40 -44 -20 -18 -35 92 -2 8 -2 -11 96 62 -8 38 25 4 56
5866 56 -41 42 -25 -27 78 -20 -34 106 27 32 22 -56 55 37 -29 57 -15 -34 40 -14 -13 9 -51 28 -26 -65 34 -101 -19 43
5896 43 -28 26 -27 -14 25 -57 -32 15 -1 -6 -1 -25 28 -49 34 17 -7 -1 -30 -54 -20 -34 -71 -5 -16 18 -6 -61 29 10 31 30
5928 30 -9 -15 46 -43 -4 -9 -26 23 -50 59 38 -12 46 62 29 -8 -51 26 49 -64 39 -7 -50 27 15 24 -4 6 40 12
5958 12 -51 39 36 -2 -7 -26 9 34 15 7 -57 71 0 -13 28 15 -17 51 -34 29 62 -29 13 -116 -30 34 -6 -15 -48 -41 -27 -30
5990 -30 -17 58 -17 14 -4 -7 -8 -13 31 26 9 10 57 12 49 -6 -1 24 -3 -2 38 24 34 -22 -26 18 1 33 32 4 63 -29 -20 51 -11
6025 -11 3 44 53 8 19 -36 28 20 -12 12 19 -15 -22 -11 30 4 18 7 -35 -32 -3 -16 13 -55 -28 11 -78 -38 -10 -37 0 -65 -35
6058 -35 10 -43 -80 7 -23 9 -2 29 15 -16 16 40 -25 -2 -7 -16 37 -44 3 65 -20 -27 2 -35 25 20 13 -9 -28 56 0 -13 106
6091 106 8 -9 52 -6 -18 35 -61 28 -36 -9 60 4 6 56 -42 12 -64 -11 70 -51 23 12 -15 -2 -10 -85 75 -18 -27 47
6121 47 -106 35 -24 -24 8 -83 -27 51 -61 22 -32 -46 74 -61 -11 54 -90 -44 -2 -67 40 -27 -12 6 -62 -19 -10 -41
6149 -41 62 -56 -22 91 -21 19 17 -38 82 -8 -8 64 -43 41 64 -11 35 -9 -51 60 7 -60 84 -22 55 58 -68
6176 -68 75 -6 46 38 -22 5 81 -74 15 5 -13 40 -23 -39 76 -48 -12 -11 -69 39 -93 37 25 -25 45 36 -43 21
6204 21 -25 -19 12 -21 13 -40 -19 79 -72 24 6 -30 53 0 -33 51 -63 18 -4 -61 9 28 45 79 -77 -12 64 26 -1
6233 -1 -16 18 33 -25 38 38 -10 53 -18 56 45 -28 50 15 -13 65 -38 -30 30 19 -19 0 17 43 2 -19 -12 -60 -14 38 -41 32
6265 32 6 -77 3 -5 13 52 -77 -14 14 -52 44 -17 -17 20 -37 31 8 -39 -1 -6 -40 30 -35 -7 -15 -62 81 -43 -40 33 11
6296 11 11 10 -77 38 -6 1 54 -66 3 -19 -16 20 8 31 97 0 -46 32 -59 58 8 -31 53 -66 -19 64 -48 69 -19
6325 -19 -19 28 -28 12 -3 -95 -32 -28 -32 73 -5 -32 -37 -17 -4 2 -38 -49 -30 -45 8 -16 -7 24 -25 -20 -1 16 -14 -28 -12 12 13 43
6359 43 68 1 -5 25 -39 -13 13 -41 23 22 13 10 17 9 -30 -18 5 36 0 53 -22 45 12 23 30 -8 -2 0 9 31 3 25 -12 25 -2
6394 -2 8 -8 -28 16 8 -9 16 36 -16 4 -48 11 -25 11 13 -5 -33 -2 9 -17 -80 11 34 6 -3 6 -26 36 -10 -2 49 -13 -2
6427 -2 8 -26 -34 -21 -51 56 -55 -30 31 -38 -6 13 -2 39 7 -25 -7 2 22 2 -53 -22 17 28 9 14 1 3 18 14 8 -33 -11
6460 -11 -24 6 37 -18 32 3 55 34 37 -31 -3 -2 49 25 -38 -26 26 7 15 -11 -42 29 -80 23 -30 -38 -21 10 -45 29 -25
6491 -25 -39 -65 -56 -55 -50 -14 -30 -51 -26 1 -10 -42 22 10 -24 -47 26 -10 4 -53 -26 29 -1 13 14 -58 -52 20 24 51 -10 4 42
6524 42 34 7 1 -24 -9 -1 31 23 -15 -7 -34 5 1 -19 10 -14 -39 47 -46 -9 48 -11 -26 59 -9 -31 -17 -10 -12 49 7 -28 -45 -16
6558 -16 -7 22 -6 -21 21 1 -44 16 -38 29 -36 6 1 -45 -24 -26 54 -36 33 -85 -36 -19 -32 11 47 -17 45 47 -55 -5 44
6589 44 -9 36 -34 -9 54 -23 9 1 -7 71 4 29 9 -67 19 -6 -3 93 42 11 97 5 49 -16 -11 56 -15 28 74 -43 32 -2
6621 -2 -53 -16 -41 -10 9 -28 49 -11 -26 40 -76 -25 35 -4 -12 16 -45 115 -2 -44 56 -57 17 -15 -35 42 -46 -32 28
6650 28 -62 -50 49 -41 16 -66 -57 65 -52 -8 66 -65 50 35 8 61 -86 -62 -5 -49 66 78 -60 74 -21 50 104
6677 104 -64 33 50 -5 13 8 11 98 -47 -6 -7 -49 71 25 -46 28 -33 15 52 2 -1 9 40 112 -80 -14 54 -50 34
6706 34 -19 -56 -21 -11 10 23 -68 3 35 -47 72 -4 -18 54 -37 -21 -57 -43 30 -10 -9 13 -60 24 -14 -55 11 -8 -50 -14
6736 -14 -98 -38 -4 -13 29 -44 -59 15 -1 -20 29 -3 26 -16 1 25 -54 35 85 12 61 4 -44 64 -11 75 50 -57 51
6765 51 44 12 56 -40 2 15 7 46 -31 10 74 -31 -19 -3 -8 22 -6 -24 43 -46 10 53 -19 -41 19 -49 -23 -62 40 -2 -12
6796 -12 67 6 -16 5 -36 -29 43 -39 17 3 -30 20 -16 -25 6 -32 -36 7 -31 36 -24 -27 24 -19 -43 17 -29 59 -32 -12 -9 -44 38
6829 38 61 0 -1 29 -9 40 -7 -47 13 -60 64 29 -19 50 4 49 45 9 -22 45 -40 53 -31 -24 100 -42 6 -13 -79 39
6859 39 -23 -13 -12 -9 -25 19 -71 10 -51 -11 34 -42 2 -27 -53 29 -38 -52 71 -13 -34 -9 -36 -21 3 -46 32 -24 -44 -13 -27
6890 -27 58 -4 -7 9 32 25 28 -76 -31 86 -24 -3 3 7 12 33 -28 1 -47 -8 -39 22 2 1 19 -39 -1 11 24 25 35 39 27
6923 27 19 -8 4 30 -45 36 -11 6 -1 -39 -8 -34 4 -30 -15 -11 -19 -47 -12 -46 61 -17 -29 -42 -15 8 -8 -20 44 -15 5 5
6955 5 9 -18 -59 -53 3 53 15 15 -22 52 21 32 -32 -27 -14 3 -13 4 33 24 0 -4 32 27 40 -10 -23 -33 11 63 -18 -46 49 -14
6989 -14 -33 22 -36 -2 1 62 -6 -28 -11 4 -3 16 -20 -13 39 12 18 25 -5 28 -44 28 -15 -5 -12 1 -51 -16 -5 -63 -26 -7 23
7022 23 -18 -35 47 -6 13 -38 -31 27 46 2 -4 -9 -15 -41 -55 15 3 -1 -36 52 20 1 26 6 9 31 4 -14 11 13 60 -22 55 -53
7056 -53 -41 57 37 58 66 -9 23 57 1 27 -3 50 19 -11 52 8 77 9 14 29 -29 -55 1 6 5 32 -15 6 -4 14 -72 -26
7088 -26 25 4 -41 3 -25 -50 55 -56 -30 -3 -34 30 3 -48 27 -47 -21 35 9 -2 14 -66 -39 -57 -27 -29 -10 30 -9 -8
7118 -8 17 6 26 21 0 35 41 24 -27 -4 -31 36 2 -2 41 -42 -14 47 -57 15 19 -56 -14 17 7 -59 -30 -27 17 -36 35 33 17
7151 17 -8 20 2 16 -44 17 0 -47 17 -10 32 68 -13 7 8 -9 48 17 36 2 15 -30 -1 -30 26 1 -32 47 -13 0 -32
7182 -32 -24 -3 14 6 20 -39 -51 33 -16 -4 -18 -52 67 -29 -47 -9 -23 17 21 -20 7 -16 63 -15 -16 -12 36 -9 34 20 44 5
7214 5 23 19 33 -9 -1 83 -46 2 -54 27 -2 10 37 -6 40 -7 47 -8 25 58 -24 24 -22 21 -18 51 -25 -24 -72 -5 16 -43
7246 -43 -33 -46 4 23 2 36 -44 -49 15 22 -30 -6 20 -4 8 -24 -9 -12 17 -2 15 30 -36 -19 -2 -12 5 12 -1 39 23 -21
7278 -21 25 20 5 24 35 -20 -13 52 -25 11 -7 -16 -34 -1 -24 24 -23 37 13 -11 2 40 -14 -2 -7 15 35 -8 13 -2 -76 -22
7310 -22 20 -57 35 -17 -40 33 6 1 34 -14 42 15 -18 -5 -15 20 -8 -36 2 10 -21 43 45 2 -18 44 41 -5 -9 -24 -1 22 -3
7343 -3 -44 15 60 -17 12 -16 -24 90 -16 -39 -17 -18 78 -6 -33 26 -36 12 32 -53 14 29 8 25 21 56 54 -18 12 18 -16 12
7375 12 12 50 32 1 -16 11 15 10 -84 27 16 -2 -50 18 -7 5 -42 -41 -6 -10 16 -18 -7 8 8 -30 42 21 15 7 9 34 -19 -45
7409 -45 15 -46 42 -32 74 2 42 42 23 46 -36 30 -54 8 -23 12 11 15 -45 66 -7 -16 15 -4 25 27 -1 40 -15 -9 -27 -15
7441 -15 -60 56 -55 30 -8 -24 22 39 -22 -23 17 61 18 32 47 69 -34 -17 -63 -51 -26 33 -14 7 0 14 -47 -7 -60 -6
7471 -6 -39 -46 41 -16 2 -10 17 -16 46 -53 -5 11 29 -7 11 4 -7 30 29 59 -47 2 29 -39 3 -47 28 -6 46 12 -9 75
7503 75 -6 39 -17 -27 -48 15 49 62 -48 -13 29 41 -41 -30 9 -1 -28 21 -55 -18 -2 -12 66 29 -24 -28 -14 -10 -5 -46 3
7534 3 40 11 -1 -35 -14 29 8 -26 33 0 22 -13 -18 -10 20 -3 17 8 10 36 -30 31 12 6 19 -5 19 35 24 -25 -7 -1 -32 -5
7568 -5 -22 -17 12 -7 25 49 17 59 13 35 52 43 6 -23 4 -7 -9 1 6 17 22 7 -32 -8 -14 7 -13 -10 -2 22 72 20 -14 4 57
7603 57 -42 28 16 -30 -11 -38 60 -5 28 -23 22 -41 -13 10 -28 51 2 -20 -26 -45 -9 0 6 11 -37 13 10 3 68 10 19 -38 -33 5
7637 5 23 -23 1 4 43 -2 24 10 14 13 12 18 -41 -45 -4 5 4 24 -19 -8 34 27 39 -35 -10 -10 -22 -21 60 43 11 28 24 3 -25 15 -60
7674 -60 31 -1 -37 23 -1 6 -25 1 42 11 12 54 -88 -72 -13 -7 -13 -11 59 -34 20 8 35 13 31 -9 33 14 29 14 22 58 36
7707 36 14 2 26 13 -60 -39 6 -29 15 33 -60 6 -1 11 19 -10 2 45 -43 -65 -5 47 -38 -9 -28 17 16 46 -9 20 41 71
7739 71 19 -13 -4 0 40 -17 -38 -12 -26 16 15 -43 -74 -20 -14 24 -20 -10 13 -5 17 -10 -4 9 -49 -56 24 10 -7 36 -46 17 -38
7772 -38 47 8 -24 -2 35 11 -6 41 30 47 3 -22 32 -25 -2 21 -23 48 -17 15 55 -35 -1 39 -6 10 31 -26 12 -26
7802 -26 -21 37 -13 17 -1 42 54 32 4 50 -33 -7 61 17 39 36 -34 -39 3 45 48 6 21 -22 -3 7 2 -11 2 -18 -7 45 -28
7835 -28 23 -68 -41 8 -6 -22 47 31 -42 21 -25 30 19 -4 -23 3 32 10 -32 4 -37 -9 50 -17 18 -28 6 20 -28 27
7865 27 30 -42 40 11 -16 0 53 13 -30 18 -24 31 -38 73 9 13 38 5 -24 7 69 -16 39 -50 -13 51 -21 -56 -28 -32 -14
7896 -14 35 23 30 -26 -3 -15 -16 -52 -7 6 37 -26 17 -25 -54 -34 17 -39 17 -59 -6 28 -17 -4 49 -30 -20 -32 35 43 26 -24
7928 -24 -29 25 -18 34 -1 27 -14 3 28 9 -17 17 -24 53 -3 -10 8 -42 -11 -17 12 0 40 -36 5 -23 43 10 5 28 36 -28 -28
7961 -28 -50 -1 37 33 16 52 7 44 -2 49 -22 -11 -18 -10 5 24 50 -3 -37 10 -11 6 -18 7 29 0 -41 2 -7 -5 10 -15 0
7994 0 14 10 -3 -51 -4 36 -19 -2 -29 3 7 -36 -50 7 61 37 18 0 24 9 37 -30 47 -35 25 35 28 -41 -5 21 1 43
8026 43 19 24 20 -31 2 -37 -11 35 64 55 -8 9 -30 20 -4 -22 16 -25 -21 -18 -28 17 -19 -26 -20 20 0 3 -8 32 10 -13 -5 12 10
8061 10 32 -60 -21 -12 15 36 2 5 -23 17 -16 -7 5 14 -3 -9 -45 8 -2 -31 41 41 -21 -52 -6 -62 2 -16 70 14 -35 48 68
8094 68 -19 61 5 53 27 -48 -31 52 -23 -8 51 -3 37 33 34 36 -15 38 33 5 -19 14 -16 -25 46 -39 17 -11 -50 5 -6 16 -38
8127 -38 -22 -7 -2 10 36 1 27 42 -15 -31 30 4 -10 -14 5 11 -40 13 2 22 19 -11 -2 53 1 66 22 30 -8 26 33 6 -16 50
8161 50 50 -51 4 37 60 16 -21 11 16 24 1 -33 -37 12 20 53 35 21 -9 12 -11 21 47 1 -53 28 7 -35 16 14
8191A4
$$ Imaginary data points
##PAGE= N=2
##DATA TABLE= (X++(I..I)), XYDATA
0 0 0 0 0 0 0 0 0 0 0 0 0 -8 8 -8 8 -16 16 -16 24 -24 32 -40 48 -56 64 -72 83 -96 112 -128 144 -165 185
33 185 -209 236 -264 297 -332 371 -413 456 -506 560 -620 685 -756 834 -917 1012 -1112 1224
51 1224 -1349 1489 -1644 1819 -2018 2245 -2508 2815 -3183 3630 -4185 4897 -5844 7161 -9117
66 -9117 12307 -18337 33432 -141721 -192483 171915 -58879 113125 -20550 -219550 163196
77 163196 23792 -38376 72424 -192179 100086 100496 -168495 101035 -45536 -61131 160735
88 160735 -119764 9076 58058 -126216 122073 -12663 -73936 102110 -136742 45342
98 45342 134009 -136462 44940 -28068 -56315 174494 -83636 -61929 58662 -69771 122399
109 122399 -8119 -133160 107145 -32064 6897 78169 -135045 48481 58345 -64840 73989
120 73989 -65554 -23446 97926 -69061 36226 5840 -87259 102658 -11505 -42937 54019
131 54019 -76364 41563 54033 -75557 40416 -27975 -16836 84101 -65693 -2032 31145
142 31145 -56635 63216 -8186 -48443 50622 -42614 11475 38253 -57074 30970 -8804 -26756
154 -26756 57264 -43018 -10043 31985 -35926 37390 -11425 -45027 46533 -11055 2411 9201
166 9201 -53710 37839 20234 -28989 18673 -32870 7038 39391 -33965 9612 -1373 -17400
178 -17400 35984 -20246 -5715 23377 -26007 17464 3971 -20028 26371 -13539 -2038 20034
190 20034 -22852 12759 4431 -12975 24744 -14026 -7985 16856 -11651 16159 98 -21306
202 -21306 17870 -2297 877 10389 -20476 9347 8177 -11016 11211 -9667 -2013 13419 -13258
215 -13258 5111 1689 -11028 13158 -6234 -5493 8928 -11561 4856 4082 -10681 6642 -5470
228 -5470 -2591 8238 -10540 2418 2142 -9297 8002 -2988 -5757 5807 -5690 2164 1476 -7267
242 -7267 5373 -1821 -2127 5219 -6979 1358 4566 -4987 3264 -449 -2200 3872 -2418 2403 2149
257 2149 -3953 4067 439 -1050 4627 -2397 404 3758 -1396 1846 1000 -30 2118 -1019 2105
272 2105 1999 -1877 2361 535 -1142 2680 280 -185 718 -813 560 535 888 135 -2318 384 946
289 946 -1196 702 -89 -1860 -1009 -361 513 -260 -1492 -1286 -1584 -274 343 -1155 -838 -1338 -1960 -251
307 -251 315 -153 -1253 -2214 -591 165 -503 129 -570 -1420 -813 42 1066 171 -894 -265 -442 500 1409
326 1409 -447 53 907 -681 529 1616 648 244 -136 1168 1367 -16 1390 711 -341 1842 1059
343 1059 258 857 -257 1120 1688 552 531 -1148 735 2426 -378 603 366 -1379 528 342 1191
360 1191 899 -2504 -467 -147 -119 2499 -1966 -2081 901 -2301 336 997 -1276 533 -3437 -2265 1880
377 1880 -531 2191 -1919 -6563 1609 1134 774 1280 -5908 -733 1032 -1311 4109 -2849 -2419 2402
393 2402 -5071 2945 3882 -4311 2277 -2958 -1136 5788 -4094 2904 2534 -6479 4565 -1287 -696 9170
409 9170 -5676 -1752 2690 -3078 9208 -629 -5302 5132 -5590 4854 7260 -8281 4558
422 4558 -1455 -3738 10891 -4979 -1164 4288 -6773 8039 -742 -7081 9159 -4968 451 4964
436 4964 -11231 7365 3954 -7798 4735 -7087 1824 9373 -11093 1469 714 -5323 9844
449 9844 -7052 -4402 7840 -8431 2715 2166 -6721 7430 -6850 -5182 10446 -4662 -32
462 -32 -858 -7857 9460 207 -5763 3405 -5071 4072 3074 -8491 5907 1694 -3712 2954 -5287
477 -5287 3386 6404 -5339 1305 -1669 -687 7528 -3345 383 3619 -6269 2310 4198 835 3329
492 3329 -6141 -2876 6857 3462 755 -5106 -2482 6953 1190 -2813 -540 1384 3094 -2147 -2803
507 -2803 745 3061 3654 -5351 -4074 3992 -157 1725 336 -4469 316 -2091 1397 4892 -4149
522 -4149 -2498 -3587 -312 9778 -4077 -7486 483 -242 8017 -3124 -10794 5617 1529 2146 -1265
537 -1265 -12743 9414 6339 -8332 2671 -7695 3122 12794 -12476 -4 3251 -5247 11730
550 11730 -6324 -5131 10254 -9321 5647 5545 -10560 9714 -5022 -3705 14991 -9603 746
563 746 3656 -9326 15714 -2648 -10052 10576 -8273 7524 7094 -17244 11176 1022 -6594
576 -6594 13112 -13554 1689 13140 -14139 7592 -1338 -8844 16672 -10210 -2776 9957 -14919
589 -14919 10434 3145 -12982 12816 -9712 -3436 14206 -12862 5153 387 -13179 16115 -5636
602 -5636 -6076 10332 -15339 7651 7380 -15665 10835 -4467 -5610 13881 -13687 2262 7889
615 7889 -12139 11346 -5103 -8468 16094 -9940 367 7587 -14032 11116 1945 -8956 11043
628 11043 -9605 916 10919 -11308 7897 -725 -9453 15043 -6114 -2642 9557 -11240 7508
641 7508 3536 -9642 11101 -4943 -2096 9167 -11200 6742 4900 -10283 9274 -4882 -3356
654 -3356 11378 -8846 2143 3303 -8797 9122 -2946 -4069 8702 -9515 1547 5198 -8009
667 -8009 7242 -2816 -6524 7956 -5351 838 3169 -8058 6138 -1583 -5842 7288 -4757
680 -4757 -8 3465 -8135 4648 1535 -4484 4369 -5140 291 4847 -5928 3298 298 -4222
694 -4222 5407 -3339 -767 4711 -4404 2134 572 -3095 5205 -2102 -1157 3648 -3207 2740 1213
709 1213 -3320 4184 -779 -1067 3089 -2351 2130 1361 -2954 3181 -207 -699 2415 -2399 1288 1751
725 1751 -2026 1879 -616 -890 2139 -1680 519 1057 -2111 1258 -374 -985 1622 -1478 -256 317
741 317 -1689 1039 -253 -1302 494 -1255 -305 303 -1229 444 -535 -1396 376 -698 -76 426 -1307
758 -1307 -270 -177 -638 418 -292 -145 -186 -953 376 368 -128 595 -453 -388 430 154 762 511 -340 -158
778 -158 -50 814 1046 185 344 -252 -329 1045 890 689 370 -654 -33 733 951 1039 -262 -440 -148 -12
798 -12 1491 877 -501 -358 -822 228 1296 226 163 -992 -1325 596 389 636 179 -2011 -730 170
816 170 -62 1288 -601 -1661 -540 -1034 1006 1020 -1441 -563 -1373 -849 1611 -271 -387 -396 -2231 390
834 390 858 35 653 -1988 -815 922 -562 1563 99 -1933 825 -749 460 2471 -1429 -147
850 -147 42 -1006 2747 290 -789 1144 -1927 1291 2278 -1391 1468 -570 -997 2768 -756 682
866 682 1336 -2197 1724 60 -549 2933 -1998 -398 1667 -1850 2422 204 -2052 1819 -2047 549
882 549 2602 -2629 958 -900 -2230 3706 -1133 -1101 874 -3404 1762 1055 -1913 1672 -3081 -799
898 -799 2801 -2377 1308 -456 -3219 2575 -1426 -800 2087 -2581 1084 -563 -2718 3171 -650 -58
914 -58 1071 -4516 1635 2734 -821 1565 -3591 -1098 4017 -304 1420 -1595 -2714 4027 -202 -56
930 -56 1760 -2955 2086 1314 -1928 2451 -1026 402 2568 -3054 1055 1070 -680 3793 -2333 -2417 2379
947 2379 -298 3182 -59 -4651 1637 525 2012 2010 -5503 131 2257 -245 2745 -4144 -2007 4319
963 4319 -1612 648 -1179 -3431 4792 -895 -2710 1378 -3267 3107 1641 -5449 1917 -1142 -272
978 -272 4267 -5033 -739 1885 -2358 4174 -1992 -3412 3050 -2937 2840 2188 -5912 2766 -512 -1012
994 -1012 5480 -4997 -808 3433 -2690 4327 -2004 -3626 6162 -2634 539 2457 -5673 5453 1726
1009 1726 -4729 3923 -2861 1175 5083 -5203 2001 -34 -2445 7099 -3376 -2254 3856 -4478
1023 -4478 4472 1977 -5754 3546 -1830 367 4609 -6239 1711 1928 -3900 5267 -3408 -3226 6009
1038 6009 -3773 352 1228 -4885 4717 -661 -3050 3230 -4705 1766 3587 -5548 2385 -913 -3191
1053 -3191 5477 -2376 -1858 1358 -3463 4248 402 -4390 2812 -2308 902 3923 -5598 1131 2556
1068 2556 -2566 2727 -2150 -982 4127 -2651 792 561 -2730 4541 -747 -2518 3336 -2181 674
1083 674 2684 -2369 1744 -504 -1516 3386 -943 419 870 -3254 3036 1758 -2638 1344 -686
1098 -686 186 2004 -2267 477 1017 -702 1201 -2138 -324 2952 -1877 -648 741 -1388 1095 -195
1114 -195 -1108 979 -845 -291 -327 -904 1885 -657 -2377 885 -41 -92 357 -1558 -172 737 -308 -551
1132 -551 -769 740 881 -1558 -472 594 132 665 -422 -1133 557 772 -136 -86 248 176 -299 22 921
1151 921 357 -172 190 -137 295 1048 79 -343 527 260 10 315 443 366 -117 -52 308 69 679 473 -687
1172 -687 29 502 -36 316 -16 -374 -62 26 241 -97 -396 134 -397 -212 485 -527 -325 89 -396 -56
1192 -56 -103 -364 -93 -452 -196 -40 -322 45 -459 -505 225 -24 -253 -172 -501 -114 82 9 24 -352 -303 69
1214 69 99 332 132 -365 -213 58 370 474 79 -125 -244 20 665 504 187 -11 -216 154 605 636 331
1235 331 -169 -296 99 599 696 215 -173 -225 52 470 651 249 -290 -423 -81 476 519 152 -369 -577 -65
1256 -65 242 346 113 -524 -759 -222 189 319 -76 -589 -598 -411 127 324 -206 -516 -597 -375 178 226 -124 -496
1278 -496 -621 -91 -5 112 223 -556 -493 58 31 398 72 -471 -135 -70 391 306 -135 143 -217 -90 717 168
1300 168 -20 292 -154 146 480 440 157 -334 313 408 44 587 19 -350 567 196 79 340 -36 -50 -86
1321 -86 123 709 -273 -308 298 -432 354 587 -677 -201 140 -165 272 -137 -155 -174 -538 286 -165 -513 613
1342 613 -591 -932 542 -183 -43 19 -918 -105 -54 97 374 -1101 53 445 -1116 853 263 -1242
1360 -1242 520 -283 -142 827 -698 258 -71 -570 1374 -650 -299 1356 -1169 306 950 -895 1124
1377 1124 -37 -632 958 -547 1085 620 -1615 1257 108 -482 1776 -1239 -158 1285 -962 1005
1393 1005 59 -664 1236 -1269 267 1519 -1463 702 -67 -1287 1828 -471 -692 703 -1232 819
1409 819 156 -1285 1329 -839 -702 1001 -1514 684 810 -1848 329 -304 -293 1236 -1453 -329 529
1426 529 -1093 920 -230 -1017 1100 -1068 -461 1016 -617 535 -450 -1096 1228 -3 -177 391 -1117
1443 -1117 803 602 -846 677 -112 30 708 -863 551 920 -388 288 -479 -9 1543 -95 -469
1460 -469 -41 -6 1172 155 -715 127 136 573 219 -565 290 426 -45 -276 -210 633 258 -353 -434 -241 684
1481 684 348 -754 -509 -153 486 76 -800 106 -78 -377 -25 -628 455 523 -1160 -523 -176 773 739 -1653
1501 -1653 -518 488 -107 846 -925 -994 1253 -400 -301 135 -501 1207 -449 -1213 1028 -283 657
1518 657 665 -1830 813 757 -704 1153 -487 -10 787 -1251 1158 866 -803 859 -1092 152 2268
1535 2268 -1184 -107 391 -562 1632 -545 -807 1369 -684 593 286 -1641 1747 315 -1129 898
1551 898 -1154 297 1259 -1272 528 -334 -806 1489 -1080 -242 999 -1660 581 375 -1266 990
1567 990 -650 -470 938 -1338 353 179 -1121 1115 -772 -975 1179 -878 269 537 -1345 674
1583 674 -93 -469 1061 -973 -32 710 -980 923 61 -936 1079 -396 -70 788 -755 706 273
1600 273 -713 999 -298 7 1013 -762 307 468 -539 849 -98 -257 672 -574 529 530 -728
1617 -728 657 -53 -327 824 -427 -159 292 -313 546 -176 -550 511 -362 26 280 -784 202 112 -515
1636 -515 241 -324 -133 63 -585 122 -14 -332 215 -436 -404 272 -253 101 43 -443 -66 -168 77 384 -345
1657 -345 -181 -111 -238 436 217 -294 -54 -164 124 264 63 94 -133 -30 238 32 307 274 -246 -24 183
1678 183 280 384 42 -31 -48 112 412 280 -59 0 -151 70 430 178 -21 -68 -136 179 227 120 6 -216
1700 -216 -102 117 49 94 -109 -252 -66 -118 66 56 -236 -197 -188 -109 133 -164 -240 -184 -241 39 -36 -124 -122 -255 -80
1725 -80 97 -60 -19 -214 -248 -13 25 93 -33 -244 -39 66 129 150 -58 -100 14 122 315 77 56 37 -105
1748 -105 289 318 6 124 -56 32 304 275 188 33 -57 97 160 348 203 -182 -123 123 161 201 212 -88 -169 15
1772 15 235 164 46 -110 -225 -63 222 -14 -136 -110 -279 -127 138 -49 -109 -243 -303 -5 -60 41 -14 -385
1794 -385 -119 -10 -165 183 -99 -430 -60 -73 187 105 -265 -142 -209 19 420 -172 -168 38 -256 321 232 -156
1816 -156 87 -127 92 281 31 359 -14 -337 304 76 141 512 -306 -51 138 -22 553 155 -109 6
1836 6 -261 476 592 -198 -55 -264 -86 680 30 -295 -36 -222 220 143 -221 194 -217 -253 68 -366 216
1857 216 322 -577 -192 -104 -132 467 -263 -364 31 -410 152 222 -283 149 -532 -347 599 -163 -67 -143 -554 530
1879 530 191 -389 146 -359 200 399 -556 237 171 -194 505 -429 -106 753 -204 146 15 -404 694 167
1899 167 -181 296 -365 410 495 -391 340 -72 -160 748 -162 -2 301 -371 404 181 -254 335 -336 21 479
1920 479 -423 158 77 -384 480 -194 -371 344 -173 53 -90 -715 405 209 -257 -28 -697 61 696 -437
1940 -437 -308 -266 -232 544 -296 -439 129 -169 230 -145 -540 435 154 -378 13 -318 114 367 -290 10 -21
1961 -21 -123 241 -175 162 433 -527 -24 385 67 430 -202 -333 445 241 189 -126 -213 543 176 -248 162
1982 162 -28 283 385 -391 -87 294 139 202 -157 -184 165 -8 279 151 -365 26 -53 -95 287 -106 -332
2003 -332 -4 -51 84 -44 -262 99 -88 -172 -35 -347 14 293 -334 -250 -48 -116 263 -16 -411 -143 -5
2024 -5 242 51 -352 -58 -64 14 296 -235 -233 205 -95 81 176 -127 230 45 -34 184 -119 198 292 -193 156
2047 156 49 -35 500 22 -185 190 14 313 175 -161 165 -37 146 318 -292 53 216 -99 341 21
2067 21 -214 220 -49 62 73 -240 208 -84 -210 167 -267 -24 206 -338 -89 -21 -122 224 -218 -243 -10
2088 -10 -169 202 -39 -390 -7 -102 -95 179 -207 -188 -35 -113 146 -53 -104 87 -146 8 142 -168 170 98 -227
2111 -227 112 -31 112 217 -110 31 69 39 327 -60 -100 146 -81 204 269 -101 205 33 35 238 17 116
2133 116 16 -133 235 131 -41 82 -94 89 100 -9 59 -21 -107 72 -80 95 102 -151 -112 -44 -39 104 -84
2156 -84 -161 -20 -105 82 -53 -141 -59 -179 -120 64 -123 -87 -140 -178 17 20 -36 -76 -173 -39 14 6 33 -86 -83 71 -26
2183 -26 106 96 -34 -61 -18 62 135 58 15 -15 34 136 120 23 65 -25 55 132 49 141 68 -21 102 93 123 105 -21 25
2211 25 41 73 86 2 -82 -24 -12 91 32 -88 32 -57 22 95 -26 -126 -112 -77 51 -18 -80 -73 -210 -59 12 -76 -31
2238 -31 -77 -164 -30 -39 33 -61 -188 -114 -66 67 133 -118 -92 -92 -58 81 45 -64 -70 -143 87 108 -21 115 -109 -65 103
2265 103 100 68 137 -51 -34 59 124 226 24 32 14 -52 272 227 -85 1 -66 75 250 105 -4 -70 -41 191 -4
2290 -4 13 95 -186 40 97 -90 41 27 -140 -7 -122 21 42 -103 55 -156 -229 175 -37 -55 -26 -283 -10
2313 -10 81 -121 -63 -202 -8 152 -208 -73 -32 -198 165 28 -198 120 -76 41 58 -211 105 -23 -84 238
2335 238 -216 16 231 -156 121 90 -117 251 35 36 116 -230 211 212 -30 162 -122 -50 423 27 12 31 -143
2358 -143 244 97 -38 81 -173 108 151 -232 136 112 -74 201 -126 -91 126 -35 25 -84 -223 151 4
2379 4 -52 55 -337 -68 204 -115 -98 -141 -188 138 60 -150 -120 -198 170 109 -276 5 50 -43 224 -121 -195 86
2403 86 96 107 -78 -214 113 29 -16 138 -219 -23 285 -70 69 19 -123 284 132 -24 12 -100 288 235 -119
2426 -119 60 -11 134 461 -136 -141 208 8 234 4 -193 201 -46 42 219 -243 68 104 -253 226 -56 -208
2448 -208 180 -154 42 50 -369 143 66 -154 130 -397 -70 304 -266 -88 -107 -209 290 -143 -232 95 -291 181
2470 181 135 -387 127 -36 -88 325 -266 5 142 -228 360 -28 -262 258 -74 146 270 -334 180 182 -46
2491 -46 321 -228 -33 388 -161 177 42 -273 408 25 -77 193 -209 233 293 -213 203 -93 -54 537 -188
2512 -188 -50 71 -229 417 3 -320 184 -70 167 129 -430 191 64 -155 149 -254 41 209 -303 28
2532 28 -26 -189 187 -151 -54 129 -263 38 47 -140 128 -283 -141 294 -35 -9 -131 -189 384 61 -162 9
2554 9 -75 179 195 -254 107 110 36 117 -240 114 230 -53 30 -89 -6 284 -27 46 89 -67 176 100 58 129 -151
2579 -151 -24 257 44 138 -92 -153 72 16 50 98 -124 57 -25 -127 116 -43 -34 -25 -151 39 26 -13 2 -171
2603 -171 -82 55 -87 87 -38 -191 6 -44 20 5 -233 -94 -52 -21 75 -130 -96 -29 -99 109 62 -69 -20 -82
2627 -82 6 118 39 64 -66 -38 80 67 37 61 -27 20 88 60 83 40 -51 37 52 95 100 -45 8 37 81 105 22 -2 3
2656 3 10 18 25 49 -1 -71 22 24 39 4 -13 -91 -9 42 8 -1 -53 -55 -49 10 -21 -45 -120 -42 -49 26 -9 -86 -89 -108 -24 -6 1 -46 -114 -81
2692 -81 2 4 41 -49 -118 -60 13 58 103 -19 -58 -53 -45 68 40 1 -30 -33 44 93 116 54 48 25 98 76 127 23 -15 57 58 55
2724 55 91 37 12 -9 45 37 -11 16 -31 -41 44 22 77 25 -25 -40 6 5 3 -61 26 -42 -94 -32 12 -38 -61 -56 -74 40 -3 -37
2756 -37 -56 -47 -2 -13 -30 -10 -82 12 8 -68 25 -52 -49 26 -70 -17 -46 -67 78 54 -38 40 -97 61 10 -77 19 13 31 81 -45
2787 -45 40 43 -3 69 13 -78 106 77 31 72 -46 80 52 9 100 -24 -68 132 10 63 32 -82 110 27 4 76 -99
2814 -99 54 118 -111 9 -96 -60 147 -89 -132 -4 -150 144 -24 -175 64 -79 10 82 -318 30 22 -122 80
2837 80 -132 -106 173 -151 44 27 -190 139 -74 -49 114 -253 -14 172 -139 78 -63 -88 247 -26 -55 24
2859 24 -160 288 44 -154 240 -61 140 168 -296 112 131 -32 175 -186 -30 322 -37 79 25 -147 225
2880 225 -31 13 134 -180 99 141 -122 118 -69 -92 238 -137 8 -27 -134 145 -82 -154 97 -173 23 75
2902 75 -282 105 -14 -63 119 -198 -33 124 -182 120 -75 -258 168 -88 -2 98 -299 102 111 -28 123 -180
2924 -180 -2 190 -79 32 1 -97 242 -68 -77 157 7 111 -14 -139 136 51 8 70 -131 127 167 -46 137
2947 137 -5 -3 67 -104 116 9 -88 86 -50 83 96 -127 76 120 -21 79 -70 67 114 -94 20 -45 -4
2970 -4 114 -83 -75 132 -20 5 -15 -114 69 -34 -56 15 -140 50 -38 -124 84 -90 -100 28 -42 43 -45 -87 73
2995 73 -67 3 33 -98 92 1 -117 89 -3 53 57 -100 32 65 -23 113 -62 -6 83 -23 121 39 -30 95 -4
3020 -4 25 119 -25 51 -13 -24 85 35 2 23 -67 20 -4 -30 82 6 -50 -19 -70 126 -6 -119 -28 -61 109 32 -85
3047 -85 -48 -35 -95 58 -27 -80 -34 -83 -65 -1 -30 -5 -115 -21 10 -142 67 -31 -105 -9 11 -53 13 -99 9 13 -60 43
3075 43 -53 33 53 7 52 35 -21 61 -2 21 59 -20 66 65 -37 82 10 43 98 -40 0 18 -3 75 25 -4 67 14 75
3104 75 5 -72 -6 -21 -28 16 -14 2 2 -16 40 22 6 -23 -108 16 -11 9 -22 -14 13 -1 -24 -9 30 -42 1 -66 -31 -29 -23 -39
3136 -39 -42 -58 -17 -21 -33 2 -53 9 5 -51 -17 -29 -39 52 -12 28 2 -52 -54 17 19 51 -14 28 14 5 47 16 19 -13 13 10 36 20
3170 20 54 44 10 17 71 -31 73 -25 50 55 -32 46 26 10 58 43 34 -27 -27 13 58 -81 1 -63 -78 -6 -39 25 -66 -87 -30
3201 -30 -38 -76 -34 -90 -22 -52 -24 2 -30 -20 -48 -67 -41 10 -10 26 -27 -13 30 -15 -1 -17 -34 42 -13 27 37 -27 -26 -46 -18
3232 -18 72 24 -31 98 -3 51 106 5 31 5 15 81 43 40 43 23 123 -27 -8 97 -14 -11 14 -35 55 0 -4 52 -69
3261 -69 47 49 -7 27 3 11 -8 -68 -37 -17 -119 54 -26 -116 -29 -112 -14 33 -87 14 -9 -77 10 -80 -30 56 -48 -6
3289 -6 -32 -58 48 -66 -31 35 -103 79 6 -37 63 -61 9 86 -17 97 19 -34 62 -16 36 55 -36 102 83 -61
3315 -61 61 -47 61 121 -69 43 50 -41 132 -85 5 148 -27 24 32 -82 139 -50 -7 83 -16 30 -23 -145 96
3340 96 -3 -57 74 -72 29 24 -122 13 -49 7 45 -173 5 12 -48 44 -41 -84 113 -86 -14 33 -84 38 -91
3365 -91 -79 47 -58 6 56 -72 92 13 -123 -7 -61 -5 40 -55 66 12 -71 95 -69 50 77 -48 56 34
3389 34 -43 71 4 2 30 -52 93 20 -10 68 -46 50 40 -33 9 7 -15 82 -23 -18 44 -117 64 62 -21 70 -84 -5 37
3418 37 0 46 -62 -91 54 -99 -37 21 -68 -26 -58 -55 43 -36 -8 -23 -149 44 4 -77 -16 -61 0 -32 -95 28 9 -62
3446 -62 28 -4 5 73 -6 31 -62 6 88 3 -1 79 -47 87 50 -11 44 14 -15 109 -5 106 -27 -36 63 1 48 30 -119
3475 -119 13 2 -29 31 -25 17 64 -93 -7 -43 -20 50 -84 4 60 12 49 -25 -86 10 -6 -3 21 -69 -16 -50 -21 60 -100
3504 -100 -31 22 -66 22 -8 -67 60 -3 -52 -11 -19 24 19 -39 17 -36 -37 63 -79 -11 42 2 58 25 -7 60 -36 63 110 -48
3534 -48 36 31 -51 80 35 -30 30 35 40 67 -28 88 -13 72 23 -15 79 75 -17 45 13 -25 40 -45 8 0 -25 27 12 18 9 -79
3566 -79 1 5 -10 -9 -39 -21 27 -59 34 -4 -13 -70 -38 -6 2 -66 -28 20 -44 -5 -2 -7 4 40 39 -32 -37 74 -28 -24 11 -24 -60 -22
3600 -22 -9 -33 3 -11 19 -43 -13 19 -13 28 30 100 4 31 24 68 21 -9 26 25 46 -8 48 7 -27 14 33 9 -7 13 10 20
3632 20 65 -25 42 -8 -2 43 32 21 -38 2 -63 -16 -15 -76 -18 -64 30 46 -14 -47 -59 -6 -47 -52 17 -8 -32 13 10 -24 -2 -27
3664 -27 22 27 -53 -22 8 21 -4 11 -41 -67 -45 7 -16 27 65 20 39 -5 -22 46 25 35 25 10 37 0 29 15 57 21 91
3695 91 -50 -12 64 21 40 71 15 23 7 35 24 -28 4 27 -69 -2 -42 -23 57 4 -38 7 -99 -28 4 -7 -26 -33 36 36 -59
3726 -59 3 -19 1 -16 9 -29 14 -17 7 -25 -35 0 -44 -2 -15 -58 -22 -25 -26 49 -28 -4 68 -50 9 -13 -10 32 -7 1 47 23
3758 23 61 37 -83 58 -70 -4 9 12 37 2 -41 96 21 -37 63 25 2 56 -25 25 -56 -7 87 -73 3 62 -35 -7
3786 -7 -23 -46 43 -7 -78 -33 -76 19 48 -67 -8 -67 -24 34 -67 -8 -40 -77 4 -19 -47 37 -78 16 48 -75 82 -27
3814 -27 -25 34 -112 26 55 -1 27 -66 -37 98 -43 33 7 -66 108 9 -22 44 -89 34 121 -30 81 11 -24 104
3840 104 -64 3 70 -101 34 -12 -70 66 -76 -28 44 -8 36 27 50 87 -52 -36 63 -64 74 -54 -71 74 33
3865 33 -14 22 -121 39 52 -101 21 -76 -39 13 -104 44 10 -134 21 -107 -87 97 -74 -21 -12 -140 9 -16
3889 -16 -10 40 -53 -38 101 -62 45 -16 -56 44 -18 -14 28 -103 58 48 -15 108 -19 -9 89 -39 2 18 -53 89
3915 89 4 -2 87 -72 32 8 -51 115 -1 32 69 7 3 17 -27 -7 -55 43 10 -32 41 1 -45 45 -22 -12 57 -107 8
3944 8 3 -43 47 -41 26 33 -54 -19 33 -86 43 -53 -35 37 -61 16 16 -89 20 -36 -20 88 -78 -10 -30 2 -3 -11 -34 20
3974 20 -50 -31 24 4 50 47 -10 95 -11 9 60 10 55 -49 7 79 -12 -1 53 -38 18 53 31 68 -16 16 49 8 -20
4003 -20 49 17 61 16 -61 1 -49 6 6 -1 -7 18 -33 20 -12 -40 -15 -26 12 -22 32 13 -23 -16 -11 -41 25 5 -37 27 21 47 -20
4036 -20 14 18 11 26 34 18 -54 -6 -57 1 -31 -20 14 -56 -35 74 -52 2 38 29 11 -6 3 24 9 59 34 -4 45 83 107 -19
4068 -19 -19 -32 45 32 11 -19 40 9 7 6 -24 12 10 -12 -56 53 -10 -54 -20 -40 -49 -35 6 23 -86 -5 -40 -94 11 -34 -32 -29
4100 -29 -10 -2 49 -5 6 55 -23 10 -25 -8 -26 29 -13 39 8 -48 2 -76 8 -4 23 21 -16 12 26 -18 2 36 37 71 -1 41
4132 41 52 12 0 -17 26 -21 39 36 41 -16 54 31 -20 -24 -15 23 2 30 87 -12 34 12 64 -15 40 25 -45 17 -1 -7 -7 30 -18
4165 -18 20 11 -30 -89 37 -41 -26 -3 -23 -25 -13 -45 -23 -65 -43 -2 1 -20 -11 -44 -18 -37 30 25 28 -47 9 2 12 -3 -5 52 -63
4198 -63 -1 30 39 -17 -35 24 -39 -30 -27 22 -10 15 41 46 1 9 72 11 25 -19 67 -34 54 16 -2 17 5 30 26 -18 13 -6 24
4231 24 25 15 -26 67 12 -12 1 -21 43 -30 -32 -3 -45 29 -34 -48 -6 -38 -1 -67 -41 -95 -22 -43 29 -23 10 -65 20 -9 -21
4262 -21 -38 -4 -2 28 -41 31 40 44 80 6 41 -2 61 -33 17 -38 -15 28 67 25 57 46 -49 20 32 15 26 -51 11 24 -16 36
4294 36 -3 -49 27 12 15 -30 23 37 4 2 7 9 -11 47 -88 67 -27 -47 41 20 7 9 -22 -10 -48 -43 -93 -2 22 -16 -50 -24
4326 -24 -45 5 29 -85 -80 -40 -24 -6 -73 -21 20 12 -49 -22 -18 -2 -32 -34 23 -17 25 19 -64 -9 28 2 -1 66 68 -9 31 49 31
4359 31 11 -18 20 8 11 -17 14 7 -5 64 23 7 35 -1 20 44 -11 -17 41 22 12 -32 -13 9 0 14 47 -8 3 51 -79 40
4391 40 9 -68 68 -32 -17 70 1 27 -2 -35 5 -12 -6 -3 -33 -29 24 -20 -20 1 -26 5 -34 -36 10 -51 50 -9 -12 -1 -39 5
4423 5 -6 8 46 23 4 11 21 45 24 31 67 16 -16 23 3 62 63 25 50 39 -7 10 40 32 77 -47 -2 -8 -58 17 -13 -30 -39
4456 -39 -68 68 39 21 15 -29 -49 19 -6 -14 -33 30 57 -57 -64 28 21 -78 9 -58 1 2 7 -12 -33 -29 13 14 -2 39 9 -36 -27 -18
4490 -18 28 -29 56 12 -36 29 -12 25 31 -9 -30 -13 -24 34 -28 17 -25 11 43 70 25 24 79 77 14 12 37 25 -24 41 -14 -17 -33
4523 -33 35 12 -11 -27 -5 -12 -9 -22 5 37 6 2 62 -10 -28 9 -42 -10 8 -19 -26 12 -55 -45 -12 -16 -31 -52 -30 -58 -6 -21 -22
4556 -22 27 31 57 -34 58 -2 -33 -34 -7 -51 52 30 5 -32 46 -14 -26 -6 -45 -10 -33 18 -37 -23 36 0 -34 32 -3 27 21
4587 21 -29 -15 47 -10 26 -4 -41 38 -19 62 15 25 12 24 -23 -40 -2 3 62 34 -55 -51 35 -31 -4 -6 -21 -26 16 -25 6 -7
4619 -7 -82 -10 -5 -17 -26 32 5 -38 -19 -37 -25 -15 -14 -4 -25 -45 36 -16 -17 -52 14 22 3 7 33 -17 14 -12 8 54 32 -3 61 -8
4653 -8 8 8 -5 34 -22 12 8 39 -17 -11 -15 -13 -27 9 33 52 55 15 -5 33 47 -17 91 26 33 25 -15 -40 20 -27 -32 -37 37 -23 -46
4688 -46 25 -21 -29 -21 -53 -46 6 -4 0 -29 -37 -33 -25 48 -27 -37 -13 -12 -49 22 -6 -50 66 -54 29 -11 -21 90 -16 25 45 -30
4720 -30 33 21 -33 12 -68 -12 57 18 -13 -57 16 60 -13 -35 -28 -7 -8 20 3 -24 -17 -7 8 44 -2 -17 -5 19 -73 -16 26 -3
4752 -3 0 -40 -75 6 -12 36 8 -22 -2 53 2 -23 -46 12 28 -82 -35 -34 -92 7 -39 -21 -2 -81 -11 -2 -34 52 -67 -5 30
4783 30 -77 -31 -30 -31 0 19 17 78 -21 -15 -36 -30 27 56 -4 88 -11 3 71 14 59 -78 23 83 -47 -14 -2 -21 131 42
4813 42 -33 72 -33 10 27 -11 33 -44 -19 76 -71 8 65 -37 35 15 -28 41 29 34 -7 -31 16 11 -30 32 -34 -48 -44 -37
4843 -37 -34 -9 -59 21 -2 -62 -29 14 12 -10 -102 -37 -73 -45 7 -1 -43 24 8 45 15 -15 23 -32 -17 52 -12 36 30 -47 69 10
4875 10 11 55 -51 41 20 21 64 18 4 42 15 -4 66 -14 -2 10 -11 47 7 1 28 -38 -33 51 -46 -3 10 -24 31 -30 -37 -15
4907 -15 -13 -2 -37 -36 -31 0 -7 5 -27 -10 -14 -33 0 -36 -44 37 25 -42 -4 -63 27 -5 38 -29 -49 -36 48 5 2 34 -15 -2 -23 -3
4941 -3 -18 36 -31 9 3 2 10 11 18 9 -9 52 47 -4 9 0 32 45 65 -8 45 109 38 21 23 40 24 36 22 -6 -15 24 31 2 -53 -11
4977 -11 13 -50 -20 -48 12 -14 -47 -4 -5 -37 18 -9 -7 9 -32 26 9 -9 -16 10 6 -15 -16 20 -40 8 -9 -56 -12 30 -32 14 3
5010 3 -62 -24 -36 -20 28 2 -46 30 23 -13 -26 37 27 -31 40 -12 -67 -4 25 37 8 -2 24 1 21 46 17 -3 39 -17 57
5041 57 -50 4 -7 14 22 -31 -9 6 50 -5 27 -38 -15 -11 42 28 -10 15 -28 -63 -28 -7 5 -14 2 -39 -77 -83 -9 -30 -20
5072 -20 -30 -35 -15 -49 -11 -13 13 15 26 22 -1 17 -32 21 15 19 24 33 39 26 -48 54 -16 -54 -1 25 -28 6 13 -18 17 15 38 -63 -8
5107 -8 -21 -52 -29 29 -57 -9 10 3 8 -27 16 37 61 25 29 -20 50 27 24 22 -61 -17 56 -12 11 -8 -46 -6 -54 -66 -47 -69 -53
5140 -53 -19 -49 -25 -26 -52 -36 -77 -7 -89 -3 59 -47 -3 6 -73 -10 38 -17 1 -28 12 -13 -4 -3 -22 -14 31 74 11 20 -21 4 32
5173 32 12 38 -5 -20 35 -72 64 57 22 9 5 -28 53 -40 13 -16 10 6 12 42 -15 -63 -8 -24 31 49 -18 -35 21 -65 25
5204 25 16 -9 4 -52 23 67 -73 -10 5 -66 25 27 -73 30 -8 53 -29 -41 29 -30 -23 -16 -55 -28 22 -26 -5 -38 -45 42 -33
5235 -33 -15 -6 11 63 16 22 -7 -49 16 55 35 44 62 25 72 -34 -32 85 -13 23 45 -14 48 -57 45 40 -41 34 -2 28 47
5266 47 -92 -58 63 -27 48 -52 -19 86 -58 26 34 -63 45 71 -63 29 -20 18 96 -82 48 -14 -64 46 -15 -55
5292 -55 31 -27 0 47 -80 -8 -2 -61 51 -84 43 15 -49 51 -73 -62 59 -60 -34 27 -129 61 18 -49 46 -45
5318 -45 -17 136 -43 2 27 -10 65 19 -14 20 -88 13 40 -97 121 -23 -10 133 -23 21 30 -8 29 -38 -60 50
5344 50 -60 -3 28 -118 48 53 -44 62 -71 -55 84 -90 -4 -34 -28 29 -61 -66 44 2 34 -9 -104 57 -95 34
5370 34 42 -37 -36 43 -43 18 -20 -79 100 -103 10 -11 -87 20 -7 -92 61 -81 -37 103 -43 48 -34 1 83 23 -27
5397 -27 70 -59 23 15 -15 10 -4 19 64 -41 2 12 17 75 -20 -68 36 32 46 14 -43 23 -16 -39 20 -82 -3 62 -46
5426 -46 -22 -27 18 -11 -28 -8 -19 -28 -10 -5 8 18 8 -40 38 -16 -19 -9 -63 0 3 -40 -18 33 -44 -13 44 -6 -18 25 -30 13 -1
5459 -1 -37 -23 27 4 -14 20 -18 11 31 10 -2 -35 -38 2 30 23 24 2 28 -15 36 26 10 -5 49 -2 -4 -25 10 43 -21 49 15
5492 15 -18 16 37 9 70 -18 -4 38 -30 16 -30 -24 -51 -35 -36 37 -42 -6 -31 -54 -36 -24 0 -2 -18 4 -6 -55 3 -55 43 21
5524 21 -49 36 53 -36 21 19 -41 43 21 29 44 -28 -30 10 19 51 22 -4 -14 -13 39 -22 -57 74 -19 -31 18 -34 -1 9 4 -41 6
5557 6 -13 18 -55 9 18 -13 61 -55 21 -40 -22 64 -2 -25 97 -18 76 24 -24 9 15 -17 -11 2 -70 37 -51 -56 7 -6 -1
5588 -1 -38 -45 -9 -37 -74 -20 -24 11 -31 -28 -30 -10 20 -31 -81 22 19 -12 -1 -2 -53 58 -17 -16 7 -32 8 -25 56 20 54 -20 51
5621 51 -51 -7 -49 -15 19 -18 8 2 -18 40 -21 26 -14 -56 -24 74 22 36 14 -19 52 -46 -15 3 -28 26 16 -21 -23 -22 -12
5652 -12 4 -28 61 -14 46 13 13 -27 18 -38 -12 -18 -98 33 10 -37 -9 -45 -28 -24 -84 -7 -16 -20 14 -14 -1 9 -30 -2 22 -32
5684 -32 40 -20 -9 16 -78 12 70 0 9 8 -5 15 -5 42 90 -3 30 11 38 12 -2 33 56 -11 17 -38 -33 71 0 7 26 -20
5716 -20 -15 29 -17 48 -12 61 60 7 0 -9 -29 49 -12 -58 -9 -4 22 29 -10 -14 -35 19 -16 -14 2 14 0 13 3 -2 -8 -68 9 -18 -56
5751 -56 20 -1 12 19 -42 45 37 -79 13 -93 17 52 -49 -4 13 13 77 -21 -30 -30 10 30 58 -18 47 29 41 65 -47 -27
5781 -27 60 5 41 -5 7 45 13 -14 -4 -56 -15 24 -30 42 -73 20 32 -45 -9 -74 -39 35 -18 -58 27 -60 35 -40 -62 -1
5811 -1 -65 28 42 -46 4 2 -49 19 -14 -11 -24 -78 48 12 2 18 20 -19 39 -73 -7 0 33 24 -5 -34 56 -3 -11 51 -17 22 58
5844 58 -1 69 -25 -17 64 -9 -8 55 -61 59 41 -58 56 2 -37 87 -9 26 34 3 71 -13 -11 43 -44 -35 47 -76 61 5
5874 5 -33 47 -78 -31 34 -63 -5 65 -41 56 -29 -27 -5 -6 57 14 -78 33 21 -10 59 -16 -28 54 24 25 29 -6 18 29 -1
5905 -1 -15 -69 27 -14 -23 66 -56 50 45 -9 21 -17 2 1 -28 35 61 -73 32 27 -29 66 24 -29 31 -75 48 25 -8 15
5935 15 35 -18 88 17 3 -14 11 39 46 -27 53 -21 -12 0 -49 53 -7 -57 45 -13 -30 -7 5 15 -50 -40 -14 -66 -26 -8
5965 -8 -94 -39 0 -20 -15 -23 5 -1 2 25 -3 21 24 -8 -10 28 -6 46 27 14 51 -1 15 27 25 34 6 1 -19 -12 -21 26 13 46 -21 6
6001 6 104 18 8 21 -12 -23 -51 -15 -6 -2 -17 37 -11 -3 21 -24 25 -9 34 9 -37 4 7 -5 13 -30 6 -6 -45 -41 -24 -43 11
6034 11 -35 -22 16 -8 -20 -41 -67 36 9 26 44 -69 44 -6 -44 11 3 -37 24 -16 11 -5 19 37 15 15 41 25 30 17
6064 17 36 58 52 11 15 14 20 82 -40 21 -51 -9 45 -30 -10 76 -70 34 -3 -59 1 -26 -24 -10 -31 7 5 12 16 -14 -10 16 -36
6097 -36 22 18 -92 -7 -69 -23 35 -97 -12 -1 -48 7 -17 -14 29 -37 -5 29 -72 50 40 -73 25 -91 -45 20 -47 -17
6125 -17 48 -29 28 -33 -43 96 -78 32 -55 9 64 5 -36 111 -50 29 79 -25 85 0 13 9 -72 -1 43 -29 91
6152 91 15 -1 58 -4 10 37 -73 56 -33 -88 18 -76 -31 72 -41 48 25 -81 33 -47 40 43 -80 -10 -10 -92 58
6179 58 -49 -43 27 -33 -9 27 -18 32 -17 -34 39 -52 -50 -17 -24 36 -18 -17 24 -23 28 5 -61 -8 -29 -8 76 -47 -38 -5 -14 24
6211 24 9 -35 34 -12 57 57 20 70 23 -2 72 -42 59 51 13 33 -8 -46 16 12 78 -20 -19 31 17 -2 38 -6 -9 25 -45 32
6243 32 -27 -2 24 -45 -20 44 -64 23 -32 -77 10 -95 30 40 -7 -5 -67 -63 48 -97 31 24 9 34 -39 -13 36 -42 -24
6272 -24 32 35 9 -22 -17 39 -28 -1 87 -51 14 -76 -27 18 4 2 64 -10 88 41 22 17 8 42 27 -18 34 25 -17 71 -17 -26 95
6305 95 -5 77 1 10 50 -31 -46 23 -24 40 42 -3 37 2 -44 3 -16 -27 55 8 4 -11 -74 13 -4 -27 25 -71 -1 15 -84
6336 -84 54 -15 -19 14 -19 2 17 -55 37 34 -20 61 -14 -42 30 -52 -27 27 -20 -34 -47 -32 24 12 9 -8 -13 8 -32 -29 49 -9
6368 -9 -7 -63 -12 -13 4 -2 16 32 37 57 -48 13 35 26 29 38 10 9 80 22 54 -17 28 26 -41 -23 35 -53 41 -28 9 2 -9 -15 6 18
6404 18 -5 -12 -17 -16 -14 -25 -40 19 -15 36 -25 -15 -48 -31 72 -7 -17 7 -15 56 45 -25 36 26 52 58 4 -21 3 50 19 -23
6436 -23 15 0 -13 36 54 18 -9 66 -13 10 18 54 15 -53 30 15 18 5 -37 8 7 -67 29 20 -53 15 -10 -8 25 -5 1 10 37 -4
6470 -4 18 13 38 -8 -16 15 -7 -67 -13 -27 29 -31 0 -15 -49 -22 41 -3 -22 11 -52 -22 8 -7 31 1 -50 -33 39 -30 30 80
6502 80 -22 28 -10 19 37 -20 42 16 23 38 52 46 91 49 82 -30 53 -2 7 40 20 44 -26 8 36 -12 -9 4 2 -26 -31 15
6534 15 27 -5 -32 -14 -47 -18 -42 7 -11 -21 -36 -26 -16 17 7 -31 22 -18 11 -25 -26 -32 -14 -60 -50 -20 -24 -14 -34 -25 -50 52
6566 52 -51 42 14 -21 27 30 -74 4 -47 52 39 -43 10 -11 15 61 -30 14 44 28 33 38 25 31 -7 24 49 -28 96 -17
6596 -17 -57 -2 11 -6 34 -20 6 22 -7 36 51 3 -2 -56 -19 15 -41 52 -5 -52 21 0 32 8 -28 -2 12 -4 -1 5 13 47
6628 47 -17 9 54 -25 69 -11 63 14 -31 38 -10 -44 23 -56 -24 45 -52 -6 54 -53 27 -25 -31 -18 -57 -8 10 -45 -16 37
6658 37 6 63 -31 4 6 -35 31 -6 -68 54 -20 8 24 -30 40 -25 -25 117 -18 -16 55 -114 7 -19 -24 48 10 -34 15 -53
6688 -53 -63 70 -54 26 -69 -7 70 -54 -4 5 23 36 -16 -47 128 19 16 58 -101 49 17 -65 33 -42 62 59 -70
6715 -70 59 -9 -109 22 0 -7 -1 -36 79 -9 -56 6 -39 2 3 -44 -11 27 -49 22 17 -38 28 -48 22 32 -22 53 60 -33 57
6746 57 -2 18 46 -20 32 35 -6 88 17 -10 9 -33 1 43 -8 77 -20 28 -38 -48 -2 -12 -7 -2 -90 -3 28 -51 8 -23 -8 8
6778 8 -2 -70 38 -54 -31 -45 -49 31 -12 -13 6 -31 -3 -82 -41 73 -5 -26 59 -86 18 -37 -72 73 -66 8 51 -54
6806 -54 13 23 -31 13 -6 -19 43 3 76 22 -62 70 9 3 73 -68 9 22 49 60 36 -18 52 -38 17 53 -62 9 1 -28
6836 -28 25 24 29 21 5 10 -48 4 -23 -41 -31 49 -64 -7 -56 -17 -6 -56 -22 -3 -70 -41 -37 -60 -16 -56 -26 12 -58 12 5 -28 47
6869 47 7 -20 81 -10 13 27 -24 20 -17 -10 50 10 -15 16 -13 -20 -13 -48 16 0 -34 57 -14 -2 -54 -5 -18 50 -35 -26 -43 -19
6901 -19 -25 -45 13 5 -30 46 10 -18 47 -54 31 26 12 14 -4 -11 26 -8 5 13 37 52 -16 21 8 -8 10 -10 -23 24 1 8 20
6934 20 24 5 35 -31 -11 -3 -6 6 25 10 -1 -1 67 33 23 48 -3 43 34 -14 9 -9 42 -3 -15 16 26 59 45 7 -3 -25 16
6967 16 4 52 -4 16 -35 -7 -4 25 -9 55 9 20 7 -32 -29 15 19 5 63 -13 -17 0 15 0 40 2 14 36 -7 -8 13 -18 -4
7000 -4 7 -24 43 6 5 -23 -15 8 -6 -2 -43 1 -25 -15 -27 37 -14 -5 50 -5 3 34 -35 13 25 10 -3 -23 2 13 37 64 33
7033 33 3 27 -6 -1 44 27 19 25 29 -17 -12 19 -4 52 13 -20 42 -10 -25 -25 6 -4 14 23 -43 14 -30 -6 -21 -40 17 56 -48
7066 -48 47 15 -75 9 4 12 -8 -33 55 35 -24 -18 -2 -33 20 -3 -35 -20 42 -2 59 -5 0 30 2 66 1 -7 41 16 -5 -14 54
7099 54 11 -32 -4 -1 -20 -20 -31 6 32 -32 8 62 27 40 -2 35 19 33 26 49 44 10 64 -43 7 7 4 19 -1 -7 43 -23 26
7132 26 -49 -25 -17 -39 -4 19 5 -30 -63 -21 19 12 -61 -36 -20 -10 5 -12 23 -6 2 -25 -53 19 44 -28 -5 37 5 11 -20 -59
7164 -59 -44 31 26 1 -27 -9 44 55 10 -32 14 -8 -9 -24 26 15 21 44 -12 52 0 -45 -35 10 5 -32 -14 16 -17 1 -11 9
7196 9 -16 2 -9 13 70 43 -10 0 5 27 39 42 34 8 -49 29 -29 -27 2 -31 31 38 52 22 45 -13 -3 -11 37 -38 -21 20 -30 7
7230 7 -47 -13 -6 10 12 -5 1 4 57 0 17 47 -21 17 33 24 25 -22 39 -13 -11 45 4 -1 25 -10 28 -30 63 -26 14 64 69 -15 -3
7265 -3 16 17 -55 14 36 -11 2 -11 -17 -49 44 -59 -11 -7 37 9 -9 -13 19 36 26 13 -5 32 -56 -18 9 -28 -4 -26 -29 26 -8
7298 -8 -9 -8 19 -19 -4 -50 -15 18 -30 83 20 25 -46 38 -24 30 26 20 -27 -11 -6 35 38 -19 12 19 24 30 6 5 31 7 4 13 -15 25 -18
7335 -18 32 15 -79 -3 7 -43 34 -19 -30 31 -28 18 -4 -28 30 -35 5 -24 12 21 19 -61 8 -15 17 -3 0 26 -12 -64 -2 9
7367 9 -28 29 -7 -36 3 -3 15 51 3 13 -24 -37 60 22 -4 2 4 15 -6 14 34 -10 15 24 -1 6 11 39 6 9 28 9 -59 42
7401 42 30 7 28 -38 -71 56 24 -17 30 -10 12 12 34 12 6 -27 -38 56 -35 -33 -34 -34 7 51 30 1 9 -44 -17 1 -38 -10 -4
7434 -4 -45 7 34 -19 -4 22 -10 31 -4 46 -19 -14 -31 3 49 6 -61 -2 38 19 -15 37 -19 1 -3 39 -10 -18 26 -27 -51 51
7466 51 10 -11 27 -33 -10 2 5 -47 39 47 -6 -9 54 -35 20 19 54 36 -7 -21 -15 -14 -2 32 20 -14 -16 3 3 -35 -18 7 -54 29
7500 29 -25 -43 28 17 -42 -9 26 6 -22 -14 -22 -17 0 -1 -23 33 -44 -15 7 29 -21 25 6 -16 33 -22 29 6 56 0 16 -53
7532 -53 12 -2 -11 12 13 -5 -66 -14 69 -56 45 -17 -9 -27 4 -22 -43 8 25 21 38 36 21 24 14 7 25 -30 13 -13 -72 19 -1
7565 -1 -18 -20 15 54 59 -4 17 25 -39 34 -9 10 16 29 6 15 -41 -49 -2 -50 28 6 11 15 -32 -20 -20 1 41 -45 40 23 -35 -1 -1 -26
7601 -26 24 -34 12 -13 -1 -26 5 -32 -26 -19 -35 -11 -15 -56 38 16 3 -18 -17 3 17 -1 19 -13 2 -44 62 18 -30 9 21 -15
7633 -15 27 1 -34 23 -43 42 17 14 20 -6 -4 61 -21 87 -21 4 16 -4 13 -18 -33 3 28 -36 17 32 -52 -51 -15 -7 -30 -19
7665 -19 -38 -9 -13 -19 -2 -32 -26 -24 36 -5 -58 -29 -14 26 29 -15 7 15 -54 24 -4 -7 19 11 -33 19 56 25 10 23 27 4 6 -5 -46
7700 -46 -8 3 -40 11 -58 30 -33 -40 -30 22 -28 -5 13 1 35 -34 1 52 -2 -12 9 20 25 -26 -15 3 -37 7 -6 17 -44
7731 -44 -17 36 5 -9 -55 26 0 20 -20 13 5 -72 17 -47 -22 11 16 23 -6 -70 -15 9 -11 -1 -22 0 -40 64 -5 -31 -2
7762 -2 19 -9 42 -100 -9 17 -10 -25 37 6 -4 29 -11 -3 41 24 21 -30 29 -7 36 11 -17 -74 41 15 -23 40 3 -24 -9
7793 -9 -45 -18 -54 -16 20 -33 -1 -18 -52 -5 63 -5 -14 -16 21 36 -1 -38 8 50 -32 -7 -10 -8 4 -31 23 -43 8 -28 8 -26 -5
7826 -5 -7 25 -3 -38 51 8 -42 13 -64 -39 -7 9 -6 -41 55 -7 -1 -39 10 34 -11 -18 11 -2 -5 3 -34 32 -19 28 13 -3 19
7859 19 4 -42 -7 23 -24 -1 22 26 60 -25 12 22 -54 1 -3 -34 -2 12 -4 11 -10 -17 -5 3 -6 4 -17 -2 30 51 17 12 45
7892 45 -4 -21 3 29 12 0 -1 -2 -15 9 -12 -13 7 -13 18 -16 13 12 9 -23 -13 -33 32 18 10 27 31 44 8 -43 15 17 -62 -53 -8
7927 -8 37 63 -3 35 23 43 36 15 -11 3 57 9 37 25 0 28 -48 -5 21 5 37 -47 -42 -12 -47 7 -1 12 -43 26 -15 5
7959 5 14 13 16 -30 30 -6 50 -27 -36 24 -22 39 9 -6 -26 -42 65 27 -2 -43 27 -42 43 44 -41 12 13 28 0 67 72 -78 -7
7992 -7 -6 -47 9 28 33 -40 -23 -15 62 -37 -45 -19 -1 -5 55 30 -26 -13 25 35 -58 18 -11 40 14 20 42 40 26 8 26 -10 9 9 10
8027 10 -35 18 -21 15 -60 -34 37 -7 9 -30 -22 -8 -1 5 -53 -43 -2 5 -4 -27 91 27 33 5 -30 21 50 -13 3 0 -5 -38 19 12
8061 12 41 12 -12 -4 -20 19 18 -13 13 23 -8 -3 34 -15 -12 -42 13 1 2 31 -3 28 -24 -10 9 8 -4 40 43 -23 8 41 27 -28
8095 -28 46 52 -4 62 -15 35 14 -31 39 14 -58 -4 32 21 -12 35 0 17 25 7 -28 39 26 -17 -37 15 -18 32 14 -33 8
8126 8 -15 1 10 19 1 -27 5 43 -44 -30 -40 -43 17 -6 -3 26 -2 -12 -9 57 46 -2 18 -13 76 45 -6 -12 18 -53 -17 57 -7 1
8160 1 37 -6 2 -1 25 26 15 8 11 -12 4 33 32 -2 15 3 9 24 59 -16 -6 -6 -19 4 5 39 -19 -5 -20 -25 13
8191A3
##END NTUPLES=NMR FID
##END=
