##TITLE=1H_LR-724-B2-OC
 CDCl3, 8 sc, 
 2.10.2020
##JCAMPDX= 6.0         $$ Bruker NMR JCAMP-DX V2.0
##DATA TYPE= NMR FID
##DATA CLASS= NTUPLES
##ORIGIN= UXNMR, Bruker Analytische Messtechnik GmbH
##OWNER= root
$$ XWIN-NMR		Version 3.5
$$ Fri Oct  2 10:12:42 2020 Russian Standard Time (UT+4h)  she@DPX200
##.OBSERVE FREQUENCY= 200.1315066352
##.OBSERVE NUCLEUS= ^1H
##.DELAY= (6, 6)
##.ACQUISITION MODE= SIMULTANEOUS
##.ACQUISITION SCHEME= undefined
##.AVERAGES= 8
##.DIGITISER RES= 18
##SPECTROMETER/DATA SYSTEM= spect
##.PULSE SEQUENCE= zg30
##.SOLVENT NAME= CDCl3
##.SHIFT REFERENCE= (INTERNAL, CDCl3, 0, 15.7039)
##AUDIT TRAIL= $$ (NUMBER, WHEN, WHO, WHERE, WHAT)
$$ ##TITLE= Audit trail, XWIN-NMR		Version 3.5
$$ ##JCAMPDX= 5.01
$$ ##ORIGIN= Bruker BioSpin GmbH
$$ ##OWNER= she
$$ F:/spectra/data/she/nmr/H-F/1/audita.txt
$$ ##AUDIT TRAIL=  $$ (NUMBER, WHEN, WHO, WHERE, WHAT)
(   1,<2020-10-02 10:11:40.35 +0400>,<she>,<DPX200>,
      <created by zg, POWCHK disabled, PULCHK disabled
       configuration hash MD5:
       00 E9 B6 7A A2 85 ED C7 34 08 36 98 17 FE 4E 26
       data hash MD5: 16K
       FC 7D AF 60 A1 00 CF EB EF DB AC A6 42 33 71 B2>)
$$ ##END=
$$ 
$$ hash MD5
$$ 01 3B E4 03 6D C4 E2 2F CB 8F 9B 48 8B A0 8A 5B
##$RELAX= 
##$RELAX= 
##$RELAX= 
##$RELAX= 
##$RELAX= 
##$RELAX= 
$$ Bruker specific parameters
$$ --------------------------
##$DU= <F:/spectra>
##$EXPNO= 1
##$NAME= <H-F>
##$PROCNO= 1
##$TYPE= <nmr>
##$USER= <she>
##$AMP= (0..31)
100 100 100 100 100 100 100 100 100 100 100 100 100 100 100 100 100 100 
100 100 100 100 100 100 100 100 100 100 100 100 100 100 
##$AQSEQ= 0
##$AQ_mod= 1
##$AUNM= <au_zg>
##$AUTOPOS= <>
##$BF1= 200.13
##$BF2= 200.13
##$BF3= 200.13
##$BF4= 200.13
##$BF5= 200.13
##$BF6= 200.13
##$BF7= 200.13
##$BF8= 200.13
##$BYTORDA= 1
##$CFDGTYP= 0
##$CFRGTYP= 5
##$CHEMSTR= <none>
##$CNST= (0..31)
1 1 145 1 1 1 1 1 1 1 1 1 1 1 1 1 1 1 1 1 1 1 1 1 1 1 1 1 1 1 1 1 
##$CPDPRG= <>
##$CPDPRG1= <>
##$CPDPRG2= <>
##$CPDPRG3= <>
##$CPDPRG4= <mlev>
##$CPDPRG5= <mlev>
##$CPDPRG6= <mlev>
##$CPDPRG7= <mlev>
##$CPDPRG8= <mlev>
##$CPDPRGB= <>
##$CPDPRGT= <>
##$D= (0..31)
0 1.2 0 0 0 0 0 0 0 0.06 0 0.03 0 0 0 0 0.0002 0 0 0 0 0 0 0 0 0 0 0 0 
0 0 0 
##$DATE= 1601619099
##$DBL= (0..7)
120 120 120 120 120 120 120 120 
##$DBP= (0..7)
150 150 150 150 150 150 150 150 
##$DBP07= 0
##$DBPNAM0= <>
##$DBPNAM1= <>
##$DBPNAM2= <>
##$DBPNAM3= <>
##$DBPNAM4= <>
##$DBPNAM5= <>
##$DBPNAM6= <>
##$DBPNAM7= <>
##$DBPOAL= (0..7)
0.5 0.5 0.5 0.5 0.5 0.5 0.5 0.5 
##$DBPOFFS= (0..7)
0 0 0 0 0 0 0 0 
##$DE= 6
##$DECBNUC= <off>
##$DECIM= 32
##$DECNUC= <off>
##$DECSTAT= 4
##$DIGMOD= 1
##$DIGTYP= 9
##$DL= (0..7)
0 120 120 120 120 120 120 120 
##$DP= (0..7)
150 150 150 150 150 150 150 150 
##$DP07= 0
##$DPNAME0= <>
##$DPNAME1= <>
##$DPNAME2= <>
##$DPNAME3= <>
##$DPNAME4= <>
##$DPNAME5= <>
##$DPNAME6= <>
##$DPNAME7= <>
##$DPOAL= (0..7)
0.5 0.5 0.5 0.5 0.5 0.5 0.5 0.5 
##$DPOFFS= (0..7)
0 0 0 0 0 0 0 0 
##$DQDMODE= 0
##$DR= 18
##$DS= 0
##$DSLIST= <SSSSSSSSSSSSSSS>
$$ [...]
##$SUBNAM2= <"">
##$SUBNAM3= <"">
##$SUBNAM4= <"">
##$SUBNAM5= <"">
##$SUBNAM6= <"">
##$SUBNAM7= <"">
##$SUBNAM8= <"">
##$SUBNAM9= <"">
##$SW= 16.880792210976
##$SWIBOX= (0..15)
0 0 2 0 0 0 0 0 0 0 0 0 0 0 0 0 
##$SW_h= 3378.37837837838
##$TD= 16384
##$TD0= 1
##$TE= 0
##$TE2= 300
##$TE3= 300
##$TEG= 300
##$TL= (0..7)
0 120 120 120 120 120 120 120 
##$TP= (0..7)
150 150 150 150 150 150 150 150 
##$TP07= 0
##$TPNAME0= <>
##$TPNAME1= <>
##$TPNAME2= <>
##$TPNAME3= <>
##$TPNAME4= <>
##$TPNAME5= <>
##$TPNAME6= <>
##$TPNAME7= <>
##$TPOAL= (0..7)
0.5 0.5 0.5 0.5 0.5 0.5 0.5 0.5 
##$TPOFFS= (0..7)
0 0 0 0 0 0 0 0 
##$TUNHIN= 0
##$TUNHOUT= 0
##$TUNXOUT= 0
##$USERA1= <user>
##$USERA2= <user>
##$USERA3= <user>
##$USERA4= <user>
##$USERA5= <user>
##$V9= 5
##$VALIST= <valist>
##$VCLIST= <CCCCCCCCCCCCCCC>
##$VD= 0
##$VDLIST= <DDDDDDDDDDDDDDD>
##$VPLIST= <PPPPPPPPPPPPPPP>
##$VTLIST= <TTTTTTTTTTTTTTT>
##$WBST= 1024
##$WBSW= 4
##$XGAIN= (0..3)
0 0 0 0 
##$XL= 0
##$YL= 0
##$YMAX_a= 885764
##$YMIN_a= -775832
##$ZGOPTNS= <>
##$ZL1= 120
##$ZL2= 120
##$ZL3= 120
##$ZL4= 120
##$ABSF1= 10
##$ABSF2= 0
##$ABSG= 5
##$ABSL= 3
##$ALPHA= 0
##$AQORDER= 0
##$ASSFAC= 0
##$ASSFACI= 0
##$ASSFACX= 0
##$ASSWID= 0
##$AUNMP= <proc_1d>
##$AZFE= 0.1
##$AZFW= 0.1
##$BCFW= 1
##$BC_mod= 2
##$BYTORDP= 1
##$COROFFS= 0
##$CY= 11.3945322036743
##$DATMOD= 1
##$DC= 2
##$DFILT= <>
##$DTYPP= 0
##$F1P= 16.9975609425685
##$F2P= -3.02152046262296
##$FCOR= 0.5
##$FTSIZE= 0
##$FT_mod= 4
##$GAMMA= 1
##$GB= 0.15
##$INTBC= 1
##$INTSCL= 1
##$ISEN= 128
##$LB= 0.24
##$LEV0= 0
##$LPBIN= 0
##$MAXI= 10000
##$MC2= 0
##$MEAN= 0
##$ME_mod= 0
##$MI= 1.114404
##$NCOEF= 0
##$NC_proc= 0
##$NLEV= 6
##$NOISF1= 3.799351
##$NOISF2= 2.8
##$NSP= 1
##$NTH_PI= 0
##$NZP= 0
##$OFFSET= 15.70392
##$PC= 1
##$PHC0= -10331.61
##$PHC1= 15.60089
##$PH_mod= 1
##$PKNL= yes
##$PPARMOD= 0
##$PSCAL= 0
##$PSIGN= 0
##$REVERSE= no
##$SF= 200.130013532006
##$SI= 16384
##$SIGF1= 3
##$SIGF2= 2
##$SINO= 400
##$SIOLD= 16384
##$SREGLST= <1H.CDCl3>
##$SSB= 0
##$STSI= 0
##$STSR= 0
##$SW_p= 3612.71676300578
##$SYMM= 0
##$S_DEV= 0
##$TDeff= 0
##$TDoff= 0
##$TI= <>
##$TILT= no
##$TM1= 0
##$TM2= 0
##$TOPLEV= 0
##$USERP1= <user>
##$USERP2= <user>
##$USERP3= <user>
##$USERP4= <user>
##$USERP5= <user>
##$WDW= 1
##$XDIM= 8192
##$YMAX_p= 0
##$YMIN_p= 0
$$ End of Bruker specific parameters
$$ ---------------------------------
##NTUPLES= NMR FID
##VAR_NAME=  TIME,          FID/REAL,        FID/IMAG
##SYMBOL=    X,             R,               I
##VAR_TYPE=  INDEPENDENT,   DEPENDENT,       DEPENDENT
##VAR_FORM=  AFFN,          ASDF,            ASDF
##VAR_DIM=   8192,          8192,            8192
##UNITS=     SECONDS,       ARBITRARY UNITS, ARBITRARY UNITS
##FACTOR=    0.000296,      1,               1
##FIRST=     0,             0,               0
##LAST=      2.424536,      0,               0
##MIN=       0,             -775832,         0
##MAX=       2.424536,      885764,          0
$$ Real data points
##PAGE= N=1
##DATA TABLE= (X++(R..R)), XYDATA
0@%%%%%%%%%qJ6j6K1k9M0m9O2q5J05j27J54j84K19k62L13l70M35n07N86o76P79
$$ 0 0 0 0 0 0 0 0 0 0 -8 8 -8 13 -16 24 -25 37 -48 57 -70 84 -100 119 -143 170 -200 235 -272 314 -362 417
31D17q95J025j169J328j503J694j905K138k396K682k991L324l690M090m528N008
$$ 417 -478 547 -622 706 -797 897 -1008 1130 -1266 1416 -1575 1749 -1941 2149 -2379 2629
47B629n531O102o727P411q160Q983r893J0904j2030J3290j4707J6315j8159K0300
$$ 2629 -2902 3200 -3527 3884 -4276 4707 -5186 5718 -6312 6978 -7729 8586 -9573 10727
61A0727k2820K5829k9498L4079l9958M7780n8618P4157j29600R73686q86942j39723
$$ 10727 -12093 13736 -15762 18317 -21641 26139 -32479 41678 -87922 885764 -1178 -140901
73a40901K30333q65264J459363m00965p77277P62655o93337O10403M07983j340369
$$ -140901 89432 -775832 683531 282566 -494711 267944 -425393 185010 592993 -747376
83g47376R69276m3631n71192R56777q44464L0011P12960q81644O85038o9849o87842
$$ -747376 221900 178269 -392923 563854 -280610 -250599 462361 -419283 265755 195906 -491936
94d91936Q57216n77147J32519P12725j172734M50584L58813n57565Q05331o54195
$$ -491936 365280 -211867 -79348 633377 -539357 -88773 270040 -287525 517806 -136389
104a36389l77752R28131n22684K67025K412p75958R46354j43595m52304N86792
$$ -136389 -514141 413990 -108694 158331 160743 -615215 331139 187544 -264760 322032
114C22032o84644K96695N30347p78097L91841o9774k77647O81007n40323k8581
$$ 322032 -362612 -65917 464430 -313667 78174 8400 -269247 411760 -128563 -157144
124a57144L78233n42401N35514k3077n60390N57606k67050q47M14134o15148K42046
$$ -157144 221089 -321312 214202 191125 -369265 188341 -78709 -79556 334578 -280570 -38524
135c8524J79111l27742M55699l46732j62477M90058l89302J81519J24573m50037
$$ -38524 140587 -187155 268544 -78188 -240665 249393 -139909 41610 166183 -283854
145b83854M09200q6210j78597L62545l63203P9782K07503l12147L12118j22226
$$ -283854 125346 39136 -139461 223084 -140119 -60337 147166 -164981 147137 24911
155B4911k28396L78550k20633K5215J42021l28063K92598L2822k37211K02232
$$ 24911 -203485 175065 -45568 -20353 121668 -206395 86203 119025 -118186 84046
165H4046j99348J00371K30820l41607J07724L7636j09118K70437k11634p9146
$$ 84046 -115302 -14931 215889 -125718 -17994 19642 -89476 180961 -30673 -109819
175a09819K01151j67753J41350n804j91056K21689j00278m4608J57427j85299
$$ -109819 91332 -76421 64929 59125 -131931 89758 -10520 -55128 102299 -83000
185h3000R7528M5045j53126J67661q4456n1617J43900j38857P3497L1419j48517
$$ -83000 14528 59573 -93553 74108 -10348 -61965 81935 -56922 16575 47994 -100523
196a00523J48858l2308m9616R5908j40329O5834Q1366j17932Q0373n1476l4904
$$ -100523 48335 16027 -33589 62319 -78010 -12176 69190 -48742 31631 -19845 -54749
207e4749J28786r9089P501M5302q3552R5655k7625o1433Q9220o9850K4738M9931
$$ -54749 74037 -25052 -17551 27751 -55801 39854 12229 -49204 40016 -29834 -5096 44835
219D4835r5466O6937l441n1286Q1093n6409m036M7244o2929N4413o004n0546O7961
$$ 44835 -50631 16306 12865 -38421 42672 -13737 -17773 29471 -33458 20955 14951 -35595 32366
232C2366m3577j879N0164o4205L0483J7119m0081M0949k9129l024L9631m4600
$$ 32366 -11211 -13090 37074 -27131 3352 20471 -19610 21339 -7790 -10814 28817 -15783
244a5783K3890M179l8487M8568j4782k1011L0693k8589J1627J3452k3470K2438
$$ -15783 8107 12286 -26201 22367 7585 -13426 17267 -11322 305 13757 -9713 12725
256A2725j5716q012K7869k5227R221J1550k9087K1103K180j5003J4642j1060J933
$$ 12725 -2991 -11003 16866 -8361 860 12410 -16677 4426 6606 -8397 6245 -4815 -2882
269b882O130j1157J3837p483p553J5978j4264J773J3841j3884J544K345l046O421
$$ -2882 3248 -7909 5928 -1555 -9108 6870 -7394 -5621 8220 -5664 -4120 -1775 -4821 1600
283A600l582K333k546p327J1562o55n297P081o821k720P000J36J750l438k005
$$ 1600 -1982 351 -2195 -9522 2040 1385 -3912 3169 -3652 -6372 628 764 2514 -924 -2929
298b929J950k522O468K032p064K014j103m39O593k066j578j103k791N703N10k285
$$ -2929 -979 -3501 2967 4999 -2065 -51 -1154 -1593 5000 2934 1356 253 -2538 3165 3675 1390
314A390L072m523j171M385k59J405k584j971L173l079K405L473p391K400L349
$$ 1390 4462 -61 -1232 3153 2894 4299 1715 -256 2917 -162 2243 5716 -1675 725 4074
329D074n565K688P46k172J976k402K610p65n493O774j917m134Q294n898m038M500
$$ 4074 -1491 1197 1943 -229 1747 -655 1955 1190 -4303 2471 554 -3580 4714 -1184 -5222 -722
345g22k384N604Po828J685m972P048Q186j1402R73r17m670J1075j246o80k24j1969
$$ -722 -3106 2498 2505 -4323 -2638 -7610 -562 7624 -3778 -2805 -3722 -8392 2683 1437 757 533 -11436
362a1436Q496M276j985J0579j6603m861J5708p868P951J320j2493J0648j0095
$$ -11436 -2940 1336 -649 9930 -6673 -11534 4174 -3694 4257 5577 -6916 3732 -6363
375f363m06J8594j2499Q164n743k4638L0005N422r733P503k7168J1680J7724j4996
$$ -6363 -6769 11825 -674 7490 1747 -22891 7114 12536 2803 10306 -16862 -5182 12542 -2454
389b454K0169k0453j3079L0856k3721J3382J6534l7814K1550m239j1229L4599
$$ -2454 17715 -2738 -15817 15039 -8682 4700 21234 -16580 4970 731 -10498 24101
401B4101l3424O853K0973m2422L4907l175k7155M8683l6814j1760L6423l4353
$$ 24101 -9323 -2470 18503 -23919 10988 7813 -19342 29341 -7473 -19233 17190 -17163
413a7163L3885l158m4512M6483k6035L056M2646o3728K5646J6016m3911O0598
$$ -17163 16722 13564 -30948 15535 -10500 -7444 35202 -28526 -2880 13136 -30775 29823
425B9823k7450l0787M6908m1386L3320J4052o6435N6011j2378j9536N3961o8361
$$ 29823 2373 -28414 18494 -22892 10428 24480 -41955 14056 1678 -17858 36103 -32258
437c2258J8994M9162o2288L6341j2460k2984O7938n8842m908M4922m7445M8536
$$ -32258 -13264 35898 -26390 9951 -2509 -25493 42445 -16397 -21305 23617 -23828 24708
449B4708j4524n2663O9927k9520q120L9380n7628L9054N571n3847O6261j7794
$$ 24708 10184 -42479 27448 -2072 -10192 29188 -28440 10614 16185 -37662 28599 10805
461A0805k5189L3195n1524L8707L3266n9121K5176j3575m564N1640n2173J337
$$ 10805 -14384 18811 -32713 5994 39260 -19861 5315 -8260 -12824 38816 -13357 -12020
473a2020L4307l7587K4364p833j8468M5048k9592j0743J9418k2324L2452p008
$$ -12020 22287 -15300 9064 1231 -17237 27811 -1781 -12524 6894 -15430 17022 10014
485A0014k9448L4169k3300n945L2055j9920J0903q356l0912L6792J0301r789q117
$$ 10014 -19434 14735 -8565 -14510 17545 -2375 8528 172 -30740 6052 16353 6564 -1553
498a553k9071L1000K4902l0474l563Q55P189J2927j7370o971J0274J2523n396
$$ -1553 -30624 376 25278 -5196 -8759 -7904 -715 12212 -5158 -12129 -1855 10668 5272
511E272k2432J3115R589n392O578j5029M367P176j3380K1003m027j4936Q562j8114
$$ 5272 -17160 -4045 5544 152 6730 -8299 -3932 3244 -10136 10867 6840 -8096 466 -17648
525a7648K7868J9216m7208M611Q216J3034K7086n4501o773L7449l696K0538m3733
$$ -17648 10220 29436 -17772 -13161 -4945 8089 35175 -19326 -26099 11350 7654 28192 -15541
538a5541j9004O5035k5070k840L995m2471O3384o889n0937M8944l1341J3246L4564
$$ -15541 -34545 30490 5420 2580 6575 -35896 27488 20599 -30338 18606 -12735 511 35075
551C5075p2724M4554J2140m7267O1951m4441j0339N6626o9306M1035K5031o7847
$$ 35075 -37649 6905 19045 -28222 33729 -10712 -21051 35575 -33731 7304 32335 -35512
563c5512N5007l2520j1191P8029p4764P516K5461m9866Q0417l4872n0363P3172
$$ -35512 19495 -13025 -24216 53813 -20951 -13435 12026 -37840 42577 7705 -42658 30514
575C0514n6657K7343L7500q8822O7837l870n1078P5280o2181R905N8726q6749
$$ 30514 -26143 1200 38700 -50122 17715 13845 -37233 38047 -24134 -14229 44497 -42252
587d2252N4323L033o0568R0626n3354j9478O8642q2145M6095K9691p2912O8139
$$ -42252 12071 15104 -45464 45162 -8192 -27670 40972 -41173 4922 34613 -38299 29840
599B9840m0655k2799Q4121p2235K2318K4114p6861Q5027j5779n1208P1376o3886
$$ 29840 -10815 -33614 50507 -21728 590 24704 -52157 32870 17091 -34117 37259 -26627
611b6627J8624N0795p9934N4128m860m5838P5595o0067J46O2125p7136M4017Q093
$$ -26627 -8003 42792 -37142 16986 12126 -33712 41883 -18184 -18038 44087 -33049 10968 19061
624A9061o1030P6979l3926k2345N5076o6298L5281K5933o0559N8800l2761k6347
$$ 19061 -41969 35010 1084 -21261 33815 -32483 2798 28731 -31828 26972 -5789 -32136
636c2136P2633n8167J3449K9589o4368N7150p324l8790N7218m7082R399L5298
$$ -32136 40497 -17670 -4221 25368 -39000 18150 10826 -27964 29254 -17828 -8429 26869
648B6869o1733M8870M54m3657N5013m1931k17M9444n5820K5975O329l8309N3000
$$ 26869 -34864 14006 14460 -29197 25816 -16115 -16332 33112 -22708 3267 9596 -28713 24287
661B4287k9505j0734M2706m9820K2636J6382m0561M5273j9452k2455M1205l2711
$$ 24287 -5218 -15952 26754 -23066 -430 15952 -24609 20664 1212 -21243 19962 -12749
673a2749J4867J4637m0790L7246q629k1436L6874l0000P708K1498l8935K5928
$$ -12749 2118 16755 -24035 13211 4582 -16854 20020 -9980 -2272 19226 -19709 6219
685F219K032j9019K8315k6879K202K5060k9592J8635j84k1405K9988j7655n433
$$ 6219 8251 -10768 17547 -9332 -7130 17930 -11662 6973 6789 -14616 15372 -2283 -7716
698g716K2034k3410J2797K484j9052K4323j1628o721J7577j9987J0613O921j9444
$$ -7716 14318 -9092 3705 6189 -12863 11460 -168 -6889 10688 -9299 1314 8235 -11209
711a1209J7546n927p339J5020j5247O422P907j6564J2218k557o814J3893j2181
$$ -11209 6337 410 -6929 8091 -7156 -734 7173 -9391 2827 270 -6544 7349 -4832
724d832J243P959j1031R192j666p318J0789p849N5P717q992N866n01o436Q320
$$ -4832 -3589 4370 -6661 2531 865 -6453 4336 -3513 -3458 4259 -4733 1133 632 -5804 2516
739B516l546m87N266p754L592K033m359N905k803k473L490m156M081K153m455
$$ 2516 -1030 -1517 3749 -4005 -413 1620 -2739 3166 363 -2110 1380 -2776 1305 3458 -997
754i97K695k624j354O056k156m38N43l910K214J481O95J645m451n19J757q53L870
$$ -997 1698 -926 -2280 3776 1620 1182 1725 -2185 29 1510 2205 3850 -601 -1120 637 -216 3654
771C654l32m104L00p49J900K745r56j910l007k62M024O64L52j173n077J566K423
$$ 3654 3322 -782 -482 -1231 669 3414 2458 548 -2459 -2721 1303 1967 2319 1146 -3931 -2365 58
788E8J428J581l435l096N09R86M307j59l254j069k404K593M939k076r68k358k578
$$ 58 1486 3067 -368 -3464 -2955 -1969 2338 2179 -1075 -2144 -4548 -1955 2984 908 -60 -2418 -4996
805d996M509J392N09k33n407J285K597j08M202l731l673K465j378M070K387n395
$$ -4996 -487 905 1414 1181 -4226 -2941 -344 -452 3750 19 -3654 -1189 -2567 1503 3890 -1505
821a505J384k291o7P214l901r07J429n519N539K182m016L966m709j398N829l164
$$ -1505 -121 -2412 -2479 4735 834 -73 1356 -4163 1376 3558 -458 3508 -1201 -2599 3230 66
837F6K585K23o913N881q00j253N868p244M71M123n483N951j289m971N989n884
$$ 66 2651 2874 -4039 1842 1042 -211 5657 -1587 -1116 3007 -2476 3475 2186 -2785 3204 -2680
853b680K231O519r054M484j194o098J1773n505l188O292j0090O669M625q956P945
$$ -2680 -449 6070 -2984 1500 306 -5792 5981 476 -2712 3580 -6510 159 4784 -4172 3773
868C773o693k914J1431q765L311L606j2441R787k25m710R716j0284J377O208j0239
$$ 3773 -2920 -5834 5597 -3168 143 3749 -8692 1095 870 -3840 5876 -4408 -3031 3177 -7062
883g062J1141k032p690J0913j1242J928J1888j1312O268k798q452J4136n847O48
$$ -7062 4079 2047 -5643 5270 -5972 -4044 7844 -3468 2800 2 -8450 5686 -161 487
897D87N662j5242R799L460q271J2981j0893m583J2462q461O902p38j0702J2477
$$ 487 6149 -9093 706 4166 -4105 8876 -2017 -6600 5862 -2599 4303 3565 -7137 5340
911E340n818j058Q669j3741R968L684j4369J0302l493j97J0902j5470K010N146
$$ 5340 -478 -1536 7133 -6608 3360 7044 -7325 2977 -516 -713 10189 -5281 -3271 1875
925A875l763J2348j2087p022J3485p471O936J020j5292J1625n68j988P183j3312
$$ 1875 -1888 10460 -1627 -8649 4836 -2635 4301 5321 -9971 1654 1086 -902 6281 -7031
939g031N193N798r046J0979q028n668J4302r497K521L530j2771J3508j141p300
$$ -7031 -1838 3960 -5086 5893 -2135 -7803 6499 -2998 -477 3053 -9718 3790 2649 -4651
953d651Q304j1254O750R910j5726O584k595l055J7449j3776m862Q441p613J4616
$$ -4651 3653 -7601 -851 9059 -6667 -83 -2678 -5733 11716 -2060 -6922 1519 -6094 8522
967H522l828j5165J3239o016N376Q229k0645J0952L373r983J6333j3876k536J6190
$$ 8522 4694 -10471 2768 -3248 2128 10357 -10288 664 4037 -5946 10387 -3489 -6025 10165
981A0165j6289Q722K431j4453J8521q756n208J4720j8868J0266R376j9299J5117
$$ 10165 -6124 2598 5029 -9424 9097 341 -4867 9853 -9015 1251 10627 -8672 6445
994F445p633p735K2530j5592N46N674j6479K1623l803j4064J6567j7573P739J6372
$$ 6445 -1188 -8923 13607 -1985 -1439 4235 -12244 9379 5576 -8488 8079 -9494 -1755 14617
1008A4617k5512J2944K13j2388K2627j6831k522J5765j9441J6298p71k0526K5230
$$ 14617 -10895 2049 2262 -10126 12501 -4330 -6852 8913 -10528 5770 4999 -15527 9703
1021I703j0530n474J7763k4805J1514J2089j8715J4984j2125m581K4301j9615
$$ 9703 -827 -6301 11462 -13343 -1829 10260 -8455 6529 -5596 -10177 14124 -5491
1033e491M075O228j9402K3484l446j5950J8526j4196M021J2320k0135J4266j581
$$ -5491 -1416 4812 -14590 8894 5448 -10502 8024 -6172 -2151 10169 -9966 4300 2719
1046B719j1996K0642j5442j309J6553k0078J1384N247j7971J6137n366l553J3282
$$ 2719 -9277 11365 -4077 -5386 11167 -8911 2473 7720 -10251 5886 520 -3033 10249
1059A0249j9017P630R455j4088J4170r651r456K1873j1221j944P494j3526J3045
$$ 10249 -8768 -1138 8317 -5771 8399 -1252 -10708 11165 -56 -2000 5494 -8032 5013
1072E013p39j0855J2602r125J496R573j6547J0812L841j3736J1764m513l343R622
$$ 5013 4274 -6581 6021 -3104 -1608 7965 -8582 2230 6071 -7665 4099 -414 -3757 5865
1086E865j1235M985M910r485Q083n786k409J3952j2213j664Q182p289O852j653
$$ 5865 -5370 -385 4525 -4960 3123 -2663 -5072 8880 -3333 -4997 3185 -4104 2748 1095
1100A095p516Q864l012j34K497p894Q565R16q828O904j515k648N893n604J746
$$ 1095 -6421 2443 -569 -703 1794 -6100 2465 3381 -5447 1457 -58 -2706 3187 -2417 -671
1115f71L137m541K669j766J125M687q043P10O130l818K399j471l948N764l00j893
$$ -671 2466 -2075 594 -1172 -47 4640 -3403 -2693 3437 -381 2018 547 -3401 2363 2063 170
1131A70l65q22M216k000l360L635q12j52J938l640K76L029q08r21o93R16M97j656
$$ 170 -195 -1017 3199 1199 -2161 1474 662 510 2448 -1192 -916 2113 1305 384 -309 607 1104 -552
1149e52J523R7j844Q84J80j112J276L66j337k37J330l61q75J92M81p17K47K11
$$ -552 971 1068 -776 108 288 -824 452 818 -519 -756 574 213 -662 -470 11 -706 -459 -248
1167b48o66J38R15m22r81N29N72r68J018J10j210P67j49L5L9J25N26o04k59N72
$$ -248 -914 -776 139 -283 -1264 -735 -163 -1131 -113 -3 -1213 -446 -595 -560 -521 -396 130 -474 -733 -161
1187a61o71O33J315j425l00M42K78O95l43l12l1m73R47J75k45M23n88m78N96l
$$ -161 -832 -199 1116 -309 -609 -167 111 806 463 151 120 -353 594 769 524 947 359 -119 477 474
1207D74Q27n62o37k64O10K43O82o51m02J95l93N97K96l44p20k13K45N31K69l21
$$ 474 1301 739 102 -162 448 691 1373 722 320 515 122 719 1015 671 -49 -262 -17 514 783 462
1227D62m63m88L07L71J34l85m91k13K47L41l1R1k46m79K91L38j41r1j11R1k19
$$ 462 -1 -489 -182 189 323 -62 -553 -766 -519 -178 -209 -118 -364 -843 -552 -214 -355 -446 -557 -466 -685
1248f85J59N4pj55J36J72J44m53j40K16J32K66j2j27o8L71o0L49J1n37k08N88
$$ -685 -526 -472 -479 -634 -498 -326 -182 -635 -775 -559 -427 -161 -173 -300 -368 3 -57 292 303 -234 -442 146
1270A46m1M54J42p85q1K95J19Q40m25k76m18k26J243K02o51m8q70K26J120j9n7
$$ 146 105 559 701 -84 -165 130 249 1089 664 388 -30 -256 987 1189 538 490 -380 -154 966 947 890
1291H90n85n94M15N5J176j75j831P27n17L33J503n92r71m54j85J460J04o96M73
$$ 890 305 -289 126 181 1357 1182 -649 78 -439 -106 1397 805 -166 -620 -805 655 759 63 536
1310E36k273N83K170j271M92j78j968R18J038p1L70j267m09K95rK350j123j644
$$ 536 -1737 -1154 1016 -255 237 59 -1909 -991 47 -24 346 -921 -1330 -1035 -1044 1306 183 -1461
1328a461J214q00J69J758p11q37k40m13J822k48L05M3k766J659K053j858J071
$$ -1461 -247 -1047 -878 880 169 -668 -908 -1321 501 253 558 601 -2165 -506 1547 -311 760
1345G60o70j551K097J66k09N65j863Q84N4r38L110j813j821K464j913Q56K440
$$ 760 90 -1461 636 802 593 1158 -705 179 233 -705 2405 592 -1229 1235 -678 178 2618
1362B618k825N35n60l79K727k089M15J274m289L250J512l338L132k327k240M439
$$ 2618 -207 328 -232 -611 2116 27 442 1716 -2573 677 2189 -1149 1983 -344 -2584 1855
1378A855k196J131J56l470L656j648r98M766m830o7K835m039L881K11l568L241
$$ 1855 -341 790 946 -2524 1132 -516 -1514 3252 -1578 -1645 1190 -2849 1032 1243 -2325 916
1394I16l049J314L042m667K988n4l951M904k132n95M366n356N77K355k136M233
$$ 916 -2133 -819 2223 -2444 544 490 -3461 1443 -689 -1284 3082 -2274 -1697 658 -1478 2755
1410B755l049k731M730k804J348K045n058L565L12k945L835k274K33J941m116
$$ 2755 -294 -3025 1705 -1099 249 2294 -2764 801 1113 -1832 2003 -271 -38 1903 -2213
1425b213K795J333k984L233k864r28M337k863M60J270l125K698p35j373L599k904
$$ -2213 582 1915 -1069 2164 -700 -1628 2709 -154 306 1576 -1549 1149 414 -959 2640 -264
1441b64k86J890l055L104O74l595J918o64J45K286k825J27J010j367K358j489
$$ -264 -550 1340 -1715 1389 2063 -1532 386 -278 -133 2153 -672 -545 465 -902 1456 -33
1457c3j369K008n29o12M06j127K008l22j518K80n21J627J289k958m42J224O14
$$ -33 -1402 606 77 -535 -129 -1256 752 430 -1088 -808 -1329 298 1587 -1371 -1813 -589 25
1474B5O26j474l33J021Q9M1p04J13J467j210o42J85J295L31j356j95N10Q77N77
$$ 25 651 -823 -1156 -135 -46 -5 -709 -596 871 -339 -981 -796 499 830 -526 -721 -211 666 1243
1493A243k533M63K481r24r74j175J252L247k615j797R52l4L497j972l937L492
$$ 1243 -1290 -827 1654 730 -244 -1419 -167 3080 465 -1332 -380 -414 3083 1111 -2826 666
1509F66J180r52k7l184K987J572k606R25j904R72L865m850M03K345k552K632j245
$$ 666 1846 894 867 -2317 670 2242 -364 561 -1343 -371 3494 -1356 -953 1392 -1160 1472 227
1526B27j850L664l396L93K081k802L397j605l510N230j524j576K292l540K940
$$ 227 -1623 2041 -1355 -962 1119 -1683 1714 109 -3401 1829 305 -1271 1021 -2519 421
1541D21J137l777K682j169k57L376n196J445L158l434K656j631k059M260k466
$$ 421 1558 -2219 463 -706 -963 2413 -2783 -1338 1820 -1614 1042 -589 -2648 1612 -854
1556h54M57J518l611L288j56k980M306k289j130L272l413K009R47l076L154j224
$$ -854 -397 1121 -2490 798 642 -2338 1968 -321 -1451 1821 -1592 417 1364 -1712 1442 218
1572B18j285L106l138Q30K365l527K568k34k460L573k112QJ729l259K417O95k771
$$ 218 -1067 2039 -1099 -269 2096 -1431 1137 903 -1557 2016 -96 -88 1641 -1618 799 1494 -1277
1589a277K986j949m92K704k855R22J238k367K362j561j253L011j846L50R39k674
$$ -1277 1709 -240 -732 1972 -883 39 1277 -1090 1272 -289 -1542 1469 -377 -27 912 -1762
1605a762K191R2j619K052j790o2J325j697J590J76k109K152j544J28K313j960
$$ -1762 429 521 -1098 954 -836 -898 427 -1270 320 496 -1613 539 -1005 -877 1436 -524
1621e24j2O36j063J334p18n21J586j774N77R25j370J620m94j502J193k90P53L89
$$ -524 -536 100 -963 371 -347 -868 718 -1056 -479 446 -924 696 202 -1300 -107 -397 356 745
1639G45j610R10n5l93J336r56n8O36q17M07P19p41M78n53j18Q87p66O34k59o29
$$ 745 -865 45 -10 -403 933 -23 -81 555 -262 145 864 123 601 48 -70 817 51 685 426 -203
1659b03P39r1n08R15o12k72L27j80N36l56j16K03n69J25Q86j007J22J29j74O35
$$ -203 536 445 -63 852 240 -32 295 115 651 295 179 382 -187 -62 824 -183 -61 68 -106 529
1679E29n67k06J3k74L33q4p5J18n14J2N97L4m62K53m14L47J79R7J60o16j25J61
$$ 529 -38 -244 -231 -505 -172 -256 -331 -213 -727 -715 -118 -84 -546 -293 -707 -360 -181 -84 76 -540 -665 -504
1701e04K92J77K29o38K68j53K83L04j03l66m24J47O27K06l70L30m94j83P04L39
$$ -504 -212 -35 194 -444 -176 -329 -46 258 155 -211 -635 -488 139 345 -25 305 -189 -372 332 671
1721F71j81j71n33J77K29K98K34m68k90K50J31N28n25j99J05o10Q25J52l13j45
$$ 671 490 319 -214 -37 192 490 724 256 -34 216 347 875 350 151 256 -354 471 623 310 165
1741A65k27n5L09J07q8l6o04O14k42M38j02n90J24q6J41K15j50j21j60k92N35
$$ 165 -62 -117 192 299 211 175 -429 185 -57 381 279 -311 -187 -273 -132 83 -67 -188 -348 -640 -105
1762a05p6k55O12p49r1O50O9M4l10m86M97j37K30J06n98N48J63l56M47p1o89K57
$$ -105 -181 -436 176 -573 -664 -14 55 99 -211 -697 -200 -337 -107 -1 -599 -51 112 -244 203 132 -557 -300
1784c00K15O5M32l96p3o6l0L49N7k23K06l36J75P61o30O3j22j96L03Q6o5N30r71
$$ -300 -85 -20 412 16 -57 -123 -153 196 253 30 236 -100 75 836 206 269 147 -49 254 340 275 805 -166
1807a66N80O4p04J103m58m41O04o95L47N74o85j1j6n25J127n42k03J79p12M13
$$ -166 414 478 -226 877 419 -22 582 -113 234 808 123 112 96 -429 698 156 -47 132 -580 -167
1827a67N12q05O48o64m6R88q76J89L2q01J454l22j004J089p99O7P42j016O02p4
$$ -167 345 -460 188 -476 -522 466 -410 -221 -189 -990 464 142 -862 227 -572 -505 237 -779 -177 -251
1847b51k55P27n60m7O93p33L57r6o02J024J07r30Q24o33L50O04l44l3l13o27J137
$$ -251 -506 221 -339 -386 307 -426 -69 -165 -767 257 364 -566 258 -375 -25 579 235 202 -111 -738 399
1868C99J50k28L16j225L43J184r69J00K47o46J056j57l79O30n96k71L72r74J091
$$ 399 549 321 637 -588 -245 939 -30 70 317 -329 727 570 191 821 225 -46 326 -648 443
1887D43L14o47M33j048Q4J581j063Q1j91p67J108O4o14P86j281J29J305j012M45
$$ 443 757 110 543 -505 -421 1160 97 178 -13 -780 328 392 -222 564 -717 -588 717 -295 150
1906A50j01p70R89m14l67P08q29M12L01j081J057k39p35J354j083Q4J222j573
$$ 150 49 -721 268 -146 -513 195 -634 -222 79 -1002 55 -184 -919 435 -648 -564 658 -915
1924i15P11O60j176Q18k80o2N13r50M82P35q82Q71o76q91J747l26m68O08j081
$$ -915 -204 456 -720 98 -182 -244 269 -681 -199 536 -346 525 -151 -1042 705 379 -89 519 -562
1943e62Q28O49j230O98k54m30J277j220M17R90j366N03K05o66Q93l67l04Q09j166
$$ -562 266 915 -315 383 129 -301 976 -244 173 1163 -203 300 505 -161 732 365 61 870 -296
1962b96L43K61n41J736j202j565J584N0K6M87k310J119J050n81L16j356J13J389
$$ -296 47 308 -233 1503 301 -1264 320 370 396 883 -1427 -308 742 161 477 -879 -766 623
1980F23r49N7O18j315J691m95j637J512j40p5M72j052L26q0NJ312r79j012R87
$$ 623 -326 -269 349 -966 725 230 -1407 105 -35 -110 362 -690 -364 -444 -439 873 -106 -1118 -131
1999a31p33J273M16k083P43L43O4R86j348P5R26p97P78n40p51J755n92p50M72
$$ -131 -864 409 825 -1258 -515 -172 -108 878 -470 -395 531 -266 512 -28 -779 976 384 -366 106
2018A06m79O28N71p72k55l54Q04Q20j113J91K26o88J124k7r35L50p5j98O55m70
$$ 106 -373 255 826 54 -201 -555 249 1069 -44 147 373 -315 809 782 -153 197 122 -76 579 109
2038A09R7K02m69Q62r59j15P77j60k62Q0j156N43J044l84m96n54L76J043k75n22
$$ 109 206 408 -61 801 -158 -273 504 344 82 162 -994 -451 593 209 -287 -841 -465 578 303 -219
2058b19k00k99J157j17r23O34l69k5N59n34K37k8k10M82n28P3N17n64N16j03o89
$$ -219 -419 -718 439 322 -601 33 -336 -361 198 -336 -99 -127 -337 145 -383 -310 207 -357 159 56 -633
2079f33N81P07q02k74j6K30N36j0k10o72J35Q13m5l75J6j60r7O32j78J72j70r8
$$ -633 -52 655 -147 -421 -437 -207 329 319 109 -563 -428 385 340 -35 -19 -179 -276 356 178 350 180 82
2101H2j19l2N21J50p35j62K83q8O61J78m36j76m07L96J63K88k70n71l41N85M41
$$ 82 -37 -69 452 602 -133 -295 -12 -100 561 739 303 127 -280 116 279 567 297 -274 -615 -30 411
2122D11k04j04l95N8K97k2J50j14m40K1J27N76j27m09k51J7L33L35l04j28j63
$$ 411 207 103 -292 -234 63 41 191 77 -363 -342 -215 361 234 -175 -426 -409 -76 259 -45 -173 -336
2143c36l4N2J41J86K26p52j07P01J24J73k78o09K89M54r7j7l63J5K85P7K26j12
$$ -336 -370 -318 -177 9 235 -517 -624 77 201 374 96 -513 -224 230 133 116 -247 -232 53 130 356 244
2165B44k93J46j82K88M27j53p1n56J80M62l13K41m34j00K99J56N0nl40Rj53L93
$$ 244 -49 97 -85 203 630 477 406 -150 30 492 179 420 -14 -114 185 341 391 386 46 55 -98 295
2187B95Q3j02l80N9j70L25M14l98l09LJ66j28N96l77l36j3j05n72J121k50j56
$$ 295 378 276 -104 -45 -215 110 524 126 -183 -180 -14 -142 454 77 -259 -272 -377 -949 172 -78 -234
2208b34l74K52L69r7j30j72k85L30N18j62k47l39M77k04P1N05m05J5J31k07J43
$$ -234 -608 -356 13 -84 -214 -386 -671 -341 177 15 -232 -571 -94 -298 -227 278 -127 -112 19 -188 -45
2229d5m4nJ42l07M32j47n0M61k01l06L06O2K61l54k27M68k94L27k2p61L49K28
$$ -45 -89 -94 48 -259 173 26 -24 437 236 -70 236 298 559 205 -22 446 152 479 457 -304 45 273
2251B73m49P64j92m82N42l35J31K1l18M32l45r3L89m91J78L87q22N43j0j52Q4
$$ 273 -176 588 396 -86 456 121 252 273 -45 387 42 -51 338 -153 25 412 -410 133 123 -29 55
2272E5m37J78M9l60J020n71n76O17o3r1M97q36%M31j40N49p62J70M42q91N99M01
$$ 55 -382 -204 -155 -515 505 -66 -642 -25 -88 -179 318 -518 -518 -87 -227 322 -440 -270 172 -719 -120 281
2294B81q02Q28m43n27J055o34K25K45o41N19k36k11J330r48m52N01n69Q34M32
$$ 281 -521 307 -136 -663 392 -242 -17 228 -413 106 -130 -341 989 41 -411 90 -479 355 787
2313G87j221M36l6K86N98j316M47O35j133J366p69o48J237n80l21O49q86O13K07
$$ 787 -434 2 -34 252 850 -466 -19 616 -517 849 80 -568 669 89 -232 417 -469 144 351
2332C51n98R46j352L14J606j783P06J91j030J156l04p53J036j059R49J46j830
$$ 351 -247 699 -653 -339 1267 -516 190 381 -649 507 203 -550 486 -573 376 522 -1308
2349a308J523n23m77K077j984k22J194p29Q07k17j160J124l31M41P26k254J278
$$ -1308 215 -308 -785 1292 -692 -914 280 -449 358 141 -1019 105 -226 215 941 -1313 -35
2366c5N88j402J193q34m59J546o47j47J2p03J568m1j328J005j126P60J674k248
$$ -35 553 -849 344 -490 -949 597 -50 -197 -185 -888 680 639 -689 316 -810 -50 1624 -624
2384f24R9O55l65J053n50p92Q97m62R71k54j500J197O1n67R39j119k81J414k60
$$ -624 -525 130 -235 818 268 -524 373 -89 882 628 -872 325 386 -181 758 -361 -642 772 512
2403E12k19n15k50Q52j38M5L2j150P33Q96p28j32J69n22N89K34p32m5p5O52M49
$$ 512 293 -222 -472 380 242 287 319 -831 -98 798 70 -62 107 -415 174 408 -324 -369 -444 208 657
2424F57j139J31J43l6J012r18r17R01K28K9J01j181M83P04k2K10q19m21J262n64
$$ 657 -482 -351 -208 -244 768 -150 -1067 -166 62 91 192 -989 -506 198 176 386 -433 -854 408 -156
2444a56Q9M83j199O57N21r11P08m71M2J190j337J58L87r89J793j87j658J206m62
$$ -156 -67 416 -783 -126 395 -516 192 -279 -237 953 -384 -226 161 -828 965 778 -880 326 -136
2463a36N58J114k152L78L06l09J601j431q12J774j166Q08M64k195J506q4l68J642
$$ -136 422 1536 -616 -238 68 -241 1360 -71 -883 891 -275 533 997 -1198 308 224 -144 1498
2481A498j992P1J546j670J187o30j371K561p33j046J183j608J266P87k115J484
$$ 1498 -494 -423 1123 -547 640 10 -1361 1200 467 -579 604 -1004 262 1049 -1066 418
2497D18p58l98K202j960K85O94j807J858K7j593J233j393Q88K059k836P19K23
$$ 418 -340 -738 1464 -496 -211 483 -1324 534 561 -1032 201 -1192 -304 1755 -1081 -362 -139
2514a39o44K290j675j442K087n44O31n82j807K851k68j269Q59j898J941J264k702
$$ -139 -783 1507 -168 -1610 477 -67 564 -18 -1825 1026 758 -511 348 -1550 391 1655 -1047
2531a047J085k86j8J684j830k26J409j549J198R1q82J441j720L01J599j322N44
$$ -1047 38 -248 -266 1418 -412 -638 771 -778 420 511 -371 1070 -650 -349 1250 -72 472
2548D72p80l93K240j300q95Q57o52J520k98k079J385J70O6K90j789J055J092j361
$$ 472 -308 -701 1539 239 -656 201 -451 1069 771 -1308 77 247 313 603 -1186 -131 961 -400
2566d00P47q24O1J474j279k92M54l32P45l02m68Q29j234M73O91o51N60o04m12
$$ -400 347 -477 -416 1058 -221 -513 -59 -391 354 52 -416 413 -821 -348 343 -308 252 -352 -764
2585g64J373n28k86L17o88P98j63m00Q53n38m79P00q06L58Q54j017O00n41J69
$$ -764 609 81 -205 112 -576 222 59 -341 512 -26 -505 195 -611 -253 601 -416 184 -357 -188
2604a88P16q56P94k18j296J314k9m3L50j234M61M01o0P14q62l80O98k27K99J31
$$ -188 528 -328 466 248 -1048 266 237 194 544 -690 -229 172 112 826 -36 -416 282 55 354 485
2624D85p55M79n50J22N12J48j40n85j82Q07j04k55M35o53k00O43k44J42r9m02
$$ 485 -270 209 -341 -219 293 441 301 -284 -466 341 237 -18 417 -236 -436 207 -37 105 6 -396
2644c96K80L6K39K46p12L17O8l60O11l93l12L24k16K58n0J03jl36j1M18l4o4l75
$$ -396 -116 -80 159 405 -307 10 78 -282 329 -64 -376 -52 -268 -10 -60 43 42 -294 -305 113 79 15 -360
2667c60L03p2R2K7J9p7j94K95J2M87n61l10L70r7J12K72j73k52J27k4L01J22j96
$$ -360 -57 -129 -37 -10 9 -68 -262 33 45 532 -29 -339 31 -66 46 318 145 -107 20 -4 297 419 223
2690B23m07J13p4O48k06k4k21m91O97K2J17k04l72j8L06R3K05k04l03j6j12N95
$$ 223 -184 -71 -145 503 297 273 52 -439 258 280 397 193 -179 -197 109 202 407 203 -100 -116 -228 367
2712C67o0l51Qk37J55K63L36k80l00n44M67L87k59Q4o55J03L12K37J75k97k33
$$ 367 307 -44 -36 -273 -118 145 481 201 -99 -643 -176 211 -48 36 -619 -516 -204 33 208 -89 -322
2733c22K6q6L96J41l35o9ll9M37k89K64j78J9k57L88J85j03k35j50L1j88N77N
$$ -322 -296 -382 14 155 -180 -249 -252 -291 146 -143 121 -57 -38 -295 93 278 175 -60 -210 -179 -367 210 215
2756B15k34lR3j19M03j00j81m47M95J95j98K1K8n0p1K35l04M0p5M34l98K11N5
$$ 215 -19 -22 71 -48 355 255 74 -373 122 317 119 140 168 118 47 282 -22 18 -57 377 -21 190 245
2779B45m88L77K74l79P6k92L82K28o78L79q7j68P07o82o49Q64n44N88p7p74P46
$$ 245 -243 134 408 29 105 -187 195 423 -255 124 37 -131 576 -106 -755 109 -435 153 76 -698 48
2800D8J01P1M4p98N25K57n85M90n40m42R61k50j4K14p67P13J07m41M65r00O21
$$ 48 149 220 264 -534 -9 248 -337 153 -387 -829 132 -118 -132 82 -685 28 135 -306 159 -741 -120
2821a20J377j712J10K04k12J236m94j182Q91n92J561k41k181J393L67o00J363
$$ -120 1257 -455 -345 -141 -353 883 389 -793 98 -494 1067 826 -1355 38 405 -195 1168
2838A168k056K81J748j147L62l55q60K066j211j80R66j942J491O49j606J247r76
$$ 1168 -888 -607 1141 -6 356 1 -859 1207 -4 -184 782 -1160 331 980 -626 621 -355
2855c55m83K326j690k0K32j134K330l47j804J456j432R93J302l059J414M39r27
$$ -355 -838 1488 -202 -222 10 -1124 1206 859 -945 511 -921 72 1374 -1685 -271 168 -759
2872g59K457k799J16K156k037J652m81k106K641r92k31J420k829J693J174j654
$$ -759 1698 -1101 -985 1171 -866 786 305 -1801 840 -152 -383 1037 -1792 -99 1075 -579
2888e79J279j382p49K921j705L35n4j764K802m34j661J395j245R10J448l068J708
$$ -579 700 -682 -1431 1490 -215 120 66 -1698 1104 670 -991 404 -841 69 1517 -1551 157
2905A57O52j347J935k017j15J865j847J479k39j805K214j256L6J874k761J037
$$ 157 809 -538 1397 -620 -735 1130 -717 762 523 -1282 932 -324 -288 1586 -1175 -138
2921a38P21o34J455j815q24K225q24O57n55k036L010k32j939J326j213J242N50
$$ -138 583 -51 1404 -411 -1235 990 166 823 268 -1768 1242 1010 -929 397 -816 426 976
2938I76k238J386m9k98J361k310O13J483j446J067n11r83J565j125M51P60j850
$$ 976 -1262 124 75 -223 1138 -1172 -559 924 -522 545 34 -949 616 -509 -58 702 -1148
2955a148J326j43o24J810k037K4J632j463J161p09q08J591o37m93P89j104J499
$$ -1148 178 35 -589 1221 -816 -792 840 -623 538 -171 -979 612 -25 -518 271 -833 666
2972F66j44j845J891m62j22P05j750R90P26j198J013q80K20J107j778J210N35
$$ 666 522 -1323 568 106 -16 689 -1061 -71 655 -543 470 -410 -190 917 -861 349 884
2989H84j547R54n22J34J324j669J35P67p40J254j293m65J935j361L20N9p07J404
$$ 884 -663 291 -231 -97 1227 -442 -307 460 -280 974 -319 -784 1151 -210 110 169 -538 866
3007H66p36q86R42l70Q27Q1j848J204J38m36R77j105J82M93j250J087l5m49J012
$$ 866 130 -756 186 -184 643 724 -1124 80 218 -218 759 -346 -164 329 -921 166 131 -318 694
3026F94j711O48J111j148N75r0r72J083l68l14Q19o32K89k21n51J459n39l79J29
$$ 694 -1017 -369 742 -406 169 79 -893 190 -178 -492 327 -305 -16 -237 -788 671 132 -247 -118
3045a18m15P30J82q03K97o4J1K71m53O40k9n01L52j38l1O88q27J00Q8OL03J7k56
$$ -118 -533 197 379 -424 -127 -191 -180 91 -362 278 249 -252 100 -38 -69 619 -208 -108 -20 -14 289 306 50
3068E0M55n08K39M27o79K68l96N3N54o32J79R5l28N52r2j47Q9m09L21jk71L36
$$ 50 505 -3 236 663 -16 252 -144 -91 463 -169 10 105 -223 329 237 90 179 -230 91 90 -181 155
3090A55k61k66O16k41K7J03n58L99j25k68M35k74K02q3k57M59J85l26M5j99n3
$$ 155 -106 -372 244 3 30 133 -425 -26 -151 -419 16 -258 -56 -139 -396 63 248 -78 -33 -232 -285
3111b85M05k72L70o89J58L56p8K15K34n87n8L76k4J98n45L3M08n62O08j10l76
$$ -285 120 -152 218 -471 -313 43 -35 180 414 -173 -231 145 121 319 -226 -193 215 -347 261 151 -225
3132b25M65l77J62N25n45K34n0l42K87j54J52K14k83P5l0L4m3kk35L42k15K87
$$ -225 240 -137 25 550 5 239 189 -153 134 -20 132 346 63 138 108 142 99 97 -138 204 -11 276
3154B76k60j04J17J06j96O4l49J10L77l31M25m25J74Kj69J84q8k79L09J12m09
$$ 276 16 -88 29 135 -61 3 -346 -236 141 -190 235 -190 -16 -14 -183 1 -87 -366 -57 55 -354
3175c54L91k7om9j6K12j30l49L65p9r8J07j86M59m1k80J67O4j73K22l11q3J79
$$ -354 37 10 4 -45 -61 151 21 -328 37 -42 -140 -33 -219 240 199 -81 86 150 -23 199 -112 -195 -16
3198a6j30K01R5n17M99l59K23K39l68M07j94o6L39k34NK83n97L19J47m86N49k84
$$ -16 -146 55 150 -367 132 -227 -4 235 -133 274 80 14 353 119 124 407 -190 129 276 -210 339 55
3220E5R4K77o66M93J87r07R05m96j99O41n69M88k17n08Q07m29j35O58p84K91L31
$$ 55 149 426 -240 253 440 -467 438 -58 -257 384 -185 303 86 -422 385 -44 -179 479 -305 -14 317
3241C17r09Q09q2o02O92m92N2M40q00P25k79l46J068j019L97M48j268R89j39p30
$$ 317 -592 217 135 -467 225 -267 -215 225 -575 150 -129 -475 593 -426 -29 419 -849 140 1 -729
3261g29J310r80L49K84o33Q73k83q91J250q06l39J273j358O93K87p32J100o71
$$ -729 581 -399 -50 234 -399 474 191 -700 550 -256 -595 678 -680 13 300 -432 668 -3
3279cl81J241j361Q01K68j280J688p77o50R96j039N21Q45j691J261l80n38J447
$$ -3 -384 857 -504 297 565 -715 973 196 -454 542 -497 24 869 -822 439 59 -479 968
3297I68j294J49J327j962R69J9o20J314j140l02J221j252J030k88j357K278j213
$$ 968 -326 -177 1150 -812 157 176 -444 870 -270 -572 649 -603 427 139 -1218 1060 -153
3314a53k99J473j903J253K76j995J703l65j05R85j987R94Q71j622J609q53r12
$$ -153 -452 1021 -882 371 647 -1348 355 -10 -115 870 -1117 -123 748 -874 735 -118 -1030
3331a030J984j662K08J206j348J245q11j119K607j652j02J215k115J865K46j748
$$ -1030 954 -708 -500 706 -642 603 -208 -1327 1280 -372 -474 741 -1374 491 737 -1011
3347a011K071j087k04J183k039J450K83j850K018r31j83J445j991R82P11j730
$$ -1011 1060 -27 -231 952 -1087 363 646 -1204 814 -117 -300 1145 -846 136 847 -883
3363h83J824j018k38J358j802Q05Q36j765J781r75p14J880j643O90L54j629J793
$$ -883 941 -77 -315 1043 -759 46 882 -883 898 -77 -791 1089 -554 136 490 -1139 654
3380F54k46j094J698j693O08R36j803J402k96j002J725j295J8J002j571J235n5
$$ 654 408 -686 1012 -681 -73 863 -940 462 166 -836 889 -406 -388 614 -957 278 223
3397B23j227J596j194L63J204k127Q41O06o93J308j456m70J695j186Q95o9j392
$$ 223 -1004 592 -602 -239 965 -1162 -321 285 -408 900 -556 -1026 669 -517 378 309 -1083
3414a083J652m62n95J278j450N84L94j187J632p10m36J061j465O78P24j353J482
$$ -1083 569 107 -488 790 -660 -76 318 -869 763 53 -383 678 -787 -109 615 -738 744
3431G44o55n51J046j170R82P15j745O95j49o9J282j614L7R02q79R24j24j119J110
$$ 744 89 -462 584 -586 396 1111 -634 61 -88 -157 1125 -489 -452 450 -429 495 371 -748 362
3450C62n94O06K07j229R18P0j140J388q52j02J073j396R78k88o91J478r66QN68
$$ 362 -232 374 581 -648 270 340 -800 588 -264 -366 707 -689 289 1 -690 788 -178 -170 398
3469C98j178J289k08q29P84q35M68P39j182O35K0p50J309p40l15P05p44N87R7
$$ 398 -780 509 301 -528 256 -579 -111 628 -554 81 101 -649 660 -80 -395 310 -434 153 250
3488B50r83R21j61k51O61q90L75M97j017R33j87o39J132p75L4M38j054J104k11
$$ 250 -733 188 27 -224 437 -453 -78 419 -598 335 148 -491 641 -134 -100 338 -716 388 177
3507A77m71P92r84M94Q41q86M74k11q51J185n58l67J043j040M67l4k78P59n37
$$ 177 -294 498 -486 8 849 -37 437 226 -625 560 2 -365 678 -362 105 71 -207 552 15
3526A5j8N44r77N49K48p04N91l70l34N51l53L74N5p59O57j01l52N16l62j41N01
$$ 15 -3 541 -436 113 361 -343 248 -122 -456 95 -258 116 171 -588 69 -32 -384 132 -230 -371 130
3547A30n33P75l83l61N76m58K6L01m84P64m07k02L46m8j2Q1l98K52P9o31J012
$$ 130 -403 372 -11 -372 204 -254 -228 73 -411 353 -54 -256 90 42 30 111 -287 -35 44 -587 425
3568D25n13j53M42m39L62j02l35N47m21K88J49n00J70L10k19M52o39J98K83l51
$$ 425 -88 -241 201 -238 124 22 -313 234 -187 101 250 -250 -80 230 11 463 -176 22 305 -46
3588d6n1J81j07M02j72q5K65m58J26N8j34Q0j8J35k99kJ02j9J12K8J17l25J97
$$ -46 -97 84 -23 379 207 122 387 -71 55 113 -21 59 41 176 -123 -125 -23 -42 70 98 215 -110 87
3611H7k21J60o9j36j35M15j59p9K75l31k2L0L75k37r4k2K42j61O3j81J01K36k41
$$ 87 -134 26 -43 -179 -314 101 -58 -137 138 -193 -215 -185 190 -47 -141 -163 79 -82 -19 -200 -99 137 -104
3634a04L2J34m74L44J12j03J16j40O7k30K22J94j80J7J03j89K88o8k45K67q9J71
$$ -104 -72 62 -412 -68 44 -59 57 -83 -16 -246 -24 170 -10 7 110 -79 209 141 -104 163 74 245
3656B45j55O0l1j68J6np7Q0N1j12np2M16j88K90k70p1n8j03L65k06k07K56j79
$$ 245 90 150 119 -49 -33 -38 -115 -35 16 -96 -101 -173 243 55 345 75 4 -54 -157 208 2 -205 51 -128
3680a28J68L21k40k14K71m82K94M3l84L36N7k8p6n1J81k62Q7K07j28J64k71J89
$$ -128 40 361 121 -93 178 -304 -10 33 -351 -15 42 14 -62 -113 68 -194 -107 100 -28 136 -135 54
3702E4k15L35m28L64k88P2J26N8Kj48m1J3J13n1K67l64K63j36n5J65J7j36J29
$$ 54 -161 174 -254 110 -178 -106 20 78 80 -68 -109 -96 17 -34 233 -131 132 -4 -59 106 123 -13 116
3725A16j50Mr8J32q2J45l34K89J66j49K61k79k55N12l72L46Pn50L57Q3p7J38N9
$$ 116 -34 -30 -128 4 -78 67 -267 22 188 39 300 21 -234 278 -94 252 259 -291 66 149 72 210 269
3748B69l09L11l95N11m55k63N98k78M8J17l32Q9L12l95L38l88M7L88n10M36l84
$$ 269 -40 271 -124 387 -68 -331 267 -11 37 154 -178 -89 223 -172 166 -222 -175 213 -297 139 -245
3769b45l2N00n45M67mm95K58O40p33K44q3l91Q73n93l6J10k78P16j11q88R54n93
$$ -245 -277 223 -322 145 141 -354 -96 544 -189 55 -28 -419 454 -139 -175 -65 -343 373 262 -626 328 -265
3791b65M67l1n58L51K22l48O98p73L1O84q35K73K43n47R00k71m28N66o95K87M73
$$ -265 202 171 -387 -36 186 -162 536 -237 -206 478 -357 -84 159 -388 512 241 -187 379 -316 -29 444
3812D44r70J014m71o25J478j258L31K91q25J140j49q95J024q12K50O32j287P81
$$ 444 -526 488 17 -608 870 -388 -57 234 -591 549 400 -495 529 -283 -33 599 -688 93
3830I3L66p00O74r23J53J062r86K15J78r98J555m97o83R03q93L06Q25j197Q99
$$ 93 459 -241 433 -490 -337 725 -261 -46 132 -866 689 192 -491 412 -481 -175 650 -547 352
3849C52o28n97J462p98LP29j324J067J3j217J508q93J57N86j097R61O7o96J111
$$ 352 -276 -873 589 -209 -206 523 -801 266 279 -938 570 -323 -166 420 -677 284 351 -345 766
3868G66j118k48J237q74M79L25j447J332j93n65J055j620Q74Q75j213O57j79n31
$$ 766 -352 -600 637 -237 242 567 -880 452 259 -306 749 -871 3 878 -335 322 143 -388
3886c88J255j111N1Q53j004P08K58j213J023p05K70R65j567P53Q8p06J214q56
$$ -388 867 -244 -193 660 -344 364 622 -591 432 -273 -3 962 -605 148 236 -470 744 -112
3904a12l01P43p73Q68qj220J202o17l4M93j143P26O06o51N37n67j55R03p11J71
$$ -112 -413 330 -443 425 417 -803 399 -218 -252 241 -902 -176 430 -221 316 -251 -406 497 -214 -43
3924d3L08r37Q50p4m35Q77q80l4Q14q36N65K3q67J188q32o9O43n05M26J12p86
$$ -43 265 -672 178 104 -331 546 -334 -368 446 -390 175 198 -669 519 -313 -382 261 -244 182 294 -492
3945d92Q39l96N2N99j168Q64R7o20O18l78j94K53NJ65R6n99N93m84J62L92p01
$$ -492 347 -49 3 602 -566 298 395 -225 393 15 -179 74 79 244 340 -259 334 -150 12 404 -297
3966b97L07L44j077R68k90j14L67m53K48K97m78O97n74j91Q51p38J47M62j082
$$ -297 10 354 -723 245 -45 -159 208 -245 3 300 -178 519 -55 -246 605 -133 14 476 -606
3985f06P29j39l44Q36o92j82M66p21P91R8o79O41j98k66K98l75M57k8l11P26q72
$$ -606 123 -16 -360 476 -216 -398 68 -653 138 236 -443 198 0 -266 32 -343 114 86 -225 501 -371
4006c71J60M96m33R1k0j72O23l49j02J41k42K84r0k24M02l89n0N15k67P2Q7n70
$$ -371 -211 285 -148 -57 -77 -249 374 25 -77 64 -178 106 16 -208 194 -195 -245 270 3 75 162 -408
4028d08M33K63j61M4q3O6J37m34K54M7j48M55o63J45L64m19K67j29r2J76j7j28
$$ -408 25 288 127 171 88 154 291 -143 111 158 10 465 -198 -53 311 -108 159 30 -62 114 97 -31
4050c1L82l85N1J13m58O37k62l17M80j45k13J75k34K80J3j83M6j21K70M6l92K81
$$ -31 351 -34 17 130 -328 309 47 -270 210 65 -148 27 -207 73 86 -97 -51 -172 98 144 -248 33
4072C3k18q1K33J25l76L57k27K23p3j39L30j79r7J15j31K47O6l79L33m31L32J99
$$ 33 -185 -266 -33 92 -284 73 -154 69 -4 -143 187 8 -89 26 -105 142 208 -171 162 -269 63 262
4094B62o56N67j4l93M44k56k01N24k13R1J75k85n8o4J19o3Q9l15M28m5o1J19j52
$$ 262 -394 173 159 -234 210 -46 -247 277 64 155 330 45 -13 -77 42 -21 68 -247 181 136 75 194 42
4117D2J51j79p9L85k12N5l73L05r1J44l58L32k23K08p2l19P2L45k86J03r6pJ02
$$ 42 193 14 -65 320 108 163 -210 95 4 148 -210 122 -101 107 35 -284 -212 133 -153 -50 -146 -153 -51
4140e1k18K35q3l78Q30n55J42K69m93J82j04P8m7L9J1J66j74K83p9Qp8J12j92
$$ -51 -269 -34 -117 -495 335 -220 -78 191 -302 -120 -224 -146 -193 -154 -143 23 -151 132 53 61 -17 95 -97
4163i7L04r1J8k87K12J49O8k14J38m64M11j44k1Q4j63n7K64o9J46p7O6Kj01j07
$$ -97 207 116 134 -153 59 208 276 62 200 -264 147 3 -18 66 -97 -154 110 41 187 110 176 178 77 -30
4187c0M93m47J78ln32M37R1k41L12k17J5K16j70J90o4k18m9PJ6J65j90nJ69m79
$$ -30 463 16 194 191 -341 96 187 -54 258 41 56 272 102 292 228 10 -39 -32 -16 149 -41 -46 123 -356
4211c56M35k32M9K19l15L0N5NJ23j74R9J96l57K99J65n21L06m5j31K24l71K98
$$ -356 79 -153 -104 115 -200 -170 -115 -110 13 -161 -62 134 -223 76 241 -280 26 -19 -150 74 -297 1
4233AK91n53N31l22m05O72j51j89K74m89M08J35k95L89l24J04L02q43N66L5l07
$$ 1 292 -261 270 -52 -457 215 64 -125 149 -340 68 203 -92 297 -27 77 379 -464 102 137 -170
4254a70O91m40r1K15k76J47K98n30K30l9J72L27m99k23N65k35O2r3j98L20m61
$$ -170 521 81 -10 205 -71 76 374 -156 74 35 207 534 35 -188 377 142 204 111 -87 233 -228
4275b28L24K78m70K11j7o49O13J16l95N62m58P0Kj68L91j92k64K70j94K68K59
$$ -228 96 374 -96 115 98 -551 62 178 -217 345 -113 -43 -41 -209 182 -10 -274 -4 -198 70 329
4296C29q45M48J76l04O07p13j02L25j95N47l52k79N37p9j00L12n82K40J89l28
$$ 329 -516 -68 108 -196 411 -302 -404 -79 -274 273 -79 -358 179 100 0 312 -270 -30 159 -169
4316a69K91q9j55L71n08M63k25l06M11l0k7J71k34Q1L56m16K65l27L7N24m13l1
$$ -169 122 33 -122 249 -259 204 -21 -327 84 54 27 198 -36 45 401 -15 250 -77 -40 484 71 40
4338D0Q7j93K60J25n39L43j64Q6L25p13N70j28l14K01J98k77L49k22k75K50l49
$$ 40 127 -66 194 319 -220 123 -41 45 370 -343 227 99 -215 -14 184 -93 256 34 -241 9 -340
4359c40K57J09p2P9j84k14O08M7j44n49l3K28L16j96J42l94L00J22j06j95N7N7
$$ -340 -83 26 -46 33 -151 -365 243 290 146 -403 -436 -208 108 -88 54 -340 -40 82 -24 -219 -162 -105
4381a05J53J80n52L97K17l14J34l71J13L14k43M50j61j48m5j64PK04m56K66K59
$$ -105 48 228 -324 73 290 -24 110 -261 -148 166 -77 373 212 64 19 -145 -138 66 -390 -124 135
4402A35K1j17j63p9N71k54k52M79m02p6O01n26J4L9j00M90n18l2M40l16j62J96
$$ 135 156 39 -124 -203 368 114 -138 341 -61 -137 464 -62 -48 -9 -109 381 -137 -169 271 -45 -207 -11
4424a1k30M63j85k12J73j06J33R8j96N9M6m77P73m57P9j67j0M42j05j85p1m8m2
$$ -11 -241 222 37 -175 -2 -108 25 123 -73 -14 32 -445 328 -129 -50 -217 -227 215 110 -75 -146 -194 -236
4447b36N53m89J37Q6l14L61M4l92J01r5L59Pk39N1K96n66P23o17K4L93j48n6k55
$$ -236 317 -172 -35 51 -263 98 142 -250 -149 -244 115 122 -117 -66 230 -336 387 -230 -206 187 39 -17 -272
4470b72Q8NK56j11K25j37p1L07m81M3J06O8O6j22J42J80j24N3r2rj86k85K84J54
$$ -272 -184 -179 77 -34 191 54 -17 290 -191 -148 -42 26 92 -30 112 292 168 221 129 120 -66 -351 -67 87
4494H7k45J28j93O0J74k9rJ14J5j96K98j78M8K04j94j35j5M9K03k71m9N7K4j32
$$ 87 -158 -30 -223 -163 11 -18 -27 87 102 -94 204 26 74 278 84 -51 -66 -17 186 -85 -134 -77 -53 -185
4518a85L06r6q3p4L6o6J76l0Q5M5l39J17n4J32pQ7k31o3L20k49J88o5J45j14K75
$$ -185 121 25 -58 -132 -96 -162 14 -16 69 114 -225 -108 -162 -30 -37 50 -181 -244 76 -173 15 -50 95 -19 256
4543B56m19p9K54m0q2J36r0K3J16j35M17L0j92l43O5Q8K23j26Q9L9j90J33j27
$$ 256 -163 -242 12 -28 -110 26 -64 -41 75 -60 357 387 195 -148 -83 5 228 102 191 230 40 173 46
4566D6N0J02j12j95K46j01J80m9n3nP4j61J9p2O1l6ok10N3K80k46J94J69j1m27
$$ 46 96 198 86 -109 137 36 216 167 114 109 183 22 41 -31 30 -6 -12 -222 -169 111 -135 59 228 217 -210
4591b10J70l4J12J5m5k51K26k00K52j22r0J52p4J74k12K58k04N6m8O5j46J32q8
$$ -210 -40 -74 38 53 8 -243 -17 -217 35 -87 -177 -25 -99 75 -137 121 -83 -27 -75 -10 -156 -24 -112
4614a12j86L97j25q7j20L74P1j84MJ68j64n4J6LQ5J72j99J16k97J53J97j45J51
$$ -112 -298 99 -26 -113 -233 141 212 28 32 200 36 -18 -2 1 86 258 59 175 -122 31 228 83 234
4637B34q8l9N6o7j48M3k87M50o8q0N4P1k25O5N8k0J05k53J13j0L6J98l12n6J53
$$ 234 146 107 163 96 -52 -9 -296 154 86 6 60 131 -94 -29 29 9 114 -139 -26 -36 0 198 -114 -170 -17
4662a7q3j12M45l44J60r5j57L45O0l14L81l89j50N19k34J0j04q1L50O9l87K27
$$ -17 -100 -212 233 -111 49 -46 -203 142 202 -112 269 -120 -270 249 15 25 -79 -160 190 259 -128 99
4684I9m49K93M10m03o7K5k48L61k21K66n1j63N12k92j34J26K3K33p5l05J8J5M20
$$ 99 -350 -57 353 -50 -117 -92 -340 21 -200 66 15 -148 364 72 -62 64 87 320 245 -60 -42 -27 393
4707C93r7l80R7j12J44J28q1l04M91j78J85k9m16L82m7m23N32l78R2L09m33K53
$$ 393 296 -84 13 -99 45 173 92 -212 279 101 286 257 -159 223 176 -247 285 -93 -1 308 -125 128
4729A28k34l02O98l69j34K21n55M41J74m42L27k36J34M32m98J28O1j37O78o93
$$ 128 -106 -408 290 -79 -213 8 -547 -106 68 -374 -47 -283 -149 283 -215 -87 -26 -163 515 -178
4749a78L4L7l08O47ln59O84o10J51M67p23M30J29n29O77k56m23P04l28L02l7j057
$$ -178 -144 -107 -415 232 229 -330 354 -256 -105 362 -361 69 198 -331 346 90 -333 371 43 345 308 -749
4771g49R39M5j67L21q70L87O54o60K60k23j50O48m51o1N53r22O40K89q88O97n06
$$ -749 190 235 68 389 -481 -94 560 -100 160 -63 -213 435 -16 -77 476 -446 194 483 -405 292 -214
4792b14OP26r37N92K63q59Q22k63p54J145o43J18M23j297R12K50n78O43q36J29
$$ -214 -208 518 -419 173 436 -423 399 136 -618 527 -116 2 425 -872 40 290 -288 355 -481 -352
4812c52J163j163M08pq84J281l59m35N68q61O72J46p19Q94n14l29J104r25M33
$$ -352 811 -352 56 49 -835 446 87 -348 220 -641 31 177 -542 352 -162 -491 613 -312 121
4831A21%m33R48l90r20R72o81L16N43q73N45j70k90P51n79O5M39n06K15L22q48
$$ 121 121 -312 636 246 -674 298 -383 -67 476 -397 148 -22 -312 439 -140 -75 364 -142 73 395 -453
4852d53P80l70j01M62p16K92P39q37N12l04k02O21k85M9j40n83R05k17m46M43
$$ -453 327 -43 -144 318 -398 -106 633 -204 308 4 -198 423 138 187 47 -536 369 152 -294 149
4872A49k6K63Q7q06K98L09n72P20l39n13N87l29O3L37m26M57j45k01J65k30j91
$$ 149 123 386 473 -333 -35 274 -298 422 83 -430 157 -172 -109 228 -198 259 114 -87 78 -152 -343
4893c43O46o09K61oj7M84n53q2K29k91K33k61j50O21l55L0N87l88k78P7R3L11
$$ -343 303 -306 -45 -51 -68 416 -137 -219 10 -281 -48 -309 -459 162 -193 -163 424 36 -242 -165 -72 239
4915B39k04j54K23j90O4J39j94L34p8J14j71k64J66K5P1J18k92k49N33l5k60M42
$$ 239 35 -119 104 -86 -22 117 -77 257 179 293 122 -142 24 49 120 238 -54 -303 230 195 -65 377
4937C77l10j91L80o4k83P4J21Qk55K52o2j10J35j55K96l62L9K60l8k49J19l7K41
$$ 377 67 -124 256 192 -91 -17 104 112 -143 109 47 -63 72 -83 213 -149 -110 150 112 -137 -18 -55 186
4960A86m6p1o4j58J04m1M9Q9l45M16r0j52j58K41j20L17k23l25K21J38r0K12M9
$$ 186 140 69 5 -153 -49 -90 -41 48 -297 119 29 -123 -281 -40 -160 157 -66 -391 -170 -32 -122 90 139
4983A39M1J4l74R6O5J42j58r3L55k31R2l8j06K8r0J18K80l09J33L7q7j03j39N5
$$ 139 180 194 -180 -84 -19 123 -35 -128 227 -4 88 50 -56 -28 -118 0 280 -29 104 141 54 -49 -188 -133
5007a33L16J81l57m4N1l8j20J25J52l5k47k4L29j86N4R4P3K6k8l21K83k19K3k3
$$ -133 183 364 7 -37 14 -24 -144 -19 133 98 -149 -173 156 -30 24 118 191 217 189 -132 151 -68 -45 -68
5031f8l70O23j53k44K01m0j01K70j37J93k14l44J07K26m3L29k37q0j02K85r1M7
$$ -68 -438 185 32 -212 -11 -51 -152 118 -19 174 -40 -384 -277 -51 -94 235 -2 -82 -184 101 10 57
5053E7j50M9jq1J88r3M1p9j03M09m56J58K32k10K25j36j62L11k77J23P4k64L00
$$ 57 -93 -44 -45 -126 62 -31 10 -69 -172 237 -219 -61 171 -39 186 50 -112 199 -78 45 119 -145 155
5076A55n6P6j46j44J76Ol01L4J68K8j07K28l6p0j55K71j10j97M00k01o6%M3r2
$$ 155 99 175 29 -115 61 67 -234 -200 -32 -4 -111 117 81 11 -144 127 17 -180 220 19 -47 -47 -4 -96
5100i6K71j60j45R7o8J3lmJ65M1q4j27o1K79j00k4o3Q1J81rk65J66k29J3J89k72
$$ -96 175 15 -130 -33 -101 -88 -91 -95 70 111 27 -100 -161 118 18 -6 -69 12 193 184 -81 85 -144 -131 58 -214
5126b14K31k6k24L29L8l52K21j06M4J7r4L07j71j48L10j15j88J41j27L2J72j56
$$ -214 17 -9 -233 96 134 -218 3 -103 -59 -42 -136 171 0 -148 162 47 -141 0 -127 -95 77 -79
5148g9P8K4k53L14J43j23lk43J06K53m23N12l40q9L92l36J26O1K0O8k40n1J13
$$ -79 -1 23 -230 84 227 104 101 -142 -36 217 -206 306 -34 -123 269 -67 59 120 140 208 -32 -83 30
5171C0k22J71K5Q1KK2j6j6k20K57j79R9QK6q8J63j3n60K60k2L43q3k79N15m10
$$ 30 -192 -21 4 85 87 109 93 77 -143 114 -65 34 42 68 -20 143 130 -430 -170 -192 151 68 -211 304 -106
5196a06J01J97m82N59j60j15N6n6Q3J50k57J28J01l99M82l38l0J87j87M8K38k27
$$ -106 -5 192 -290 269 109 -6 50 -6 77 227 -30 98 199 -200 282 -56 -86 101 -86 -38 200 -27
5218b7J02j28l5J43o3L8J63l93K76p6l47O55m12P7M30n68O8L17j66M75l51m96
$$ -27 75 -53 -88 55 -8 30 193 -200 76 0 -347 308 -104 -27 403 -165 -97 220 54 529 178 -318
5240c18L69j70J49K67m96N15k77R2K48p39K90R3k27J52K7k50L55l33K30K67q38
$$ -318 51 -119 30 297 -199 316 39 131 379 -360 -70 23 -204 -52 -25 -275 80 -253 -23 244 -594
5261e94P89q4n45N50l41o5M84l60K0J66l76Q30n67j85N44p02N93J1m84N85q1l41
$$ -594 195 111 -434 116 -225 -290 194 -166 -146 20 -356 474 -93 -278 266 -436 157 168 -316 269 188 -153
5283a53L87o02L33L79n08J72J73n85O96m42K6N73q86O50k15j69M35l38Q5K62m06
$$ -153 234 -368 -35 344 -164 8 181 -404 292 -150 -124 449 -437 213 -2 -171 264 -74 11 273 -133
5304a33L14L7p82O78j97k20N50n05K93K11l61L10r0j09L52k45k50L74m83K98J01
$$ -133 181 218 -564 114 -83 -303 247 -258 35 246 -115 195 105 -4 348 103 -147 227 -256 42 143
5325A43l42L2J05O5R0m76L14K63p03O70j84j5O88r48K41L16q14R33j21n80N63
$$ 143 -199 -167 -62 3 93 -383 -69 194 -509 161 -23 -38 650 -298 -57 259 -555 378 257 -323 240
5346B40l48j11M54n97O37j18m47M14j23j11O05m98K31j53l62M03o7l16L69k34
$$ 240 -108 -219 235 -362 275 157 -290 124 1 -110 495 -3 228 75 -287 116 49 -267 102 -132
5366a32P4K65m10K90k79o9N27k67J01N3m32L20m8j34Q5J79k22M15l60K41k74N0
$$ -132 -58 207 -203 87 -192 -261 266 -1 100 153 -279 41 -7 -141 -56 123 -99 316 -44 197 -77 -27
5388b7l8K32n90N38k19K67j1k89K47J05l06J88k77j04M45k89R3r4j19K89k77L01
$$ -27 -65 167 -423 115 -104 163 152 -137 110 215 -91 97 -180 -284 161 -128 -35 -129 -248 41 -236 65
5410F5P1l00o0K91k07L7r7K10J42l28p0L30l23J45P7j56K76m48M76j2k20J55o6
$$ 65 136 -164 -224 67 -140 -103 -200 10 152 -176 -246 84 -239 -94 -17 -173 103 -345 131 119 -101 54 -12
5433a2j05K73m15L48k9k55J46J93j99K99l30R8K53k92L75k18j58L7P1j0P5j65
$$ -12 -117 156 -259 89 60 -195 -49 144 -55 244 -86 12 265 -27 348 130 -28 9 80 70 145 -20
5455b0K44k49N4J31O6j66k7j37K51j42j10Q2k9M5J36J07k08K9j41J75j7N9Q2k96
$$ -20 224 -25 29 160 226 60 33 -104 147 5 -105 -23 -52 -7 129 236 28 57 -84 91 74 133 215 -81
5479h1Q7J25j45J76l73q7K03K96l35J71j20k7n2lJ29K7j70K69rJ2l2m61L29p0
$$ -81 6 131 -14 162 -211 -298 -95 201 -134 37 -83 -110 -162 -165 -36 -9 -179 90 81 93 61 -400 -71 -141
5503a41J62K8j41J82Q2j71J95k89R6J24k30PJ95k85K92n2k90L50j79J96q8j27
$$ -141 21 49 -92 90 172 1 196 -93 3 127 -103 -96 99 -186 106 54 -236 114 -65 131 43 -84
5525h4J98q0j02K07r9J13K6k13q2R0O5K1m4O0n1Nj09J09j74J65j09j59K54k09
$$ -84 114 34 -68 139 40 153 179 -34 -116 -26 39 60 16 76 25 30 -79 30 -144 21 -88 -247 7 -202
5549b02L09m35M75j55j0j12J97q6R3M3k42O0Nj65L50k58L10R7m66K61mm20M13
$$ -202 107 -328 147 -8 -18 -130 67 -19 74 117 -125 -65 -60 -225 125 -133 177 274 -192 69 65 -355 58
5572E8k06L1J38j84l8K65rJ20k68J8K44j61j5l4o1K47L0j87p4j04M2J50K25j2
$$ 58 -148 -117 21 -163 -201 64 55 175 -93 -75 169 8 -7 -41 -102 145 175 -12 -86 -190 -148 2 227 215
5596B15j87J40J85n50K05L50n58K75k2J60l74L90k56K65j96N4P5j32J78j34l64
$$ 215 28 168 353 -197 8 358 -200 75 53 213 -161 229 -27 238 42 96 171 39 217 83 -281
5617b81L89j60RK39l55J53Rl02L67m40K24K78k06P5J89k90R9l4k06M55m98J65
$$ -281 108 -52 -43 196 -159 -6 3 -299 68 -372 -148 130 -76 -1 188 -102 -3 -37 -243 212 -286 -121
5639a21J52k81M27k67P8K14k54J2J7K17j27n4o9K24m54K03r5P7L39j55j00J97
$$ -121 31 -250 177 -90 -12 202 -52 -40 -23 194 67 13 -56 168 -286 -83 -178 -101 238 83 -17 180
5661A80k62J5O4k45M51J5m73L20j35k5K25l72M76l61K4K53k70P4M24k55k57K05
$$ 180 -82 -67 -3 -248 203 218 -255 65 -70 -95 130 -242 234 -127 -103 150 -120 -46 378 123 -134 71
5683G1m15M91o2J17j77R7J35l27L6K23k96O5l2J3n0K32k14J76K41l15J4l12J5
$$ 71 -344 147 85 202 25 122 257 -70 -34 189 -107 -42 -74 -61 -111 121 -93 83 324 9 23 -289 -274
5706b74L24j35KK2jR0l44N43L7m59J66P7l4P8qk06J92r7j17L52k52K95k77j90
$$ -274 50 -85 -83 -61 -62 28 -316 227 264 -195 -29 48 14 92 84 -122 70 -27 -144 208 -44 251 -26 -216
5730b16N14o07J64O2r6M00q9j37K59l46N3l3J60r8j36K01j4n2l5J85m05L81K1
$$ -216 298 -309 -145 -83 -179 221 132 -5 254 -92 -39 -72 88 -10 -146 55 41 -11 -46 139 -266 115 136
5753A36n52N93k45J61j00p2K37k81RJ41Lj7J03M9l81L33j37j73j36L68q7K70j44
$$ 136 -416 177 -68 93 -7 -79 158 -123 -114 27 30 13 116 165 -216 117 -20 -193 -329 39 -48 222 78
5776G8Rj46r5L86k69K66o10K94rq0L09R8j99j03n9J72n3l16J11O0J13M7j1o9J40
$$ 78 87 -59 -154 232 -37 229 -381 -87 -96 -176 133 231 32 -71 -130 42 -11 -327 -216 -156 -43 4 -7 -76 64
5801F4k73NM56l57K42j55%K01l78J07r4MK19N0M5k49k2oK97j89K74j36r5J81o3
$$ 64 -209 -204 252 -105 137 -18 -18 183 -195 -88 -182 -178 41 91 136 -113 -135 -141 156 -33 241 105 10 191 128
5826A28j25q5M1L51k22K4j41J29l26L19k46J77p0n3L92j67lJ67m84K23J48k36
$$ 128 3 -82 -41 310 88 112 -29 100 -226 93 -153 24 -46 -99 293 126 123 290 -194 29 177 -59
5848e9Q4Kj23J43n7k5O5n8l07J63r9M20j67j03J44Pk04J19n1k20K68M9J01k95
$$ -59 25 27 -96 47 -10 -35 30 -28 -335 -172 -271 149 -18 -121 23 30 -174 -55 -106 -326 -58 -9 92 -203
5872b03J30J0P8J53j75L1l8K0j01j9J18p5J38j33j21J72P4k62K70j26P8j6m5k8
$$ -203 -73 -63 15 168 -7 24 -14 6 -95 -114 4 -71 67 -66 -187 -15 59 -203 67 -59 19 3 -42 -70
5896g0OK52j28oJ05k27O5J6k69K98j28J00oK7j12R3ol16K90J84j98K49k88K19
$$ -70 -64 188 60 54 159 -68 -3 13 -256 42 -86 14 8 35 -77 16 10 -306 -16 168 -30 219 -69 150
5920A50l0q8r7J76p5j81J59j82J57J55K2J10m29P6J44l24L17k14K49r4p1L0m7
$$ 150 120 32 -65 111 36 -145 14 -168 -11 144 166 276 -153 -77 67 -257 60 -154 95 1 -70 -40 -87
5943h7j17o6M5LK82l22K40k84K00K5K1L45k65jj12L37lm65J46J99r3P0P4q4m6
$$ -87 -204 -270 -225 -222 60 -262 -22 -306 -106 -81 -60 285 20 19 -93 244 241 -224 -78 121 28 98 172 88 42
5968D2oJ59j76N0J40k21rJ07o0l7J14o0L3m4p8K28K6j59j49R2p6%K31j7p1r9k8
$$ 42 36 195 19 69 209 -12 -21 86 26 -11 103 43 76 32 -46 182 208 49 -100 -8 -84 -84 147 130 59 -40 -68
5995f8J70j7k49l0QJ71j40j1r6K95J17l65J89j21r6L04k03m9K42j27K0J55j32
$$ -68 102 85 -164 -194 -186 -15 -155 -166 -262 33 150 -215 -26 -147 -243 61 -142 -191 51 -76 -56 99 -33
6018c3p0J94l01j63L27J98k96P7J44k5R0j86K02j70j34R3L09l60j20M35k54r1
$$ -33 -103 91 -210 -373 -46 152 -144 -67 77 52 142 -44 158 -12 -146 -53 256 -104 -224 211 -43 -134
6040a34K36P6Mj25N9j4j95P6j3J94l26P2J49Rj8P7k30oK12L9K6J40k41N1j42o7
$$ -134 102 178 182 57 116 102 -93 -17 -30 164 -162 -90 59 68 50 127 -103 -109 103 142 168 308 67 118 -24 -91
6066i1m2J57k9j38M0L04j4l32K8K03j85L25m41K16R0j81J6p5N2o6J29m3L5j1J41
$$ -91 -133 24 -5 -143 -103 201 187 -145 -117 86 -99 226 -215 1 91 -90 -74 -149 -97 -163 -34 -77 -42 -53 88
6091H8k78K3K38M8j56j99K74Qj50N6n1J7J29j36K05j09P9o9j02P7k37N3L68r2
$$ 88 -190 -167 71 119 -37 -236 38 46 -104 -48 -99 -82 47 -89 116 7 86 17 -85 -8 -245 -192 176 84
6115H4n0RO9k5q2j27K01n9l3L05l08O8R4j64k3pO0M5k74K31Ok54M87l05J41j97
$$ 84 34 43 112 87 5 -122 79 20 -13 292 -16 52 146 -18 -41 -48 12 57 -217 14 20 -234 253 -52 89 -108
6141a08J02k37L92j24k47J00K66j21o6n3O6j2j44J12j12L30l73K86j14P3m3m7
$$ -108 -6 -243 149 25 -222 -122 144 23 -43 -96 -30 -42 -186 -74 -186 144 -229 57 -57 16 -27 -74
6163g4r2K63k30L5r0J97j33j07L27J16k83j59J76J08J73k22J56j47J34L4k19L52
$$ -74 -166 97 -133 -98 -188 9 -124 -231 96 212 -71 -230 -54 54 227 5 161 14 148 182 -37 315
6185C15k01N8n3k41K81k40J97Kk13K72N6m62J96J62k71K83J5K0P7k35K20m25J35
$$ 315 114 172 119 -122 159 -81 116 118 -95 177 233 -229 -33 129 -142 141 156 176 253 18 238 -187 -52
6208e2P3K6L7L3m7mJ1k61K11j92K59J03l64K92k48M6M0p1m87O03j40n2K38m7J12
$$ -52 21 47 84 117 70 66 77 -184 27 -165 94 197 -167 125 -123 -77 -37 -108 -595 8 -132 -184 54 7 119
6233A19l78J77J57o0n7Q9k35J73J38j52J52k0j48o9J52j21l0j1J34j18j21K74
$$ 119 -259 -82 75 15 -42 47 -188 -15 123 -29 123 103 -45 -114 38 -83 -113 -124 10 -108 -229 45
6255D5k49N29l12o3L90n86J50L27m14J97K59o19N95r5j73N3j69J17k1q9K87j19
$$ 45 -204 325 13 -50 340 -246 -96 231 -183 14 273 -346 249 154 -19 34 -135 -18 -39 -128 159 40
6277D0j60K69l09J49L4K8J53o2k14PJ94N3k19n9O1K04k32J87l1k12J95l31P7M41
$$ 40 -120 149 -160 -11 23 51 204 142 -72 -65 129 182 -37 -96 -35 169 -63 124 93 -119 76 -255 -178 263
6301B63l98J46k7n4O9k78M21L9l36n9K55R0N9m79L68K0j77j1J81j90J34k9M5J48
$$ 263 -135 11 -16 -70 -1 -279 142 181 -155 -214 41 131 190 -289 79 99 -78 -89 92 -98 36 7 52 200
6325B00k71N6P9j85K34j27qJ28k25M03qk80o6Q2m8K05k29p1O08k79j12j3l7j0
$$ 200 -71 -15 64 -121 113 -14 -22 106 -119 284 276 -4 -70 12 -36 169 -60 -131 477 198 86 73 36 26
6349B6L6k38L35P3o7j26q6J63J57k12N1j15J50J02l74L10j03j28L7l1K59k55J50
$$ 26 62 -176 159 232 165 39 -47 116 273 61 112 -3 147 249 -125 185 82 -46 -9 -40 219 -36 114
6372A14k20J62J66k6j92M2LJ65k58m1R3j01J7R0J43k29K17l17o2L39l43M3L54
$$ 114 -106 56 222 196 4 46 49 214 -44 -85 8 -93 -76 14 157 -72 145 -172 -234 105 -238 -195 159
6395A59o2o1K2q1j28K82l64J06N6J67j70j0Q9O9J80l34K82k3J5k34J12n8J6K3
$$ 159 97 36 58 -23 -151 131 -233 -127 -71 96 -74 -84 5 74 254 -80 202 179 194 -40 72 14 30 53
6419E3N4r6j18L65rk51N0j44j03o6J92j40J39p9J79j67k0M12j63q1J6k60L83m0
$$ 53 107 11 -107 258 249 -2 48 -96 -199 -265 -73 -213 -74 -153 26 -141 -161 251 88 7 23 -237 146 106
6443A06l45J74K11k03N3j12K13m00L58j06J04J5N1q8p9K44l89Q7J19j43o8O4n0
$$ 106 -239 -65 146 -57 -4 -116 97 -303 55 -51 53 68 119 31 -48 196 -193 -106 13 -130 -198 -134 -184
6466a84J55l6K9J46n32K19l2K72J05k18j31K08J3J38j84J85m56L58M9l04P2Q0
$$ -184 -29 -65 -36 110 -422 -203 -235 37 142 -76 -207 1 14 152 -32 153 -303 55 104 -200 -128 -48
6488d8J71j32L8j9Ll1J51l8N2m7k26J84j49j57L74k76J92qRk0j22j6O1k18M05
$$ -48 123 -9 29 10 13 -18 133 95 147 100 -126 58 -91 -248 126 -150 42 34 43 23 -99 -115 -54 -272 133
6513A33n8j64K05j59K6MM1J7ok16J24O3j16J65k64J70j88J66o1J58j9l5J34j06
$$ 133 75 -89 116 -43 -17 -13 28 45 39 -177 -53 10 -106 59 -205 -35 -223 -57 -118 40 21 -14 120 14
6537A4o5k79K45Q7L8q7k95K28K3N4Ll5Q3K12m37K24k56J68J40j41k74N89k38P1
$$ 14 -51 -330 -85 2 40 -47 -342 -114 -91 -37 -34 -69 14 226 -211 13 -243 -75 65 -76 -350 239 1 72
6561G2n3p1J73J21j19j5k00J9Q9j9R7k87m8M23n7k68J51R5L7k67K51l13L16j90
$$ 72 19 -52 121 242 123 108 -92 -73 16 -3 94 -193 -241 182 125 -143 8 103 140 -127 124 -189 127 -63
6585f3J7j21J36n9O6lP7l10J51J0j7J81k46L49k14j53K68L1j67Kj96K44LM6Q4
$$ -63 -46 -167 -31 -90 -24 -27 50 -260 -109 -99 -116 65 -181 168 -46 -199 69 100 -67 -65 -261 -17 -14 32 116
6610A16l29O9L00K43l90K2Q0k45M09k85m5J50q0M5L8j52P9K9j89K76k81L02k19
$$ 116 -213 -144 156 399 9 31 111 -134 275 -10 -55 95 15 60 98 -54 25 54 -135 141 -140 162 -57
6633e7k18K96J98l28L23j25l6K10n73L34R6J7k20l2k8J99p5N7M0P8R3k80l49N01
$$ -57 -275 21 219 -109 214 89 53 263 -310 24 120 137 -83 -115 -143 56 -19 38 78 156 249 -31 -380 121
6657A21j32K8J64j59j36JJo9P2J04j9q2K59l75M8q3N05p1k86K34L9m61K21L33
$$ 121 -11 17 181 22 -114 -113 -112 -181 -109 -5 -24 -106 153 -222 -174 -257 248 177 -109 125 164 -297 -76 257
6681B57k98k09J97n7N7o8M7j8j2k7J82r0J31K5r8j38O8J08n2k8r8%K19L9q7j11
$$ 257 -41 -250 -53 -110 -53 -121 -74 -92 -104 -131 51 -39 92 117 19 -119 -51 57 5 -23 -121 -121 98 137 50 -61
6707f1J79Kk6L7J85k82j3m9Q1j18L04j71j58j26K75J07k04J28j73J75k22K48n2
$$ -61 118 120 94 131 316 34 21 -28 53 -65 239 68 -90 -216 59 166 -38 90 -83 92 -130 118 66
6730F6j09L10k10j67k4n2L10j54J7pL1J16j45j13K53k51k9J33J21j74j51P8M18
$$ 66 -43 267 57 -110 -134 -186 124 -30 -13 -20 11 127 -18 -131 122 -129 -158 -25 96 -78 -229 -151 267
6753B67n32oN41k41m7l0j84J30QJ38j50J69o6P9j49J22o3k36K42m7mL2oO1J21
$$ 267 -265 -271 270 29 -18 -48 -232 -102 -94 44 -106 63 -3 76 -73 49 -14 -250 -8 -55 -59 -27 -33 28 149
6778A49l10L09q8j13K94j50q5J12r2K2l19J97Q5r0K9o5K67J37l77o7L03j13j60
$$ 149 -161 148 60 -53 241 91 6 118 26 48 -271 -74 11 -79 -50 -115 152 289 -88 -155 148 35 -125
6801a25O36m54k71M25r8m3k85K78p6j0R2m09J65J64j47O0K20o1j09K58l40M5L11
$$ -125 511 57 -214 211 113 70 -215 63 -13 -23 69 -340 -175 -11 -158 -98 122 61 -48 210 -130 -85 226
6824B26l00J32m7J92k47j37K05n5j3K07l60J73O2j92K79R8l88J94k72M14j89q9
$$ 226 -74 58 11 203 -44 -181 24 -31 -44 163 -197 -24 38 -154 125 223 -165 29 -243 171 -18 -107
6846a07L71k46L1L61m44Q1l9M2Pk4j71J10L9q6q5mL74q1l7j39J42j58L04l4k73
$$ -107 264 18 49 410 -34 47 8 50 57 33 -138 -28 11 -75 -160 -164 210 129 92 -47 95 -63 241 207 -66
6871f6J83j83J20Kj67K45k93%K69k19K42J13l04J45j10k00M15n45M09l3J01j69
$$ -66 117 -66 54 56 -111 134 -159 -159 110 -109 133 246 -58 87 -23 -223 192 -353 56 23 124 -45
6893d5K03l57L22jj82J58j25Q5j01k49L34N3j32R4k1K5J35j68o2J11k10K96m42
$$ -45 158 -199 123 122 -60 98 -27 58 -43 -292 42 95 -37 57 36 61 196 28 -34 77 -133 163 -279
6916b79L70k07J4J40j90K05r6r8J36K37k76K8j96K35j41K60j2j66jq7O0J78k67
$$ -279 91 -116 -102 38 -152 53 -43 -141 -5 232 -44 -16 -212 23 -118 142 130 -36 -37 -124 -64 114 -153
6939a53M24m64l8K31Q1m1R2j77Q7p3K16l08J61j71J43k6k31K21k0j54N6K3m9K41
$$ -153 271 -193 -231 0 81 40 132 -45 42 -31 185 -123 38 -133 10 -16 -247 -26 -46 -200 -144 -121 -170 71
6963G1j6j71j12N00k59j25L35k41j16J28j51L68l03JN0k25J77J85j99J76K5o6
$$ 71 55 -116 -228 272 13 -112 223 -18 -134 -6 -157 211 -92 -91 -41 -266 -89 96 -103 73 98 32
6985C2K03l82OJ83k89J95M4j02O8M3K80j90lk28K73j57R3j76J45m0r1J01P3JK3
$$ 32 235 -147 -141 42 -247 -52 -8 -110 -42 1 281 91 88 -140 133 -24 69 -107 38 -2 -93 8 81 82 105
7010A05j10O8JQ3j3K6j85J76k4N3k66L0q9M4j6Q6M1k20K04m4J60m22L97k10J2
$$ 105 -5 63 64 147 134 160 -25 151 127 180 -86 -56 -145 -101 -117 -31 10 -210 -6 -50 110 -312 85 -125 -113
7035a13P5J0K7J29k71L66j93j09J09JL6P6l66L91o2Jp5n3p4q3K72K7p5q9J38K6
$$ -113 -38 -28 -1 128 -143 223 30 -79 30 31 67 143 -223 168 106 107 32 -21 -95 -178 94 121 46 -43 95 121
7061A21l11j19K72j18L7J63k00J79K0k7k0J9kj44O03o73K92J72j37j77j33J87
$$ 121 -190 -309 -37 -155 -118 45 -155 24 44 17 -3 16 14 -130 473 -200 92 264 127 -50 -183 4
7083DN1j37J93N2j1Q9j82j39n0j9O9L37j49Q8k04j25K29n0j32K20J42k95K60k56
$$ 4 55 -82 111 163 152 241 59 -80 -130 -149 -80 257 108 196 -8 -133 96 46 -86 134 276 -19 241 -15
7107a5N1j09k28M23j94r8K17j55J20ok60J16j33K05M8J70k2l8o0k5l3j53J22o0
$$ -15 36 -73 -301 122 -72 -170 47 -108 12 6 -254 -138 -271 -66 -18 152 130 92 32 7 -26 -179 -57 -117
7131a17J69j34J31q4j00l1M66m95K64ok96K23j61Q7K00j61j28K42r8L6O5l00L35
$$ -117 52 -82 49 -35 -135 -166 300 -195 69 63 -233 -10 -171 -84 116 -45 -173 69 -29 7 72 -228 107
7154A07j47O5n8k22M78m29L34j74R0j6J03J6j41L16n47L6K61j36K03M9q1p4lq9
$$ 107 -40 25 -33 -255 223 -206 128 -46 44 28 131 147 6 322 -225 -189 72 -64 139 188 107 33 30 -59
7178e9k2n4J27j16J08K7j30L73j74J72k12r0K16q7j65r9K70Kj40j04p1j4K82n7
$$ -59 -81 -135 -8 -124 -16 11 -119 254 80 252 40 -50 166 79 -86 -185 85 87 -53 -157 -228 -242 40 -17
7202a7J32m2j3j67NO9j71K03n6j50J54n0K05J05k06ok64N4K21rj72L66k22L25
$$ -17 115 73 60 -107 -102 -33 -204 -1 -57 -207 -53 -103 102 207 1 -5 -269 -215 6 -3 -175 191 -31 294
7226B94l88K24K6j09j51K26l19J80J67j86nJ6R6J20m04M34kl71J34J21J39k75
$$ 294 -94 130 156 47 -104 122 -197 -17 150 -36 -41 -25 71 191 -213 221 219 -152 -18 103 242 -33
7248c3J50j69J08p2L0o2p7K36j86J40K7l8j4k73Q2J47j7l90L00J03k0J75j16j35
$$ -33 117 -52 56 -16 14 -48 -125 111 -75 65 92 54 40 -233 -151 -4 -21 -411 -111 -8 -28 147 31 -104
7272a04J96j36N6l24L3J35p2K6L65m08J01J1L01o1j28q2N0N5j3k43J11P1j98k2
$$ -104 92 -44 12 -312 -279 -144 -216 -190 175 -233 -132 -121 180 119 -9 -91 -41 14 1 -242 -131 -60 -258 -280
7296b80L79r9J96q8j62J93m6l11K71Kj47K38k42K17j27PJ78j82O8J32k92J97k93
$$ -280 99 0 196 108 -54 139 93 -218 53 55 -92 146 -96 121 -6 1 179 -3 65 197 -95 102 -191
7319a91J86j17J49K68l04j02L5o2Q6r3K68k25K69k26O5Q1l02L38j1j60Q0k30Q5
$$ -191 -5 -122 27 295 -9 -111 -76 -138 -52 -145 123 -102 167 -59 6 87 -215 123 112 -48 32 -198 -113
7342a13J50K9j7K0j92k40L26k67O8J33N1N0l9K1J70k46J07j32nK04rn4J57n4j34
$$ -113 37 66 49 69 -123 -363 -37 -304 -236 -103 -52 -2 -41 -20 150 -96 11 -121 -126 78 69 15 172 118 -16
7367a6K47j97J77j60k3K53k66J38l38K44o7J07j41r9l2J92j5q2j19M2J92J8PJ7
$$ -16 231 34 211 51 28 281 15 153 -185 59 -8 99 -42 -141 -173 19 4 -78 -197 -155 37 55 62 79
7391G9Jr0J05n4K2l7Kj00k2J66K88k00j48m2k39M22j04O2j70J69k10N6oj54N1
$$ 79 80 -10 95 41 63 26 28 -72 -94 72 360 160 12 -30 -269 153 49 111 -59 110 -100 -44 -50 -204 -153
7416a53K52j8k22K07o7R6m31K51K9j44J11J14k45R5k59M56l17jL56k11J70P4k2
$$ -153 99 81 -141 66 -1 95 -336 -85 -56 -200 -89 25 -220 -125 -384 72 -245 -246 110 -101 69 143 121
7439A21k14j3K07j61m6K67m7l5J32j42r0n0J34r9O5j1N7k06K63Qk77L50l67K57
$$ 121 -93 -106 101 -60 -106 161 114 79 211 69 -21 -71 63 -36 29 18 75 -131 132 140 -137 213 -154 103
7463A03j85m5K59J76j87j50J34j4j98j29J31J67J2j2k09J57N9j29O3n8p8J27J28
$$ 103 -82 -127 132 308 121 -29 105 91 -107 -236 -105 62 74 62 -147 10 69 -60 3 -55 -133 -6 122
7486A22K8k00K2l1J90k42q9K75j01j28O2p0L39j87j14K54J2j11k8K8j84O9O4M0
$$ 122 150 -50 -28 -59 131 -111 -200 75 -26 -154 -92 -162 177 -10 -124 130 142 31 3 31 -153 -84 -20 20
7510B0K0pL0k2L7J29k29m6J03LM1J6j93P1k69J69K84p6K09j94j48J77p5J17j39
$$ 20 40 33 63 41 78 207 -22 -68 35 38 79 95 -98 -27 -296 -127 157 81 290 96 -52 125 50 167 28
7535B8k5L0KK11M8k24k0P0k56J06r4J24K80k45K3j83K43M3j25j77K22k07J17J03
$$ 28 3 33 35 246 294 70 50 120 -136 -30 -124 0 280 35 58 -125 118 161 36 -141 81 -126 -9 94
7559I4Q0r9l6l1k24J91j7j13jK47j20j4O1l10J97l1j66J53O6p5K72m4M4m6j24
$$ 94 174 75 39 8 -216 -25 -42 -155 -156 91 -29 -43 18 -292 -95 -126 -292 -139 -73 -148 124 80 124 78 -46
7584d6Q8J67j41O7k37J02k7p6J48k37J36J69k03R1P8q1K44k00j8j53L54l73R3
$$ -46 42 209 68 135 -102 0 -27 -103 45 -192 -56 113 -90 1 79 -2 242 42 24 -129 225 -148 -55
7607e5j0J01Q0j88J59l6j32K21j73m9J5k46K47J10p2L4n1L2J2q4l4J34J46j45
$$ -55 -65 36 116 -72 87 51 -81 140 -33 -82 -67 -313 -66 44 -28 6 -45 -13 -1 -85 -119 15 161 16
7631A6k2k02J91P3o6r8K8M53j81j73k71K59K8N5j43j42J18P4K5j24P3J55o3j17
$$ 16 -6 -208 -17 56 -10 -108 -80 373 192 19 -252 7 35 90 -53 -195 -77 -3 22 -102 -29 126 63 -54
7655e4k09K68m3J6k53N91n22K37j17J42J45k43J82l44m6P46m02o7J05q1n6k0M5
$$ -54 -263 5 -38 -22 -275 316 -206 31 -86 56 201 -42 140 -204 -250 496 94 27 132 51 -5 -25 20
7678B0K21l16J29o7L5K79l17OK0l4K37m21L76l08j16K94K38k94K05m34m1J77J84
$$ 20 241 -75 54 -13 22 301 -16 -10 10 -24 213 -208 168 -140 -256 38 276 -18 187 -247 -288 -111 73
7701G3j85k32J69K66j4M5j57L9LJ19j22j40Q9J44Qr4J00R6k53j6L83m68K54q2
$$ 73 -112 -344 -175 91 77 122 -35 4 7 126 4 -136 -47 97 105 11 111 207 -46 -62 321 -147 107 25
7725B5j15q2K38M9L2j16J34r1l03J42J66k28J63l8J73n6l31K56J73m3N2l5k12
$$ 25 -90 -172 66 115 147 31 165 74 -229 -87 79 -149 14 -24 149 93 -238 18 191 148 200 165 -47
7748d7k5Q5J47m6k62J50k8j7J18q6p8jO1j08M18l85J37q4R2q0j30K14K50l59J01
$$ -47 -72 13 160 114 -148 2 -26 -43 75 -11 -89 -90 -29 -137 281 -104 33 -51 41 -39 -169 45 295 -64 37
7773C7j53M05j56P0l92K98kk23J14j46r0R6r7J58k8J72J25l38K27k08K2J37j43
$$ 37 -116 289 133 203 -189 109 107 -116 -2 -148 -238 -142 -239 -81 -109 63 188 -150 77 -131 -109 28 -115
7796a15J1o8J53J65k73J00J83k40R3j9j89J64r4j64K43Q4j34J98m28M57r5j95
$$ -115 -104 -172 -19 146 -127 -27 156 -84 9 -10 -199 -35 -129 -293 -50 34 -100 98 -330 127 32 -163
7818a63M92n91K22J80k13K79j69q6J36P5j57K49j64k49L63l05M8J47k70K51R3
$$ -163 329 -262 -40 140 -73 206 37 -49 87 162 5 254 90 -159 204 -101 -53 94 -176 75 168
7839A68l55M42n07J64RqK23K24m59J87p9N6J01k22J26j21N3J3l0k09K64m9k1K88
$$ 168 -187 255 -252 -88 -79 -87 136 360 -99 88 9 65 166 -56 70 -51 2 15 -15 -224 40 -9 -30 258
7863B58k26n4J64l32O2O0r7o4K13J86l32J90l6n4J60q7J42j29l5J03k3j60K02
$$ 258 32 -22 142 -190 -128 -68 -165 -229 -16 170 -162 28 -8 -62 98 11 153 24 -11 92 69 -91 111
7886A11j59M3J98n7k27J95j57L29k47J4q9n5J38j12Jj4J56pj05M7k62K65j66O2
$$ 111 -48 -5 193 136 -91 104 -53 276 29 43 -46 -101 37 -75 -74 -88 68 61 -44 3 -259 6 -160 -98
7910i8P9M1l5N4J45p9n9k34K66j54L0J72k76P8J2mJ82k06R1j7m1n2J8J65J7k47
$$ -98 -19 22 -13 41 186 107 48 -186 80 -74 -44 128 -148 -70 -58 -62 120 -86 5 -12 -53 -105 -87 78 95 -152
7936a52J65Nj05O8pj76N11k35r8K31l20j12K30o6L8j64P6J96R9j15O4k38P1n9
$$ -152 13 18 -87 -19 -26 -202 309 74 -24 207 -113 -225 5 -61 -23 -187 -111 85 184 69 133 -105 -34 -93
7960i3j9J3L66j59j82L17m52m2L68j16j53J59K1j45K51R2k02J32q9J08k61j18
$$ -93 -112 -99 267 108 -74 243 -209 -251 117 1 -152 7 28 -117 134 226 24 156 67 175 -86 -204
7982b04M26l20J83n2n4p8J20j9j63p1J38O0k01M36l89K01J2Rr2R5J21r6o3j51
$$ -204 222 -98 85 33 -21 -99 21 2 -161 -232 -94 -34 -235 201 -188 13 25 34 -58 37 158 62 -1 -152
8006a52L31j13l34R5K45K40q5j39k61K17Q5j0k63j8L20K0j11J18j85m0J90k43
$$ -152 179 66 -268 -173 72 312 227 88 -173 44 129 119 -144 -162 158 178 67 185 0 -40 150 -93
8028i3j31O2J93k73K11M2O8P8k42J14J4L6L3j07q6J69O4k13j02K37M8n1k22M1
$$ -93 -224 -162 31 -242 -31 11 79 157 -85 29 43 79 112 5 -81 88 152 -61 -163 74 122 71 -151 -110
8052a10L01j90J14K08k72j30J35k7q4K35k54J49L6j29J3j33K06j48J86l57M00
$$ -110 191 1 115 323 51 -79 56 29 -55 180 -74 75 111 -18 -5 -138 68 -80 106 -251 149
8073A49o4J3k2O7p0j79J50L9M1l95L80J19l22L22k07N0k2l3p1J88N7j37M4m9j86
$$ 149 85 98 76 143 73 -106 44 83 124 -271 109 228 -94 228 21 71 49 16 -55 133 190 53 97 48 -138
8098a38K99j15j7r7J06N5q9M4K5k51N6N02m54J54Q8m1k20K55k64p7L13j40j95
$$ -138 161 46 29 -68 38 93 4 48 73 -178 -122 380 -74 80 168 127 -93 162 -102 -179 134 -6 -201
8121b01J47l31O55j11k2j41Q2q2P2k42J29K3r1L7j27J45J14l1j97j05N71p5j17
$$ -201 -54 -385 270 159 137 -4 78 -4 68 -174 -45 -22 -113 -76 -203 -58 56 25 -172 -277 294 219 102
8144A02j8o5K21j80K2Kj24L05k03k2j52PJ17j48J97j54J42J15k44J53J09R2k98
$$ 102 84 19 240 60 82 84 -40 265 62 40 -112 -105 12 -136 61 -93 49 164 -80 73 182 274 -24
8167b4L80n19J90Ok42P8p7J96n7R2O0Q9J22k11Mj90K25O0k73L8j5J30JJ31
$$ -24 356 -163 27 33 -209 -131 -208 -12 -69 23 83 172 294 83 87 -103 122 182 -91 -53 -68 62 63 194
8191A94
$$ Imaginary data points
##PAGE= N=2
##DATA TABLE= (X++(I..I)), XYDATA
0@%%%%%%qJ6j6K4l2L2m0N6q0J04j28J60j92K28k75L27l88M60n42O34p32Q46r76
$$ 0 0 0 0 0 0 0 -8 8 -8 16 -16 16 -24 32 -48 56 -72 88 -104 124 -151 176 -212 248 -294 340 -392 454 -522
29e22J120j282J463j662J882k121K387k684L007l361L750m174M635n139N688o290
$$ -522 598 -684 779 -883 999 -1122 1265 -1419 1588 -1773 1977 -2197 2438 -2701 2987 -3303
45c303O948p668Q455r312J0255j1294J2440j3711J5125j6707J8490k0516K2838
$$ -3303 3645 -4023 4432 -4880 5375 -5919 6521 -7190 7935 -8772 9718 -10798 12040
58A2040k5530K8697l2486L7110m2897N0370o0420P4706r6666J34834k18691O88245
$$ 12040 -13490 15207 -17279 19831 -23066 27304 -33116 41590 -55076 79758 -138933 549312
70E49312j64755j103240R81378p53475Q38037K95449j373506Q09677k3258k25002
$$ 549312 384557 -718683 262695 -490780 347257 642706 -730800 78877 55619 -169383
80a69383Q66196j274481L78086P85045j033440P23610j76607o47495J070243o69992
$$ -169383 696813 -577668 -199582 585463 -447977 275633 99026 -548469 521774 -148218
90a48218J5039N62115r43664O49630P0123n52024Q96824q35277j48946R73441
$$ -148218 -133179 428936 -514728 134902 205025 -346999 549825 -285452 -434398 539043
100E39043p40324L50567p039p98605J031139j77695m00939M50310p33053N70739
$$ 539043 -201281 149286 142247 -656358 374781 197086 -203853 246457 -486596 84143
110H4143M06743r05983N52157j84944k36375Q08929p11572l3283M60471n13149
$$ 84143 490886 -415097 137060 -47884 -284259 524670 -186902 -220185 240286 -272863
120b72863N28403j61267m68170O32854l83707R4079L70010p19046M05273J57268
$$ -272863 255540 94273 -373897 258957 -124750 -30671 339339 -379707 25566 182834
130A82834l92942M91666m07345j05441N19021m20865K15182J3342m25858N52715
$$ 182834 -210108 281558 -125787 -231228 287793 -133072 82110 95452 -330406 222309
140B22309j73582j92789L66946m36656J94213K31456m01310L26211j32943j90566
$$ 222309 48727 -144062 222884 -213772 -19559 211897 -189413 136798 3855 -186711
150a86711L90896k86726P9490J43206l67510L35314j5785k30033K71080k49974
$$ -186711 204185 -82541 -3051 140155 -227355 107959 92174 -137859 133221 -116753
160a16753R0436K32577l52397J48165J3317r9266K93128k82279o2164K43219j77567
$$ -116753 -26317 206260 -146137 2028 15345 -83921 209207 -73072 -135236 107983 -69584
171f9584J67387n3075k28174K73408q4833l2876J27562k29965J50707N3721j78076
$$ -69584 97803 44728 -183446 89962 5129 -27747 99815 -130150 20557 74278 -103798
182a03798J84827j03407l9684J58706j76333Q9223M4856j50057J60619o7612m7434
$$ -103798 81029 -22378 -62062 96644 -79689 9534 54390 -95667 64952 -2660 -50094
193e0094J22947j52168Q0521P0783j35555R9923o2147k5899J45212j25384J1879
$$ -50094 72853 -79315 1206 71989 -63566 36357 -25790 -51689 93523 -31861 -19982
204a9982M5714q7312J20856m2710p4671J00670p2033L5255M1782j05920Q1933
$$ -19982 25732 -61580 59276 16566 -58105 42565 -29468 5787 47569 -58351 23582
215B3582j0470m5285Q4810q1333J3173N9949q1512O0298n470n6486P3051m4755
$$ 23582 13112 -32173 52637 -28696 -15523 44426 -37086 23212 17742 -38744 34307 -10448
227a0448N315M1239p1976N0722K284m6997O4635m3454j0627N2859n1084K1082
$$ -10448 -5133 36106 -35870 14852 17136 -29861 34774 -8680 -19307 33552 -17532 3550
239C550O762l2834M7711k9314r644L4157m3688K9126J4440m4676L2294q417j2400
$$ 3550 10312 -22522 25189 -4125 -13769 20388 -23300 5826 20266 -24410 7884 -533 -12933
252a2933K9337k6034P808O319k2469K9412j1814j2459K4858k5480P330J8504k3670
$$ -12933 16404 -9630 -1822 4497 -17972 11440 -374 -12833 12025 -13455 -6125 12379 -11291
265a1291J1110M18q731J3051j0087N322L823j4923J5733m027q803J7540j0951
$$ -11291 -181 237 -8494 4557 -5530 -208 3615 -11308 4425 398 -8405 9135 -1816
278a816n297R850m362M049m29l000J994o514Q654M377j0469N780j473n674Q999
$$ -1816 -7113 2737 -1625 2424 1995 -1005 989 -5525 3129 7506 -2963 2817 1344 -4330 4669
293D669L00k245j159l609M239m38J574L631q517N14L604j957M799j312m960Q31
$$ 4669 4969 2724 1565 -2044 2195 1757 3331 6962 -1555 -1041 2563 606 5405 4093 -867 -36
309c6j445M049K546n584J602j577k956N766k86j165j001l028L122l73j309M115
$$ -36 -1481 2568 5114 -470 1132 -445 -3401 2365 2079 914 -87 -3115 7 -366 -1675 2440
325B440n638j140P080n826r5L898l797J789n09n17K082n419M721K613o840O063
$$ 2440 -3198 -4338 2742 -3084 -3179 719 -3078 -1289 -1798 -2315 -233 -5652 -931 1682 -5158 905
341I05j170p069O971J06N89K411q732K309J582J480R303j1103m150O429l776Q189
$$ 905 -265 -7334 -363 -257 332 2743 -5989 -3680 -2098 -618 8685 -2418 -6568 -139 -3915 4274
357D274J821p642K054p268N060J0764p594M715p740j0720K0710k708m726P560
$$ 4274 6095 -1547 507 -6761 -1701 9063 1469 6184 -1556 -12276 8434 5726 1000 8560
371H560j4992O751K676q403J8856q614p583P261k0977K0940J7882k5888N176j1375
$$ 8560 -6432 319 2995 -5408 13448 4834 -2749 4512 -16465 4475 22357 -3531 1645 -9730
385i730l7K9301j8886L140j146k4397L3376o731j2940K8145l3924L392K2529k5016
$$ -9730 -9767 19534 648 3788 2642 -21755 11621 4890 -8050 20095 -13829 -10437 12092 -12924
399a2924K7325j2961k0882L7489l3071Q277K7722m3195L4145n289l9651N0253
$$ -12924 14401 1440 -19442 18047 -15024 -6747 20975 -22220 11925 6636 -33015 17238
411A7238j8954k743K4999n3017L3083J2227l2590M8426m2192j2279N3619m8875
$$ 17238 -1716 -4459 20540 -32477 606 12833 -19757 28669 -13523 -25802 27817 -21058
423b1058K9928J2773o0454N2098j1163j2006M2693o5923K7456L4666n3863M8722
$$ -21058 8870 21643 -38811 13287 2124 -9882 32811 -33112 -5656 29010 -24853 23869
435B3869k9402k6336P5949n5433k609L5131m6579N3838k0586m7106O9482l3843
$$ 23869 -5533 -31869 44080 -11353 -13962 21169 -25410 28428 7842 -39264 30218 -3625
447c625K704K7473o8164N4868J2659n1672N1194l6254k401M5096o1553L9199K0842
$$ -3625 -921 26552 -41612 13256 25915 -25757 25437 -10817 -13218 31878 -29675 9524 30366
460C0366n9888L9921j9814q53N5602o3756N82K8290k6625M4906k7642l2605N4810
$$ 30366 -29522 10399 -9415 -10268 45334 -18422 -17840 10450 -16175 28731 1089 -31516 23294
473B3294k9850j837K1308l2471L5031p483l4715L4211j2480Q090J3540m1100K6472
$$ 23294 -6556 -8393 12915 -19556 15475 7992 -26723 7488 -4992 3098 16638 -24462 2010
486B010L298k5556L7078j2391j2610J0879k7522K8411K2113k9464l984j3402J9442
$$ 2010 5308 -20248 16830 4439 -8171 2708 -24814 3597 25710 -3754 -7738 -21140 -1698
499a698L3049l6072j2586J6465K143J0489j3894j0150J5279P395n206j9363R239
$$ -1698 31351 -4721 -17307 -842 1301 11790 -2104 -12254 3025 10420 5214 -14149 -4910
512d910J8777j2312J205o012l626J6263j2303P977P124k4324J1639k092O595K5248
$$ -4910 13867 1555 2760 -3252 -6878 9385 -2918 5059 12183 -12141 -502 -2594 4001 29249
526B9249m4975n847L2972k974J5847l6744k1888N5401n558o917j5545l0475O4728
$$ 29249 -15726 -21573 11399 8425 24272 -12472 -34360 21041 15483 8566 -6979 -37454 27274
539B7274m823m1636K6264l0670L1879K7167p2151L8866Q661k8330M8844n5067
$$ 27274 22451 -19185 7079 -23591 8288 35455 -36696 2170 10831 -17499 31345 -23722
551b3722M535N5900o3367L5848K969n1138O9252l9029j1972O3159p4146K4300
$$ -23722 -19187 36713 -26654 9194 12163 -38975 30277 -8752 -20724 42435 -31711 -7411
563g411K4644n0035P3708m0201m3990O9088m5863L4731J6457q6272P2638q451
$$ -7411 17233 -32802 40906 705 -43285 25803 -20060 14671 31128 -55144 17494 9043
575I043l3192O8628p6892J8944N5677q1297N7437p296m7966Q3442o5181k441O2178
$$ 9043 -24149 44479 -32413 -13469 42208 -39089 18348 11052 -36914 46528 -18653 -21094 41084
588D1084q0226N9389N618p3750Q3578m4055j5602P5909q2177K9642K3109o5356
$$ 41084 -39142 20247 25865 -47885 35693 -8362 -23964 51945 -30232 -590 22519 -42837
600d2837Q4158l3948m0423O9029o9639L7790M1550r0453O2149j1216l8404P9170
$$ -42837 41321 7373 -33050 35979 -33660 4130 45680 -44773 17376 6160 -32244 46926
612D6926o6728L872N1129p1598N6456q288n2241Q1784n2953j0743N8539p2858
$$ 46926 -19802 -15930 35199 -36399 20057 11769 -40472 41312 -11641 -22384 36155 -36703
624c6703M6688J7408o6781O2971l2061j4236O3347o6644K4027K0697n9796P0390
$$ -36703 9985 27393 -39388 23583 -8478 -22714 40633 -26011 -1984 18713 -41083 29307
636B9307k2287l7730O0817n5037J8893L8526o5545M6462p101l3905N8301m8711
$$ 29307 7020 -30710 30107 -24930 -6037 32489 -33056 13406 6305 -27600 30701 -18010
648a8010Q556M2372o3313L8839J442l8885O1827l8058j3373M2541m6978L2925
$$ -18010 -9454 32918 -30395 8444 9886 -28999 32828 -5230 -18603 23938 -23040 9885
660I885O549m3498M9805k7287j2584M4749m4017K0504J4240m5547M1976r068j7794
$$ 9885 16434 -27064 22741 -4546 -17130 27619 -16398 4106 18346 -27201 14775 5707 -12087
673a2087L4290l8587J4953K1126l9670L2167p182k0279L6126l2334M260K6647
$$ -12087 22203 -16384 -1431 19695 -19975 12192 5010 -15269 20857 -11477 -7217 19430
685A9430l2190K0087m959j9095L5075k2325l009K0073k8299K0665K086k3225K7372
$$ 19430 -12760 7327 2368 -16727 18348 -3977 -6986 13087 -15212 5453 7539 -15686 11686
698A1686j3967n695J8348k2788J4948N053k1123K0734r813n185J8520k0316P840
$$ 11686 -2281 -7976 10372 -12416 2532 7585 -13538 7196 -2617 -7802 10718 -9598 -1758
711a758Q729j7277J5366n945o230J5735j5521L774Q771j2907J1620l612q232J3699
$$ -1758 6971 -10306 5060 -885 -7115 8620 -6901 -3127 5644 -7263 4357 745 -7487 6212
725F212q944J361O538j1345Q814n48p064J1049o532j458O144q407O045K017o228
$$ 6212 -2732 -1371 5167 -6178 2636 2088 -4976 6073 -459 -1917 4227 -4180 1865 3882 -2346
740b346O507n025r93O716n666K869P27n807N105j395k12M177n556M84J024k423
$$ -2346 4161 -864 -1857 4859 -807 2062 2789 -3018 2087 692 480 4657 -899 -415 609 -1814
756a814N509j070l899J568k289J263L241j432L66k954j687L994j49J073J99n272
$$ -1814 3695 2625 -1274 294 -1995 -732 2509 1077 1443 -1511 -3198 796 647 1720 1919 -3353
772c353M30J828J021K311j989k666j102M82M396N78k063j166l288J803M273k22
$$ -3353 -2923 -1095 -74 2237 248 -2418 -3520 -3038 1358 1936 -127 -1293 -4581 -2778 1495 1273
788A273r9k913k617K382K085K411m65m945J17Q75J436M692k714l445M45j519M198
$$ 1273 1174 -1739 -4356 -1974 111 2522 2057 -2888 -2771 -1896 -460 4232 1518 -1927 -1482 -3001 1197
805A197K304k186l59l793P08N278j253J297j848n137M003J453M13K928o234m74
$$ 1197 3501 1315 956 -2837 -2129 3149 1896 3193 1345 -3792 211 1664 2077 5005 -1229 -1703
821a703K364j542O022k284n027L477l409K206N580o567J324j22l830O763j477
$$ -1703 661 -881 5141 2857 -2170 1307 -2102 104 5684 -883 441 319 -3511 3252 1775
836A775k026K744o367L262L983n272M466l577l668P457m369J075L402p765M882
$$ 1775 -251 2493 -3874 -612 3371 -1901 2565 -1012 -4680 2777 -1592 -517 2885 -4880 2
851Bk85k985Q113p563o78N407p790Q404R13r869Q048m874r5R768j0415K860J903
$$ 2 -283 -3268 4845 -2718 -3396 2011 -5779 2625 3538 -6331 1717 -3157 -3252 6516 -3899 -1039 864
868H64p808J2083l631n641Q734j0375M035P649j0065P897l777n916J1406p924
$$ 864 -6944 5139 1508 -4133 4601 -5774 -1739 5910 -4155 3742 -35 -5951 5455 -2469
882b469L295N577j2877R146k105o180J5081r530k657O580j0762J1426J579r768
$$ -2469 826 6403 -6474 2672 567 -5613 9468 -62 -2719 3861 -6901 4525 6104 -3664
896c664R017j0382K170J2248j2515O944j536j1610J5162l610l288O536j2661Q258
$$ -3664 5353 -5029 -2859 9389 -3126 3818 2282 -9328 5834 2224 -1064 5472 -7189 1069
910A069L414r404J0693q709k45J1623j5839N712O036q323J0283r543n349J3497
$$ 1069 4483 -4921 5772 -2937 -3182 8441 -7398 -1686 4350 -3973 6310 -3233 -8582 4915
924D915n617M539l076j2882J5867j378m161O851j4518O732R050r836O767p190
$$ 4915 -702 3837 761 -12121 3746 2368 -1793 5058 -9460 -2728 6322 -3514 3253 -3937
938c937k249J2675r973M050J546j1176J4533l407p494J0439j1165N986P830j3841
$$ -3937 -6186 6489 -3484 566 2112 -9064 5469 2062 -5432 5007 -6158 -172 7658 -6183
952f183P604k808j955J4175j4914r26R204q475J3160n844j4180J5221l953L898
$$ -6183 1421 -1387 -3342 10833 -4081 -5007 4197 -4278 8882 3038 -11142 4079 126 4024
966D024M053j9378J1631M712o256J0819j6285J257J5675j5016R787j702j3851
$$ 4024 8077 -11301 330 5042 -1214 9605 -6680 -5423 10252 -4764 5023 3321 -10530
979a0530J9884r166m993J3330j6511J0799L952j6582J6606q946l719J8756k0381
$$ -10530 9354 188 -4805 8525 -7986 2813 6765 -9817 6789 -2157 -5876 12880 -7501
992g501M558Q320j6040K0079o082j3825J5681j3070R835R251k3812J4669l003
$$ -7501 -2943 5377 -10663 9416 3334 -10491 5190 -7880 1955 11206 -12606 2063 -940
1005i40p125K2694k1372j246J6795j8726J5837k190j7076K2553j2795p9J4469
$$ -940 -8065 14629 -6743 -7989 8806 -9920 5917 3727 -13349 9204 -3591 -3670 10799
1018A0799k4781J6793O290k0657K0307j2946m429K3723k0734L958N544j5359K4280
$$ 10799 -13982 2811 9101 -11556 8751 -4195 -8624 15099 -5635 -1677 3867 -11492 12788
1031A2788r810j3017J8573j6892J0489J1456k6183J6052O5j0495J8921j6793J644
$$ 12788 2978 -10039 8534 -8358 2131 13587 -12596 3456 3521 -6974 11947 -4846 -3202
1044c202J2938j8787J5152j591j4995K1493j3015l020J6619j9755Q247P464j4435
$$ -3202 9736 -9051 6101 4510 -10485 11008 -2007 -5027 11592 -8163 84 7548 -6887
1057f887J4276j0204m576J8599j4863L563M025j6321K0193k107j4629J3473r141
$$ -6887 7389 -2815 -7391 11208 -3655 -92 3933 -12388 7805 5698 -8931 4542 -4599
1070d599L744Q609j5860R475M31q377J3318j1585N64J2833j5959O316N445j1123
$$ -4599 -855 7754 -8106 1369 1800 -6577 6741 -4844 -4280 8553 -7406 -1090 4355 -6768
1084f768J0714n412l386J0923r958K550L324p894J2597o033r196J3049m891l63
$$ -6768 3946 -1466 -4852 6071 -3887 -1337 1987 -5907 6690 657 -8539 4510 -381 -744
1098g44M371r653P109K452n962M782n479L048O241j0853M331M164o404N628k499
$$ -744 3627 -6026 1083 3535 -2427 2355 -3124 -76 6165 -4688 -357 3807 -2597 3031 532
1113E32k945O178m505N50J731k046M522n358k193Q330l648j488J834m345M101
$$ 532 -2413 3765 -740 -190 1541 -505 4017 -1341 -3534 4796 1148 -340 1494 -2851 1250
1128A250K136m226L91j29K176J84m689L285J575k601J691k166j294M125r69j710
$$ 1250 3386 -840 -449 -578 1598 1782 -2907 378 1953 -648 1043 -1123 -2417 1708 739 -971
1144i71l08Q42O52r52J09J120j973M55J316j273O18N91j378Q2J270j95r23J69
$$ -971 -1279 -437 215 -737 -628 492 -1481 -1026 290 -983 -365 226 -1152 -1070 200 5 -918 -749
1162g49Q90q18K09J31k84J00P19j55r41N19R99r02J71R22j124n9Q12j45j07L80
$$ -749 141 -677 -468 -337 -621 -521 198 43 -898 -379 620 -282 -111 811 -313 -372 440 295 188 568
1182E68K23l02o14P70j5m1R48j349o76J120Q2M38k47o63k6j05P16L46j022J71
$$ 568 791 489 -125 645 630 589 1537 188 -488 632 714 1152 905 242 216 111 827 1173 151 322
1202C22p2p16J108J85l06l98n24O6O27K54L4q40n53M23K41L86j41n92l42k85N84
$$ 322 250 -466 642 827 521 123 -401 -335 292 546 580 -260 -813 -390 -149 237 96 -496 -838 -1123 -539
1223e39M22J70m89n17k61Q60J61k26k31l91N9L11N49k60j71j79k1L06N06l04j58
$$ -539 -117 53 -436 -953 -1214 -354 -193 -419 -650 -1041 -982 -671 -122 -382 -553 -732 -753 -447 59 -245 -403
1244d03J86J09J50k11L56J03k46R0n9J24J00r2K3L93lp5m7p6K4J91L05k29m81
$$ -403 -217 -108 42 -169 187 290 44 134 75 199 299 207 230 623 620 545 498 422 446 637 942 713 232
1267B32k47N94J21J59j5j126P3P69j22O52o44p17P3p2J031R5q96j97k85J57J062
$$ 232 -15 579 700 859 844 -282 -209 560 438 1090 446 -271 -198 -270 761 856 -40 -237 -522 -365 697
1288F97j21q63l81j71N42K17K86Q4j662L31Q79k67J046m13j905O90K82J078L05
$$ 697 576 -287 -668 -839 -297 -80 206 290 -1372 -1041 -162 -429 617 204 -1701 -1011 -729 349 654
1307F54j280l1p89K39K251q82r78Q62j653P31J623k07m97j063k03J419l18J469
$$ 654 -626 -657 -1446 -1207 1044 162 -816 46 -1607 -876 747 540 43 -1020 -1223 196 -122 1347
1325A347o79j975J279L47m60J700o58j250J99k48J812k12j136O24k009R14L245
$$ 1347 668 -1307 -28 319 -141 1559 901 -349 -150 -398 1414 1202 66 690 -1319 -405 2840
1342B840k320n88R05k101J725J220j640P12r88k82J624j750J932J30l638K819
$$ 2840 520 -68 837 -1264 461 1681 41 753 -235 -517 1107 -643 1289 1419 -2219 600
1358F00l52q80L108k875j141J968j285J727k96j978K467l389J466L411m388J628
$$ 600 248 -632 2476 -399 -1540 428 -857 870 574 -1404 1063 -2326 -860 2551 -1837 -209
1374b09L01l257M250n94j659K200l729K186J639l240M052k106k722M660l204J165
$$ -209 92 -3165 1085 491 -1168 1032 -2697 -511 1128 -2112 1940 -166 -2888 1772 -1432 -267
1390b67L175n281K248K54j730M227l805nL425m966L288J249l944M709l296k022
$$ -267 2908 -2373 -125 129 -1601 2626 -1179 -1184 2241 -2725 563 1812 -2132 2577 -719 -2741
1406b741N152k559J459R0m647N107l32k096L393m625J255L492m150K187J62k251
$$ -2741 2411 -148 1311 1401 -3246 1861 1529 -567 2826 -1799 -544 2948 -1202 985 1147 -1104
1422a104K964k651M0L687l854J682q5l197M669j367k264L097k920J178J771l153
$$ -1104 1860 -791 -751 2936 -918 764 679 -2518 2151 784 -1480 1617 -1303 -125 1646 -1507
1438a507K775r05k574L458j908K82K344m084J174J460j217K066k200j034K698
$$ -1507 1268 363 -2211 1247 -661 -379 1965 -2119 -945 515 -702 1364 -836 -1870 828
1453H28j686Q68J99k316K518j64j218R61j079J440N57k420P57O89M23J185k871
$$ 828 -858 10 209 -2107 411 247 -971 -10 -1089 351 908 -1512 -755 -66 357 1542 -1329
1470a329n65K493J41J00j377l75J449K68m43m23l7J204r77q33N69J529j28j822
$$ -1329 -1894 599 740 840 -537 -912 537 805 362 -61 -98 1106 129 -704 -135 1394 1266 -556
1488e56J22J032K84K59j468m58K793p87j880j28J011K513k101l019K798J92J134
$$ -556 -434 598 882 1141 -327 -785 2008 1221 -659 -787 224 2737 636 -2383 415 607 1741
1505A741o24m691L108K873k323l0j924J288L052l477O9O07r03L645l254k284M592
$$ 1741 1117 -3574 -466 2407 84 54 -1870 -582 2470 -1007 -938 -331 -1234 2411 -843 -3127 1465
1522A465k179M54J016k964K948r38k135L619k113P86N91l900M059J231m218K787
$$ 1465 -714 -260 756 -2208 740 -198 -2333 1286 -827 -41 550 -3350 709 1940 -2278 509
1538E09j569K44L252m393J345J788k353L251k878j704N319l346M19J294l596M057
$$ 509 -1060 -816 2436 -1957 -612 1176 -1177 2074 -804 -2508 2811 -535 -116 1178 -2418 1639
1554A639k93k629K906k592P58K768m159K511N35l309L811j684j267L221l276J659
$$ 1639 1346 -1283 1623 -969 -211 2557 -1602 909 1444 -1865 1946 262 -1005 2216 -1060 599
1570E99R30l101L268j523j504L854l281L65K168l558K587P8k357K651j793j24
$$ 599 1529 -1572 1696 173 -1331 2523 -758 -393 1775 -1783 804 882 -1475 1176 -617 -741
1586g41K478l398K166R2k486L190j425j501K880k428R29P08k573K598k87j467
$$ -741 1737 -1661 505 597 -1889 1301 -124 -1625 1255 -1173 -244 464 -2109 489 202 -1265
1602a265J986k115O80K208k925J375k4j449K295j369K87J312k446J381N37j435
$$ -1265 721 -1394 -714 1494 -1431 -56 -80 -1529 766 -603 -316 996 -1450 -69 468 -967
1618i67K319j261r82J572j149O00N31j336J664o75r56J487j085P00O12k024J128
$$ -967 1352 91 -891 681 -468 132 663 -673 991 316 -640 847 -238 462 1074 -950 178
1635A78O63m58O92j361L68P38q17Q56j93j155J197k90l08J005j264M18Q0o16M33
$$ 178 841 383 1075 -286 82 820 3 859 666 -489 708 418 110 1115 -149 269 349 -267 166
1654A66p6j36L50p17N97K57q27N46P0o32M71m51K20J40k69J98l17R4M65p33j26
$$ 166 90 -46 304 -413 184 441 -386 160 230 -402 69 -382 -162 -22 -291 -93 -410 -316 149 -584 -710
1675g10L57k28N16j95m01L49j52L11J85n64L46o9p3M30j47j61J97k99L50M06j06
$$ -710 -353 -581 -65 -260 -661 -312 -464 -153 32 -532 -186 -255 -328 102 -45 -206 -9 -308 42 448 342
1696C42j01l92k10N75j43J91N5j74m57N70o9N82n50l80J52j6O94J48l61k41k02
$$ 342 241 -151 -361 214 71 262 317 143 -314 256 187 769 219 -161 -9 -25 669 817 456 215 13
1717A3j45R03k65j31J92q63L17N00l00J06m65J8J52M36K9k83q66M92j16L82L72
$$ 13 -132 771 506 375 567 -296 21 521 221 327 -138 -120 32 468 497 214 -652 -160 -276 106 478
1738D78p44j22j88K80L26Pl06j92m20N79M7O9L66p24k63O34M7J2n0k86o6L15L24
$$ 478 -266 -388 -576 -296 30 37 -269 -461 -881 -302 -255 -186 180 -544 -807 -173 -126 -114 -164 -450 -516 -201 123
1761A23q2l22k00L40n04R73k12l95J68n4K16N14l04Q8m68p8R35l89L1L06o78k48
$$ 123 41 -281 -481 -141 -645 328 116 -279 -111 -165 51 565 261 349 -119 -197 738 349 380 686 8 -240
1783b40O44j7K57m12k94l0M15K85j14o85L52q8j61O65l01l11L00m29K38K26k82
$$ -240 404 387 644 232 -62 -92 323 608 494 -191 161 73 -88 577 276 -35 265 -164 74 300 18
1804A8K58n85J51M90p63M91nm21N33k05m47R92o81k84N29n95Q44l81q69R32o92
$$ 18 276 -309 -158 332 -431 60 55 -366 167 -38 -485 507 -174 -458 71 -524 320 -61 -930 2 -690
1825f90J76J178j364J56L74q4O42k40o40N06o56O84O28j276P15J85p19J227p29
$$ -690 -514 664 -700 -544 -170 -254 388 148 -492 14 -642 42 670 -606 109 294 -425 802 73
1844G3m02Q67n39K23K96o77O55k38m21N54n40M72M87j059M92K42q70J411m90m64
$$ 73 -329 538 -1 222 518 -159 496 258 -163 391 -149 323 810 -249 243 485 -385 1026 536 72
1864G2J00n87N89J015r80n0l61k59J453n46o32J74l45O05K71j172Q04%q22R97
$$ 72 172 -415 174 1189 209 159 -202 -461 992 446 -186 -12 -357 248 519 -653 151 151 -671 326
1884C26q80L73R26j457L60M00p21J349o80q31N92n23N11P22r95K16j92l89J446
$$ 326 -554 -181 745 -712 -352 48 -673 676 -4 -835 -243 -766 -255 467 -528 -312 -504 -893 553
1903E53q32r1O71j007L25P85j093R01m55m91J165j064O61M60j199J048N1q64J296
$$ 553 -279 -370 301 -706 -381 404 -689 212 -243 -734 431 -633 28 488 -711 337 388 -476 820
1922H20r56m3J174j347L27Q63j046N49j92n71J394r80J88L83j265J794J57j572
$$ 820 -136 -179 995 -352 -25 838 -208 341 149 -422 972 -8 180 563 -702 1092 1249 -323
1940c23L12K4J62P63j209J76P66j019R03m67o54J584j230m58J333j375Q85J78
$$ -323 -11 13 175 938 -271 -95 671 -348 555 88 -566 1018 -212 -670 663 -712 173 351
1958C51r65J018o10n91R36n68P72l00j868J831P12q88O66j800J28K318j031k63
$$ 351 -614 404 -206 -797 139 -429 343 43 -1825 6 718 -170 496 -1304 -1176 1142 111 -152
1976a52m80n6J634j084o93J367j392R90L87j453Q56M34m22L00o78Q2J008q24J103
$$ -152 -632 -688 946 -138 -831 536 -856 134 521 -932 -76 358 -64 236 -442 -360 648 -176 927
1995I27p02j305J461m4Q2O09j807J36J338m92M70o63m19J245p62K40j62p68J484
$$ 927 225 -1080 381 337 419 1028 -779 -643 695 203 673 10 -409 836 74 314 152 -616 868
2014H68rj478P90o5j03O11q09k01M41P7O23k94o72L76o07N52O54j318J11N93l69
$$ 868 859 -619 171 106 3 614 -195 -396 45 122 745 451 -221 155 -452 100 754 -564 -453 140 -229
2035b29O30l27m79K80q6M41n77l61Q47j38m79K77n22L86R75p70n79m07P81Q28
$$ -229 401 74 -405 -125 -211 230 -347 -708 139 1 -478 -201 -723 -337 638 -132 -711 -1118 -337 491
2055D91m34l75J86l10N83L91j070K84L20k05L27k62j34R1J26K38m7l85M81K12
$$ 491 57 -318 -132 -442 141 532 -538 -254 66 -139 188 -74 -208 -117 9 247 200 -185 296 508
2075E08m60J47m83M61N76m96k75P6p7O38p8o92J95l14P79J34p06P6KQ2M76m67
$$ 508 48 195 -288 173 749 253 -22 54 -23 615 537 -155 40 -274 505 639 -67 9 11 93 569 102
2097A02j82K76n08L34l4p9M44n32k22O50k12k20M84o95p4K07J9O15m61j37m29
$$ 102 -80 196 -312 22 -12 -91 353 -179 -401 249 37 -183 301 -394 -468 -261 -242 373 -88 -225 -654
2118f54n6Q44J62n67J7k01k2M78Qj89j28j58j0N68k01M86o63r2M20j3M81l63n99
$$ -654 -710 134 296 -271 -254 -455 -477 1 9 -180 -308 -466 -476 92 -109 377 -286 -378 42 29 510 147 -452
2141d52L61J35J9J44j58P3k87l26J368k98l05n5l59J17Q42m55k57m0j1K49j25
$$ -452 -91 44 63 207 49 122 -165 -491 877 579 274 219 -140 -23 819 364 107 67 56 305 180
2162A80N26l32l15J53j27K94K39l08m99O9oL49k29j73l2j56N21Q4k81Jk07k06
$$ 180 706 374 59 212 85 379 618 310 -189 -120 -126 223 -6 -179 -211 -367 154 238 -43 -42 -249 -455
2184d55K14K23J44l66k38J22K90n1J72l07j94J61L05k44K95l60j69jK13L17p10
$$ -455 -241 -18 126 -240 -478 -356 -66 -117 55 -252 -446 -285 20 -224 71 -289 -458 -459 -246 71 -639
2205f39K22J50j42M22P6l8k35m9L29J37k8l12L4n2J90K03j54M38l43l93L37k0
$$ -639 -417 -267 -409 13 89 51 -184 -233 96 233 205 -107 -73 -125 65 268 114 552 209 -184 153 133
2227A33L36R0m70q5k36M29J88k04P9k99j0K74J89n13M84n45L41J6J5j77m78N40
$$ 133 469 559 89 4 -232 197 385 181 260 -39 -49 225 414 -99 385 -160 181 197 212 35 -443 97
2249I7J32l15L31k68k82N80l79L8J46m10K86N4k98O70o85j0M44n33K8P77n67L28
$$ 97 229 -86 245 -23 -305 275 -104 -66 80 -330 -44 10 -288 382 -303 -313 131 -402 -374 403 -164 164
2271A64m46q6M11j09K87m95p53J009M18p25O20o43j52Q03j11L7k79k57N21m21
$$ 164 -282 -368 43 -66 221 -274 -1027 -18 400 -325 295 -348 -500 303 192 229 -50 -307 214 -207
2291b07j9Q93q45K19K90p95O32K30k72L07n35N0L05k37Q81o18p86Q77m20P6J252
$$ -207 -226 667 -178 41 331 -464 168 398 126 433 -102 -52 253 16 897 279 -507 370 -50 26 1278
2312A278j812J91N77j50N88j176J88Q30r93N90M04j682J976l03j222Q61l37P8
$$ 1278 -534 -343 234 84 672 -504 -316 514 -479 111 515 -1167 809 506 -716 145 -192 -114
2330a14Q44j369Q04l94n27J596r69o43J279j339P79N54j403R28m47K7J238j854
$$ -114 730 -639 165 -229 -756 840 -129 -772 507 -832 -53 501 -902 26 -421 -394 844 -1010
2348a010P26R18j426J546o86j356J930p79j22O55j205P68L17m85Q73j320N09J181
$$ -1010 -284 634 -792 754 68 -1288 642 -137 -259 396 -809 -41 276 -209 664 -656 -147 1034
2366A034j486O52P27j803J511j67j009P15m11Q24L33j643R17j89j00J775k095
$$ 1034 -452 200 927 -876 635 468 -541 174 -237 587 920 -723 194 5 -95 1680 -415
2383d15o87J983q18N64j8j366R49J67L5K33j750J221R58j283O23l72q29J373q
$$ -415 -1102 881 63 627 609 -757 192 359 394 627 -1123 98 1056 -227 396 24 -805 568 560
2402E60p49k56j65R09o9k78J01m79K8J285j117m72M59k87K73Q45j043J31K18K33
$$ 560 -189 -445 -610 299 230 -48 53 -426 -398 887 -230 -702 -243 -530 -257 588 -455 -324 -106 127
2422A27J40q43J67N15j26L15P4j830J646N66p81R8n33J21J195p54n2Nq93J328
$$ 127 267 -576 -409 106 -20 295 369 -1461 185 751 -30 68 -465 -344 851 97 45 50 -843 485
2442D85l4p62Q91r11J69J020j051J06K96m82J229n96j054J199m58O16M81k212
$$ 485 451 -311 580 -331 -162 858 -193 -87 209 -273 956 360 -694 505 47 663 1144 -1068
2460a068R37J051p84R91j675l66J469p70J068m22k007K219j52r97J832k282N46
$$ -1068 -131 920 136 1127 -548 -914 555 -215 853 431 -1576 643 491 -506 1326 -956 -410
2477d10J279j541Q98o13o27K194j321m28J254j996J994J63k446J571m69N7J831
$$ -410 869 -672 226 -387 -1014 1180 -141 -569 685 -1311 683 846 -1600 -29 -498 -441 1390
2494A390k500P56N63j287K189j087j204J968j736J051Q67k188J149j07k59J934
$$ 1390 -1110 -354 209 -1078 1111 24 -1180 788 -948 103 970 -1218 -69 -176 -435 1499
2510A499k231l68J748j019J747j079k191K667K01p46M40k205K189P93k234P91
$$ 1499 -732 -1100 648 -371 1376 297 -1894 773 974 228 668 -1537 652 1445 -789 2
2526Bn48N49J878k781L02J469j101R93q52r33J985j162J07J134j699J466o25j026
$$ 2 -546 3 1881 -900 -598 871 -230 763 -89 -1022 963 -199 -92 1042 -657 809 184 -842
2544h42K017j205l65M44q72J621r8k207J766n40K35R21k076P81J270j141K62q63
$$ -842 1175 -30 -395 49 -823 798 700 -1507 259 -281 -46 875 -1201 -420 850 -291 -29 -892
2562h92J89J648j479j0K28m29J530q24o64R50q73P93J85p91N10l88m69J631r65
$$ -892 -703 945 -534 -544 -316 -745 785 -39 -703 247 -626 167 352 -439 71 -317 -786 845 -120
2581a20L2L32j206J700j69q34M25o97N24L32q50N89q4n02J027o71J6P81q16L34
$$ -120 -88 244 -962 738 569 -265 160 -537 -13 319 -531 58 -26 -528 499 -172 -156 625 -191 143
$$ [...]
8191B43
##END NTUPLES=NMR FID
##END=
