##TITLE=1H_LR-724-B1
 CDCl3, 8 sc, 
 1.10.2020
##JCAMPDX= 6.0         $$ Bruker NMR JCAMP-DX V2.0
##DATA TYPE= NMR FID
##DATA CLASS= NTUPLES
##ORIGIN= UXNMR, Bruker Analytische Messtechnik GmbH
##OWNER= root
$$ XWIN-NMR		Version 3.5
$$ Thu Oct  1 10:28:44 2020 Russian Standard Time (UT+4h)  she@DPX200
##.OBSERVE FREQUENCY= 200.1315066352
##.OBSERVE NUCLEUS= ^1H
##.DELAY= (6, 6)
##.ACQUISITION MODE= SIMULTANEOUS
##.ACQUISITION SCHEME= undefined
##.AVERAGES= 8
##.DIGITISER RES= 18
##SPECTROMETER/DATA SYSTEM= spect
##.PULSE SEQUENCE= zg30
##.SOLVENT NAME= MeOD
##.SHIFT REFERENCE= (INTERNAL, MeOD, 0, 15.7039)
##AUDIT TRAIL= $$ (NUMBER, WHEN, WHO, WHERE, WHAT)
$$ ##TITLE= Audit trail, XWIN-NMR		Version 3.5
$$ ##JCAMPDX= 5.01
$$ ##ORIGIN= Bruker BioSpin GmbH
$$ ##OWNER= she
$$ F:/spectra/data/she/nmr/H-F/1/audita.txt
$$ ##AUDIT TRAIL=  $$ (NUMBER, WHEN, WHO, WHERE, WHAT)
(   1,<2020-10-01 10:27:51.87 +0400>,<she>,<DPX200>,
      <created by zg, POWCHK disabled, PULCHK disabled
       configuration hash MD5:
       00 E9 B6 7A A2 85 ED C7 34 08 36 98 17 FE 4E 26
       data hash MD5: 16K
       D8 5A 19 CC 4D 73 AA 5A 20 B2 6A 0C 4A 2B DE 94>)
$$ ##END=
$$ 
$$ hash MD5
$$ F2 8E 2B 0C B7 33 8C 8B 66 A0 00 E5 BD 00 FD 7B
##$RELAX= 
##$RELAX= 
##$RELAX= 
##$RELAX= 
##$RELAX= 
##$RELAX= 
$$ Bruker specific parameters
$$ --------------------------
##$DU= <F:/spectra>
##$EXPNO= 1
##$NAME= <H-F>
##$PROCNO= 1
##$TYPE= <nmr>
##$USER= <she>
##$AMP= (0..31)
100 100 100 100 100 100 100 100 100 100 100 100 100 100 100 100 100 100 
100 100 100 100 100 100 100 100 100 100 100 100 100 100 
##$AQSEQ= 0
##$AQ_mod= 1
##$AUNM= <au_zg>
##$AUTOPOS= <>
##$BF1= 200.13
##$BF2= 200.13
##$BF3= 200.13
##$BF4= 200.13
##$BF5= 200.13
##$BF6= 200.13
##$BF7= 200.13
##$BF8= 200.13
##$BYTORDA= 1
##$CFDGTYP= 0
##$CFRGTYP= 5
##$CHEMSTR= <none>
##$CNST= (0..31)
1 1 145 1 1 1 1 1 1 1 1 1 1 1 1 1 1 1 1 1 1 1 1 1 1 1 1 1 1 1 1 1 
##$CPDPRG= <>
##$CPDPRG1= <>
##$CPDPRG2= <>
##$CPDPRG3= <>
##$CPDPRG4= <mlev>
##$CPDPRG5= <mlev>
##$CPDPRG6= <mlev>
##$CPDPRG7= <mlev>
##$CPDPRG8= <mlev>
##$CPDPRGB= <>
##$CPDPRGT= <>
##$D= (0..31)
0 1.2 0 0 0 0 0 0 0 0.06 0 0.03 0 0 0 0 0.0002 0 0 0 0 0 0 0 0 0 0 0 0 
0 0 0 
##$DATE= 1601533671
##$DBL= (0..7)
120 120 120 120 120 120 120 120 
##$DBP= (0..7)
150 150 150 150 150 150 150 150 
##$DBP07= 0
##$DBPNAM0= <>
##$DBPNAM1= <>
##$DBPNAM2= <>
##$DBPNAM3= <>
##$DBPNAM4= <>
##$DBPNAM5= <>
##$DBPNAM6= <>
##$DBPNAM7= <>
##$DBPOAL= (0..7)
0.5 0.5 0.5 0.5 0.5 0.5 0.5 0.5 
##$DBPOFFS= (0..7)
0 0 0 0 0 0 0 0 
##$DE= 6
##$DECBNUC= <off>
##$DECIM= 32
##$DECNUC= <off>
##$DECSTAT= 4
##$DIGMOD= 1
##$DIGTYP= 9
##$DL= (0..7)
0 120 120 120 120 120 120 120 
##$DP= (0..7)
150 150 150 150 150 150 150 150 
##$DP07= 0
##$DPNAME0= <>
##$DPNAME1= <>
##$DPNAME2= <>
##$DPNAME3= <>
##$DPNAME4= <>
##$DPNAME5= <>
##$DPNAME6= <>
##$DPNAME7= <>
##$DPOAL= (0..7)
0.5 0.5 0.5 0.5 0.5 0.5 0.5 0.5 
##$DPOFFS= (0..7)
0 0 0 0 0 0 0 0 
##$DQDMODE= 0
##$DR= 18
##$DS= 0
##$DSLIST= <SSSSSSSSSSSSSSS>
$$ [...]
##$SUBNAM2= <"">
##$SUBNAM3= <"">
##$SUBNAM4= <"">
##$SUBNAM5= <"">
##$SUBNAM6= <"">
##$SUBNAM7= <"">
##$SUBNAM8= <"">
##$SUBNAM9= <"">
##$SW= 16.880792210976
##$SWIBOX= (0..15)
0 0 2 0 0 0 0 0 0 0 0 0 0 0 0 0 
##$SW_h= 3378.37837837838
##$TD= 16384
##$TD0= 1
##$TE= 0
##$TE2= 300
##$TE3= 300
##$TEG= 300
##$TL= (0..7)
0 120 120 120 120 120 120 120 
##$TP= (0..7)
150 150 150 150 150 150 150 150 
##$TP07= 0
##$TPNAME0= <>
##$TPNAME1= <>
##$TPNAME2= <>
##$TPNAME3= <>
##$TPNAME4= <>
##$TPNAME5= <>
##$TPNAME6= <>
##$TPNAME7= <>
##$TPOAL= (0..7)
0.5 0.5 0.5 0.5 0.5 0.5 0.5 0.5 
##$TPOFFS= (0..7)
0 0 0 0 0 0 0 0 
##$TUNHIN= 0
##$TUNHOUT= 0
##$TUNXOUT= 0
##$USERA1= <user>
##$USERA2= <user>
##$USERA3= <user>
##$USERA4= <user>
##$USERA5= <user>
##$V9= 5
##$VALIST= <valist>
##$VCLIST= <CCCCCCCCCCCCCCC>
##$VD= 0
##$VDLIST= <DDDDDDDDDDDDDDD>
##$VPLIST= <PPPPPPPPPPPPPPP>
##$VTLIST= <TTTTTTTTTTTTTTT>
##$WBST= 1024
##$WBSW= 4
##$XGAIN= (0..3)
0 0 0 0 
##$XL= 0
##$YL= 0
##$YMAX_a= 305318
##$YMIN_a= -307962
##$ZGOPTNS= <>
##$ZL1= 120
##$ZL2= 120
##$ZL3= 120
##$ZL4= 120
##$ABSF1= 10
##$ABSF2= 0
##$ABSG= 5
##$ABSL= 3
##$ALPHA= 0
##$AQORDER= 0
##$ASSFAC= 0
##$ASSFACI= 0
##$ASSFACX= 0
##$ASSWID= 0
##$AUNMP= <proc_1d>
##$AZFE= 0.1
##$AZFW= 0.1
##$BCFW= 1
##$BC_mod= 2
##$BYTORDP= 1
##$COROFFS= 0
##$CY= 11.3945322036743
##$DATMOD= 1
##$DC= 2
##$DFILT= <>
##$DTYPP= 0
##$F1P= 16.9975609425685
##$F2P= -3.02152046262296
##$FCOR= 0.5
##$FTSIZE= 0
##$FT_mod= 4
##$GAMMA= 1
##$GB= 0.15
##$INTBC= 1
##$INTSCL= 1
##$ISEN= 128
##$LB= 0.24
##$LEV0= 0
##$LPBIN= 0
##$MAXI= 10000
##$MC2= 0
##$MEAN= 0
##$ME_mod= 0
##$MI= 1.114404
##$NCOEF= 0
##$NC_proc= 0
##$NLEV= 6
##$NOISF1= 3.799351
##$NOISF2= 2.8
##$NSP= 1
##$NTH_PI= 0
##$NZP= 0
##$OFFSET= 15.70392
##$PC= 1
##$PHC0= -9976.086
##$PHC1= 19.80089
##$PH_mod= 1
##$PKNL= yes
##$PPARMOD= 0
##$PSCAL= 0
##$PSIGN= 0
##$REVERSE= no
##$SF= 200.130013532006
##$SI= 16384
##$SIGF1= 3
##$SIGF2= 2
##$SINO= 400
##$SIOLD= 16384
##$SREGLST= <1H.CDCl3>
##$SSB= 0
##$STSI= 0
##$STSR= 0
##$SW_p= 3612.71676300578
##$SYMM= 0
##$S_DEV= 0
##$TDeff= 0
##$TDoff= 0
##$TI= <>
##$TILT= no
##$TM1= 0
##$TM2= 0
##$TOPLEV= 0
##$USERP1= <user>
##$USERP2= <user>
##$USERP3= <user>
##$USERP4= <user>
##$USERP5= <user>
##$WDW= 1
##$XDIM= 8192
##$YMAX_p= 0
##$YMIN_p= 0
$$ End of Bruker specific parameters
$$ ---------------------------------
##NTUPLES= NMR FID
##VAR_NAME=  TIME,          FID/REAL,        FID/IMAG
##SYMBOL=    X,             R,               I
##VAR_TYPE=  INDEPENDENT,   DEPENDENT,       DEPENDENT
##VAR_FORM=  AFFN,          ASDF,            ASDF
##VAR_DIM=   8192,          8192,            8192
##UNITS=     SECONDS,       ARBITRARY UNITS, ARBITRARY UNITS
##FACTOR=    0.000296,      1,               1
##FIRST=     0,             0,               0
##LAST=      2.424536,      0,               0
##MIN=       0,             -307962,         0
##MAX=       2.424536,      305318,          0
$$ Real data points
##PAGE= N=1
##DATA TABLE= (X++(R..R)), XYDATA
$$ [...]
1846e49J72j4Q4j70l1N59l76k9J40j5Q8j1o31M67N95m03L0J06j15M36m10m0M09
$$ -549 -377 -391 -307 -477 -508 51 -325 -354 -214 -229 -141 -152 -783 -316 279 -124 -94 12 -103 333 -77 -117 292
1869B92j28K59p1k21J68J22j22L42j74J49J72n10kL02n7O8q5j17o3q1o7m4p8L34
$$ 292 164 423 352 131 299 421 299 641 467 616 788 278 276 578 521 589 504 387 324 243 176 132 54 388
1893C88k89n0L54l97j44K66l92J98k3q2K03j08k66J40j44L4N3j61L4N1j81J74
$$ 388 99 49 403 6 -138 128 -264 -66 -89 -171 32 -76 -342 -202 -346 -312 -259 -420 -386 -335 -516 -342
1915c42l2%K92m38j1J15M6j45K60l34M74k7m41L19K12J84k59l84j11O47N6q6k65
$$ -342 -374 -374 -82 -520 -531 -416 -370 -515 -255 -589 -115 -142 -583 -264 -52 132 -127 -511 -622 25 81 -5 -270
1938b70P5N75k8m72J14k07N31K33m87l0O66o33M89k28M0K98j98m30M53R8O8k82
$$ -270 -195 380 352 -120 -6 -213 318 551 64 34 700 67 556 328 368 666 468 38 491 589 657 375
1960C75n67Q66k22k10P8l60L20M15p91J68P7j6R0m89N4O37p44M31l60j92Q03m05
$$ 375 -192 674 452 242 320 -40 280 695 -96 72 149 133 223 -266 -212 425 -319 112 -248 -440 363 -42
1982d2o09M53j54Q8K81m91J93P3o11O24k55K40K90j134N68K49j00N09o34k16J013
$$ -42 -651 -198 -352 -264 17 -474 -281 -208 -819 -195 -450 -210 80 -1054 -486 -237 -337 172 -462 -678 335
2003C35p00j72N45k53L37R4p30P28l16J70M99p48L31j6O4M17m99l94R42q22L94
$$ 335 -365 -537 8 -245 92 186 -544 184 -132 38 537 -211 120 104 168 585 86 -308 634 -188 206
2024B06N11j082Q63J69o65N25l12R6N55p54K84j05k88N87k36k97N96m65k90P24
$$ 206 717 -365 498 667 2 527 215 311 866 112 396 291 3 590 354 57 653 188 -102 622
2044F22j161M99J51m41O57m33j89L17m52M02L5n36N73k50m70N89n42J88M94m04
$$ 622 -539 -40 111 -330 327 -106 -295 22 -430 -28 7 -529 44 -206 -676 -87 -629 -441 53 -351
2064c51K01k27o66R19j48N1q9k71L74J12k01K54k55k76N48k67K40J33k66J18K68
$$ -351 -150 -377 -1043 -124 -272 -221 -310 -581 -207 -95 -296 -42 -297 -573 -25 -292 -52 81 -185 -67 201
2085B01m01K40j10J14L93k68j79K80j56O11m09k51L88l67J00Q8j7O4J76k71k9
$$ 201 -200 40 -70 44 437 169 -10 270 114 725 316 65 453 86 186 274 257 321 497 226 197
2106A97J10j99j0J06J12K35l52J47p4j99L72n22K13J50j96n4J02n66N00N2m87
$$ 197 307 108 98 204 316 551 199 346 272 73 445 -77 136 286 90 36 138 -428 72 124 -363
2127c63K31j17J23k37L76l56l8J7M18k31j45J75k59J71l4K20n67J01L05J06p2
$$ -363 -132 -249 -126 -363 13 -343 -381 -364 54 -177 -322 -147 -406 -235 -269 -49 -616 -515 -210 -104 -176
2148a76j33j06O4l5P7M91j33j50q9J21O5j55N36l48m5K8m6L22p9M0ml91N30l17
$$ -176 -309 -415 -351 -386 -309 182 49 -101 -190 -69 -4 -159 377 29 -16 12 -34 288 209 249 245 -146 384 67
2172F7J96N8j76J64j0M5R8k54J2J33k02J53Kk6k3k46Q1L24k57J04mj08j42J75
$$ 67 263 321 145 309 299 344 442 188 200 333 131 284 286 260 237 -9 72 396 139 243 239 131 -11 164
2196A64Q9m27P3k25k1J49K82j40j42J21l07J35J31K8m07J43M4l8n3L84n72L2J91
$$ 164 253 -174 -101 -326 -347 -198 84 -56 -198 -77 -384 -249 -118 -90 -497 -354 -310 -348 -401 -17 -589 -557 -366
2219c66j0L03Lk68K00j23Q0K63j76j94OM07j52N3L21k82j3k01J27J59K16rj90
$$ -366 -376 -73 -70 -338 -138 -261 -181 82 -94 -288 -282 125 -27 26 347 65 52 -149 -22 137 353 344 154
2242A54j72K62J34j54J01k82K77RN1k33P7j15L50nq8k00O0N5K9j82O3J83k35k0
$$ 154 -18 244 378 224 325 43 320 329 380 147 224 109 459 454 366 166 226 281 310 128 191 374 139 119
2266A19l15J74Oj59MM00m23j29J84J9m0J78k00J01j88R7J79m83M60l38M4j72K59
$$ 119 -196 -22 -16 -175 -171 229 -194 -323 -139 -120 -160 18 -182 -81 -269 -172 7 -476 -16 -354 -310 -482 -223
2289b23k45J86L5R8j00N2l19M98k67j9K09r7K48j93J01j92R1K18j18J64L63o12
$$ -223 -468 -282 -247 -149 -249 -197 -516 -18 -285 -304 -95 -192 56 -137 -36 -228 -137 81 -37 127 490 -122
2311a22K29J43k60J17L09l49K01n7j77K60m6K47K2o11K40l8j9O25n75j68N71m16
$$ -122 107 250 -10 107 416 67 268 211 34 294 248 495 517 -94 146 108 89 714 139 -29 542 126
2333A26R6K11m33K10J3j3K0l91R5O01o38M8J44n42N90J71n84M7l10N49J05n29
$$ 126 222 433 0 210 223 210 230 -161 -66 535 -103 -55 89 -453 137 308 -276 -229 -539 10 115 -414
2355d14L06j83k79Q06k78l79L22m60K61J98l75M52k03q1M14m37p1M43l51L83k8
$$ -414 -108 -291 -570 236 -42 -421 -99 -559 -298 -100 -475 -23 -226 -307 107 -330 -401 42 -309 74 46
2376D6n27L33K13j25K88o13K64M74n44N99m56k99Q31k90l30K50j66M24P1k7k30
$$ 46 -481 -148 65 -60 228 -385 -121 353 -191 408 -48 -347 484 194 -136 114 -52 372 443 416 186
2397A86M1J04K99n39K5L45l41J79K11m92K47J37m53K87k69L6J11m6M2L4m62M47
$$ 186 227 331 630 91 116 461 120 299 510 18 265 402 -51 236 -33 3 114 68 110 144 -318 129
2419A29%j91L1m48K97K93l12J63m0j93K87j40k10J38p3L8k3QP0j43L5k8R7R4k34
$$ 129 129 -62 -31 -479 -182 111 -201 -38 -78 -271 16 -124 -334 -196 -269 -231 -254 -246 -176 -319 -284 -312 -215 -121 -355
2444c55L3P8L98j93l79K62j61O05j73k15N2j53M23j52l34K64R6j12L64P8n25Q61
$$ -355 -322 -244 154 -39 -418 -156 -317 288 115 -100 -48 -201 222 70 -264 0 96 -16 348 426 -99 762
2466G62p45J5L21k69K91K42p74N45N6m16K13L5p9J71k56J21J98n16L59l50j05
$$ 762 17 32 353 84 375 617 -157 388 444 28 241 276 197 368 112 233 431 -85 274 -76 -181
2487a81M68k41n3K84p45P16j22m71N75j62m18M91m32P9j32J46Q1k21J21K69m00
$$ -181 287 46 -7 277 -468 248 126 -345 230 68 -350 141 -291 -212 -344 -198 -117 -338 -217 52 -348
2508c48J39K08o40M52J19k44J74M5k13N60l59o9J11L5m0K68o01L27j31O3M09p02
$$ -348 -209 -1 -641 -189 -70 -314 -140 -95 -308 252 -107 -176 -65 -30 -70 198 -403 -76 -207 -144 265 -437
2530d37O54j08m01L22M6k07L15k11K22K91n05R8Q3j22M10m21j97L85k35O29n66
$$ -437 217 109 -292 30 76 -131 184 -27 195 486 -19 79 162 40 450 29 -168 217 -18 611 45
2551D5j21K17K49l46JJ33J91j9l16K63j88L5O1k66m0N25k96j8j22j60O0l9L9k12
$$ 45 -76 141 390 44 45 178 369 350 34 297 109 144 205 -61 -101 424 128 110 -12 -172 -112 -151 -112 -324
2575c24L15Ln08N6L04p0k8K17k54n2M91l57J1J34m5L1j89M6O7J06Q4j76J5o3J15
$$ -324 -9 -6 -514 -458 -154 -224 -252 -35 -289 -341 150 -207 -196 -62 -107 -76 -265 -219 -152 -46 38 -138 -123 -186 -71
2600g1k09J43J2J73j62J39Q8k6LO6K7j07L04k99K11o9J82j30j80N1N6K47j04k34
$$ -71 -280 -137 -125 48 -114 25 113 87 90 156 183 76 380 81 292 223 405 275 95 146 202 449 345 111
2624A11J00J57J1m9J67k51p7m5N6l56J11M7J86k83L53k38k77M11l93o5K85K32
$$ 111 211 368 379 330 497 246 169 124 180 -176 -65 -18 168 -115 238 0 -277 134 -259 -324 -39 193
2646A93j03l03J81j79K01k39J42L6O8j53j62J32m4j9L14k19l8J25M7j02n5J86
$$ 193 90 -213 -32 -211 -10 -249 -107 -71 -3 -156 -318 -186 -230 -249 65 -154 -192 -67 -20 -122 -177 9
2668IJ45l04P8J4k04J36K71l32J30j27M34k73K46j45j98L11j59J73j78J93N5n
$$ 9 154 -150 -72 -58 -262 -126 145 -187 -57 -184 250 -23 223 78 -120 191 32 205 27 220 275 270
2690B70l07P1J75rm3l3L3k49L11J4k26N20j47n4k44L44m50j86M06j39j01R1N8
$$ 270 -37 34 209 200 157 124 157 -92 219 233 7 527 380 326 82 426 -24 -210 196 57 -44 47 105
2713A05p5J69l18j49K63k54j07L10j22J00L0j16k7J75M4N3m64P3j6n3J56K00j80
$$ 105 30 199 -119 -268 -5 -259 -366 -56 -178 -78 -48 -164 -191 -16 28 81 -383 -310 -326 -379 -223 -23 -203
2736b03K5j16M8L00j17K9k78o4K36j88L80n4n3k57K97J54j23K07q1P0q2J67j67
$$ -203 -178 -294 -246 54 -63 -34 -312 -376 -140 -328 52 -2 -55 -312 -15 139 16 223 142 212 130 297 130
2759A30qk7K35l95L03j06J01J23k54K87k38j8o1L13j27j73J99j83j95L3O6J68
$$ 130 122 95 330 -65 238 132 233 356 102 389 151 133 72 385 258 85 284 101 -94 -61 5 173
2781A73j54R7Lj53j40M10j9l99L31m3r5p6J34J07k04O5j04K20k49m1j93K0L48
$$ 173 19 116 119 -34 -174 236 217 -182 149 106 11 -65 69 176 -28 37 -67 153 -96 -137 -330 -310 38
2804C8n46oL46k82M61Rk94J35q9J35J88j16j17j6%K12k48p5N45m58L9L17k48k3
$$ 38 -508 -514 -168 -450 11 20 -274 -139 -228 -93 95 -21 -138 -154 -154 58 -190 -265 280 -178 -139 178 -70 -93
2828i3K71l57L00Q4j95L37k05K39l22r5L08om16N20k29n5K88k63Kk39K33O33n96
$$ -93 178 -179 121 205 10 347 142 381 59 -36 272 266 -150 370 141 86 374 111 113 -126 107 740 144
2851A44l15M46k80N20k35k30M6j59J09L27m67j63Q20p43R1J62l72M79n22J18J28
$$ 144 -171 275 -5 515 280 50 96 -63 46 373 -94 -257 563 -180 -89 73 -299 180 -342 -224 -96
2872i6k51K35J01m17O02l31k53N17l86R2J95m32M59j6k55J50k01L04j3l04M4L67
$$ -96 -347 -112 -11 -428 174 -157 -410 107 -279 -187 8 -424 35 19 -236 -86 -287 17 4 -300 -256 111
2894A11l13K22j39j63M98j14o5J4j76K59o3m8M08R8m90K05l12K13j79J48K19k04
$$ 111 -202 20 -119 -282 216 102 37 51 -125 134 71 23 431 529 39 244 -68 145 -34 114 333 129
2916A29J2J4m00L17M70q23K33L32k41M40m29J82k2k24N01m06k07K60l22K18M80
$$ 129 141 155 -245 72 542 -281 -48 284 43 483 54 236 214 -10 491 85 -122 138 -184 34 514
2937E14q48M68p6k17K49j62K7j01k56K26o2k57L67J80k56R9k41J57K05l29M61
$$ 514 -334 134 58 -159 90 -72 -45 -146 -402 -176 -238 -495 -128 52 -204 -105 -346 -189 16 -313 148
2958A48n17p4K83J44q9Q0m93N81j56n06N85k31N2K55m65K60L07j84n7o0l4L08
$$ 148 -369 -443 -160 -16 -105 -25 -518 63 -93 -599 -14 -245 -193 62 -403 -143 164 -20 -77 -137 -171 137
2980A37l64L73L05l60j4J5K38K36q04K97K08l88M48j7m68M26o3O4l75J61K67j04
$$ 137 -227 146 451 91 77 92 330 566 -238 59 267 -121 327 310 -158 268 205 269 -106 55 322 218
3002B18k52L74m34K21p8j46K23n1j81K38l23Q0L98l83K1M31o68M58n36J41K39
$$ 218 -34 340 -94 127 49 -97 126 75 -106 132 -191 -111 287 -96 -75 356 -312 146 -390 -249 -10
3023a0J8k54J25k21J40K66o37N80r8L5K01k24j53J03N9%L3m11N18j96j30K34l49
$$ -10 8 -246 -121 -342 -202 64 -573 7 -91 -56 145 -79 -232 -129 -70 -70 -37 -448 70 -126 -256 -22 -371
3046c71J62L29j51J67o4J00m8L9j40J9p9L35po8m3j64P4K45k38J89j01j40J07
$$ -371 -209 120 -31 136 72 172 124 163 23 42 -37 298 291 223 180 16 90 335 97 286 185 45 152
3069A52K30l63J55J6J42l24j62L52q0R4k1j97O9K41l56K01k59J93%l43M5NK15
$$ 152 382 19 174 190 332 8 -154 198 118 212 191 -6 63 304 -52 149 -110 83 83 -260 -215 -210 5
3092Ep9J62j05q6l2M8k08mJ61J12N6m67M42j59O4Q9m02K88j28K06q7N1J40l07
$$ 5 -74 88 -17 -103 -135 -87 -295 -299 -138 -26 30 -437 5 -154 -90 -1 -403 -115 -243 -37 -124 -73 67 -240
3116b40P6J65k01J87k1J58j86K05N2l27J85J98l4j60P7k97j9J51J64j41K80j91
$$ -240 -164 1 -200 -13 -34 124 -62 143 195 -132 53 251 217 57 134 -163 -182 -31 133 -8 272 81
3138H1j55L25%l08J53J05J64l50kJ74k20J07j28K75j55q4J13mj24P7r8l8J46Q3
$$ 81 -74 251 251 -57 96 201 365 15 13 187 -33 74 -54 221 66 -18 95 91 -33 44 -54 -92 54 137
3162A37l46K61n5r9j12J0Q7j69o9N7J36J09K01k02j3J01m10K28j30N3OpK06j6
$$ 137 -209 52 -3 -102 -214 -204 -117 -286 -355 -298 -162 -53 148 -54 -67 34 -376 -148 -278 -225 -219 -226 -20 -36
3186c6o7n7j42K64L7j2o7j0nL52l13p1J31RJ4K20j54JnK39j90k23L23l25J30k5
$$ -36 -103 -160 -302 -38 -1 -13 -80 -90 -95 257 -56 -127 4 13 27 247 93 94 89 328 138 -85 238 -87 43 18
3212A8J49k51L20j36j12L12j44O9j21J49j86K95k3r9l04j98K4M44k52p5K66m9
$$ 18 167 -84 236 100 -12 300 156 225 104 253 67 362 339 240 -64 -262 -238 206 -46 -121 145 96
3234I6j56q1M6J2k52J68L0M2j13K15k43R9J26L9l68J14O8Q9J5j90L42m30J60J48
$$ 96 -60 -141 -95 -83 -335 -167 -137 -95 -208 7 -236 -137 -11 28 -340 -226 -158 -69 -54 -244 98 -332 -172 -24
3258b4j7J52j06k16M52n10K93j49m7O7J85j86K10J29k18J60k63J60J03m13K26
$$ -24 -41 111 5 -211 241 -269 24 -125 -172 -105 80 -106 104 233 15 175 -88 72 175 -238 -12
3279a2R0j41M60l68j5K36j01J77q7j46J01j93N5J20k48K64k4l07M28k0l46K63
$$ -12 78 -63 397 29 14 250 149 326 239 93 194 1 56 176 -72 192 168 -139 289 269 -77 186
3301A86j62J69k9l40J42K0j6J20r0m04L04j4J99K7l85M95l97rL18k50j55M92m92
$$ 186 24 193 164 -176 -34 -14 -30 90 0 -404 -100 -114 85 112 -273 222 -175 -184 134 -116 -271 221 -271
3324b71K17o6nJ78k45j67K06J91j78J70m51M91m21J84M32m76K32Q0l26K32L6k17
$$ -271 -54 -120 -125 53 -192 -359 -153 38 -140 30 -421 70 -351 -167 265 -211 21 101 -225 7 43 -174
3346a74N20m35K87q6L4l3j75l76P24j91l13L52k59M12J19l59K09j50k25N50l93
$$ -174 346 -89 198 112 146 113 -62 -438 286 95 -218 134 -125 287 406 47 256 106 -119 431 38
3367C8J54K5l73K37j6l90O92m12j05N97m79j73M94n71K70Qk82L85l02J95J90o43
$$ 38 192 217 -156 81 65 -325 367 -45 -150 447 -32 -205 289 -282 -12 -4 -286 99 -203 -8 182 -461
3389d61N16M0k53J29K9k43L21m86L63K64n51N28k81k76N59n49L64J6k8M0k25k63
$$ -461 55 95 -158 -29 0 -243 78 -408 -45 219 -332 196 -85 -361 198 -351 13 29 1 41 -184 -447
3411d47N85l74O1L30m77M26n1k26J73l3j46L37k27J21K1j77L97l04l6M38k28k25
$$ -447 138 -236 -175 155 -322 104 53 -173 0 -33 -179 158 -69 52 73 -104 293 -11 -47 391 163 -62
3433f2M20k31j42J58j62L64j70l32K62M0j06K81l64K35k37J23L6q0M30j28n80
$$ -62 358 127 -15 143 -19 345 175 -157 105 145 39 320 -44 191 -46 77 113 33 463 335 -245
3454b45K61k00l46N68k1j85k0n5J53N2j97L66l32p5K22j62k7J92j75L88j15m02
$$ -245 16 -184 -530 38 17 -168 -188 -243 -90 -38 -235 131 -201 -276 -54 -216 -243 -51 -226 162 47 -355
3476c55K65j18J81j55k86N58j74L3mo07N59Q0L4J82j32N7l54K43K29l20rL42k81
$$ -355 -90 -208 -27 -182 -468 90 -84 -51 -55 -662 -103 -23 11 193 61 118 -236 7 236 -84 -93 249 -32
3499c2JJ92p4J84k56J82r7j49J35J63k64M6K51k03J59N0r9J7o6r7M38m02oj3N8
$$ -32 -31 161 87 271 15 197 100 -49 86 249 -15 31 282 79 238 288 189 206 140 43 481 79 73 60 118
3524A18j21J47j00m4o5j5J62k43L44k32J21l76J22J47J37k38k96K00lO5K65n48
$$ 118 -3 144 44 0 -65 -80 82 -161 183 -49 72 -304 -182 -35 102 -136 -432 -232 -235 -170 95 -453
3546d53K96N7k82K32n5J3nj89K58J24j34L12k28N8J0o2K36l2m23M52l50K35k9
$$ -453 -157 -100 -382 -150 -205 -192 -197 -386 -128 -4 -138 174 -54 4 14 -48 188 156 -267 185 -165 70 41
3569D1l4K08j24Q1k09J58j69j86K14J26P9l0j44J64j25K56j94o4R2r8K0J37n7
$$ 41 7 215 91 172 -37 121 -48 -234 -20 106 185 155 11 175 50 306 112 48 140 42 62 199 142
3592A42j21k9oJ33J1L4m5l6m5p3K61J8k77j3K77k98j79RJ96r6q6K58n4JO6Kq8
$$ 142 21 -8 -14 119 130 164 119 83 38 -35 226 244 -33 -46 231 -67 -246 -237 -41 -137 -223 35 -19 -18 48 50 -38
3619c8l06K18J77m11K08j15J60%O9m0l36O35k60j38J50j03J36k60j6J70J99m5
$$ -38 -344 -126 51 -360 -152 -267 -107 -107 -38 -78 -414 221 -39 -177 -27 -130 6 -254 -270 -100 99 54
3641E4j33q7K23P1O1P5j60k53J37K8jK92m74K33K7k00r7L24k15J43K68k44K9M8
$$ 54 -79 -166 57 128 189 264 104 -149 -12 16 15 307 -167 66 93 -107 -204 120 -95 48 316 72 101 149
3665A49J5k02K6J60q6%K13l08Q1L4k3l20L68R5k8j88r3r0J75p1m2R1J71j24r3
$$ 149 164 -38 -12 148 62 62 275 -33 48 82 59 -261 107 202 174 -14 -107 -197 -22 -93 -135 -44 127 3 -90
3690i0P3j21j1J23k04J21J06p8P8j83K14j71J80j36k18n6L32o4Q8L0l99L18L2
$$ -90 -17 -138 -149 -26 -230 -109 -3 -81 -3 -186 28 -143 37 -99 -317 -373 -41 -105 -17 13 -386 -68 -36
3713c6j60L59l45j56M92l05J60o0O2j35L52k69R3q2n0J85j39NJ88O8j44j94L66
$$ -36 -196 163 -182 -338 154 -151 9 -51 11 -124 228 -41 52 -30 -80 105 -34 -29 159 227 83 -111 255
3736B55m5j03j10j25L01Jj66K91l85L88j13j10k45J50j22O1k35L14q6J08j6J2
$$ 255 210 107 -3 -128 173 174 8 299 -86 302 189 79 -166 -16 -138 -77 -312 2 -84 24 8 20
3758B0j42J12J43j58J67k36L02l20J48k07J63k60J57P1O6j0l2K3m3k51K34q0k10
$$ 20 -122 -10 133 -25 142 -94 208 -112 36 -171 -8 -268 -111 -40 26 16 -16 7 -36 -287 -53 -133 -343
3781c43K89j68J59k3K5m4J82l0k3k1J60k55K41j81K10j28lpo2K19l91J96p0K61
$$ -343 -54 -222 -63 -86 -61 -105 77 47 24 3 163 -92 149 -32 178 50 47 40 -22 197 -194 2 -68 193
3805A93Q1k06N5N6j61O4J9r0l8Q2K16j99p0J98l77J06P3L3Q3p3L0J9k7j88J87
$$ 193 274 68 123 179 18 82 101 11 -27 55 271 72 2 200 -177 -71 2 35 118 45 75 94 67 -121 66
3830F6q7j67P3J68r6K70m19L40k05o6j28J70Q1R7k42j44J13K9K64j75j43M82k15
$$ 66 -21 -188 -115 53 -43 227 -192 148 -57 -123 -251 -81 0 97 -145 -289 -176 -147 117 -58 -201 281 66
3853F6k56J18j65J04K13mj22p5K44j04j08K75l31J64k6q5M81k94j66J62J03o9
$$ 66 -190 -72 -237 -133 80 76 -46 -121 123 19 -89 186 -145 19 -7 -92 389 95 -71 91 194 125
3875A25K4l3L9J79k41r0J51j87L6j9K14j9K44m88M69n53J68J65k30N6j08mL16
$$ 125 149 116 155 334 93 3 154 -33 3 -16 198 179 423 -65 404 -149 19 184 -46 10 -98 -102 214
3898B14j59k09J62m9J05j99kK54j26k4L32m05K00j27k32K61J38j81j43l4J08J83
$$ 214 55 -154 8 -41 64 -135 -137 117 -9 -33 299 -106 94 -33 -265 -4 134 -47 -190 -224 -116 67
3920F7m56M55k17o3K38j78j18M9J38n2N5j99J01L06m08Q8J54j13K64l08L42k91
$$ 67 -389 66 -151 -214 24 -154 -272 -223 -85 -137 -82 -281 -180 126 -282 -194 -40 -153 111 -197 145 -146
3942a46R5J29l75L51l4K3J5n7n9q0J20m3K27j28J08k1N2k30J11O8k02J00J44J79
$$ -146 -51 78 -297 54 20 43 58 1 -58 -138 -18 -61 166 38 146 125 177 -53 58 126 -76 24 168 347
3966C47l25K00l91qJ17Q4Mr7K00j06k54J34j16J85JP6k8j88l4k7N3J66%j59L1
$$ 347 22 222 -169 -177 -60 24 28 -69 131 25 -229 -95 -211 -26 -25 51 23 -165 -199 -226 -173 -7 -7 -166 -135
3991a35j3R3j00K02k9l8n3n2k4J14j12J73J13l02K66K4j84O4j41R6P2k95J99j7
$$ -135 -148 -55 -155 47 18 -20 -73 -125 -149 -35 -147 26 139 -163 103 127 -57 7 -134 -38 34 -261 -62 -79
4015g9k9J31J6k0K14j96J8r5Q2j0k29J49J85m2on8N1O3k98L16J34k15j93K07k03
$$ -79 -108 23 39 19 233 37 55 -40 42 32 -197 -48 137 95 89 31 82 145 -153 163 297 82 -111 96 -107
4040a07K52O6k65J29J0j88L15j75L30l88J08n2j99M9J30j38%M12l79j44J00K64
$$ -107 145 211 -54 75 85 -103 212 37 367 -21 87 35 -164 -115 15 -123 -123 289 -90 -234 -134 130
4062A30m33J64L6J19P9l51L24j16J21j08q6o0p0j1J03J33n6J50l00L61k48P9j02
$$ 130 -303 -139 -103 16 95 -256 68 -48 73 -35 -121 -181 -251 -262 -159 -26 -82 68 -232 129 -119 -40 -142
4085a42j04L40j81n2P9J80p4P2K6k87K69k15JnO3J77j05M7J56k8j22r3J07j43
$$ -142 -246 94 -87 -139 -60 120 46 118 144 -143 126 -89 -88 -93 -30 147 42 89 245 217 95 2 109 -34
4109c4K12j19J68l85J60Ok39L58k77K47r7l8P3K12j21nQ5k03J31j76j77LJ33J10
$$ -34 178 59 227 -158 2 8 -231 127 -150 97 0 -38 35 247 126 121 206 3 134 -42 -219 -216 -83 27
4133B7q4J94k02J52l41L08m18M44n2m7J54k01J36j99N0Q6k02k9M15j90K5j11K22
$$ 27 -57 137 -65 87 -254 54 -364 80 28 -19 135 -66 70 -129 -79 7 -195 -224 191 1 26 -85 137
4156A37j95m7K53j74Q3j55nJ00N9q0K77k20L0q3O6O9k23j20K28o0J72r3J73j45
$$ 137 -58 -105 148 -26 57 -98 -103 -3 56 -24 253 33 63 -20 46 115 -108 -228 0 -60 112 19 192 47
4180D7m5J03k10P5M6j02K39k31LK59k34j42K19o0K10k57k6L50m11K25l2k63J82
$$ 47 2 105 -105 -30 16 -86 153 -78 -75 184 -50 -192 27 -33 177 -80 -106 244 -167 58 26 -237 -55
4203e5Q9m4l0l66P33n12N3J61r2J62k31R6k61N10m74J08J04J9m0J41r9k15J78
$$ -55 34 -10 -40 -406 327 -185 -132 29 -63 99 -132 -36 -297 213 -261 -153 -49 -30 -70 71 -28 -243 -65
4226f5K32j70r8R5q6J19Kq1k4R6j28j27K63O8K1j08K08l48K30p5L09k37k91L23
$$ -65 167 -3 -101 -6 -92 27 29 -52 -76 20 -108 -235 28 96 117 9 217 -131 99 24 333 96 -195 128
4250A28j81R6P7J99k56pl5L14k78P3J90m79J61N7p9L27l56J24J25m23N46m56P2
$$ 128 -53 43 120 319 63 56 21 335 57 130 320 -159 2 59 -20 307 -49 75 200 -223 323 -133 -61
4273f1j26J41J22j35J9J65j64J55Q2l24r1J60k35K86p7L3K79m94J32K90k35k08
$$ -61 -187 -46 76 -59 -40 125 -39 116 198 -126 -217 -57 -292 -6 -83 -50 229 -265 -133 157 -78 -286
4295b86K65J50k93j60L30N7p0q6o3J10JN7q3OJ74p3l9K38j61M3Q3p6Q6q5K3l99
$$ -286 -21 129 -164 -324 6 63 -7 -93 -156 -46 -45 12 -71 -65 109 36 -3 235 74 117 200 124 210 125 148 -251
4321b51K89Q2r1QJ14j26J92o9l84L43L8p5K85l03j25K21m1q6K90m97M03k72Q1
$$ -251 38 120 29 37 151 25 217 148 -236 107 145 70 355 52 -73 148 107 21 311 -186 217 -55 26
4344B6j11%P6j63K55k07k4K14O4j83J10k0m0q9R3j24N5J34k08L9j17P6J5j41K59
$$ 26 -85 -85 -9 -172 83 -124 -148 66 130 -53 57 37 -3 -92 1 -123 -68 66 -142 -103 -220 -144 -129 -270 -11
4369a1k98L40j31P2j02k11K63Q7K3j78K12r5M9J3p9k66J61K26j10J5J1J97k49
$$ -11 -309 31 -100 -28 -130 -341 -78 9 32 -146 66 -29 20 33 -46 -312 -151 75 -35 -20 -9 188 -61
4392f1K25j12N0L6j64J29j07L75l89J05J93k13j23Q4k54K50J20j87K20k13N8o7
$$ -61 164 52 102 138 -26 103 -4 371 -18 87 280 67 -56 28 -226 24 144 -43 177 -36 22 -45
4414d5O0K47l81k98L05K50j55J95k45J2J88j59K20q3r1n7o7o2L08k60J34Q7k76
$$ -45 15 262 -119 -417 -112 138 -17 178 -67 -55 133 -26 194 111 20 -37 -104 -166 142 -118 16 103 -173
4437a73K88KL4j03l9q6Mm7k5o4N4K03J18k04J56k1j21k8j96K45j37K17j4k59O4
$$ -173 115 117 151 48 9 -77 -73 -120 -145 -209 -155 48 166 -38 118 97 -24 -52 -248 -3 -140 77 63 -196 -132
4462a32K55j63K11m2K3j71J13j18L32k83r6J15K6R4o5l6M2K1j94J39j56K13j28
$$ -132 123 -40 171 129 152 -19 94 -24 308 25 -71 44 70 164 99 63 105 126 -68 71 -85 128 0
4485@J96l64J39P5L0r9J57l35J83R7K0p2J05j48n0Q2Ml4j10K8N0J51q3k13J42
$$ 0 196 -168 -29 46 76 -23 134 -201 -18 79 99 27 132 -16 -66 16 20 -14 -124 -96 -46 105 22 -191 -49
4510d9kn9n2N2j8N2Q9p7j10K81l22J87K5l36L90k24K30j68j01MK10P7j53K17r9
$$ -49 -51 -110 -162 -110 -128 -76 13 -64 -174 107 -215 -28 -3 -339 51 -173 57 -111 -212 -208 2 79 -74 143 44
4535D4o8K34j32K20m55L21k37r1L04j43J90K8j53L5J31j95K61k7j38o1k0k31L15
$$ 44 -24 210 78 298 -157 164 -73 -164 140 -3 187 215 62 97 228 33 294 267 129 68 48 -183 132
4558A32j45j47J21L43l76J92j32M2q0n4l6l86N25j18J34J65l37j96J40J99o4j33
$$ 132 -13 -160 -39 304 -72 120 -12 30 -50 -104 -140 -526 -1 -119 15 180 -157 -353 -213 -14 -78 -211
4580b11L39k41L3K74l10J15n6J38j19L8M5k85K03k44J05J16k2O9J39k53M6L2K67
$$ -211 128 -113 -80 194 -116 -1 -57 81 -38 0 45 -240 -37 -281 -176 -60 -82 -13 126 -127 -81 -49 218
4603B18k34l1j91K39j35M0mK1NQ1K8j61J57L0j76N31l46k1j41L0L09K33l64j47
$$ 218 -16 -47 -238 1 -134 -94 -98 -77 -72 9 37 -124 33 63 -113 418 72 51 -90 -60 249 482 118 -29
4627b9M3n8j39J54K9j2J74p1j41N3J23n6j34J69k25K78k33J68M3k06J8j58J54
$$ -29 14 -44 -183 -29 0 -12 162 91 -50 3 126 70 -64 105 -120 158 -75 93 136 -70 -52 -210 -56
4650e6qL42n12L20k80P8k6J91J0J4k09M13m22J40J3l71L05R9j45J30k03j34K91
$$ -56 -64 278 -234 86 -194 -116 -142 49 59 73 -136 277 -145 -5 8 -363 -58 41 -104 26 -177 -311 -20
4673b0J24k6k4p6nj54J50Q9J14j59j4L7n0J3J70k42K4K9n1J38k18M27l51J11Q2
$$ -20 104 78 54 -22 -27 -181 -31 58 172 13 -1 36 -14 -1 169 -73 -49 -20 -71 67 -151 276 -75 36 118
4698A18J24k23j69J91J26l61m1J60J59k82J21M27k76q8L1N8J44j49k77K92j44
$$ 118 242 19 -150 41 167 -194 -235 -75 84 -198 -77 350 74 -14 17 75 219 70 -207 85 -59
4719e9n6L6k1j7R4j19K26k9m0oO1p3K0Q4k58J44L0J0k1m0l53M56J3j7Nk2Pj0k10
$$ -59 -115 -79 -100 -117 -23 -142 84 55 15 9 70 -3 17 101 -157 -13 17 27 6 -34 -387 69 82 65 70 48 55 45 -165
4748a65J3O2qJ32k70L21l7%Q1j84K32J8k02K0j93J17O8k56K33J86k90K93q2k24
$$ -165 -152 -90 -98 34 -236 85 48 48 129 -55 177 195 -7 13 -180 -63 5 -251 -18 168 -122 171 89 -135
4772a35K12O9O9J28m65J80n4J77o3l15K17L24l02R0j35k01K41p4j48L97k09j2
$$ -135 77 146 215 343 -122 58 4 181 118 -197 20 344 42 132 -3 -204 37 -37 -185 212 3 -9
4794il3j69J82Q9j18K13l82M63k14j9M2O1r4m6K3m46N56k91K77l2m7J9p2O2J39
$$ -9 -42 -211 -29 60 -58 155 -227 236 22 3 45 106 12 -34 -11 -457 99 -192 85 53 6 25 -47 15 154
4819A54k84%K51k52J62q0J18M1l04L19l11J1L65p9R1l32J98k70M91m54J29K35
$$ 154 -130 -130 121 -131 31 -49 69 110 -194 125 -186 -175 190 111 202 -130 68 -202 289 -165 -36 199
4841A99k4R7l52J58P5l05J04K94o2l1k29J5j24M87k62nP7J39j17j34P7J1J12k40
$$ 199 175 272 -80 78 153 -152 -48 246 184 153 -76 -61 -185 302 40 35 112 251 134 0 77 88 200 -40
4865d0L0j0k92K19K9L1L3j8j39K32k68K19n5r0J04O6J13l08M14k90j41P7p7J34
$$ -40 -10 -20 -312 -93 -64 -33 0 -18 -157 75 -193 26 -29 -119 -15 51 164 -144 270 -20 -161 -84 -161 -27
4889b7j21J52l20K20J73j3j55Q3R1Q0O0k03j33J00j21R5j87K61k08J11J25M0j1
$$ -27 -148 4 -316 -96 77 64 -91 -8 83 163 223 20 -113 -13 -134 -39 -226 35 -173 -62 63 103 92
4912I2l56M83j19L5J18l16K70j64p2J73n9L2k93L65K5m48J91r5K58k12K49j74
$$ 92 -264 219 100 135 253 -63 207 43 -29 144 85 117 -176 189 214 -234 -43 -138 120 -92 157 -17
4934a7K31J30k60j21L8J7m4J00q2P8k86K45r4K29Lp7j53q8L22m2j69J18k1j39
$$ -17 214 344 84 -37 1 18 -26 74 -8 70 -216 29 -65 164 167 90 -63 -151 171 129 -40 78 57 -82
4958h2K3Q6l92L89k04K64j93K33k19J17J2k60J92j3O9j04q2N02l42J31k11j35
$$ -82 -59 27 -365 24 -180 84 -109 124 -95 22 34 -226 -34 -47 22 -82 -164 338 -4 127 -84 -219
4980b19J45j59K55K50k79j3J35k36J90J31l38P8k4J83R9m4m16M80p4j36j58K00
$$ -219 -74 -233 22 272 -7 -20 115 -121 69 200 -138 -60 -84 99 198 154 -262 218 144 8 -150 50
5002E0q2J9M15l11j31m0K11j40J05J8J12l20J42k13K30j89J15j27K77l23O9r5
$$ 50 -32 -13 402 91 -40 -80 131 -9 96 114 226 -94 48 -165 65 -124 -9 -136 141 -182 -113 -208
5024b08n0K71j13l1K09j19R6J72j49j4l04L19j60P1O6k26J64k12M22k00N1m6j09
$$ -208 -258 13 -100 -131 78 -41 55 227 78 64 -240 79 -81 -10 56 -170 -6 -218 204 4 55 9 -100
5047a00Q3j08Q8k59L51q9k25K25p7K22k08r0R3rO2Jl2L1P7J76j80p8K98j89K8
$$ -100 -17 -125 -37 -296 55 -34 -259 -34 -111 111 -97 -187 -94 -103 -41 -40 -72 -41 36 212 32 -46 252 63 91
5072I1N3j34P2M2j57J97q9J85m90M20m5k71M3J7N2J63j87j0N8J30j77j98L07j05
$$ 91 144 10 82 124 -33 164 75 260 -230 190 145 -126 -83 -66 -14 149 -38 -48 10 140 -37 -235 72 -33
5096c3j12K66j57J3k28K90K6n2j31J33k9m0j33J86o5o9j88R7P7K63J28m75K75
$$ -33 -145 121 -36 -23 -251 39 65 13 -118 15 -14 -54 -187 -1 -66 -135 -323 -226 -149 114 242 -233 42
5119D2J58l21L8P0K22j71P9ok0RPj08j42j58M17r0j72M06j69j72P1pP9J26r8k13
$$ 42 200 -121 -83 -13 209 38 117 111 91 100 107 -1 -143 -301 116 26 -146 260 91 -81 -10 -17 62 188 90 -123
5145a23O9K39r8k39R6N0n3q7M21j58L3k14Q6K44QJ4j81k17K43j71l0J39k74K35
$$ -123 -54 185 87 -152 -56 -6 -59 -146 275 117 150 -64 22 266 274 288 107 -110 133 -38 -68 71 -203 32
5169C2p3J02Q7J8l82L43k78K29r3J52k35K55j60L5q1j21P6o4n2J29K98l98J06
$$ 32 -41 61 148 166 -216 127 -151 78 -15 137 -98 157 -3 32 -49 -170 -94 -158 -210 -81 217 -181 -75
5192g5N4k81J73L4J42RQ1p8j54K67j70o0j28j7L70K6k74J8j6p7K13J41l37K31
$$ -75 -21 -302 -129 -95 47 56 137 59 -95 172 2 -58 -186 -203 167 193 -81 -63 -79 -156 57 198 -139 92
5216I2J47k65K26j85n3p1J81l4q0q8K10K8p0q1o5M38k78No9R1k15j93M16k09l5
$$ 92 239 -26 200 15 -38 -109 72 38 -42 -130 80 108 38 -43 -108 330 52 57 -12 79 -136 -329 87 -122 -157
5241a57J54k32O40k70j01p0L8j45J54m6r2j7J00j56m1K42N2q0j62K39n6L6N5k32
$$ -157 -3 -235 405 135 34 -36 2 -143 11 -35 -127 -144 -44 -200 -241 1 53 -27 -189 50 -6 30 85 -147
5265a47J82q6J43M4r0k73R0J99q3O3o0M7q6R0J36k54J81j96P0L9j34K14j66J34
$$ -147 35 -51 92 136 46 -227 -137 62 -21 42 -18 29 -57 33 169 -85 96 -100 -30 9 -125 89 -77 57
5289E7j3Ml54L63l2k72K40Pj19n1J14Q3k54K90N2j67J22J22N9k67k17K69M0j66
$$ 57 44 48 -306 57 25 -247 -7 0 -119 -170 -56 27 -227 63 115 -52 70 192 251 -16 -233 36 76 -90
5313i0M1J41j57P0K28k82L90k69q6Q6kk06L3n7L26j65k75o7N65n46N52j97j21
$$ -90 -49 92 -65 5 233 -49 341 72 -14 72 70 -136 -103 -160 166 1 -274 -341 224 -322 230 33 -88
5336h8Q8j50K70j70L38k89j21L06j31kk36L58j37m5J5j7R9q6q8K23r0j56R0P9
$$ -88 0 -150 120 -50 288 -1 -122 184 53 51 -185 173 36 -9 6 -11 88 2 -86 137 47 -109 -19 60
5360F0j13J84j09J7j41L8P0k42J79j06J65k2j24p9K47l94N13k30J52J4R0j1k25
$$ 60 -53 131 22 39 -102 -64 6 -236 -57 -163 2 -20 -144 -223 24 -370 143 -87 65 79 169 158 -67
5383f7k12M06J73k77R1J7Oo9n5q8p9R0J01p7J36J12m54J98M9j26J58k8K1J83k17
$$ -67 -279 127 300 23 114 131 137 68 13 -75 -154 -64 37 -40 96 208 -246 -48 1 -125 33 5 26 209 -8
5408hj26K19k05J98j3l33L67L3P5k44j48J01l9J49L5k02K75j90o7L53r0j94n8
$$ -8 -134 85 -120 78 65 -268 99 132 207 -37 -185 -84 -123 26 61 -141 134 -56 -123 230 140 -54 -112
5431a12Q4m9k6n5J85m9mK18n89K64%Q6J70J17k90J3n0PL92q6k17j36M20n03J35
$$ -112 -28 -77 -103 -158 27 -22 -26 192 -397 -133 -133 -47 123 240 -50 -37 -87 -80 312 226 9 -127 293 -210 -75
5456g5N1j61J56J30k2j73o1J16J5k6L26m71K54M2o1K0j22K11j20j79J40J28j32
$$ -75 -24 -185 -29 101 79 -94 -155 -39 -24 -50 276 -195 59 101 40 60 -62 149 29 -150 -10 118 -14
5479a4J13k05r5K16Ol8K6P9r0k26K21J96j11k26J89p4l9K51r4o8k14K52j41J31
$$ -14 99 -106 -201 15 21 -17 9 88 -2 -228 -7 189 78 -148 41 -33 -72 179 85 17 -197 55 -86 45
5503D5l8J34j93l9q8L06k36J56J46k95J05o2Q5J95j39j40J90nj40J53J91m38J86
$$ 45 7 141 -52 -91 -179 127 -109 47 193 -102 3 -59 26 221 82 -58 132 127 -13 140 331 -107 79
5526G9j65J98j13L1q4K87k98P4L3r4m7j6K95k41M5j94K17J80p7P5k51k65K46p8
$$ 79 -86 112 -1 30 -54 233 -65 9 42 -52 -99 -115 180 -61 -16 -210 7 187 110 185 -66 -331 -85 -163
5550a63M1M58k98j5p9P0J68k16K80k45l6J45j05k76j5L66l86L21l02K82M5K52
$$ -163 -122 336 38 23 -56 14 182 -34 246 1 -35 110 5 -271 -286 80 -306 15 -287 -5 40 292
5572B92m08%J39l76L20J64m25L71q4j7J80k38J04O3jj37Q2o9K2j30K88j28Rk3
$$ 292 -116 -116 23 -353 -33 131 -294 77 -7 -24 156 -82 22 85 84 -53 29 -40 -18 -148 140 12 21 -2
5596bm0jl3n4M8Q6k07K72M1l20L08J26k56k86L14j10o7K56j38J7j75L99j47%r2
$$ -2 -42 -43 -76 -130 -82 4 -203 69 110 -210 98 224 -32 -318 -4 -114 -181 75 -63 -46 -221 178 31 31 -61
5621f1J68j76Q8K02k17j64pL71k10J3j7j16Q1J6P6L8N6j65m8K4J55m7j7j95L82
$$ -61 107 -69 19 221 4 -160 -167 204 -6 7 -10 -126 -45 -29 47 85 141 -24 -72 -48 107 60 43 -152 230
5646B30k27j60K88k1j91j40K78l9j47k12M68o9k02J61r1J39Q3J48k80J04j64K64
$$ 230 3 -157 131 110 -81 -221 57 18 -129 -341 127 58 -144 17 -74 65 148 296 16 120 -44 220
5668B20n49M74j78qJ65q9j42m1J53J30j77k25R4K63l45Q5QL85j48no8p2K54k03
$$ 220 -329 145 -33 -41 124 35 -107 -148 5 135 -42 -267 -173 90 -255 -170 -162 223 75 70 2 -70 184 -19
5692a9m7J69r8JJ41j31j65K13j52J24k00N9j65L03Kn7p4l5J71j22J2J16j94J19
$$ -19 -66 103 5 6 147 16 -149 64 -88 36 -164 -105 -270 33 35 -22 -96 -131 40 -82 -70 46 -148 -29
5716b9o7RJ48J14j06j30Q1M3k77K82l2J1j31J30J85l63J57r0J01K9l7j3o1J34
$$ -29 -96 -87 61 175 69 -61 20 63 -214 68 36 47 -84 46 231 -132 25 -65 36 65 28 15 -46 88
5740H8o6r9J3j58J34k3K82k22N8n3J68l37L95o1r5n2L5J42l97M55k57J36j45O9
$$ 88 22 -77 -64 -222 -88 -111 171 -51 7 -46 122 -215 180 119 24 -28 7 149 -248 207 -50 86 -59 10
5764A0L2j08J84J84j91L9l23J50j29k24L58j47J59R9k66L54m9j96k04L35q3n0
$$ 10 42 -66 118 302 111 150 -173 -23 -152 -376 -18 -165 -6 93 -173 181 132 -64 -268 67 -16 -66
5786f6j8KO2j47Q1J78j63J97j04K50j14m1k54q0K82k10K28l34N01kk43k9Mln4
$$ -66 -84 -82 -20 -167 -86 92 -71 126 22 272 158 117 -137 -217 65 -145 83 -251 250 248 5 -24 -20 -23 -77
5811g7j04L81k0j97J17l30N8J16N2J9j84K33l3L7k73K00K7q8R3j30K75O6l05j7
$$ -77 -181 200 180 -17 100 -230 -172 -56 -4 15 -169 64 31 68 -205 -5 22 -66 27 -103 172 238 -67 -84
5835h4J38l2J04p4k17J93k3j09Q1M6l2n0j51o2K46J82j24k17K67J8j75l4K02k77
$$ -84 54 22 126 52 -165 28 5 -104 -23 23 -9 -59 -210 -272 -26 156 32 -185 82 100 -75 -109 93 -184
5859a84J89j27K9R9J22q2R6k14J24j06N2J7r4m5L22k51J14J53j73k95L14P4l10
$$ -184 5 -122 -93 6 128 46 142 -72 52 -54 -2 15 -79 -124 198 -53 61 214 41 -254 60 134 -176
5882a76R3R3J40k7r2L9k66M0L44k19J06J22r0r6p3J41j00J26l29J36p6K36k48
$$ -176 -83 10 150 123 31 70 -196 -156 188 -31 75 197 107 11 -62 79 -21 105 -224 -88 -164 72 -176
5905a76L09n4r1J3r1K54k58K84k15k24K24K7J00m93L88J07j78L2qP8oK15l90J0
$$ -176 133 79 -12 1 -90 164 -94 190 -25 -249 -25 2 102 -391 -3 104 -74 -42 -50 28 22 237 -153 -143
5929a43Q3R2l01L34j1j87J89o6m9m5QK16j82j96R3J21r0J9L20r2j1j80j27L31
$$ -143 -60 32 -269 65 54 -133 56 -10 -59 -104 -96 120 -62 -258 -165 -44 -134 -115 205 113 102 -78 -205 126
5953A26k53J00L3j97q7M44R3m45J83r7q8L93m70K82K5q9R0k35K85r6J8K58l22
$$ 126 -127 -27 6 -191 -278 166 259 -186 -3 -100 -188 205 -265 17 42 -47 43 -192 93 -3 15 273 -49
5976d9N0l1O0J45r7K64k91J27k78J39rK48p3j52Q8m59N03n17J78J49J11K5j73
$$ -49 1 -30 30 175 78 342 51 178 -100 39 30 278 205 53 141 -318 185 -332 -154 -5 106 131 -42
5999d2K65m86J26J43O5j93J2J99K44m45K1j25L59m57J40J05k1K9j08L49M4l90
$$ -42 223 -263 -137 6 71 -122 -110 89 333 -112 -91 -216 143 -314 -174 -69 -90 -61 -169 180 224 -166
6021a66J60N2k25L02j19J2j46J63r9K36n6k67J33P4k15P5J8J85n0K8N2k92R3l1
$$ -166 -6 46 -179 123 4 16 -130 33 -66 170 114 -153 -20 54 -161 -86 -68 117 67 95 147 -145 -52 -83
6045h3j93K05j97L33j35R5n2m0r3J29J86j31k6n7K17j07k1J95j86j05m8O5j19
$$ -83 -276 -71 -268 65 -70 25 -27 -67 -160 -31 155 24 -2 -59 158 51 30 225 39 -66 -114 -49 -168
6068a68m3J86J72k04k9j07L10k29K04l10J02L06j11j97N3J7K87l74r9K83L6r7
$$ -168 -211 -25 147 -57 -86 -193 117 -112 92 -218 -116 190 79 -118 -65 -48 239 -135 -234 49 85 -12
6090a2J08l53L41j83J90O2j52J73j49j71K13J33m25K75p9j87K27P6q9n8l6p6O
$$ -12 96 -257 84 -99 91 153 1 174 25 -146 67 200 -225 50 -29 -216 11 87 -2 -60 -96 -172 -166
6113a66P6K00j58r9K56p5J42k88J31K06Q1k93j93Q9O2J8L06n62K54L26m60L1p8
$$ -166 -90 110 -48 -147 109 34 176 -112 19 225 306 13 -180 -91 -29 -11 295 -267 -13 313 -147 -116 -194
6136a94L66r1j20N7oJ31P4l09K52j99J78M9l20N5o5K86lk61J8j54J65J03n8j42
$$ -194 172 81 -39 18 12 143 217 -92 160 -39 139 188 -132 -77 -142 144 141 -120 -102 -256 -91 12 -46 -188
6160a88J63q5J00m1k7k14K93J3O7K8l93J69L39J7k91R7l1O4O5j99j82K4JK12J19
$$ -188 -25 -110 -10 -51 -78 -292 1 14 81 109 -284 -115 224 241 -50 47 16 80 145 -54 -236 -212 -211 1 120
6185A20l4k2J83k49p7j20K49M1j30l1k9j82L13j21n0J29L34o5j78J01m9k36L53
$$ 120 86 64 247 -2 -79 -199 50 91 -39 -70 -99 -281 32 -89 -139 -10 324 259 81 182 133 -103 250
6208B50j26l79J22K30J31k27K0j74J60Q8L7J7l86J42P3J11K1p7K84m05M5j45K80
$$ 250 124 -255 -133 97 228 1 21 -153 7 95 132 149 -237 -95 -22 89 110 33 317 -88 -43 -188 92
6231I2o6j19J49K10j53k21J78m1j81nN3J71J54q9K3rj22j4r4J3R1K1q6J73m2K9
$$ 92 26 -93 56 266 113 -108 70 29 -152 -157 -104 67 221 132 155 146 24 10 -84 -71 20 41 -45 128 86 115
6257A15o3Q3j19j26J14mJ4j47J26o2P5m1m7J77k14l1L37k85p8J21J19q8n1J4j29
$$ 115 52 135 16 -110 4 0 14 -133 -7 -69 6 -35 -82 95 -119 -150 187 -98 -176 -55 64 -24 -75 -61 -190
6282a90J87Q7K36l20K03Q4k28o0K33l34J88k11J38J10j64j22K77r9p7J2r9J98
$$ -190 -3 84 320 0 203 287 59 -1 232 -102 86 -125 13 123 -41 -163 114 15 -62 -50 -149 49
6304D9k8j2Q2k04J91J5j14J76j88L7j82M2K79r4j84J54j01KK09Q2j79JN4j6nk44
$$ 49 21 9 91 -113 78 93 -21 155 -33 4 -178 -136 143 49 -135 19 -82 -80 129 211 32 33 87 71 66 -178
6330a78K35m5o9j0J67Kj71J7j26L43m79N26j33L4m0j33J76N0k03k28K60j55J40
$$ -178 57 12 -57 -67 100 102 -69 -52 -178 165 -314 212 79 113 73 -60 116 166 -37 -265 -5 -160 -20
6353b0P8k46K83j00l0J72j86J59n6q0R6J01k82O1P3o0l7M4K22m7j87J79Q1j52
$$ -20 58 -188 95 -5 -35 137 -49 110 54 -26 70 171 -111 -50 23 -37 -74 -30 192 145 -42 137 218 66
6377F6k0j61J03rJ41K5k09L1m4l8L3Q3j33p2K29J34k10K21j65r0j41pJ27O9J10
$$ 66 46 -115 -12 -21 120 145 -64 -33 -77 -115 -82 1 -132 -204 25 159 -51 170 5 -85 -226 -233 -106 -37 73
6402G3p2k0j14j39L60k43M5P5J38j40l51N01k01J27l2j08R6O7j51J50m9J57j11
$$ 73 1 -19 -133 -272 88 -155 -110 -35 103 -37 -388 113 -88 39 7 -101 -5 62 -89 61 12 169 58
6425E8P4j29p2J06K27P6k61J8J5j94KP5J41k55J26J80k00j01L89j74o2R3O9j93
$$ 58 132 3 -69 37 264 340 79 97 112 -82 -80 -5 136 -119 7 187 -13 -114 275 101 39 132 201 8
6449Hl0J14o6K39n3l70P0L59l23p6k4L2R7J0m0qJ34L8lk3oq3j5J31q4k42J66J37
$$ 8 -22 92 26 265 212 -158 -88 271 -52 -128 -152 -120 -23 -13 -53 -61 73 111 108 85 79 -4 -19 112 28 -214 -48 89
6477H9Mq6l52N24N6k59L06k52j29K74k90K10r0K41k75J28r5J43r6r9J43o6j89
$$ 89 93 7 -345 179 235 -24 282 30 -99 175 -115 95 5 246 -29 99 4 147 51 -48 95 29 -160
6500a60K8J65p7j36L48j78p7pR4j61J81J78j39kQ6j10M2P2j89J79l4j1O4J53n29
$$ -160 -132 33 -44 -180 168 -10 -87 -94 0 -161 20 198 59 57 143 33 75 147 -42 137 103 92 156 309 -220
6525b20Q7K59j49J27j73j37K08P5j82q1O3R3L3l5j20J39OO1K7l56K5M06q2j62
$$ -220 -133 126 -23 104 -69 -206 2 77 -105 -186 -123 -30 3 -32 -152 -13 -7 54 81 -275 -250 156 74 -88
6549h8K66j71Q6lr0J73j41M3J1J38j00r2j22J75k00j4j02K43j5K38k78r3K17j51
$$ -88 178 7 93 90 0 173 32 75 86 224 124 32 -90 85 -115 -129 -231 12 -3 235 -43 -136 81 -70
6573g0q6M67k95R9k35K27j93M9J05P5J4m22J70J72p9o4kL88q0l49L15j80r6k31
$$ -70 -156 311 16 115 -120 107 -86 -37 68 143 157 -265 -95 77 -2 -66 -68 320 240 -109 206 26 -70 -301
6597c01K78L7q7J71n1j09J09J0J51k32k49K40j78K54r8QM5Q9p4o6L58m23K09q9
$$ -301 -23 14 -73 98 47 -62 47 57 208 -24 -273 -33 -211 43 -55 -47 -2 87 13 -53 305 -118 91 2
6621Bj98K14p6J63Q9l32J36k43M26k99J00j39J60k3r5O8N9q3L29j72O1J6j28k90
$$ 2 -196 18 -58 105 194 -138 -2 -245 181 -118 -18 -157 3 -20 -115 -47 12 -71 258 86 147 163 35 -255
6645b55M47k48K6K7J72l1r3P4l10M62j59j18k52L01J33k06J4J5N8r2K9J6j59K6
$$ -255 192 -56 -30 -3 169 138 45 119 -191 271 112 -6 -258 43 176 -30 -16 -1 57 -35 -6 10 -149 -123
6669a23L83k75R4n8qO0k0k94M22j95K14k32j93M28k70r8K30k18J43J87j35J09
$$ -123 260 -15 79 21 13 73 53 -241 181 -14 200 -32 -225 203 -67 -165 65 -153 -10 177 42 151
6691A51p0j40R9J69k16J60j05j22J16o8J74j51M5m3j07P0L7l7J5K79k39n6J93
$$ 151 81 -59 40 209 -7 153 48 -74 42 -26 148 -3 42 -1 -108 -38 -1 -38 -23 256 17 -39 154
6714A54j27l3L6J26l00L33p7j57J86l92K73k04K73o7J95k86O1P1j02n2K65j94
$$ 154 27 -6 30 156 -144 189 112 -45 141 -251 22 -182 91 24 219 -67 -6 65 -37 -89 176 -18
6736a8K74L3l71J90k62J98J06j53M5J60l13p1K50RJ20j5k17j22L00q9J1r7p0p
$$ -18 256 289 -82 108 -154 44 150 -3 42 202 -111 -182 68 77 197 182 -35 -157 143 54 65 -32 -102 -109
6760a09J9P8J91nk35R8qj38j33L36l2k93J45J53R7l5j80J42P2l17J06M6L4j71
$$ -109 -90 -12 179 174 -61 37 29 -109 -242 94 62 -231 -86 67 164 129 -51 91 163 -154 -48 -2 32 -139
6784a39M0M0J96j66rl2M3L0k09J93p0n0l5M34k57J06j04K14k03J92L7l44k0J40
$$ -139 -99 -59 137 -29 -38 -70 -27 3 -206 -13 -83 -133 -168 266 9 115 11 225 22 214 251 -93 -113 27
6808B7j75P3K38j83J22m1k4K15k71p6P3J53q2M5k33J05K54k86j60N43l54N5R7
$$ 27 -148 -75 163 -20 102 61 37 252 -19 -95 -22 131 49 94 -139 -34 220 -66 -226 317 -37 18 115
6831A15n6o5O4k11K96j07r5K4j18J95j14J50k50L67k16J12L2k04k54M92j49QO4
$$ 115 59 -6 58 -153 143 36 -59 -35 -153 42 -72 78 -172 195 -21 91 123 -81 -335 157 8 16 80
6854H0k79K51l86J83O1P6k58K76l5j5K6p5O2m0j19K16j72J00K4N6j01r6J50j27
$$ 80 -199 52 -334 -151 -90 -14 -272 4 -31 -46 -20 -95 -33 -73 -192 24 -148 -48 -24 32 -69 -165 -15 -142
6878a42J95kN0j6o8J31j03J50m0k02R8l1j77K29k51K37j26N4P0j61J61qJ08k71
$$ -142 53 51 101 85 17 148 45 195 155 -47 51 20 -157 72 -179 58 -68 -14 56 -105 56 48 156 -115
6902a15K01m7J1j41k71N49j72k30O8J57pn1L2j47K3N2J13M9RK3j83J85j09O3j87
$$ -115 86 39 50 -91 -362 187 15 -215 -147 10 3 -48 -16 -163 -140 -88 25 74 83 106 -77 108 -1 62 -125
6927a25O2j53j3l9K73J7J46k97L4K2j9j60J92L6l06K78k7K18j08o6q6q2N3J66
$$ -125 -63 -216 -229 -268 5 22 168 -129 -95 -73 -92 -252 -60 -24 -330 -52 -79 139 31 -35 -121 -203 -150 16
6951A6J52j40O8N5j13K2o5Pj32J25j22j7K52j77J50o1q7j9L00r0j67J63j03J34
$$ 16 168 28 96 151 38 60 -5 2 -130 -5 -127 -144 108 -69 81 20 -67 -86 214 124 -43 120 17 151
6975A51j12k88P6K75n9j7j95rR7k0J02Q5l34M02n74L26K3M9K53j30l4p4k11J04
$$ 151 39 -249 -173 102 43 26 -169 -178 -81 -101 1 86 -248 154 -420 -94 -71 -22 231 101 67 -7 -218 -114
6999a14K17j62l3K9K28j82J92k18J98N2k45qM6q2j51L18J8j06K91j60j00J20l42
$$ -114 103 -59 -92 -63 165 -17 175 -43 155 207 -38 -46 0 -82 -233 85 103 -3 288 128 28 148 -194
7022a94L56r5j33R0j52K88J34j84k10J07j13k48N72r8r0m6J10r5j55K92k13O4
$$ -194 162 67 -66 24 -128 160 294 110 -100 7 -106 -354 218 120 30 -16 94 -1 -156 136 -77 -13
7044a3P0J60m07J99p7K66k03J30j84j47K56J81l24j04J92L4J97k12J02nj26j91
$$ -13 57 217 -190 9 -68 198 -5 125 -59 -206 50 231 -93 -197 -5 29 226 14 116 111 -15 -206
7066b06L6lM37l02l4L8k63L20o1j96O3P8n7J69O5r2L0j86K57j80L83Om34JQ0J80
$$ -206 -170 -173 264 -38 -72 -34 -297 23 -38 -234 -171 -93 -150 19 84 -8 22 -164 93 -87 296 302 -132 -131 -51 129
7092A29k26K41m09J67K25o6j66K22j64l6R7l57K55k6J88k0j86K04n0K16j34j49
$$ 129 -97 144 -265 -98 127 61 -105 117 -47 -83 14 -343 -88 -114 74 54 -132 72 22 238 104 -45
7114d5k3J57l37N07l50K15J91n42L91j15j57L26r9O6j74N2K3j15K04l9r6Pk30
$$ -45 -68 89 -248 259 -91 124 315 -227 164 49 -108 218 119 185 11 63 86 -29 175 136 40 47 -183
7137a83N7l8L99j65j09l38M67m3J13j08M8k9k2j3N3j4K6l21K07j66P4jO2n5j49
$$ -183 -126 -164 235 70 -39 -377 90 47 160 52 100 71 49 36 89 75 101 -220 -13 -179 -105 -106 -44 -99 -248
7162b48J21K38j32l23N97k10j23J37l9j05J32j4O9J08l78J79M8k8J91m90J25J73
$$ -248 -127 111 -21 -344 253 43 -80 57 18 -87 45 31 100 208 -170 9 57 29 220 -270 -145 28
7184B8j01J20m1k25J34Q0J21r4K77l64J02m6r9J11J92k91l0K3j00J51M6R5M5j97
$$ 28 -73 47 6 -219 -85 -5 116 22 299 -65 37 -9 -108 3 195 -96 -126 -103 -203 -52 -6 89 134 -63
7208f3K51j39j57J42p3r6J86j50Q5o5J46k4m08L44J03Q5l28K84j89k1j20Q8R2
$$ -63 188 49 -108 34 -39 -135 51 -99 -14 -79 67 43 -365 -21 82 167 -161 123 -66 -87 -207 -119 -27
7231b7M5N6q0j21K03l58K10J73l78L69Q7n27K60J97m7M8j82K21k75p2L78P5m97
$$ -27 18 74 -6 -127 76 -282 -72 101 -277 92 179 -348 -88 109 62 110 -72 149 -126 -198 180 255 -242
7254b42M05l20K72q7j26R6l69L82lk36J88k2nJ53p4q3L1L01k15M0m0k48M33l34
$$ -242 163 -157 115 28 -98 -2 -371 11 8 -228 -40 -62 -67 86 12 -71 -40 261 46 86 46 -202 231 -103
7278a03K00j37J59k58K80j52j15rR1K37k33M3k4J40k67J84J69k29J18j15j0Q6
$$ -103 97 -40 119 -139 141 -11 -126 -135 -44 193 -40 3 -21 119 -148 36 205 -24 94 -21 -31 55
7300E5J7j57n1R0N4O5j95R4O7N3k04J59k5j62J65j40K41J11j3j59J29j50J12j54
$$ 55 72 -85 -136 -46 8 73 -122 -28 39 92 -112 47 22 -140 25 -115 126 237 224 65 194 44 156 2
7324BR6j1K3Nm6P4j34J1k5OJ19m41K38L7M2R1p4n1OK34ll47K69k54qN6J6J16R8
$$ 2 98 87 110 115 69 143 9 20 -5 1 120 -321 -83 -46 -4 87 13 -38 -32 202 199 -148 121 -133 -141 -85 -69 47 145
7353A45P1j44q2J70o3m25M43j28j14J31Q0l0mm8j71L30j78j12MK01j56R9l22J92
$$ 145 216 72 -10 160 97 -328 115 -13 -127 4 84 54 50 2 -169 161 -17 -129 -125 76 -80 19 -303 -111
7377a11k14M05o8j4k0j39K17J2o7J2O4j54J05K5j4k27L51j6k98Q0J74l79K02j0
$$ -111 -325 80 12 -2 -22 -161 56 68 1 13 77 -77 28 53 39 -188 163 147 -151 -71 103 -276 -74 -84
7401h4J86R0j21kK9K0n5K24l44J37k9j75K31j84J57j92J48j23j7J78k30K52k31
$$ -84 102 192 71 69 98 118 63 287 -57 80 51 -124 107 -77 80 -112 36 -87 -104 74 -156 96 -135
7424a35N5J38j58K11j9j6l00L6qJ73k5L1r4j32K38m6K72l98L71q9n5J11l07k68
$$ -135 -80 58 -100 111 92 76 -224 -188 -196 -23 -48 -17 -111 -243 -5 -51 221 -177 194 105 50 161 -146 -414
7448d14O42m16Q9J69k76K68j39J55k56J96j6j59J86k1k32J95K74l38K43l31L9
$$ -414 228 -188 -99 70 -206 62 -77 78 -178 18 2 -157 29 8 -224 -29 245 -93 150 -181 -142
7469a42O9K80j7k21J24l3Kq9J11j64N7j49j4L2J14O7Q6K6J11k25J16l75J68L54
$$ -142 -73 207 190 -31 93 60 62 -27 84 -80 -23 -172 -186 -154 -40 27 113 139 250 25 141 -234 -66 288
7493B88k73j40K61k0k22K17j24k7r5k3J02J20l6l2r3j46M60l87K9K62j25N4k9
$$ 288 15 -125 136 116 -106 111 -13 -40 -135 -158 -56 64 28 -4 -97 -243 217 -170 -141 121 -4 50 21
7516B1K10m29K54J12r9j10j24K21j80J09j42K69j56K2o1K21k98M2K16j54J30O
$$ 21 231 -198 56 168 69 -41 -165 56 -124 -15 -157 112 -44 -22 -83 138 -160 -118 98 -56 74 80
7538H0q8J12m50L06j42L67n88L88j8K8Q4n3K63j9l49j33L10r8q7J63j38k02J08
$$ 80 -8 104 -346 -40 -182 185 -403 -15 -33 -5 79 26 289 270 -79 -212 98 0 -87 76 -62 -264 -156
7561a56J33L3k65K42N5j95L91q4j70Q8j67R8Q2j53K43k35p4J03J13l57J64M8N2
$$ -156 -23 10 -255 -13 42 -153 238 154 -16 72 -95 3 85 -68 175 -60 -134 -31 82 -275 -111 -63 -11
7584a1p1L2j79J76Q8j04OJ15j81r6L99j85r1L8J60J33k11q8j76K61l2q6p9K11
$$ -11 -82 -50 -229 -53 35 -69 -63 52 -129 -225 174 -11 -102 -64 96 229 18 -70 -246 15 -17 -103 -182 29
7608B9n5M0J10k66N0K2Q8n8J09k34M7K28k52Q9k1J16K9p2J42r1K18r9r5j90K91
$$ 29 -26 14 124 -142 -92 -70 18 -40 69 -165 -118 110 -142 -53 -74 42 71 -1 141 50 268 169 74 -116 175
7633A75l29P3K42m9r6j3J13k83J03mJ65j64J80j35j14K03k66L01k99M71p6j41
$$ 175 -154 -81 161 112 16 3 116 -167 -64 -68 97 -67 113 -22 -136 67 -199 102 -197 274 198 57
7655E7M5q7P5j71%K02J7j2j24p7K30l47L49j2j74P5k72N2M5J65p1Pl3M2j63J61
$$ 57 102 15 90 -81 -81 121 138 126 2 -75 155 -192 157 145 -29 46 -226 -174 -129 36 -35 -28 -61 -19 -182 -21
7681b1LM9q7J63j16r7J73k34L12k55K70j62J52k19J17m9j4K29o3j30k3p8o6K63
$$ -21 -18 31 -56 107 -9 -106 67 -167 145 -110 160 -2 150 -69 48 -1 -15 214 151 21 -2 -80 -146 117
7705A17l2K72k92M5P8k79K28J29l38K36k10m4K6L7O9j09j51K74M8l15J64L52k29
$$ 117 85 357 65 110 188 -91 137 266 -72 164 -46 -90 -64 -27 42 -67 -218 56 104 -211 -47 305 76
7728G6j36r2L6PK08k36L20o1j2j37n8q3Q0Q1M4J9j77J17P6r0j10O3o1Lm8L43k79
$$ 76 -60 -152 -116 -109 99 -137 183 122 110 -27 -85 -168 -88 -7 37 56 -121 -4 72 -18 -128 -65 -126 -123 -171 172 -107
7755a07K40j25KL9k05q1N9K44N3j06m7p9J3O2J70n0j48R9j57K04J32l63L05k1
$$ -107 133 8 10 49 -156 -237 -178 66 119 13 -34 -113 -100 -38 132 82 -66 33 -124 80 212 -151 154 133
7779A33j5l09L3N57l43M5L39j21o19L84l3j39P2j42J40j07J02L72l00PJ52k07
$$ 133 118 -191 -158 399 56 101 440 319 -300 84 51 -88 -16 -158 -18 -125 -23 349 49 56 208 1
7801AK22j74j57J3K8J01J40k30m2Q8P5j97O3rJ1j52q3M50k50K4K22k56J84l9k11
$$ 1 223 49 -108 -95 -67 34 174 -56 -98 -10 65 -132 -69 -78 -67 -219 -302 148 -102 -78 144 -112 72 33 -178
7826a78L08j93l70M83j33J40Qk8k9o4J85k32J91j27o2K30j71J43k00K06p3k06
$$ -178 130 -63 -433 50 -83 57 65 37 8 -56 129 -103 88 -39 -101 129 -42 101 -99 107 34 -172
7848a72R0M3M5p1K3L5L0q9J62j60J81J15m25O2J16j17J94K6k24J55K4P4M6OJ5
$$ -172 -82 -39 6 -65 -42 -7 23 -66 96 -64 117 232 -193 -131 -15 -132 62 88 -136 19 43 117 163 169 184
7873A84j27k72J04K80q0J85j99r1r5O2R0k82K24J10k07J41j64K8j88K55JmJ33
$$ 184 57 -215 -111 169 89 274 75 -16 -111 -49 41 -241 -17 93 -114 27 -137 -109 -297 -42 -41 -45 88
7896H8K44n39O1J55L8rk96J39o9Q9J49N4k67J78j34L51l83J21n9po7J10J18m04
$$ 88 332 -207 -146 9 47 38 -258 -119 -188 -99 50 104 -163 15 -119 232 -151 -30 -89 -96 -163 -53 65 -339
7920c39K82k3J61J34l77J16K83o7Q2l71P4L88m48L52l81J31p6K27k33J67J34j10
$$ -339 -57 -80 81 215 -162 -46 237 170 252 -119 -45 343 -105 247 -134 -3 -79 148 -85 82 216 106
7942A06j29J45j07k3j97J74j23J47J54q9j44m7Q8o7KJ82p8M6O1k58L11j93j55
$$ 106 -23 122 15 -8 -205 -31 -154 -7 147 58 -86 -133 -45 -112 -110 72 -6 40 101 -157 154 -39 -194
7965a94O4J85J68j43j6p8J0N8m6K6J08j41o2K41j90k04J79l2J39L8j64K08k60
$$ -194 -130 55 223 80 64 -14 -4 54 8 34 142 1 -61 180 -10 -214 -35 -67 72 110 -54 154 -106
7988a06J45J85k17j0M8OJ95l75o0K53J6j87K73j59J75j84j3J52m53J46K81q5L00
$$ -106 39 224 7 -3 45 51 246 -129 -189 64 80 -107 166 7 182 -2 -15 137 -316 -170 111 26 326
8011C26m12J65j08O5R5RK9K11k34q7K05l01R5j55J67n4j87R0lO5O7qo5p1K94n6
$$ 326 -86 79 -29 36 131 140 169 380 146 59 264 -37 58 -97 70 16 -171 -81 -84 -19 48 40 -25 -96 198 142
8037A42L7j50J2k8j24K52j61j01J45Nm8k9J84k10J96lk5l24O6P6J12N5k3P9k06
$$ 142 179 29 41 13 -111 141 -20 -121 24 29 -19 -48 136 -74 122 119 94 -230 -164 -88 24 79 56 135 -71
8062g1K44j24N7j54R5j6J4L1J02j94J56m20N18m09J39o1n4M2Q8n8N0J29k48J27
$$ -71 173 49 106 -48 47 31 45 76 178 -16 140 -280 238 -171 -32 -93 -147 -105 -17 -75 -25 104 -144 -17
8086a7k31K37Q5j46p1J47J8j21M0qj7l7M3J68j29J30k24J94O4k36N2J95J77k48
$$ -17 -248 -11 74 -72 -143 4 22 -99 -59 -67 -84 -121 -78 90 -39 91 -133 61 125 -111 -59 136 313 65
8110F5O0J4q1j10J30j8J11j92j7K55k73j59j7M7K13l4K15k30k0M1k5j14Q7j74
$$ 65 125 139 58 -52 78 60 171 -21 -38 217 -56 -215 -232 -185 28 -6 209 -21 -41 0 -25 -139 -52 -226
8134b26K07q8R1j26J77K5n9R5J07pr5n9j78M0K41j59J19o2K10m08K23N7k73J98
$$ -226 -19 -107 -16 -142 35 60 1 96 203 196 101 42 -136 -96 145 -14 105 43 253 -155 68 125 -148 50
8158E0p5K22j78J87j78R2p5oj14j20K05J38p4j18J67j52J7j62K42n0n6J1R5l2
$$ 50 -25 197 19 206 28 120 45 39 -75 -195 10 148 74 -44 123 -29 -12 -174 68 18 -38 -27 68 36
8182C6N3m29M21m77L63K16k40o3J33
$$ 36 89 -340 81 -396 -33 183 -57 -120 13
8191A3
$$ Imaginary data points
##PAGE= N=2
##DATA TABLE= (X++(I..I)), XYDATA
0@%%%%%%%%qJ6j6J6j9K7m0M8n6P2q8J04j20J44j76K08k43K83l28L81m40N06n80
$$ 0 0 0 0 0 0 0 0 0 -8 8 -8 8 -11 16 -24 24 -32 40 -48 56 -64 80 -96 112 -131 152 -176 205 -235 271 -309
31c09O60p50Q50r60J081j214J362j522J697j892K103k332K581k854L155l482L840
$$ -309 351 -399 451 -509 572 -642 720 -802 895 -997 1106 -1226 1355 -1499 1656 -1826 2014
48B014m232M660n131N652o229O872p590Q397r315J0367j1586J3019j4730J6815
$$ 2014 -2218 2442 -2689 2963 -3266 3606 -3984 4413 -4902 5465 -6121 6898 -7832 8983
62H983j9423K2788k7309L3734m3625O0887r9277L25555j5312m25082L73326k85295
$$ 8983 -10440 12348 -14961 18773 -24852 36035 -63242 262313 247001 -178081 195245 -90050
74i0050K90915J04453n02650K87794M2777j33226K77574m14183J22555K89888
$$ -90050 200865 305318 -197332 90462 133239 13 277587 -136596 -14041 275847
84B75847l64709K05819m3946k06691L92915k70902n3139K65328l07139J82583
$$ 275847 -88862 116957 73011 -133680 259235 -11667 -64806 200522 -106617 75966
94G5966M1839k72516L33598j56376j40563K72288k25777J11725Q5847l01272K50459
$$ 75966 117805 -154711 178887 22511 -118052 154236 -71541 40184 126031 -175241 75218
105G5218k0639j18468K03043k55024P3066K02109k58166J49004k7958j57780K78219
$$ 75218 54579 -63889 139154 -115870 -42804 159305 -98861 50143 22185 -135595 142624
116A42624j45763p1039J57784j89687J44187N3843k00810J58962p4198k7819J73333
$$ 142624 -3139 -74178 83606 -106081 38106 91949 -108861 50101 -24097 -51916 121417
127A21417j90502M4263Q2615j32518J49609o9880q8029J68858j19024K6542P6289
$$ 121417 -69085 -24822 57793 -74725 74884 5004 -83025 85833 -33191 -6649 69640
138F9640j55797J23611N022j06060J29089q2641j3970R5267j08572O3647J5095
$$ 69640 -86157 37454 42476 -63584 65505 -17136 -31106 64161 -44411 19236 34331
149C4331q3025R3484n4528l573P3262j09085N7860L2204p8582Q4701n8872l1780
$$ 34331 -48694 44790 -9738 -13311 59951 -49134 8726 40930 -37652 47049 -11823 -43603
161d3603J06100p5553O960K7719o9043Q0222j2003n3323N1631m4947K8957K8532
$$ -43603 62497 -13056 -6096 21623 -47420 32802 20799 -32524 19107 -25840 3117 31649
173C1649p0081N2528j4621k9244O5598n9991Q835M7717o8477M0083N346m4928
$$ 31649 -38432 14096 -525 -29769 35829 -24162 -15327 32390 -36087 3996 9342 -35586
185c5586N8841k9744j5886L7981m1796K6518R527l4078L8539k6472n311L5861
$$ -35586 23255 -6489 -22375 15606 -26190 328 9855 -24223 14316 -12156 -17467 18394
197A8394l9914K6884P711m4536M4748j1152j8306L9455l8504N760K9031l2212
$$ 18394 -21520 5364 13075 -31461 13287 2135 -16171 23284 -15220 -9460 19571 -12641
209a2641K0769k939k0578L0035j5123J005J1940k4925K2017p23j5631K4226k1352
$$ -12641 8128 5189 -15389 14646 -477 528 12468 -12457 9560 8837 -6794 17432 -3920
222c920J790K2322k8432J3960Q737k4143K1199n544j2464K0733j2893l335R228
$$ -3920 -2130 20192 -8240 5720 14457 -9686 11513 5969 -6495 14238 1345 -1990 7238
235G238r414P583j754l668N002j0697P353M857j2057J1244o144r976J6887p629
$$ 7238 -2176 5407 3653 -15 4987 -5710 1643 6500 -5557 5687 -457 -10433 6454 -1175
249a175m626J0840j1591o31R018o197J108K204n679P27L803Q65m337O98L415n918
$$ -1175 -5801 5039 -6552 -7183 1835 -4362 -3254 -1050 -6729 -6002 -2199 -1334 -5671 -4973 -1558 -7476
265g476M135N139r112K986L918p570O994L855r363L023M311n156L080M684n159
$$ -7476 -3341 1798 -7314 -4328 -410 -7980 -986 2869 -6494 -3471 840 -4316 -1236 3448 -1711
280a711j457M827k089o58O133l630l656O491j538k764N451k012k983M147r48j129
$$ -1711 -3168 1659 -430 -1088 5045 1415 -2241 4250 2712 -52 5399 3387 404 4551 3603 2474
296B474L174k253k386M334n40l295L178j27l643K997R04l945K454O39m420L389
$$ 2474 5648 3395 1009 5343 4803 1508 4686 4559 916 3913 4817 872 3326 3965 -455 2934
312B934J110n007J865K088l243J108Q93l902J125J771l482K147J136m945R94L012
$$ 2934 4044 -963 902 2990 -253 855 1748 -2154 -1029 742 -2740 -593 543 -4402 -3408 -396
328c96l143O60K623m887P7M186l277rM260m523j960N619k065k296M281j931k604
$$ -396 -3539 -2879 -256 -5143 -5066 -880 -4157 -4166 94 -4429 -6389 -770 -2835 -5131 -850 -2781 -5385
345e385M268o50k816M772n52m530N023O62l961M067N59l683L855Q29m631L874
$$ -5385 -1117 -1767 -4583 189 -363 -4893 130 792 -3169 898 1457 -2226 1629 2458 -2173 1701
361A701K474m305K085K303m483J888M124m329L46L924m229k99L896k068N16J894
$$ 1701 4175 -130 1955 4258 -225 1663 5787 1458 1804 5728 1499 1200 5096 3028 3544 5438
377E438m129k086N690J060m181P41j168k352N650j066m444M652l603l956O703
$$ 5438 1309 -777 4913 5973 1792 2533 1365 -987 4663 3597 -847 3805 202 -3754 2949
392B949j455j729J478m577J320K177l06j45l872L587p20m856O929k825l321P887
$$ 2949 1494 -235 1243 -3334 -2014 163 -143 -288 -4160 -573 -1293 -6149 780 -2045 -5366 2521
408B521r665J001R182q527M139O72r377J0748j876m352Q250q697K210N376o894
$$ 2521 -7144 -6143 3039 -5488 -1349 -677 -10054 694 -1182 -5534 2716 -5981 -3771 1605 -5289
423e289P829l932m675R703p404M799L519j4556J4762L71j2072J4835j0039j926
$$ -5289 2540 -1392 -6067 3636 -3768 1031 4550 -10006 4756 5127 -6945 7890 -2149 -4075
437d075J7175j7119K582R843j1583R849l978o611J3990r981J590N259j2477J4706
$$ -4075 13100 -4019 -1437 8406 -3177 6672 2694 -3917 10073 92 1682 6941 -5536 9170
451I170m288j0994J8444j3187j810J4911j9416J0926Q251k1861J4113m79r080
$$ 9170 4882 -6112 12332 -855 -2665 12246 -7170 3756 12007 -9854 4259 3780 -5300
464e300J5735j3783j266J1386j2663R294k530q980J6259j2767k155J3354j5002
$$ -5300 10435 -3348 -4614 6772 -5891 3403 873 -8107 8152 -4615 -6770 6584 -8418
477h418R872K044j7705J8741m742r860J6305j3190K443R512j7337J1471L885r798
$$ -8418 1454 3498 -14207 4534 -208 -10068 6237 -6953 -4510 5002 -12335 -864 3021 -6777
491f777R594j1161K598J3119j3981O932o44r568J7211q683n664J4220j2029L503
$$ -6777 2817 -8344 -5746 7373 -6608 324 -320 -9888 7323 -1360 -7024 7196 -4833 -1330
505a330O745j1474R713j068n716R136p472J309M068n799Q950m099n885O434m132
$$ -1330 5415 -6059 3654 2586 -3130 6006 -1466 -157 3911 -1888 7062 2963 -2922 3512 -620
520f20P680O57j4347Q924K167j647O421j3696J765J1950o532l01l526j309R915
$$ -620 7060 7717 -6630 2294 4461 2814 9235 -4461 -2696 9254 2722 2421 -1105 -2414 7501
535G501m931k187k060o49J0453r432j970P901j0589Q385J921j3460J3079l543
$$ 7501 2570 383 -1677 -2326 8127 -1305 -3275 4626 -5963 2422 4343 -9117 3962 419
549D19p158J0840r474M127L791j1407J1045l664m625J0546j4311P437R504j7323
$$ 419 -6739 4101 -5373 -1246 2545 -8862 2183 -1481 -6106 4440 -9871 -2434 7070 -10253
563a0253J0671k657q044J9877j2953m630J2359j3421J1660K330j5310J4699p236
$$ -10253 418 -2239 -10283 9594 -3359 -7989 4370 -9051 2609 4939 -10371 4328 -2908
576b908j905J4361j6996P846N154j5093J8165q143p992J9775j7463M405J2865
$$ -2908 -4813 9548 -7448 398 5552 -9541 8624 481 -7511 12264 -5199 -794 12071
589A2071k2670J5698L138j5816J8582j1809m751J7537j4892P201K539j6128J8525
$$ 12071 -10599 5099 8237 -7579 11003 -806 -5557 11980 -2912 4289 6828 -9300 9225
602I225n846o933J5418j8854O564J1961j9310J4382k988j2570J9510j3323j314
$$ 9225 3379 -3554 11864 -6990 -426 11535 -7775 6607 3619 -8951 10559 -2764 -4078
615d078J4009j8586J0510M280j6969J7056o391p376J5109j4766M410P565j3715
$$ -4078 9931 -8655 1855 6135 -10834 6222 -169 -7545 7564 -7202 -2792 4773 -8942
628h942J3045n182q605J6019j2799L090J0883j9481J1052M390j3286J4691p004
$$ -8942 4103 -1079 -9684 6335 -6464 -3374 7509 -11972 -920 3470 -9816 4875 -2129
641b129o099J3375j0888L865M879r938J0911n688m537J2564j0560L401O073j3042
$$ -2129 -8228 5147 -5741 -1876 3003 -6935 3976 -1712 -6249 6315 -4245 -844 5229 -7813
655g813J1363l99q698J2401q002j408R789j1169N721M357r187P491l662j834Q002
$$ -7813 3550 3151 -5547 6854 -1148 -2556 7233 -3936 1785 6142 -3045 4446 784 -1050 6952
670F952p344K682J215o094Q770m575m272J0025p823L01N357q522O423J416p255
$$ 6952 -392 2290 3505 -2589 6181 1606 -2666 7359 -464 -163 5194 -3328 3095 4511 -2744
685b744N372k774n04M616o246K406J726m445M375l080m86M545o169K252J899n040
$$ -2744 2628 -146 -650 3966 -2280 126 1852 -2593 1782 -1298 -1784 2761 -3408 -1156 743 -4297
701d297N441k119l841N862l676nK872m576L012M85l047L146j365m30K191k710
$$ -4297 1144 -975 -4816 1046 -2630 -2635 237 -4339 -1327 -842 -3889 -743 -2108 -2538 -347 -3057
717c057J726N61j583K771k373N4L471l502J810J149l495L155L32k440L122q45
$$ -3057 -1331 -770 -2353 418 -1955 -1901 1570 -1932 -122 1027 -2468 687 1019 -1421 1701 856
733H56j546J941j21m1J08p8L06q02J267O76j653J840j048j466K902j245j310K450
$$ 856 -690 1251 1130 1089 1197 1119 1425 623 1890 2566 913 2753 1705 239 3141 1896 586 3036
751C036j909q41K321r84n11J179j289r03Q77Q1n49M8N52j862k5J501r27j3R16
$$ 3036 1127 286 2607 1623 1112 2291 1002 99 976 1057 508 556 1108 -754 -779 722 -205 -218 698
770F98k408J25J505j259M26P27j827l29R05J24L12K80r13r64L72P28mR68o01j433
$$ 698 -1710 -1585 -80 -1339 -913 -186 -2013 -2342 -1437 -1313 -1001 -721 -1634 -2598 -2226 -1498 -1502 -534 -1135 -2568
790b568O18P02J57J205j019j304R28k6O97J442j023r96L66K84J089M32J86j236
$$ -2568 -1950 -1248 -1091 114 -905 -2209 -1281 -1307 -610 832 -191 -1187 -821 -537 552 984 1170 -66
808f6m24J340q9P71R63j840K4N71p11J890L97k167J066l51q27K456o21j614O63
$$ -66 -490 850 761 1532 2495 655 679 1250 539 2429 2826 659 1725 1374 547 3003 2382 768 1431
827A431q84K23R90J16m42j118K94J60o54J407p69j926J812r39r85K597j601j325
$$ 1431 547 770 1760 1876 1434 316 610 770 116 1523 754 -1172 640 -299 -1284 1313 -288 -1613
845a613J923j971N69J517j866J90p7n85J347j204L29L73j824K238n56j503K922
$$ -1613 310 -1661 -1092 425 -1441 -1251 -1328 -1913 -566 -1770 -1441 -1068 -2892 -654 -1210 -2713 209
862B09k361n95L264l041J194J851l863K908K86j813K469j449J30J497k025K157
$$ 209 -2152 -2747 517 -2524 -1330 521 -3342 -434 -148 -1961 508 -941 -811 686 -1339 818
878H18n59r99K865l339O48L931l848J917N12l611M394p59j597K594l251J209J915
$$ 818 259 -740 2125 -1214 -566 3365 -483 1434 1946 -1665 2729 1970 373 2967 -284 925 2840
895B840l020L247j222k637L353j902P80J619l493J951n91p79K744l680R53K647
$$ 2840 -180 3067 1845 -792 2561 659 1439 3058 -435 1516 925 146 2890 -790 163 2810
911B810m431J748O28k518M395k227k991K333j121K536j01l976J475l79J198K074
$$ 2810 -1621 127 755 -1763 2632 405 -2586 -253 -1374 1162 1061 -2915 -1440 -1819 -621 1453
927A453m665J473R57k186L862k190k148L993k797N66K238m121K511J516k435K181
$$ 1453 -3212 -1739 -782 -2968 894 -1296 -3444 549 -2248 -1682 556 -3565 -1054 462 -1973 208
943B08k322L53L054k608J796j583j772N233k122r55K254m680L864K814m527K114
$$ 208 -2114 -1761 1293 -1315 481 -1102 -2874 2359 237 -718 1536 -3144 720 3534 -993 1121
959A121q43j088M733l408l32J252k223M492j951k814M427l903J682L280o326L672
$$ 1121 278 -810 3923 515 183 1435 -788 3704 1753 -1061 3366 -537 1145 4425 -1901 1771
975A771J017m399N490l201k582N444m507K410J426n970N005r98k771N573o109
$$ 1771 2788 -1611 3879 678 -1904 3540 -967 1443 2869 -3101 1904 906 -1865 3708 -2401
990b401O68M607n514L741r82m636O847l776n93M379p164M277K020o470O936l299
$$ -2401 -1733 2874 -2640 1101 119 -4517 2330 -1446 -2039 2340 -4824 -547 1473 -4997 1939 -1360
1006a360l514P753n792P46L733o760N818j98m792O414n190J313N707q130L335
$$ -1360 -4874 2879 -2913 -2167 1566 -5194 624 426 -4366 2048 -3142 -1829 3878 -4252 -917
1021i17J907m433P779n161l233P387m863K850J718p714O804O78m500N210m650
$$ -917 990 -3443 4336 -825 -4058 3329 -1534 1316 3034 -4680 2124 2802 -1698 3512 -1138
1036a138O42N235o441L274L78l398O415m977j328O352o349K301L581o879M564
$$ -1138 -496 4739 -1702 1572 1950 -1448 4967 -10 -1338 5014 -1335 966 4547 -2332 2232
1051B232l00m145N908k982j099K221m000M408M54n369L857j833r1M080n830J084
$$ 2232 1932 -2213 3695 713 -386 1835 -2165 2243 2697 -2672 1185 -648 -739 3341 -2489 -1405
1067a405K942l686L057j290k763N032l390p74L219l770K206R45l617L546j389
$$ -1405 1537 -2149 908 -382 -3145 1887 -1503 -2277 942 -2828 -622 323 -3294 252 -1137
1082a137j502L072k324J249O95l765L510P46k624K610k441J5L663l057O14P62
$$ -1137 -2639 433 -1891 -642 53 -3712 -202 544 -2080 530 -1911 -1896 1767 -1290 -676 86
1098H6j270K635k043n96K823j730O6J343k123J913N28k197J645r8M08l47j778
$$ 86 -1184 1451 -592 -1188 1635 -95 -29 1314 -809 1104 1632 -565 1080 982 1390 1043 -735
1115g35K973j98j949J169j259M20K862k545j199J660j40K2k44n16J004o82O9m82
$$ -735 2238 2040 91 1260 1 421 3283 738 -461 1199 1059 1081 837 321 1325 643 712 230
1133B30q46J770l91j122M73o93N25O87j405O05r6p47N24K28p55O74p25k5jK56
$$ 230 -616 1154 763 -359 114 -579 -54 633 -772 -167 -263 -1010 -486 -258 -1013 -339 -1064 -1089 -1090 -834
1153h34J38o69M37j20p88J041K35j249J276l59n03J041m4o65P20m01M7j93Q46
$$ -834 -696 -1365 -928 -1048 -1836 -795 -560 -1809 -533 -892 -1395 -354 -398 -1063 -343 -744 -697 -890 -44
1172d4K38q69N33L01k45N25J06n46P58k25K65p3k92N46oo05P36n36J47N49l91
$$ -44 194 -675 -142 159 -86 439 545 -1 757 532 797 724 432 978 972 367 1103 567 714 1263 872
1193H72j0N30m02r2j58J80J42J03m26k04l83N47K2m24N15q86r5N59l66j87O78
$$ 872 862 1392 990 898 740 920 1062 1165 739 535 152 699 721 297 812 -74 -169 390 24 -163 515
1214E15q28k52L76k87K00k43k32j77l0L17k33L07q7p08K66N12n21M21M21j088
$$ 515 -313 -565 -189 -476 -276 -519 -751 -928 -958 -641 -874 -567 -654 -1362 -1096 -584 -1105 -684 -263 -1351
1234a351K71M86k16M40j00n51p4L17l4L97K87j70l51J45M68j65O18l17l24L32
$$ -1351 -1080 -594 -810 -370 -470 -1021 -1095 -778 -812 -415 -128 -298 -649 -504 -36 -201 417 100 -224 108
1254A08J93j75O49N2p71N03L05k82L74R9m60p6L65j33K08L07o04Q2K5L61m07O5
$$ 108 301 126 775 827 56 559 864 582 956 1055 595 519 884 751 959 1266 662 744 769 1130 723 788
1276G88Q1m68J67j59J24m1j79k40Q7m46K32J49l01J75l40l30N10j41j82k34K48
$$ 788 869 401 568 409 533 492 313 73 160 -286 -54 95 -206 -31 -371 -701 -191 -332 -514 -748 -500
1297e00n74K36L83k01j02L21l29n55O76l17r2M90m61l55P15l6K46o1J9j38K36
$$ -500 -1074 -838 -455 -656 -758 -437 -766 -1321 -645 -962 -1054 -564 -1025 -1380 -665 -701 -455 -516 -497 -635 -399
1318c99k53Q4O53k9nk99J71O3M12L04n72j0K05j3M11L32n74l65J059l64p4P03
$$ -399 -652 -568 85 56 51 -248 -77 -14 398 702 130 120 325 312 723 1055 481 116 1175 811 737 1440
1340A440j063o0J217o61k2K37m41k3L93m05J22l64P82p28q49J217j84o16R13j280
$$ 1440 377 317 1534 873 851 1088 647 624 1017 612 734 370 1152 424 -425 792 608 -8 905 -375
1360c75n6R07n42N08q83q13J668j142K43J032j852O16N22j345J647q65l31O80
$$ -375 -431 476 -66 442 -441 -1254 414 -728 -485 547 -1305 -689 -167 -1512 135 -730 -1061 -381
1378c81j279J120P65j626J425q74q77K094j149OJ294j961J141J52j378K460j351
$$ -381 -1660 -540 225 -1401 24 -850 -1727 367 -782 -776 518 -1443 -302 -150 -1528 932 -419
1395d19k94J056j451J278J474k434J050k51j48J842j588p5J144j538K002k99j831
$$ -419 -713 343 -1108 170 1644 -790 260 9 -139 1703 115 40 1184 -354 1648 1349 -482
1412d82K081o89j251J717j149O31Q25k001P06M51m52J162j265l0J290j958R96
$$ -482 1599 910 -341 1376 227 858 1683 -318 388 839 387 1549 284 254 1544 -414 582
1429E82O23j696J605j202j040K397j158l75O34j484J176R93k160N55l4N6Q71j692
$$ 582 1205 -491 1114 -88 -1128 1269 111 -264 370 -1114 62 1055 -1105 -550 -584 -528 343 -1349
1447a349P42N51q10O36r44m66J939m36p87J84j252J560R05j137M95j083L91J329
$$ -1349 -607 -56 -866 -230 -1174 -1640 299 -137 -924 -740 -1992 -432 473 -664 -169 -1252 -861 468
1465D68n41j82L0p54J157K91j040O78l49L23K52r20O85P63l64n53J92J13Q72l22
$$ 468 -73 -255 -225 -979 178 469 -571 107 -242 81 333 -587 98 861 497 -56 136 249 1121 799
1485G99k11j98L77J7l17j28Q71j53j013m59J468M72n13o80j113J191J453j237
$$ 799 588 390 767 784 467 339 1210 1057 44 -415 1053 1525 1012 332 -781 410 1863 626
1503F26j087J24P60N66q81n51K22O27L35j510p78J573R9o41O50j356L80R42q41
$$ 626 -461 -337 423 989 108 -443 -221 406 741 -769 -1547 26 125 -516 134 -1222 -842 100 -741
1522g41L2M62o65K20k47L60R22j652J90M10j52J132j142q55J695m20J42N7j072
$$ -741 -709 -247 -912 -692 -939 -579 343 -1309 -1119 -709 -861 271 -871 -1726 -31 -451 -309 -252 -1324
1541a324J516O40j607M95J15j40J499j369l19P00k11J302p18r91J241p72PJ294
$$ -1324 192 832 -775 -280 -165 -305 1194 -175 -494 206 -5 1297 579 -412 829 57 64 1358
1559A358j367O62K95r26R41k29o44J085o21K8K59q80Q06P0q71R01o52n47J457
$$ 1358 -9 653 948 22 963 734 90 1175 554 582 841 -39 767 837 -34 867 215 -332 1125
1578A125j392K40O87j151Q33l63o14J168q68k0N47o74N35k76o23Q26l6q80R99
$$ 1125 -267 -27 660 -491 342 -21 -635 533 -335 -355 192 -482 53 -223 -846 -20 -56 -936 63
1597F3j075N22M85j026N55L0m12P70m74l12O00p23P89j17q36J312n83l79J146
$$ 63 -1012 -490 -5 -1031 -476 -446 -858 -88 -562 -874 -274 -997 -208 -325 -1161 151 -432 -811 335
1616C35q02J56P67j074N97K30l56O28k95j66P23p52K73K54k54P38k11q74P57l79
$$ 335 -467 -311 456 -618 -21 209 -147 481 186 20 743 -9 264 518 264 1002 791 -83 674 295
1636B95M71P5p26O02j02o46O27M01m69L5l12K89j59n4M41q47J44J44m09M92N54
$$ 295 766 841 115 717 615 -31 596 997 528 563 251 540 381 327 768 -79 65 209 -200 292 846
1657H46j002L2r7k41P16m81N1j37l41M52O5l03K04k20l36N05o6j13j5l77L27p6
$$ 846 -156 -124 -221 -462 254 -227 -176 -313 -654 -202 -137 -440 -236 -456 -792 -287 -353 -466 -481 -858 -531 -607
1679f07m7L44l48J84O5k70N02j41j06L53m72J63L14N5j48N4m0J63K37L8Q6l75
$$ -607 -654 -310 -658 -474 -409 -679 -177 -318 -424 -71 -543 -380 -66 -11 -159 -105 -145 18 255 293 379 4
1701DL58j80J55L75l81K9J8rO9L99k34k24J33J5QJ75k48m0J36J77j49o3N5m14
$$ 4 362 182 337 712 331 360 378 369 438 837 603 379 512 527 535 710 462 422 558 735 586 523 578 164
1725A64L41O4m63J35q0k11K88q9Jj24j15k71k4NJ62k4q4j03l34N15L25m19j54
$$ 164 505 569 106 241 161 -50 238 149 150 26 -89 -360 -384 -379 -217 -241 -325 -428 -762 -247 78 -341 -495
1748d95k48q0L12J6K20j09n0j55J01K59K23m76Q5J11k29M37Q4j85J22j91K0K56
$$ -495 -743 -823 -511 -495 -275 -384 -434 -589 -488 -229 -6 -482 -397 -286 -515 -78 6 -179 -57 -248 -228 28
1770B8K01J00k11l00K69K5K60J27j49j70J92R1J55K6m06K16qO4R8k68m3K64p9
$$ 28 229 329 118 -182 87 112 372 499 350 180 372 463 618 644 238 454 446 510 608 340 297 561 482
1793D82J87m1j58j6n46K50L61k66j42K35n48K72J97n29M79j52m18OJ4M85j58n65
$$ 482 669 628 470 454 -92 158 519 253 111 346 -202 70 267 -262 217 65 -353 -347 -333 152 -6 -571
1815e71M79n20K53K78l78J7K79p74P33j84m77O13l12j75K87j05K69o0n42M53o2
$$ -571 -92 -612 -359 -81 -459 -442 -163 -937 -204 -388 -865 -252 -564 -739 -452 -557 -288 -348 -890 -437 -499
1836d99R5N05m86q8M27l10P20l93j9J45m5j57M25r8L43k55j36J27p6J00j00n7
$$ -499 -404 101 -385 -473 -46 -356 364 -29 -48 97 52 -105 320 222 565 310 174 301 225 325 225 168
1858A68K63K87l33q3k18R8M12l77mO2L51m3l50N5n4j16l4J65j19k6J97m12q0J06
$$ 168 431 718 385 302 84 182 594 217 213 275 626 583 233 288 234 118 84 249 130 104 301 -111 -191 -85
1882h5LJ29k69k33M06m3P2k53p4k5M1q8J41L14o06K23l40J46K60O4j82K33l76
$$ -85 -82 47 -222 -455 -49 -92 -20 -273 -347 -372 -331 -419 -278 36 -570 -347 -687 -541 -281 -217 -399 -166 -542
1905e42J72j51J00j00M21p5l38J94N30q4j84j2m1j9L26j52j49L57k24M2J40j03
$$ -542 -370 -521 -421 -521 -100 -175 -513 -319 211 127 -57 -69 -110 -129 197 45 -104 253 29 71 211 108
1927A08mL46j07K04k20r4M26p8j11l38k4Q62m30o47M56Q2n1L43p53o8M07r9l4
$$ 108 104 450 343 547 327 233 659 581 470 132 108 970 540 -107 349 431 380 723 -30 -98 309 210 176
1950A76q5k66L96j23l66J78J39j56Ko42R42J28q77K93M1j7M44q22j13N33j52K72
$$ 176 91 -175 221 98 -268 -90 49 -107 -105 -747 195 323 -554 -261 -220 -237 207 -615 -728 -195 -347 -75
1972g5n42Q4N31n72pL25k53O54l22o42N14N3j97Q03p06J16K89o21O69l7n9M79
$$ -75 -617 -533 -2 -574 -581 -256 -509 145 -177 -819 -305 -252 -449 354 -352 -236 53 -568 101 64 5 484
1994D84r46K98O71l47L19m69l20R87l96k77P00n03L9M33o56J31O63o20J96k64
$$ 484 -462 -164 507 160 479 10 -310 677 281 4 704 201 240 673 17 148 811 191 387 123
2014A23q6O76n14J69j99m60J022k99n86Q59n89m3L30n95M33j53k24K88m54r0N42
$$ 123 37 713 199 368 169 -291 731 432 -154 705 116 73 403 -192 241 88 -136 152 -302 -392 150
2035A50o15L08O2m39N68j08m59O09n55k22M68m57N77J81o63L45j95l8L50n55K90
$$ 150 -465 -157 -95 -534 34 -74 -533 76 -479 -701 -233 -690 -113 68 -595 -250 -445 -483 -133 -688 -398
2056c98L19k20K12j73k55N89k27j7M20o26L65L39k59L92o06J55K75j83K26n3k42
$$ -398 -79 -299 -87 -260 -515 74 -153 -170 250 -376 -11 328 69 461 -145 10 285 102 328 275 33
2077C3L03K13m54N10l67l6N52l55j89L65m3Q8l49r0J98K2p0J50m10L17k5k85J55
$$ 33 336 549 95 605 238 202 754 399 210 575 532 620 271 181 379 401 331 481 71 388 363 78 233
2100B33n9n95P20l2r7l6k71j11R9L7K66n62p0M42n64M03J29m77K60N2Kl2k6J69
$$ 233 174 -421 299 267 170 134 -137 -248 -149 -112 154 -408 -478 -36 -600 -197 -68 -545 -285 -233 -231 -263 -289 -120
2124a20j52j52M5M7k4J57k7j04J97J53m5k28J4K19p1p0M87j52n25K99m8L44p6
$$ -120 -272 -424 -379 -332 -356 -199 -226 -330 -133 20 -25 -253 -239 -20 -91 -161 326 174 -351 -52 -100 244 168
2147A68L6j7P5l1n2JJ67J58m00M29n29L86R6k20lj28K60j9N0k96k5L54k78K35
$$ 168 204 187 262 231 179 180 347 505 105 534 5 391 487 267 264 136 396 377 427 131 106 460 182 417
2171D17n07K89j25l49M47j47N2q4q5j22j06L73k46j27J7j89L01L21l12k53P7K05
$$ 417 -90 199 74 -275 172 25 77 -7 -92 -214 -320 53 -193 -320 -303 -492 -191 130 -182 -435 -358 -153
2193a53j06J45q9k48m6j6k23O42J21l54m0K40k77N55k16j39O3j20J18K72Q3K9
$$ -153 -259 -114 -203 -451 -497 -513 -736 -94 27 -327 -367 -127 -404 151 -65 -204 -141 -261 -143 129 212 241
2215B41l99R6R0J43Q3R3m03j38K85Q7L74j67l56K57L2o1J00K69m15l34K95K84
$$ 241 -158 -62 28 171 254 347 -56 -194 91 178 552 385 29 286 318 257 357 626 211 -123 172 456
2237D56K1p2p0j24o5j0L12j14k14j47J1J59J81k79J81m31J39k62J80J49J19l72
$$ 456 477 405 335 211 146 136 448 334 120 -27 -16 143 324 45 226 -205 -66 -328 -148 1 120 -252
2259b52k4R1j47K90k44JM9j2L38k75O2k24J14j82j13M04l42L72o9j73J05J80m
$$ -252 -276 -185 -332 -42 -286 -285 -236 -248 90 -185 -123 -347 -233 -415 -528 -124 -466 -94 -163 -336 -231 -51 -55
2282e5j18Q4Q3j77K62k42k24K46K91j43j1m9o1M53l27J81j32j21M47l35J50L02
$$ -55 -173 -89 -6 -183 79 -163 -387 -141 150 7 -4 -53 -114 339 12 193 61 -60 387 52 202 504
2304E04j16j82K08k55L19k79J15Qn48L64K19l5p1J95o27K13J53J3l6l19K6J28
$$ 504 388 206 414 159 478 199 314 322 -226 138 357 322 251 446 -181 32 185 198 162 -157 -131 -3
2326cp2M05p7o53M85J12m07P2l9m9K56l71K44l0k77M67l33n2J32k52N18R9q80
$$ -3 -75 330 253 -400 85 197 -210 -138 -177 -226 30 -341 -97 -127 -404 63 -270 -322 -190 -442 76 175 -705
2349g05L63J25j03O65r66K59J88j44M66j65n18O86l0k82L05k15j20L17l79P74
$$ -705 -342 -217 -320 345 -621 -362 -174 -318 148 -17 -535 151 121 -161 144 -71 -191 126 -253 521
2369E21o29j81P78j22q7j3n19M83L73k23J7k34j56N03k69J11L6m32M48J08p77
$$ 521 -108 -289 489 367 280 267 -252 231 604 381 398 164 8 511 242 353 389 -43 405 513 -264
2390b64M05pJ2L06m95J5K08k21N33o50o4K78n2K31q3n38J04R2J9J78k72n24Q31
$$ -264 141 134 146 452 -43 -28 180 -41 492 -158 -222 56 4 235 152 -386 -282 -190 -171 7 -265 -789 42
2413D2l6j87j07k61M13K73l28%k90J01N76m72Q2J6l43M66P2k50J33q3J97Q7M2
$$ 42 6 -181 -288 -549 -136 137 -191 -191 -481 -380 196 -276 -194 -178 -521 -55 17 -233 -100 -183 14 101 143
2436A43k86L45j22m4K20k63K81j90J82O7l43m7P8K65M98m81m09K29K95K6m96P1
$$ 143 -143 202 80 36 256 -7 274 84 266 333 -10 -57 21 286 784 303 -106 123 418 444 -52 19
2458A9J5J91o1M0O7q8J43l51o5L44m2k05J50l62K39K54n05Q5L24p8k18j85K77
$$ 19 34 225 164 204 271 183 326 -25 -90 254 212 7 157 -205 34 288 -217 -132 192 114 -104 -289 -12
2481a2J83l52l33P5M5K63K65m39K71l93M0O58m96n6M42n63L6M72n79M77j30j32
$$ -12 171 -181 -514 -439 -394 -131 134 -305 -34 -427 -387 271 -225 -281 161 -402 -366 106 -473 4 -126 -258
2503b58L33m27P06l09k62L03l98k4N81n06J06J73j74M05P1k43N56n92j17K68j72
$$ -258 75 -352 354 45 -217 86 -312 -336 245 -261 -155 18 -156 249 320 77 633 41 -76 192 20
2524B0N41k62m17N39j49o3j59n7K2M55k51j14Q9O7K84n00j03L40lK4k88m67P89
$$ 20 561 299 -118 421 272 209 50 -7 15 470 219 105 194 261 545 45 -58 282 279 303 15 -452 337
2547C37j46j63K1l35N7J67o5j3n1J49j52k16K61O4j58J48j37n7J61R0k92J42j38
$$ 337 191 28 49 -286 -229 -62 -127 -140 -191 -42 -194 -410 -149 -85 -243 -95 -232 -289 -128 -38 -330 -188 -326
2570c26J43L04m36J87j12n3j9J93J31j07k67J50j38K79K12m1j7L1l56j00L76L84
$$ -326 -183 121 -315 -128 -240 -293 -312 -119 12 -95 -362 -212 -350 -71 141 100 83 114 -242 -342 34 418
2592D18r3j41qK42l61K47k81L2J78l32K15R9j31K17pk56K22l34K60J56n05M23
$$ 418 325 184 176 418 57 304 23 55 233 -99 116 215 84 301 294 38 260 -74 186 342 -163 260
2614B60l8j37K12j63k33K81k48l5J19p8J4l5J17mk48J54k3j90J84j61k3K3L9P0
$$ 260 222 85 297 134 -99 182 -66 -101 18 -60 -46 -81 36 32 -216 -62 -85 -275 -91 -252 -275 -252 -213 -143
2638a43Rl73L35N0p7J21J39j67q2L5L1R9J8P2k08J0R2J58o9r6j6k65L66P0K9j95
$$ -143 -134 -507 -172 -122 -199 -78 61 -106 -188 -153 -122 -23 -5 67 -141 -131 -39 119 50 -46 -62 -327 39 109 138 -57
2664e7K39J72j02j60K0R3r2P5P0l6j56N2oJ57O8k09M6N2K12l54L6J4N2k97K58
$$ -57 182 354 252 92 112 205 113 188 258 222 66 118 112 269 337 128 174 226 438 84 120 134 186 -111 147
2689A47J16J53m43J18r1J21j35J6n1j03J34j20R3l05K88R9j20j94P4l9N4K20k97
$$ 147 263 416 -27 91 0 121 -14 2 -49 -152 -18 -138 -45 -350 -62 37 -83 -277 -203 -242 -188 32 -265
2712b65L8M8j15j85L80j85l1K32O0J19m24J61r3j6K01j3j04P2p1j56K87M01m02
$$ -265 -227 -179 -294 -479 -99 -284 -315 -83 -23 96 -328 -167 -260 -276 -75 -88 -192 -120 -191 -347 -60 341 -61
2735f1L1j06RK99K5j06n1l08J99J40J18lL6k32J55k6J76L4j35j08P3j94L60p7
$$ -61 -30 -136 -127 172 197 91 40 -268 -69 71 189 186 222 -10 145 119 295 329 194 86 159 -35 325 248
2759B48q6o6m7J87l27N88n56N5R3k37R9J2K00m91J78J49j98K90j20j63r5Q8j01
$$ 248 162 96 49 236 -91 497 -59 -4 89 -148 -49 -37 163 -328 -150 -1 -199 91 -29 -192 -287 -199 -300
2782c00K92j46L6l07K64R7k59J37p4J26m5N4M2K3J2rj45r9J12j37N26k16k20K42
$$ -300 -8 -154 -118 -425 -161 -64 -323 -186 -260 -134 -179 -125 -83 -60 -48 -57 -202 -301 -189 -326 200 -16 -236 6
2806Fj21L34L0k81J1J69j44J45j87Q5K49j46p0m4J5M39l74jJ86j38q9P2k56K03
$$ 6 -115 219 249 -32 -21 148 4 149 -38 47 296 150 80 36 51 490 116 115 301 163 74 146 -110 93
2830I3M2j76J46P8J03J42m66K09J21m49M15m88Q0L31k65J15n4j81L61m06j25N78
$$ 93 135 -41 105 183 286 428 -38 171 292 -157 258 -230 -150 181 -84 31 -23 -204 157 -249 -374 204
2852B04j68l37M29n21K10L04l96J50k5k64K14k36Q5L54l81K09J51k37J14k88J97
$$ 204 36 -301 128 -393 -183 121 -275 -125 -150 -414 -200 -436 -351 3 -378 -169 -18 -255 -141 -429 -232
2873b32O09o58m5N09n92L49l4j87N77m35O0M35n28J87m6k24M92k86P1K24j60M16
$$ -232 377 -281 -326 183 -409 -60 -94 -281 296 -139 -79 356 -172 15 -31 -255 237 -49 22 246 86 502
2895E02l48j61L67j20o20O53o4l21K76m4J57l04k4K82l6k03J54m46M60L0k00K35
$$ 502 154 -7 360 240 -380 273 209 -112 164 120 277 -27 -51 231 195 -8 146 -300 160 190 -10 225
2917B25m69N3L55m75O3K48L2p6J6k40L90l68L06j78l06L27j9k27K62j33j82K36
$$ 225 -244 -191 164 -311 -248 0 32 -44 -28 -268 122 -246 60 -118 -424 -97 -116 -343 -81 -214 -396 -160
2939a60j17K19J34j86K2mR2K10p71O49J18j99l3J74k66J19O5K9k24jN23j86j96
$$ -160 -277 -58 76 -110 -88 -92 0 210 -561 88 206 7 -26 148 -118 1 66 95 -129 -130 393 207 11
2962A1Q6r4N41j29l60J36k99J69N56o25J18L93n73N03l37k59N11j12k25J27j91
$$ 11 97 3 544 415 55 191 -108 61 617 -8 110 503 -70 433 96 -163 348 236 11 138 -53
2983e3J03L14l07K28m18J7J40J04j79K57n09M28J64o05M36k17K82m5k30j7J16
$$ -53 50 364 57 285 -133 -116 24 128 -51 206 -303 125 289 -316 120 -97 185 140 -90 -107 9
3004Ik28L11k31j19K02l89J97K28l96N10p6j98L07n9m92K01k48O65m85k5M95k58
$$ 9 -219 92 -139 -258 -56 -445 -248 -20 -416 94 18 -180 127 68 -424 -223 -471 194 -291 -316 179 -79
3026g9K7J71k35j1N12m73J47j19n6J90m1P0J23l75N12j1l18J57k41p1J61L23j87
$$ -79 -52 119 -116 -127 385 -88 59 -60 -116 74 33 103 226 -149 363 352 34 191 -50 -121 40 363 176
3049A76n2k76M42m4j89J58n63M94j41K75l08M2JK13j81q0J45Pl65K90o5n3k02
$$ 176 124 -152 290 246 57 215 -348 146 5 280 -28 14 15 228 47 -33 112 119 -246 44 -21 -74 -276
3072b76K45m7j66K18k08J72j86R2k9K01k47J01k05K13J94J4j16l07M8Q7J48O6
$$ -276 -31 -78 -244 -26 -234 -62 -248 -156 -185 16 -231 -130 -335 -122 72 86 -30 -337 -289 -202 -54 12
3094A2k34N3J5j22N58j24k32q4L8J40J17l1J12l21kJ98O2l70L90o4k2q2J09n5
$$ 12 -222 -169 -154 -276 282 158 -74 -158 -120 20 137 106 218 -103 -105 93 155 -215 175 111 89 7 116 61
3118F1K01p4p7j22K99j16J41K7m87L82n4j27l7P7J96q2j83m9M8j00pJ02J18N6
$$ 61 262 188 111 -11 288 172 313 340 -147 235 181 54 17 94 290 208 25 -24 24 -76 -83 19 137 193
3142A93o7k54M8R5K7n8j19k69O23k97J13k49N8mQo8K63j18l61K36Q7k70M98q5
$$ 193 126 -128 -80 15 42 -16 -135 -404 219 -78 35 -214 -156 -160 -152 -220 43 -75 -436 -200 -113 -383 115 30
3166C0k45j19K34l8L5J86j26p2j41K98k03J09L1o3p5l2J65j67M38r8L74o09J51
$$ 30 -215 -334 -100 -138 -103 83 -43 -115 -256 42 -161 -52 -21 -84 -159 -191 -26 -193 245 147 521 -88 63
3189F3r2L47K5j71j07N5K51n16M15%K0j06n4q6J77l05J86q4J77q7j37J03J55q5
$$ 63 -29 318 343 172 65 120 371 -145 270 270 290 184 130 44 221 -84 102 18 195 108 -29 74 229 144
3213A44o2j56K87r7l4n5nL8M0p4j42J67k20J43J92m12J76J30k86K32j63J78l21
$$ 144 82 -74 213 116 82 27 22 60 100 26 -116 51 -169 -26 166 -246 -70 60 -226 6 -157 21 -300
3236c00N3O6K56Rr8J7o2p0j01M2oj59L32O2M2j98j18L24j79O1J08j53L7L39j33
$$ -300 -247 -181 75 84 -14 3 -59 -129 -230 -188 -194 -353 -21 41 83 -115 -233 91 -88 -27 81 -72 -35 304 171
3261A71j78R0j03K61j24j86L10m9K73m33J73k4l4J10K2k44K26j48m1J17L1j83
$$ 171 -7 83 -20 241 117 -69 241 192 465 32 205 181 147 257 279 35 261 113 72 189 220 37
3283C7K93p4l66L75m48r5M41j74o7K05j40k3o6J03j23j28K02L23n39K10R2L6k18
$$ 37 330 256 -110 265 -183 -278 163 -11 -78 127 -13 -36 -102 1 -122 -250 -48 275 -264 -54 38 74 -144
3306a44j95L66M7m73K17K24l26K61j67J54K10o77N24J9n11O65q2j10Nj01K15K85
$$ -144 -339 27 74 -399 -182 42 -284 -23 -190 -36 174 -503 21 40 -471 194 112 2 7 -94 121 406
3328D06p15L58n5j00N02m50j95N07k19K23J20m26M13l62m5J54j40K49K63n31M32
$$ 406 -309 49 -6 -106 396 -54 -249 258 39 262 382 -44 369 7 -38 116 -24 225 488 -43 389
3349C89m00pL22p68L68K05n02M91K24m14K94k91J43J8k73K92K83n81J97k91K41
$$ 389 -11 -18 304 -464 -96 109 -393 98 322 -92 202 -89 54 72 -201 91 374 -207 -10 -301 -60
3370f0Rj70K4L11n61M49k67j41M26k60K49k21k03M08j36j58L02j73o5L11k86J62
$$ -60 -51 -221 -197 114 -447 2 -265 -406 20 -240 9 -212 -415 -7 -143 -301 1 -172 -237 74 -212 -50
3392e0l1k12M44k79o6L82m50L32J31n56J99J25k35P00m35n3L24m70N27l28j20
$$ -50 -81 -293 151 -128 -194 188 -262 70 201 -355 -156 -31 -266 434 -1 -54 270 -200 327 -1 -121
3413a21M44j12k13L82n41J21J92k40K35k00L1M19l19J41j47j45N39j52l77M37
$$ -121 323 211 -2 380 -161 -40 152 -88 147 -53 -22 397 78 219 72 -73 466 314 -63 374
3433C74k53j59J29j52J05K04l83J8p9K13J32n29M10j40j57L31l56N3K42m60J13
$$ 374 121 -38 91 -61 44 248 -135 -117 -196 17 149 -380 30 -110 -267 64 -292 -239 3 -457 -344
3454c44K45j24J84O3m84M56k38J03J57k17J07K8j00K56l56J51L60k70K51j61j21
$$ -344 -99 -223 -39 24 -460 -4 -242 -139 18 -199 -92 -64 -164 92 -264 -113 247 -23 228 67 -54
3475e4K51r3k00M26o21Q6P70o83M41l96Q9K35j97p5L80l35L01k64j07O49o27O6
$$ -54 197 104 -96 330 -291 -205 565 -118 323 -73 16 251 54 -21 359 24 325 61 -46 603 -24 42
3497D2K18j94J47j50j68L06k05k6J80j10J04j17j33lL08l67L89l57L40j18l17
$$ 42 260 66 213 63 -105 201 -4 -30 150 40 144 27 -106 -109 199 -168 221 -136 204 86 -231
3518b31K70j39j08L56k28nq9k47K43Q3j73L00K7q8j66k5J81K55n08l7L37j79M88
$$ -231 39 -100 -208 148 -80 -85 -174 -421 -178 -95 -268 32 59 -29 -195 -220 -39 216 -292 -329 8 -171 317
3541C17p31J35N08k89J5oj67J92k5j3J42o8N6Pn1N7J80k33qk8K59j53p4r4L52
$$ 317 -414 -279 229 -60 -45 -51 -218 -26 -51 -64 78 10 66 73 22 79 259 26 18 -10 249 96 22 -72 280
3566B80k41J11J10r9p5J00j85K24l69L0J00j25K73q7k21K26j52K27J3j74j23L52
$$ 280 39 150 260 161 86 186 1 225 -144 -114 -14 -139 134 47 -174 52 -100 127 140 -34 -157 195
3588A95k18R5j57m7P6k50L87N2k06J54j70k10L07L1m3q5j27J48k2q2L06k11K04
$$ 195 -23 72 -85 -132 -56 -306 81 133 -73 81 -89 -299 8 39 -4 -89 -216 -68 -90 -172 134 -77 127
3611A27j26%k72K82n2K81k76J10k82J13K5n8K32J08j5j76l2m3Q7k26J56QJ31j50
$$ 127 1 1 -271 11 -41 240 -36 74 -208 -95 -70 -128 104 212 197 21 -11 -54 33 -193 -37 -29 102 -48
3635d8q7J53J27j58J31O1k93J03K22k80J86M5j09J27q6k06J45m2j06L97k73j28
$$ -48 -135 18 145 -13 118 179 -114 -11 211 -69 117 162 53 180 94 -112 33 -9 -115 282 9 -119
3657a19K50o9J70j31o9r9J26l19J95Q9O6j28l61K02K45k22K4j31L13j32l3J68
$$ -119 131 62 232 101 32 -67 59 -260 -65 24 90 -38 -399 -197 48 -174 -150 -281 32 -100 -133 35
3679C5j87L5j71L23j02N3O3J4j40l12K60j66J79k51L03Q0j13K9L30j36j4j39O7
$$ 35 -152 -117 -288 35 -67 -14 49 63 -77 -389 -129 -295 -116 -367 -64 16 -97 -68 262 126 112 -27 40
3702D0o4N2J81j30J46l44J62R1Q2J6m17M28l5j74K15o6Nj43J10k7j73j11K69j56
$$ 40 -24 28 209 79 225 -119 43 134 216 232 -185 243 208 34 249 183 188 45 155 128 -45 -156 113 -43
3726d3L25l30J76m3J8j93p1K32k34J56q5J08Mj59Q6Jm00L54n5R9k2J04n4j40P7
$$ -43 282 -48 128 85 103 -90 -161 71 -163 -7 -92 16 20 -139 -53 -52 -452 -98 -153 -54 -76 28 -26 -166 -89
3751h9k66K05P9O8k58N8P1n6J07K8k16N5K75k84L02j12nJ01l79K77R9nQ8J15m69
$$ -89 -355 -150 -71 -3 -261 -203 -132 -188 -81 -53 -269 -214 61 -223 79 -33 -38 63 -316 -39 60 55 143 258 -211
3776b11K24J64j89nn3L6K62j17m9J54l01M09j37k73J24J45j13L5J51p2pn1j18
$$ -211 13 177 -12 -17 -70 -34 228 111 62 216 -85 324 187 -86 38 183 70 105 256 184 177 126 8
3799HM0j5J14j67o1J87o5r7K03l56J70J4q4K45j16M7K69l04j78L9j61J87n0m8
$$ 8 48 33 147 -20 -81 106 41 -56 147 -209 -39 -25 -109 136 20 67 336 32 -146 -107 -268 -81 -131 -179
3823a79J22k22J34J82j42j00K43q1p3l8J30P9j9k28Q8n1J74j33R4N4j14r0L23
$$ -179 -57 -279 -145 37 -105 -205 38 -43 -116 -154 -24 55 36 -192 -104 -155 19 -114 -20 34 -80 -170 153
3846A53k70J23k1k21M77k24j75K28j46J43j00j14J95m0J0P1Q1k2K97m09J8M5R9
$$ 153 -117 6 -15 -236 241 17 -158 70 -76 67 -33 -147 48 8 18 89 170 148 445 36 54 99 198
3869A98m1o1N4O5j73o4J86j30J28k20k62M71k25R2J51j06j50P2l78K26k07K81
$$ 198 157 96 150 215 42 -22 164 34 162 -58 -320 151 -74 18 169 63 -87 -15 -393 -167 -374 -93
3891i3L31l26O3j04Q7p9L86o86Q08p50N24j51j86j6J27o8J59k58k1K38K4l74N88
$$ -93 238 -88 -25 -129 -42 -121 265 -421 387 -363 161 10 -176 -192 -65 -133 26 -232 -253 -15 9 -365 223
3914B23n26K93p6L34j19j96J87n8LJ92k75m6J45L4L0k36J78N1J32j65L80l03l3
$$ 223 -303 -10 -86 248 129 -67 120 62 65 257 -18 -64 81 115 145 -91 87 138 270 105 485 182 149
3937A49J28j25Q2j04l57N84l37p9n4J14j75K32K9q2j91K24J92m55L13q4P4n3M9
$$ 149 277 152 234 130 -227 357 20 -59 -113 1 -174 58 87 5 -186 38 230 -225 88 4 78 25 74
3960G4j58j19Q9n1r2L24k94K58K3q9j06J00O9J04j66J5k44J63o8R1j8K31m95M20
$$ 74 -84 -203 -114 -165 -257 67 -227 31 54 -35 -141 -41 28 132 -34 -19 -263 -100 -168 -77 -95 136 -359 61
3984F1PJ65l97P0j8J96k63P4r2L04j23M2N8r3j01K43Ql4N7k06l9J62n5K29j04
$$ 61 68 233 -164 -94 -112 84 -179 -105 -197 107 -16 26 84 -9 -110 133 141 107 164 -42 -81 81 26 255 151
4009A51Lj54J78k90K07n6%r9j08L96m02J05K80n5j02P2o3P4l93L14oj92k00Q7
$$ 151 154 0 178 -112 95 39 39 -60 -168 228 -174 -69 211 156 54 126 63 137 -256 58 52 -140 -340 -253
4033b53K16O9j10J46j44j12J34Q9l76M62m00K89R1n17L53l4J00q0R2j06L8o7k82
$$ -253 -37 32 -78 68 -76 -188 -54 35 -341 121 -279 10 101 -416 -63 -97 3 -77 15 -91 -53 -120 -402
4056d02L01j69P6J92N9m1j05Q0j28rR8K5rJ7K26l01L62m45J60K18k63N9J55k7
$$ -402 -101 -270 -194 -2 57 16 -89 -9 -137 -146 -48 -23 -32 -15 211 -90 272 -173 -13 205 -58 1 156 129
4080A29m7Jk13L07k43Q4J7J8q5J24J71k64j06K44j54k5o9J43k6R5p8j05k7kL07
$$ 129 82 83 -130 177 -66 18 35 53 -32 92 263 -1 -107 137 -17 -42 -111 32 6 101 23 -82 -109 -111 196
4105A96j16n8Rj76J37L3j52Q9KKKK80o20M19J97k66r3k7O8K38k63K85j18k44j91
$$ 196 80 22 31 -145 -8 25 -127 -38 -36 -34 -32 248 -372 47 244 -22 -115 -142 -74 164 -99 186 68 -176 -367
4130c67K31J11n6L3k49J51j0P5J97k11N9J27J28j62k0O8n7J46j80J57j45J32J4
$$ -367 -136 -25 -81 -48 -297 -146 -156 -81 116 -95 -36 91 219 57 37 105 48 194 14 171 26 158 172
4153A72j07q1n5J71k45P8R8j0J09m8K37k17j23q9J86R9l16K21O4J76m78J17K37
$$ 172 65 -16 -71 100 -145 -67 31 21 130 82 319 102 -21 -110 76 175 -141 80 144 320 -158 -41 196
4176A96j87P0j21M12m30k25J56j14J79K04r1j19l7J22J07j80O7j71j90Q8L17r9
$$ 196 9 79 -42 370 -60 -285 -129 -243 -64 140 49 -70 -107 15 122 -58 9 -162 -352 -264 53 -46
4198d6k24K98k00mJ63j18J30k81J9M34k16l1J19J18j26oo6K73p9j68q5J69k75
$$ -46 -270 28 -172 -176 -13 -131 -1 -282 -263 171 -45 -76 43 161 35 29 -37 236 157 -11 -96 73 -202
4221b02M86j61k77L00l2l20J87J73O7p4j20o7K1L0k9Pj29K93Pk28O8q9J63LJ28
$$ -202 284 123 -154 146 114 -206 -19 154 221 147 27 -40 -19 11 -18 -11 -140 153 160 -68 0 -89 74 77 205
4246B05o8q2J03J58q0k61o8J73k86P9J22M0j55Q6k09J06j10L15O5j06k59J54K72
$$ 205 137 55 158 316 236 -25 -93 80 -206 -127 -5 35 -120 -34 -243 -137 -247 68 133 27 -232 -78 194
4269A94k12o0J07j02m8J70m7N5k83M76l59j47L30j76N1P6j54M28k88KK42k81K
$$ 194 -18 -78 29 -73 -121 49 2 57 -226 250 -109 -256 74 -102 -51 25 -129 299 11 13 255 -26 -24
4292b4J32j51J15j91O7K21l78L04K9o4K77m25K93k54Q9J70j88j40J15PJ47R2l1
$$ -24 108 -43 72 -119 -52 169 -209 95 124 60 337 -88 205 -49 40 210 22 -118 -3 4 151 243 212
4315B12k3j34j76R6K60r8nj13pJ70j41K14m28J32j88K33k32K16q5L6P7o5J50n9
$$ 212 189 55 -121 -25 235 137 132 19 12 182 41 255 -173 -41 -229 4 -228 -12 -97 -61 16 -49 101 42
4339D2l00Q3J33m0K50m00j12L78l03J66J57l41L54Kr2L7m2j18L7Q0q4L9j06J42
$$ 42 -258 -175 -42 -82 168 -232 -344 34 -269 -103 54 -287 67 69 -23 14 -28 -146 -109 -29 -113 -74 -180 -38
4363c8Q1M3J78m01j48M44o3O0j22j48K56O5j82J62l03O8K81n8j18J17l94L98j42
$$ -38 43 86 264 -137 -285 159 96 156 34 -114 142 207 25 187 -116 -48 233 175 57 174 -220 178 36
4386C6j52J53j13RL21k25k26J06p3K74k51J91N9j95K9Q0Ko8O3J0N2N7j6l27K45
$$ 36 -116 37 -76 -67 254 29 -197 -91 -164 110 -141 50 109 -86 -57 23 25 -43 20 30 82 139 123 -204 41
4411D1j53J71j52j43N05n58J56j5j80M38k47K11j28p4J42j78N0J67q9o9j11NP
$$ 41 -112 59 -93 -236 269 -289 -133 -148 -328 110 -137 74 -54 -128 14 -164 -114 53 -36 -105 -216 -211 -204
4434b04L93l21L40j27K9m4j33j57K67L1k46K12j58J14j31J41m1J21k89J79PR3
$$ -204 189 -132 208 81 110 66 -67 -224 43 74 -172 40 -118 -4 -135 6 -35 86 -203 -24 -17 76
4456G6O7j69K08l55l6L28M3k25j19L09Q2l10Kn1K07K4j26j52J41J56j47n3J1K0
$$ 76 143 -26 182 -173 -209 119 162 -63 -182 127 209 -101 -99 -150 57 81 -45 -197 -56 100 -47 -100 -89 -69
4480f9J12j76L75k03q1o6q6J38J28j65r7J33j09K14j89J08o2j33L1J17J36j02
$$ -69 43 -133 242 39 -42 -108 -194 -56 72 -93 -190 -57 -166 48 -141 -33 -95 -228 -197 -80 56 -46
4502d6M6j3k25K25l4O9J31k97J33P5j75K16r6j4K08l23L14k26J95k78K06J7j39
$$ -46 0 -13 -238 -13 -47 22 153 -144 -11 64 -111 105 9 -5 203 -120 194 -32 163 -115 91 108 -31
4525c1j65K28O8Nk1J22l09J60P6j35K21j30K24j19j58J70l41k7L43l7j58JJ85
$$ -31 -196 32 100 105 84 206 -103 57 133 -2 219 89 313 194 36 206 -135 -162 181 144 -14 -13 172
4548A72k59J45j30n4J87j16j45j24K55J49j74j2l8J06p8K8J00p9J69j39j04J62
$$ 172 -87 58 -72 -126 61 -55 -200 -324 -69 80 -94 -106 -144 -38 -116 -88 12 -67 102 -37 -141 21
4570B1K19m15J22K2k61K63n8L4K01m14L02J2o2k30K52n8J24j72L4Q1o6K18k5k16
$$ 21 240 -175 -53 -31 -292 -29 -87 -53 148 -266 36 48 -14 -244 8 -50 74 -98 -64 17 -49 169 144 -72
4594g2l6K11j79j05R6J76j50K26k18k3J4J37r1L20K1l63N8K25qj93J1P3R9j53
$$ -72 -108 103 -76 -181 -85 91 -59 167 -51 -74 -60 77 -14 306 327 -36 22 247 239 46 57 130 229 76
4618G6k29o8K93J58m87K32N4M3j69Q5Q4j7Mq1J24pK7P1l70K14j68j05N41k02j07
$$ 76 -153 -221 72 230 -257 -25 29 72 -97 -12 72 55 59 -22 102 95 122 193 -177 37 -131 -236 305 103 -4
4643dk79K43j6M6m3j99J86J90q4m8qQ8P0j69M3j50q6J34K20l2P9l23L00o1j24
$$ -4 -283 -40 -56 -10 -53 -252 -66 124 40 -8 -16 72 142 -27 16 -134 -220 -86 134 102 181 -142 158 97 -27
4668b7N0Rj42K46k16J83n3J76l79J53j11J65J22Nj82L17k75K29j21j7J4J15j15
$$ -27 23 32 -110 136 -80 103 50 226 -153 0 -111 54 176 181 -1 316 41 270 149 132 146 261 146
4691A46j85KQ1kJ43p5m6K32l18J56k43J36J46p9k88K96k58K46l48J55L25l22P7
$$ 146 -39 -37 44 42 185 110 64 296 -22 134 -109 27 173 94 -194 102 -156 90 -258 -103 222 -100 -23
4714b3J8Oj27Nl63L39R4J97j25r6J32j76J73j48j78K96k69M5L29j99K34k00J48
$$ -23 -5 1 -126 -121 -484 -145 -51 146 21 -75 57 -119 54 -94 -272 24 -245 -200 129 -70 164 -36 112
4737A12P7k13RJ00K6j04j06J30K0k02K28k33L81k5r1O3k06K02K78k57j1j38k5
$$ 112 189 -24 -15 85 111 7 -99 31 51 -151 77 -156 225 200 109 172 -34 168 446 189 178 40 15
4760A5J31j24N5J79k73M9j15O8o3Jj85K07kL5N8l5K13k80J98j51J08j71K1J95
$$ 15 146 22 77 256 -17 32 -83 -15 -78 -77 -262 -55 -57 -22 36 1 214 -66 132 -19 89 -82 -61 134
4784A34k2J89l81M5j14K61l90K43k17K17j60N0K26j14J03j6j95J27N7o9K13l84
$$ 134 112 301 -80 -35 -149 112 -278 -35 -252 -35 -195 -145 81 -33 70 54 -141 -14 43 -26 187 -197
4806a97K13K34k82j32J01j25J16K45o4P2j05k01J39r4J02j39J10P6o8K8J17l25
$$ -197 16 250 -32 -164 -63 -188 -72 173 109 181 76 -125 14 -80 22 -117 -7 69 1 29 146 -179
4828a79P9K43j51l0K02j08O4O2j72K07j85p3j99N28j63j89J09m8l1M6K60k36N8
$$ -179 -100 143 -8 -38 164 56 120 182 10 217 32 -41 -240 288 125 -64 45 -3 -34 12 272 36 94
4851I4k2p5K52l29P7J3n2K42r9k40L79n3j85j91N7r5L88l52J77J28j53J77k07
$$ 94 72 -3 249 -80 -3 10 -42 200 101 -139 240 187 2 -189 -132 -227 161 -191 -14 114 -39 138 -69
4874f9L9m0J16j01j71J00P1J14l30J88K4K32j85PJ88k07k7J53l28K82J07j75K4
$$ -69 -30 -70 46 -55 -226 -126 -55 59 -271 -83 -59 173 -12 -5 183 -24 -51 102 -226 56 163 -12 12
4897A2P0j64Q7LP0K69k34j92k3K19MK13r3j42P3j02l8Q0rl9m3j0j89J24lK14q6
$$ 12 82 -82 5 8 78 347 113 -79 -102 117 121 334 241 99 172 70 32 112 103 64 21 11 -178 -54 -57 157 71
4924G1j99Q7MpLj16J50J48l80L29Rr3J46m1J47l13R3J03j10k7K57j58q2J61Kk37
$$ 71 -128 -41 -37 -44 -41 -157 -7 141 -239 90 99 6 152 111 258 -55 38 141 31 4 261 103 21 182 184 -53
4950e3K24k76J15j1k05J79n4M7O9M0k11J37J16R1j65o2P9j74M9K72n7k72J46M0
$$ -53 171 -105 10 -1 -206 -27 -81 -34 35 75 -136 1 117 208 43 -19 60 -114 -65 207 150 -122 24 64
4974F4J2k78P7J82l6o2O4o9O7K28p1j35J54l37K58j51o0j62L29j38K24l55l8O09
$$ 64 76 -202 -125 57 21 -41 23 -46 21 249 178 43 197 -140 118 -33 -93 -255 74 -64 160 -195 -233 376
4998C76k38j88j09J62M5l36M70m88K14pj80K43k1K1j10q9J53PJ45M1l07K31M5
$$ 376 138 -50 -159 3 48 -288 182 -306 -92 -99 -279 -36 -57 -36 -146 -235 -82 -75 70 111 -196 35 80
5021H0J39l23K24l30l9M47l54J7K52j73O8n1j57N04k16m5J83l66O1K80j4k90J96
$$ 80 219 -104 120 -210 -249 198 -156 -139 113 -60 8 -43 -200 304 88 43 226 -140 -79 201 187 -103 93
5044I3j8N7m4j97k3O7k7J59lp1m0J41J23kl49J7M1K1K40K07l87l3L6j34O1Q5j3
$$ 93 75 132 88 -109 -132 -65 -92 67 64 -7 -47 94 217 215 -134 -117 -76 -55 185 392 5 -28 8 -126 -65 20 7
5071GJ46l20P0J98k34q2J70o9j11J46j4NM6K23l11o5K28j72l9K46q1l6J65j46
$$ 7 153 -167 -97 101 -133 -215 -45 -114 -225 -79 -93 -88 -42 181 -130 -195 33 -139 -178 68 -13 -49 116 -30
5095c0J22j51Q2k33K91n1j74J93O6q0J0J43j46j19K1j0R2r9M4JJ32j01K13k19
$$ -30 92 -59 23 -210 81 30 -144 49 115 35 45 188 42 -77 -56 -66 26 -73 -29 -28 104 3 216 -3
5119cK22j66k8k6K13O3k94ml5K26j42J96k01l2l35M06r1J96Q9p9k35k09M29j12
$$ -3 219 53 25 -1 212 275 -19 -23 -58 168 26 222 21 -11 -346 60 -31 165 254 175 -60 -269 160 48
5143D8J54k81J32l0j67K37l03j8K79l36K36M4K55k97K67nj83j42K6oL04l89Q5
$$ 48 202 -79 53 23 -144 93 -210 -228 51 -285 -49 -5 250 -47 220 215 32 -110 -84 -90 214 -175 -90
5166i0r8K49N0k40K92j88K87l81k3J84J10l08K20n0K68k19J8j27K73k07J86k08
$$ -90 -188 61 111 -129 163 -25 262 -119 -142 42 152 -156 64 14 282 63 81 -46 227 20 206 -2
5188bJ71j39n9k9j4O3j04J67j17J39j81J78r4K37k7j96K35k55K67l82M3J02j30
$$ -2 169 30 -29 -58 -72 -9 -113 54 -63 76 -105 73 -21 216 189 -7 228 -27 240 -142 -99 3 -127
5211a27K68k20j4k03JM61k51K2P4K0j07J13J2j20J93j4m0K3N6k96J67P1nj01Q4
$$ -127 141 -79 -93 -296 -295 166 -85 -63 11 31 -76 37 49 -71 122 108 68 91 147 -149 18 89 84 -17 67
5236F7l11M59l83K85k8j14M0j78K40j99K24l37L16k48K84j51j30L7J58j72J95
$$ 67 -244 215 -168 117 89 -25 15 -163 77 -122 102 -235 81 -167 117 -34 -164 -127 31 -141 54
5257E4N8r8n4j63J93K4L9O3j66n8M5O4J46k98o3L27j15J54K3q5Pr3R2k43M31j57
$$ 54 112 14 -40 -203 -10 14 53 116 -50 -108 -63 1 147 -151 -214 113 -2 152 175 90 97 4 96 -147 284 127
5283A27q7K64o1m99L81o9r5K22j45o4m9Q2J82m80L28P7j60l6r7K88j31J16o5Q0
$$ 127 40 304 243 -256 125 56 -39 183 38 -26 -75 7 189 -291 37 114 -46 -82 -179 109 -22 94 29 109
5307A09o8k7k1j29K4J36J51p7j21j50J04j19K86L4k34J47L6k82K61R8k81K02k53
$$ 109 41 14 -7 -136 -112 24 175 98 -23 -173 -69 -188 98 132 -102 45 81 -201 60 158 -123 79 -174
5330a74M1K33l3j37j13K51K12k28n7l2k30K91J4J85P6j32L1J09j39j23K1P8m9
$$ -174 -133 100 67 -70 -183 68 280 52 -5 -37 -267 24 38 223 299 167 198 307 168 45 66 144 95
5353I5L8j22k9p9L23j29k7L5r2K7Q0n1j64N6L29k83Jk64L5K10O6p6J95j11j58
$$ 95 133 11 -18 -97 226 97 70 105 13 40 120 69 -95 -39 290 7 8 -256 -221 -11 55 -21 174 63 -95
5378i5L4P6J37k35N7OR2j84M5j01q6K02P0P2r7J03j43J65k22J50kj56K19j86o1
$$ -95 -61 15 152 -83 -26 -20 72 -112 -67 -168 -254 -52 18 90 -7 96 -47 118 -104 46 44 -112 107 -79 -140
5403a40J17j84K22R3L0j76l0J13J17l19K20M8K0Kj93L08k13KK04k24J4J95l08
$$ -140 -23 -207 15 108 138 -38 -68 45 162 -157 63 111 131 133 -60 248 35 37 241 17 31 226 -82
5426h2M18m22J23n9P3j4J4J46l95N7K22j00L04j94M1k56J23j7l3n1J80J14k86
$$ -82 336 -86 37 -22 51 37 51 197 -198 -141 81 -19 285 91 132 -124 -1 -18 -51 -102 78 192 -94
5449i4K04j13r5J14m8j4k06J19K13J22Q9l90J12nJ64k22J7k15J52OM9J75j52J0
$$ -94 110 -3 -98 16 -32 -46 -252 -133 80 202 291 -99 13 8 172 -50 -33 -248 -96 -90 -41 134 -18 -8
5473ho3K39j76J12k72K57r8m2j20K12J43J0q2k80J54k00N38m85k3J03n6K09n0
$$ -8 -71 168 -8 104 -168 89 -9 -51 -171 41 184 194 112 -168 -14 -214 324 -161 -184 -81 -137 72 22
5496B2j1j49J04l5K5j73J57pm6J64m5j50K67k82K59k82M03J6j59J15j41m8k9K16
$$ 22 11 -138 -34 -69 -44 -217 -60 -67 -113 51 6 -144 123 -159 100 -182 221 237 78 193 52 4 -25 191
5520A91j52p8J33P8q6N7pk93J7J81J40l51J29J77k30P2RR1l27L91o4j30n0J25
$$ 191 39 -39 94 172 86 143 136 -157 -140 41 181 -170 -41 136 -94 -22 -13 78 -249 142 78 -52 -102 23
5544B3L29n31K59K5j85J18k00O8P3k13L13k00K80Jo4k51J0R7n0K57k09N7j04K27
$$ 23 352 -179 80 105 -80 38 -162 -94 -21 -234 79 -121 159 160 96 -155 -145 -48 -98 159 -50 7 -97 130
5568A30j01J48j59J80j04k79o5J17J56j77K36Jj80J76q3R0j00J48j78P5k32R3
$$ 130 29 177 18 198 94 -185 -250 -133 23 -154 82 83 -97 79 -4 86 -14 134 -44 31 -201 -108
5590a08K28k17L46j12j5k21J17K02j86j2J91j18P3l02M2J99j38o4R0l6O8P2m73
$$ -108 120 -97 249 137 122 -99 18 220 34 22 213 95 168 -134 -92 107 -31 -95 -5 -41 27 99 -374
5613c74K50J01k02J01p4J35J3N2l00L71K61l18k4k82J31J89j5M2MM7J7J55j67
$$ -374 -124 -23 -225 -124 -198 -63 -50 2 -298 73 334 16 -8 -290 -159 30 15 57 61 108 125 280 113
5636A13O5j1j43j97J42K4l21K78ll8N6j6L13k63J86J15l21k16L10k77j7J17R2
$$ 113 178 167 24 -173 -31 -7 -328 -50 -53 -91 -35 -51 262 -1 185 300 -21 -237 73 -204 -221 -104 -12
5659a2L7p7l6K30n4j71R3k92J69K96j47p6K24o6J45l45O3P3k00K84p5j22j39K95
$$ -12 25 -52 -88 142 88 -83 10 -282 -113 183 36 -40 184 118 263 -82 -19 54 -146 138 63 -59 -198 97
5683I7j98j19J65J03p4o6j03K17p1j33P6nk2K41k13K9R0q0M0j87K04j32J58l0
$$ 97 -101 -220 -55 48 -26 -92 -195 22 -49 -182 -106 -111 -133 108 -105 -76 14 -66 -26 -213 -9 -141 17 -13
5707a3k2Lj81R3pO8L03o2J06j05j25r6K13j39J9K40k78m6L7J7j4K49j36j07l7
$$ -13 -35 -32 -213 -120 -127 -59 244 182 288 183 58 -38 175 36 55 295 17 -29 8 25 11 260 124 17 -20
5732b0p8J47j30j14K97J78j54k14P7K7L3J38m21N6R2J10j60P0j93L60J64l64K42
$$ -20 -98 49 -81 -195 102 280 126 -88 -11 16 49 187 -234 -178 -86 24 -136 -66 -259 101 265 -99 143
5755A43j21l5J21J05m15K01j1R4J6r3J89Ql60J13J14P1j24j41m0K81O9l14J69
$$ 143 22 -13 108 213 -202 -1 -12 82 98 5 194 202 -158 -45 69 140 16 -125 -165 116 185 -129 40
5778D0j17LJ00n8L7J37L9l11K18k4j04K7j09L11k23K29q8j87p5O2J9j19L48m8
$$ 40 -77 -74 26 -32 5 142 181 -130 88 64 -40 -13 -122 189 -34 195 107 -80 -155 -93 -74 -193 155 107
5802A07O1N3o2k27K81m0k11K32j15j05q8l5K17j51J12J92l85J63j41J63k8P5J09
$$ 107 168 221 159 -68 213 173 -38 194 79 -26 -114 -149 68 -83 29 221 -164 -1 -142 21 -7 68 177
5825A77j96J80j43J61n8P0j78K7K5K97k86K5Rr3j74J40k6n9J34k6J02k36J64k28
$$ 177 -19 161 18 179 121 191 13 40 65 362 76 101 110 17 -157 -17 -43 -102 32 6 108 -128 36 -192
5849a92K70l36K55k16K67j9K8j0q8R2K6R3k08n3n1J64K67k18l00K37j28K07j67
$$ -192 78 -258 -3 -219 48 29 57 47 -41 51 77 170 -38 -91 -142 22 289 71 -229 8 -120 87 -80
5872h0J23K53k19k7r4o0K74k69J20m06M28j61pJ42OJ43j41o8j4J27p6P9r9J6j07
$$ -80 43 296 77 50 -44 -104 170 -99 21 -385 43 -118 -125 17 23 166 25 -43 -57 70 -6 73 -26 -10 -117
5897a17J3J48l0j45L51r8j29O2j04O2J56Q2m38K06L6m0r4K1n3L38k26j32K43M6
$$ -117 -104 44 14 -131 220 122 -7 55 -49 13 169 251 -187 19 55 15 -79 -58 -111 227 1 -131 112 158
$$ [...]
8191h1
##END NTUPLES=NMR FID
##END=
