##TITLE=1H_LR-724-0
 CDCl3, 8 sc, 
 1.10.2020
##JCAMPDX= 6.0         $$ Bruker NMR JCAMP-DX V2.0
##DATA TYPE= NMR FID
##DATA CLASS= NTUPLES
##ORIGIN= UXNMR, Bruker Analytische Messtechnik GmbH
##OWNER= root
$$ XWIN-NMR		Version 3.5
$$ Thu Oct  1 10:21:53 2020 Russian Standard Time (UT+4h)  she@DPX200
##.OBSERVE FREQUENCY= 200.1315066352
##.OBSERVE NUCLEUS= ^1H
##.DELAY= (6, 6)
##.ACQUISITION MODE= SIMULTANEOUS
##.ACQUISITION SCHEME= undefined
##.AVERAGES= 8
##.DIGITISER RES= 18
##SPECTROMETER/DATA SYSTEM= spect
##.PULSE SEQUENCE= zg30
##.SOLVENT NAME= MeOD
##.SHIFT REFERENCE= (INTERNAL, MeOD, 0, 15.7039)
##AUDIT TRAIL= $$ (NUMBER, WHEN, WHO, WHERE, WHAT)
$$ ##TITLE= Audit trail, XWIN-NMR		Version 3.5
$$ ##JCAMPDX= 5.01
$$ ##ORIGIN= Bruker BioSpin GmbH
$$ ##OWNER= she
$$ F:/spectra/data/she/nmr/H-F/1/audita.txt
$$ ##AUDIT TRAIL=  $$ (NUMBER, WHEN, WHO, WHERE, WHAT)
(   1,<2020-10-01 10:20:29.85 +0400>,<she>,<DPX200>,
      <created by zg, POWCHK disabled, PULCHK disabled
       configuration hash MD5:
       00 E9 B6 7A A2 85 ED C7 34 08 36 98 17 FE 4E 26
       data hash MD5: 16K
       3A 21 BA 0B 36 9C 9D EE AF 86 1E 7C 50 F2 04 EB>)
$$ ##END=
$$ 
$$ hash MD5
$$ 1F 95 56 83 10 1E 70 F8 EC 2A 2D F1 92 54 85 CC
##$RELAX= 
##$RELAX= 
##$RELAX= 
##$RELAX= 
##$RELAX= 
##$RELAX= 
$$ Bruker specific parameters
$$ --------------------------
##$DU= <F:/spectra>
##$EXPNO= 1
##$NAME= <H-F>
##$PROCNO= 1
##$TYPE= <nmr>
##$USER= <she>
##$AMP= (0..31)
100 100 100 100 100 100 100 100 100 100 100 100 100 100 100 100 100 100 
100 100 100 100 100 100 100 100 100 100 100 100 100 100 
##$AQSEQ= 0
##$AQ_mod= 1
##$AUNM= <au_zg>
##$AUTOPOS= <>
##$BF1= 200.13
##$BF2= 200.13
##$BF3= 200.13
##$BF4= 200.13
##$BF5= 200.13
##$BF6= 200.13
##$BF7= 200.13
##$BF8= 200.13
##$BYTORDA= 1
##$CFDGTYP= 0
##$CFRGTYP= 5
##$CHEMSTR= <none>
##$CNST= (0..31)
1 1 145 1 1 1 1 1 1 1 1 1 1 1 1 1 1 1 1 1 1 1 1 1 1 1 1 1 1 1 1 1 
##$CPDPRG= <>
##$CPDPRG1= <>
##$CPDPRG2= <>
##$CPDPRG3= <>
##$CPDPRG4= <mlev>
##$CPDPRG5= <mlev>
##$CPDPRG6= <mlev>
##$CPDPRG7= <mlev>
##$CPDPRG8= <mlev>
##$CPDPRGB= <>
##$CPDPRGT= <>
##$D= (0..31)
0 1.2 0 0 0 0 0 0 0 0.06 0 0.03 0 0 0 0 0.0002 0 0 0 0 0 0 0 0 0 0 0 0 
0 0 0 
##$DATE= 1601533229
##$DBL= (0..7)
120 120 120 120 120 120 120 120 
##$DBP= (0..7)
150 150 150 150 150 150 150 150 
##$DBP07= 0
##$DBPNAM0= <>
##$DBPNAM1= <>
##$DBPNAM2= <>
##$DBPNAM3= <>
##$DBPNAM4= <>
##$DBPNAM5= <>
##$DBPNAM6= <>
##$DBPNAM7= <>
##$DBPOAL= (0..7)
0.5 0.5 0.5 0.5 0.5 0.5 0.5 0.5 
##$DBPOFFS= (0..7)
0 0 0 0 0 0 0 0 
##$DE= 6
##$DECBNUC= <off>
##$DECIM= 32
##$DECNUC= <off>
##$DECSTAT= 4
##$DIGMOD= 1
##$DIGTYP= 9
##$DL= (0..7)
0 120 120 120 120 120 120 120 
##$DP= (0..7)
150 150 150 150 150 150 150 150 
##$DP07= 0
##$DPNAME0= <>
##$DPNAME1= <>
##$DPNAME2= <>
##$DPNAME3= <>
##$DPNAME4= <>
##$DPNAME5= <>
##$DPNAME6= <>
##$DPNAME7= <>
##$DPOAL= (0..7)
0.5 0.5 0.5 0.5 0.5 0.5 0.5 0.5 
##$DPOFFS= (0..7)
0 0 0 0 0 0 0 0 
##$DQDMODE= 0
##$DR= 18
##$DS= 0
##$DSLIST= <SSSSSSSSSSSSSSS>
$$ [...]
##$SUBNAM2= <"">
##$SUBNAM3= <"">
##$SUBNAM4= <"">
##$SUBNAM5= <"">
##$SUBNAM6= <"">
##$SUBNAM7= <"">
##$SUBNAM8= <"">
##$SUBNAM9= <"">
##$SW= 16.880792210976
##$SWIBOX= (0..15)
0 0 2 0 0 0 0 0 0 0 0 0 0 0 0 0 
##$SW_h= 3378.37837837838
##$TD= 16384
##$TD0= 1
##$TE= 0
##$TE2= 300
##$TE3= 300
##$TEG= 300
##$TL= (0..7)
0 120 120 120 120 120 120 120 
##$TP= (0..7)
150 150 150 150 150 150 150 150 
##$TP07= 0
##$TPNAME0= <>
##$TPNAME1= <>
##$TPNAME2= <>
##$TPNAME3= <>
##$TPNAME4= <>
##$TPNAME5= <>
##$TPNAME6= <>
##$TPNAME7= <>
##$TPOAL= (0..7)
0.5 0.5 0.5 0.5 0.5 0.5 0.5 0.5 
##$TPOFFS= (0..7)
0 0 0 0 0 0 0 0 
##$TUNHIN= 0
##$TUNHOUT= 0
##$TUNXOUT= 0
##$USERA1= <user>
##$USERA2= <user>
##$USERA3= <user>
##$USERA4= <user>
##$USERA5= <user>
##$V9= 5
##$VALIST= <valist>
##$VCLIST= <CCCCCCCCCCCCCCC>
##$VD= 0
##$VDLIST= <DDDDDDDDDDDDDDD>
##$VPLIST= <PPPPPPPPPPPPPPP>
##$VTLIST= <TTTTTTTTTTTTTTT>
##$WBST= 1024
##$WBSW= 4
##$XGAIN= (0..3)
0 0 0 0 
##$XL= 0
##$YL= 0
##$YMAX_a= 751097
##$YMIN_a= -613087
##$ZGOPTNS= <>
##$ZL1= 120
##$ZL2= 120
##$ZL3= 120
##$ZL4= 120
##$ABSF1= 10
##$ABSF2= 0
##$ABSG= 5
##$ABSL= 3
##$ALPHA= 0
##$AQORDER= 0
##$ASSFAC= 0
##$ASSFACI= 0
##$ASSFACX= 0
##$ASSWID= 0
##$AUNMP= <proc_1d>
##$AZFE= 0.1
##$AZFW= 0.1
##$BCFW= 1
##$BC_mod= 2
##$BYTORDP= 1
##$COROFFS= 0
##$CY= 11.3945322036743
##$DATMOD= 1
##$DC= 2
##$DFILT= <>
##$DTYPP= 0
##$F1P= 16.9975609425685
##$F2P= -3.02152046262296
##$FCOR= 0.5
##$FTSIZE= 0
##$FT_mod= 4
##$GAMMA= 1
##$GB= 0.15
##$INTBC= 1
##$INTSCL= 1
##$ISEN= 128
##$LB= 0.24
##$LEV0= 0
##$LPBIN= 0
##$MAXI= 10000
##$MC2= 0
##$MEAN= 0
##$ME_mod= 0
##$MI= 1.114404
##$NCOEF= 0
##$NC_proc= 0
##$NLEV= 6
##$NOISF1= 3.799351
##$NOISF2= 2.8
##$NSP= 1
##$NTH_PI= 0
##$NZP= 0
##$OFFSET= 15.70392
##$PC= 1
##$PHC0= -9970.367
##$PHC1= 13.80089
##$PH_mod= 1
##$PKNL= yes
##$PPARMOD= 0
##$PSCAL= 0
##$PSIGN= 0
##$REVERSE= no
##$SF= 200.130013532006
##$SI= 16384
##$SIGF1= 3
##$SIGF2= 2
##$SINO= 400
##$SIOLD= 16384
##$SREGLST= <1H.CDCl3>
##$SSB= 0
##$STSI= 0
##$STSR= 0
##$SW_p= 3612.71676300578
##$SYMM= 0
##$S_DEV= 0
##$TDeff= 0
##$TDoff= 0
##$TI= <>
##$TILT= no
##$TM1= 0
##$TM2= 0
##$TOPLEV= 0
##$USERP1= <user>
##$USERP2= <user>
##$USERP3= <user>
##$USERP4= <user>
##$USERP5= <user>
##$WDW= 1
##$XDIM= 8192
##$YMAX_p= 0
##$YMIN_p= 0
$$ End of Bruker specific parameters
$$ ---------------------------------
##NTUPLES= NMR FID
##VAR_NAME=  TIME,          FID/REAL,        FID/IMAG
##SYMBOL=    X,             R,               I
##VAR_TYPE=  INDEPENDENT,   DEPENDENT,       DEPENDENT
##VAR_FORM=  AFFN,          ASDF,            ASDF
##VAR_DIM=   8192,          8192,            8192
##UNITS=     SECONDS,       ARBITRARY UNITS, ARBITRARY UNITS
##FACTOR=    0.000296,      1,               1
##FIRST=     0,             0,               0
##LAST=      2.424536,      0,               0
##MIN=       0,             -613087,         0
##MAX=       2.424536,      751097,          0
$$ Real data points
##PAGE= N=1
##DATA TABLE= (X++(R..R)), XYDATA
$$ plain form
0 0 0 0 0 0 0 0 0 0 0 -4 8 -8 8 -16 16 -24 32 -40 48 -56 68 -80 99 -116 140 -164 193 -225 258 -298 343
31 343 -395 451 -514 582 -656 740 -832 932 -1043 1166 -1299 1445 -1603 1776 -1963 2171
47 2171 -2397 2644 -2915 3208 -3532 3889 -4282 4724 -5212 5762 -6382 7088 -7902 8851
61 8851 -9974 11324 -12985 15076 -17788 21441 -26561 33836 -70800 751097 16424 -130333
73 -130333 42862 -611136 563948 233785 -373327 202763 -387791 144758 558051 -599224
83 -599224 130786 118229 -333963 521402 -198339 -262436 341107 -327840 265114 185788 -475359
94 -475359 292605 -102184 -90712 529597 -448914 -109274 276992 -234453 409789 -102435
104 -102435 -460939 352294 -63904 124805 155631 -567661 252655 234712 -241633 267697
$$ packed form
0@%%%%%%%%%mJ2j6J6k4L2m0N6p2Q8j04J24j48J79k15K56l04L57m18M83n56O41
31C43p38Q46r65J096j238J396j572J764j975K209k465K744l048L379l739M134
47B171m568N041n559O123o740P421q171R006r936J0974j2144J3470j4990J6753
61H851j8825K1298k4309K8061l2864L9229m8002O0397j04636Q21897p34673j46757
73a30333J73195o53998J175084l30163o07112N76090n90554N32549M13293j157275
83e99224P30010j2557m52192Q55365p19741o4097O03543o68947N92954p9326o61147
94d75359P67964l94789J1472O20309r78511L39640L86266n11445O44242n12224
104a02435l58504Q13233m16198J88709L0826p23292Q20316j7943m76345N09330
$$ plain form
114 267697 -306543 -100045 447017 -255095 39743 23659 -262624 380843 -83890 -192470
124 -192470 226466 -290479 152644 241512 -369081 126054 -21738 -92928 318595 -249935
134 -249935 -78935 173361 -188408 227313 -10087 -268999 233135 -102526 -11713 208787
144 208787 -265463 66626 77946 -154154 213148 -108243 -116571 185403 -144808 84973
154 84973 75252 -224628 170589 4590 -89096 159715 -172956 19183 159670 -128514 79085
165 79085 -61264 -96841 226015 -75613 -70153 69985 -120951 139444 45618 -155088 99985
176 99985 -43998 -1294 114554 -127817 46187 45512 -104963 109839 -25306 -59958 89276
187 89276 -84814 31926 53845 -106622 67485 -2835 -43516 76422 -78353 1911 64571
$$ packed form
114B67697n74240K06498N47062p02112K94838j6084k86283O43467m64733j08580
124a92470M18936n16945M43123Q8868o10593M95135j47792p1190M11523n68530
134b49935J71000K52296l61769M15721k37400k58912N02134l35661R0813K20500
144B08787m74250L32089J1320k32100L67302l21391q328L01974l30211K29781
154H4973r721k99880L95217j65999r3686K48811l32671J92139J40487k88184K07599
165G9085j40349l5577L22856l01628N460J40138j90936K60395r3826k00706K55073
176I9985j43983M2704J15848k42371J74004o75j50475K14802j35145l4652J49234
187H9276j74090J16740K1919j60467J74107p0320m0681J19938j54775Q0264O2660
$$ plain form
198 64571 -66886 50245 -12346 -69024 77694 -22168 -9004 29496 -81218 39971 32819
209 32819 -49450 30941 -39865 -9038 56601 -51806 9994 17130 -40591 39872 -18598 -14263
221 -14263 46033 -42195 2670 30149 -30636 17441 -6482 -10040 33178 -35188 -164 26937
233 26937 -23832 21694 -4776 -19534 30332 -6740 -330 17117 -14029 9911 2934 -5748 27385
246 27385 -16187 -12030 21982 -8298 5721 -151 -8209 13879 -6033 -2979 12078 -1832 2229
259 2229 -256 -6135 16995 -3296 -12450 12201 -2054 -2037 -5339 -3899 7767 -6024 -6878 -818
273 -818 -869 1322 -3418 -10311 7145 3375 -11751 1046 2476 448 -8766 -1826 7657 -6854 -6920
288 -6920 -556 1356 -1459 -4014 -6907 2052 3260 -6988 -1126 2905 3670 -7057 -1529 9895 1074
$$ packed form
198F4571j31457J17131o2591n6678J46718r9862J3164L8500j10714J21189p152
209C2819q2269Q0391p0806L0827O5639j08407O1800P136n7721Q0463n8470M335
221a4263O0296q8228M4865K7479o0785M8077k3923l558M3218o8366L5024K7101
233B6937n0769M5526k6470j4758M9866l7072O410J7447l1146K3940o977q682L3133
246B7385m3572M157L4012l0280J4019n872q058K2088j9912L054J5057j3910M061
259B229k485n879K3130k0291r154K4651j4255J7l302J440J1666j3791q54O060
273h18n1K191m740o893J7456l770j5126J2797J430k028r214O940R483j4511o6
288f920O364J912k815k555k893Q959J208j0248N862M031P65j0727N528J1424q821
$$ plain form
303 1074 -3016 -1474 3659 3898 1360 -2666 2835 3192 -4330 290 4218 7405 -3717 -5845 6464
318 6464 7840 1264 -1879 5258 4556 -6 -1361 8717 6036 -7420 -1250 2860 5182 496 -5040
333 -5040 -1196 2121 -699 -1524 3209 2229 449 -9969 716 12942 -824 -5284 -5742 281 2194
348 2194 -3034 1258 1730 -12135 -7868 5127 1095 2693 -9042 -8681 4476 -1175 1288 -67 -1504
363 -1504 -407 -9765 -1493 15226 -4280 -10287 2698 -4806 2697 -610 -1622 8610 -7841 -7882
377 -7882 212 5824 18670 -5328 -22927 9677 11611 3437 7489 -10077 -999 1360 2624 17760
391 17760 -7263 -9087 7594 -4953 8506 7492 -13216 8688 3902 -5999 5688 -4468 13922
404 13922 6712 -18152 7682 1580 -3748 18024 -5897 -11099 -1607 -8774 20920 6713 -21726
$$ packed form
303A074m090J542N133K39k538m026N501L57p522M620L928L187j1122k128J2309
318F464J376o576l143P137p02m562j355J0078k681j3456O170M110K322m686n536
333e040L844L317k820q25M733r80j780j0418J0685J2226j3766m460m58O023J913
348B194n228M292M72j3865M267J2995m032J598j1735L61J3157n651K463j355j437
363a504J097r358Q272J6719j9506o007J2985p504P503l307j012J0232j6451m1
377g882Q094N612J2846k3998j7599L2604J934q174M052j7566R078K359J264J5136
391A7760k5023j824J6681j2547J3459j014k0708K1904m786r901J1687j0156J8390
404A3922p210k4864K5834o102n328K1772k3921n202R492p167K9694j4207k8439
$$ plain form
417 -21726 -4394 -7647 14427 16006 -22895 -1949 3568 -10258 15214 110 -9731 720 -14489
430 -14489 12268 7880 -19986 2258 -4678 3726 11182 -28539 -3816 25059 -1019 -6235 -21070
443 -21070 -2806 34007 -2513 -12726 -8204 -10614 24850 9992 -14513 -4266 -10417 10108 17168
456 17168 -12352 1030 -1412 -7982 16358 -606 -268 6241 -9578 5335 6614 2979 3929 -12275
470 -12275 5453 20675 -11890 -12871 4812 15792 14749 -23655 -18495 13572 21535 10948 -24761
483 -24761 -18871 16441 14693 5360 -6775 -17188 2198 6700 8009 5336 -19308 -4769 2481
496 2481 2462 12417 -17565 -12288 12661 1596 -842 -10901 -7812 18696 -1371 -6298 -3120 -21392
510 -21392 22512 19100 -23031 -7820 -14396 11713 28054 -19884 -11548 -5708 -4884 32847 -7024
$$ packed form
417b1726J7332l253K2074J579l8901K0946N517j3826K5472j5104r841J0451j5209
430a4489K6757m388k7866K2244o936Q404P456l9721K4723K8875k6078n216j4835
443b1070J8264L6813l6520j0213M522k410L5464j4858k4505J0247o151K0525P060
456A7168k9520J3382k442o570K4340j6964L38O509j5819J4913J279l635R50j6204
470a2275J7728J5222l2565r81J7683J0980j043l8404N160L2067P963j0587l5709
483b4761N890L5312j748r333j2135j0413J9386M502J309k673k4644J4539P250
496B481j9R955k9982N277K4949j1065k438j0059L089K6508k0067m927L178j8272
510b1392M3904l412m2131J5211o576K6109J6341m7938Q336N840Q24L7731l9871
$$ plain form
523 -7024 -17464 12788 -22822 14197 26736 -18663 2396 -17646 1017 43678 -20835 -17788
535 -17788 7378 -4821 38121 -15598 -40739 37342 5007 5267 2480 -46393 32449 29880 -20029
548 -20029 11441 -33620 2039 52238 -25219 1215 -4379 -32237 50166 -2013 -23480 20588
560 20588 -35316 17722 26723 -36521 26544 -11721 -27836 45637 -20000 -2533 14621 -42697
572 -42697 40501 6821 -44501 27476 -17709 9421 30877 -63092 10608 27726 -20677 33424
584 33424 -39825 -24500 54252 -24857 13641 5170 -54520 43290 5970 -20448 31133 -47016
596 -47016 6725 40719 -41737 25020 -5862 -30403 51636 -29938 -7416 36967 -41459 27043
608 27043 12302 -38150 39912 -18911 -7834 45967 -44742 6718 19230 -29321 48124 -19406
$$ packed form
523g024j0440L0252l5610L7019J2539m5399K1059k0042J8663M2661o4513L047
535a7788K5166j2199M2942n3719k5141P8081l2335K60k787m8873P8842k569m9909
548b0029L1470m5061L5659N0199p7457K6434n594k7858Q2403n2179k1467M4068
560B0588n5904N3038R001o3244O3065l8265j6115P3473o5637J7467J7154n7318
572d2697Q3198l3680n1322P1977m5185K7130K1456r3969P3700J7118m8403N4101
584C3424p3249J5325P8752p9109L8498q471n9690R7810l7320k6418N1581p8149
596d7016N3741L3994q2456O6757l0882k4541Q2039q1574K2522M4383p8426O8502
608B7043j4741n0452P8062n8823J1077N3801r0709N1460J2512m8551P7445o7530
$$ plain form
620 -19406 -35854 44841 -21272 12224 21752 -48965 29950 5024 -21701 42940 -33813 -8284
632 -8284 34263 -32992 26028 1002 -38826 41787 -14523 -14581 29220 -36589 18481 15911 -39841
645 -39841 29825 -11720 -14654 37629 -33238 1750 16811 -33466 33899 -1354 -33239 26868
657 26868 -19640 6796 22427 -41781 17756 6655 -23286 28394 -17985 -7880 25662 -27916
669 -27916 12496 13458 -26261 22729 -8971 -7909 25439 -28469 7130 19570 -23332 14089 -4638
682 -4638 -11505 27362 -14929 -2916 14901 -18804 18197 3085 -15153 21256 -13163 -1081
694 -1081 21132 -17823 4659 6502 -11352 15728 -8467 -7406 18177 -12513 4035 5952 -13974
707 -13974 15078 -3118 -9241 13979 -8113 -1605 6351 -9038 9521 -2920 -11836 13078 -5325
$$ packed form
620a9406j6448Q0695o6113L3496R528p0717P8915k4926k6725O4641p6753K5529
632h284M2547o7255N9020k5026l9828Q0613n6310n8M3801o5809N5070k570n5752
645c9841O9666m1545k934N2283p0867L4988J5061n0277O7365l5253l1885O0107
657B6868m6508K6436J5631o4208N9537j1101k9941N1680m6379J0105L3542n3578
669b7916M0412R62l9719M8990l1700J062L3348n3908L5599J2440m2902L7421j8727
682d638o867L8867m2291J2013J7817l3705L7001j5112j8238L6409l4419J2082
694a081K2213l8955K2482J843j7854K7080k4195J061K5583l0690J6548J917j9926
707a3974K9052j8196o123K3220k2092O508P956j5389J8559j2441q916K4914j8403
$$ plain form
720 -5325 -4954 4738 -9027 5832 85 -10257 7029 -1644 -3575 3844 -7440 3569 2835 -9114
734 -9114 6350 -533 -5464 2155 -3573 2520 1211 -7444 2314 2182 -3510 2348 -2126 1421 2361
749 2361 -5738 3967 3783 -1151 412 -1573 2296 3872 -2500 -235 3498 -1792 -399 729 3536
764 3536 2202 -4480 1040 3098 1601 1741 104 602 1178 -679 192 5034 1235 -2797 -3079 1977
780 1977 4095 -2504 -144 461 -2038 -1011 678 2738 847 -3193 -3672 1817 2513 521 -2589 -2007
796 -2007 493 -3663 -259 3508 -1095 -4351 -4264 -299 3969 -393 -3765 -718 -2442 -57 979 -209
812 -209 3275 -4149 -5555 3355 2956 1247 -1543 -4458 1498 -156 -817 5880 -1537 -3297 -425 -2103
828 -2103 6965 3691 -5722 892 704 205 5005 -930 2865 -516 -6497 6915 3566 -468 1553
$$ packed form
720e325L71R692j3765J4859n747j0342J7286q673j931P419j1284J1009p34j1949
734i114J5464o883m931P619n728O093j309q655R758j32n692N858m474L547R40
749B361q099R705j84m934J563j985L869J576o372K265L733n290J393J128K807
764C536j334o682N520K058j497J40j637M98N76j857Q71M842l799m032k82N056
780A977K118o599K360O05k499J027J689K060j891m040m79N489O96j992l110N82
796b007K500m156L404L767m603l256Q7L965M268m362l372L047j724K385J036j188
812b09L484p424j406Q910l99j709k790k915N956j654o61O697p417j760K872j678
828b103R068l274r413O614j88m99M800n935L795l381n981J3412l349m034K021
$$ plain form
843 1553 -6378 2123 5866 -4386 3822 2791 -5105 1937 -2407 5293 7812 -9100 -81 383 -1700
858 -1700 9027 -3035 -4569 2835 -7612 2949 7125 -6420 900 -6268 -1609 10099 -7421
871 -7421 536 2675 -9202 4253 -73 -2456 7195 -8763 -4009 5174 -5927 6032 -1661 -7512
885 -7512 7345 -9692 -1462 12334 -5337 -833 -4278 -6441 13962 215 -4263 2537 -10251
898 -10251 7055 5784 -6618 9597 -7324 -7712 12173 -1948 2229 768 -8846 10311 -1304
911 -1304 -4151 10172 -7330 4604 5221 -12663 10099 3492 -4496 8897 -9364 -2475 8233
924 8233 -2463 10616 -8057 -14938 14754 818 2522 2221 -17590 8149 8187 -6152 6446 -8693
938 -8693 -1648 9555 -10549 7083 1207 -13820 11629 -4010 -4811 7021 -12453 7380 6498
$$ packed form
843A553p931Q501L743j0252Q208j031p896P042m344P700K519j6912R019M64k083
858a700J0727j2062j534P404j0447J0561M176j3545P320p168M659J1708j7520
871g421P957K139j1877J3455m326k383R651j5958M754R183j1101J1959p693n851
885g512J4857j7037Q230J3796j7671M504l445k163K0403j3747m478O800j2788
898a0251J7306j271j2402J6215j6921l88J9885j4121M177j461r614J9157j1615
911a304k847J4323j7502J1934O17j7884K2762o607p988J3393j8261O889J0708
924H233j0696J3079j8673o881K9692j3936J704l01j9811K5739L8j4339J2598j5139
938h693P045J1203k0104J7632n876j5027K5449j5639q01J1832j9474J9833q82
$$ plain form
951 6498 -14521 4370 -3534 529 14899 -15907 -3871 6146 -7529 16735 -4615 -17109 7602
964 7602 -4181 10583 7750 -23421 3282 6735 198 12050 -18621 -2482 18469 -10757 6511
977 6511 -1558 -11134 19410 -4679 -6461 9080 -12268 10682 8291 -13978 9059 -8739 -528
990 -528 23542 -15422 -3564 5574 -10378 19796 620 -14207 7840 -9337 9622 13666 -19660
1003 -19660 5954 -2148 -6222 23293 -14602 -11641 13760 -7338 9734 -3499 -17613 18195
1015 18195 -1990 -3924 8110 -21209 10733 13444 -16405 8354 -9644 -8257 21399 -7349
1027 -7349 -3316 -2079 -15266 22058 2000 -16888 9587 -12234 4998 16256 -19417 3706
1039 3706 3484 -8141 13920 -8407 -3849 9670 -13652 11147 5079 -19222 13111 -321 -4154
$$ packed form
951F498k1019J8891p904M063J4370l0806J2036J0017j3675K4264k1350j2494K4711
964G602j1783J4764k833l1171K6703L453o537J1852l0671J6139K0951k9226J7268
977F511q069r576L0544k4089j782J5541k1348K2950k391k2269K3037j7798Q211
990e28K4070l8964J1858R138j5952L0174j9176j4827K2047j7177J8959M044l3326
1003a9660K5614q102m074K9515l7895K961K5401k1098J7072j3233j4114L5808
1015A8195k0185j934J2034k9319L1942K711k9849K4759j7998J387K9656k8748
1027g349M033J237j3187L7324k0058j8888K6475k1821J7232J1258l5673K3123
1039C706k22j1625K2061k2327M558J3519k3322K4799o068k4301L2333j3432l833
$$ plain form
1052 -4154 12993 -14431 293 11750 -5299 8936 -7817 -8783 17813 -5616 1449 6555 -19055
1065 -19055 10706 11143 -8702 4145 -9405 2198 14729 -10468 763 1498 -6057 14326 -7324
1078 -7324 -7958 14363 -7486 -582 5497 -7937 6575 -2989 -4919 9782 -7522 -1830 4055 -9357
1092 -9357 9694 1294 -13598 6603 371 -684 3792 -9376 1289 2964 -2888 6158 -8037
1105 -8037 -5570 11262 -4962 -2047 2061 -7087 5345 2110 -5439 1708 -1669 2682 1709 -6703
1119 -6703 6351 1852 -7960 5971 941 -1531 3039 -5155 1967 4813 -2035 -264 -2122 2226
1133 2226 6014 -5628 -490 5144 -2848 3066 1409 -3052 2153 1067 1520 866 -2751 1206 2108
1148 2108 -615 2393 -2704 -1989 5026 -827 -2140 678 347 526 -936 85 1650 -2320 -1562 2310
$$ packed form
1052d154J7147k7424J4724J1457j7049J4235j6753r66K6596k3429P065N106k5610
1065a9055K9761M37j9845J2847j3550J1603J2531k5197J1231P35p555K0383k1650
1078g324o34K2321k1849O904O079j3434J4512r564j930J4701j7304N692N885j3412
1092i357J9051q400j4892K0201o232j055M476j3168J0665J675n852R046j4195
1105h037K467J6832j6224K915M108r148J2432l235p549P147l377M351r73q412
1119f703J3054m499r812J3931n030k472M570q194P122K846o848J771j858M348
1133B226L788j1642N138N634p992N914j657m461N205j086M53o54l617L957R02
1148B108k723L008n097P15P015n853j313K818l31J79j462J021J565l970P58L872
$$ plain form
1164 2310 -712 308 -953 -3099 1403 734 -2386 -1156 484 -351 -1802 -1439 1276 152 -2325 452
1180 452 -809 -809 677 -582 479 163 -2574 -1136 2431 980 -1652 -2527 528 2113 -788 289
1196 289 465 -464 16 714 1233 1596 -31 -1481 823 990 1090 248 -152 1065 -848 -553 1596 2186
1214 2186 -690 -1386 290 1594 1322 -390 1233 89 -921 66 1037 1964 -708 -2419 -351 1574
1230 1574 240 -499 -475 -660 -314 -1412 665 859 -556 -1363 -1515 1189 1006 -986 -1211 126 -1119
1247 -1119 -1288 600 841 -706 -2933 -652 889 434 -664 -1148 -362 -392 -720 15 1255 -201 -1253
1264 -1253 -1267 1109 2000 -538 -1116 -113 125 -19 552 1113 184 -1489 -806 2035 1767 541 -1303 -545
1282 -545 1828 685 638 1973 201 -1267 -352 1693 1759 251 -969 -89 -505 1069 1141 -290 822
$$ packed form
1164B310l022J020j261k146M502o69l120J230J640q35j451L63K715j124k477K777
1180D52j261%J486j259J061l16k737J438L567j451k632q75L055J585k901J077
1196B89J76r29M80O98N19L63j627j450K304J67J00q42m00J217j913K95K149N90
1214B186k876o96J676J304k72j712J623j144j010R87R71R27k672j711K068J925
1230A574j334p39K4j85L46j098K077J94j415q07j52K704j83j992k25J337j245
1247a119j69J888K41j547k227K281J541m55j098m84P86l0l28P35J240j456j052
1264a253j4K376Q91k538n78J003K38j44N71N61r29j673O83K841k68j226j844P58
1282e45K373j143m7J335j772j468R15K045O6j508j220Q80m16J574P2j431J112
$$ plain form
1299 822 -1262 -1948 2348 2683 -733 -1929 -1136 924 317 -295 1337 -1526 -1955 367 -788 1816 859
1316 859 -3561 -1788 1016 426 -126 -1020 -232 -884 -2949 1886 1572 -1972 -26 -2051 -1594 2110 174
1333 174 -197 -302 -2517 -13 307 1967 2552 -5297 -1751 3973 -230 702 653 -2116 775 -44 707
1350 707 2286 -1786 548 -911 -1638 5128 -215 -2922 3014 -770 -1315 2197 1069 1857 -1179 -2122
1366 -2122 2885 -351 2071 2572 -4712 648 1519 -1342 3798 24 -4287 -243 501 3822 549 -5168
1382 -5168 1708 -222 -1279 3729 -2689 -1034 1033 -3302 995 1370 -2115 818 -2441 -131 2125
1397 2125 -4586 2071 2373 -4361 206 -1293 149 4056 -2206 -2348 -269 -1955 4495 567 -3576
1412 -3576 979 -3270 1205 5596 -3519 -1839 443 21 3725 -1315 -1742 2397 -1864 1227 1841 -2202
$$ packed form
1299H22k084o86M296L35l416j196P93K060o07o12J632k863m29K322j155K604r57
1316H59m420J773K804n90n52q94P88o52k065M835l14l544J946k025M57L704j936
1333A74l71j05k215K504L20J660N85p849L546N724m203R32m9k769K891q19P51
1350G07J579m072K334j459p27O766n343k707N936l784n45L512j128P88l036r43
1366b122N007l236K422N01p284N360Q71k861N140l774m311M044P44L321l273n717
1382e168O876j930j057N008o418J655K067m335M297L75l485K933l259K310K256
1397B125o711O657L02o734M567j499J442L907o262j42K079j686O450l928m143
1412c576M555m249M475M391r115J680K282m22L704n040m27M139m261L091O14m043
$$ plain form
1428 -2202 2992 -434 -1945 3540 -862 -817 2234 115 1998 -1587 -3580 4743 2374 -825 -968 -4104
1444 -4104 3058 5316 -787 -1621 -2879 -109 5516 61 -2646 -1825 -1736 4575 1590 -4591 -1134 977
1460 977 1725 106 -3766 -581 2651 115 -402 -2244 -1249 2992 -771 -656 -311 -2830 -478 2074
1476 2074 1224 -1408 -3045 -1585 3381 1565 -1254 -2055 -2629 2417 3475 -503 -2706 -1284 881 3341
1492 3341 534 -3498 -1252 1513 4246 -2 -5450 396 4531 1873 -1710 -3623 -352 5309 1820
1507 1820 -2245 -2233 -624 4487 1949 -1986 -166 -1799 1466 4125 -1935 -1955 917 -156 2428 -175
1523 -175 -1832 1132 -1250 1210 1820 -2633 468 -239 -1169 4120 -912 -4188 616 1180 2793 -2024
1539 -2024 -5761 2346 2229 -271 -828 -5027 874 4622 -2100 -1678 -1542 -518 3904 -1314 -1543 -110
$$ packed form
1428b202N194l426j511N485m402M5L051k119J883l585j993Q323k369l199j43l136
1444d104P162K258o103q34j258K770N625n455k707Q21Q9O311k985o181L457K111
1460I77P48j619l872L185L232k536n17j842R95M241l763J15L45k519K352K552
1476B074q50k632j637J460M966j816k819q01n74N046J058l978k203J422K165K460
1492C341k807m032K246K765K733m248n448N846M135k658l583j913L271N661l489
1507A820m065J2J609N111k538l935J820j633L265K659o060k0K872j073K584k603
1523a75j657K964k382K460O10m453L101p07r30N289n032l276M804N64J613m817
1539b024l737Q107j17k500n57m199N901L748o722M22J36J024M422n218k29J433
$$ plain form
1555 -110 -2311 3332 1206 -4240 600 89 52 2757 -3052 -652 2132 -1170 1845 -937 -1060 2408
1571 2408 -2232 1202 3001 -3016 -119 1433 -250 2302 -1912 -1469 3338 -195 1112 -625 -2105
1586 -2105 4086 714 -1662 1353 -1302 771 2788 -1567 447 -920 -503 4139 -1678 -1912 1154
1601 1154 -1155 1683 312 -2530 1347 -358 -878 1065 -1674 1292 292 -3160 2029 386 -1736
1616 -1736 1060 -1300 -98 571 -2253 887 437 -1521 201 -1960 393 2203 -2327 151 205 -1928
1632 -1928 1626 635 -633 -394 -1964 1064 1669 -1576 572 -718 -662 1979 -868 283 1453 -832
1648 -832 -176 464 800 1974 -1117 -727 1913 -962 569 1177 -519 355 -515 75 1634 571 -93
1665 -93 -414 -863 1613 224 -562 1530 -1237 -858 1105 513 546 -863 -1228 461 467 -75 257 -832 -186
$$ packed form
1555a10k201N643k126n446M840n11l7K705n809K400K784l302L015k782j23L468
1571B408m640L434J799o017K897J552j683K552m214M43M807l533J307j737j480
1586b105O191l372k376L015k655K073K017m355K014j367M17M642n817k34L066
1601A154k309K838j371k842L877j705n20J943k739K966j000l452N189j643k122
1616a736K796k360J202O69k824L140m50j958J722k161K353J810m530K478N4k133
1632a928L554r91j268K39j570L028O05l245K148j290N6K641k847J151J170k285
1648h32O56O40L36J174l091L90K640k875J531O08j696Q74q70N90J559j063o64
1665i3l21m49K476j389p86K092k767L79J963n92L3j409l65J689On42L32j089O46
$$ plain form
1684 -186 -438 -1157 1408 159 -1352 -791 -281 679 395 -763 -447 -332 -835 495 285 229 -433 -1722
1702 -1722 135 565 68 -364 -759 -418 -266 -193 917 672 -1045 -824 220 1225 720 -558 -224 -71
1720 -71 -86 215 942 322 -138 -809 100 1507 454 203 -208 291 639 323 415 832 -87 -979 135 1001
1740 1001 420 -427 -652 219 -200 595 673 155 -364 -707 -396 846 946 -982 -716 -256 41 102 -184 268
1760 268 -776 -924 -256 214 595 -128 -1345 -438 441 -168 -158 66 -225 -790 -815 927 520 -723 -668 -443
1780 -443 177 628 291 -310 -257 -949 123 683 891 -175 -1517 92 1252 160 401 101 -631 324
1798 324 165 520 1010 -252 -347 -27 395 1049 -280 -68 1122 -387 -477 1252 665 230 -739 -902 1213
1817 1213 442 518 251 -1151 319 296 -1 1152 -916 -1863 579 866 267 -205 -1173 611 -63 -752
$$ packed form
1684a86k52p19K565j249j511N61N10R60k84j158L16J15n03J330k10n6o62j289
1702a722J857M30m97m32l95L41J52P3J110k45j717K21J044J005n05j278L34J53
1720g1j5L01P27o20m60o71R09J407j053k51m11M99L48l16R2M17r19q92J114Q66
1740A001n81q47k25Q71m19P95P8n18n19l43L11J242J00j928K66M60K97O1k86M52
1760B68j044j48O68M70L81p23j217R07Q79o09J0K24k91n65k5J742m07j243N5K25
1780d43O20M51l37o01N3o92J072N60K08j066j342J609J160j092K41l00p32R55
1798C24j59L55M90j262r5L20M22O54j329K12J190j509r0J729n87m35r69j63K115
1817A213p71P6k67j402J470k3k97J153k068r47K442K87n99m72r68J784o74o89
$$ plain form
1835 -752 140 -585 116 212 -1502 -24 372 -958 281 -431 -915 194 -112 1064 -176 -1864 -137
1852 -137 729 547 775 -1464 -868 1043 -93 745 180 -1223 104 -37 987 811 -1717 -560 995
1869 995 255 383 -859 -270 2306 167 -1062 90 590 1843 48 -1469 117 436 1191 1628 -1644
1886 -1644 -923 844 339 1662 -627 -1802 482 752 701 -30 -1593 643 747 -542 832 -550 -897
1903 -897 771 -338 473 -572 -1455 592 653 -611 -921 -1385 1167 1554 -1615 -609 -732 -95 1733
1920 1733 -742 -1331 -270 -476 1276 291 -1476 -867 -564 1545 1456 -2186 -1094 1084 698 856 -1250
1937 -1250 -726 1048 675 125 -668 -442 1162 559 -208 386 -759 -45 1500 500 -360 -474 277 1000
1955 1000 587 113 -190 -590 895 1205 -49 -117 -1112 230 1476 989 -1175 -1714 1213 1779 -413 -1293
$$ packed form
1835g52Q92p25P01R6j714J478L96j330J239p12m84J109l06J176j240j688J727
1852a37Q66j82K28k239N96J911j136Q38n65j403J327j41J024j76k528J157J555
1869I95p40J28j242N89K576k139j229J152N00J253j795j517J586L19P55M37l272
1886a644P21J767n05J323k289j175K284K70n1p31j563K236J04j289J374j382l47
1903h97J668j109Q11j045q83K047O1j264l10m64K552L87l169J006j23O37J828
1920A733k475n89J061k06J752r85j767O09L03K109q9l642J092K178l86J58k106
1937a250N24J774l73n50p93K26J604o03p67N94j145P14J545j000q60j14P51P23
1955A000m13m74l03m00J485L10j254o8r95J342J246m87k164n39K927N66k192q80
$$ plain form
1973 -1293 -514 714 1174 -125 -1387 -625 998 862 -796 -990 -126 -381 838 287 -1318 -903 115
1990 115 485 494 -992 -868 -556 223 941 -686 -852 -38 -51 649 331 -1534 -442 453 1331 257 -1858
2009 -1858 -528 1494 502 23 -1279 -628 2023 626 -530 -266 -437 618 520 -49 216 -938 71
2026 71 1696 -288 -97 -175 -248 1681 85 -1078 308 411 971 246 -1083 261 3 25 1722 -1086
2044 -1086 -925 499 -2 1178 -37 -2034 326 973 566 137 -1705 225 652 -608 650 -669
2060 -669 -1118 792 -160 -315 53 -1233 603 508 -629 -7 -744 933 1033 -1541 -432 283 -141 1022
2078 1022 -428 -811 140 -439 950 677 -1204 182 -598 101 1723 -1161 -477 923 -222 553 -9
2095 -9 -280 1124 -534 0 893 -642 938 390 -608 766 -340 -195 1530 -163 -619 -416 40 1480
$$ packed form
1973a293P79J228M60j299j262P62J623j36j658j94Q64k55J219n51j605M15J018
1990A15L70Rj486J24L12P79P18j627j66Q14j3P00l18j865J092Q95Q78j074k115
2009a858J330K022r92m79j302O51K651j397j156K64j71J055r8n69K65j154J009
2026G1J625j984J91p8p3J929j596j163J386J03N60p25j329J344k58K2J697k808
2044a086J61J424n01J180j215j997K360O47m07m29j842J930M27j260J258j319
2060f69m49J910r52j55L68j286J836r5j137O22p37J677J00k574J109P15m24J163
2078A022j450l83R51n79J389k73j881J386p80O99J622k884O84J400j145P75n62
2095ik71J404j658N34Q93j535J580n48r98J374j106J45J725j693m56K03M56J440
$$ plain form
2113 1480 -148 -1164 462 -402 444 940 -699 131 -209 -799 777 135 -588 109 -991 515 -125
2130 -125 -725 631 -320 -893 -18 -471 166 222 -1098 68 -65 -480 746 -156 -247 -148 -1212 616 928
2149 928 -203 -417 -827 -27 819 -336 -56 -128 -616 330 57 195 656 -692 -356 411 393 293 75 -114
2169 -114 12 -263 378 887 -386 -119 -193 122 981 240 -165 406 -128 133 432 385 401 -563 -757 688
2189 688 441 125 -248 -620 154 -1 -123 416 203 -570 -349 -118 393 130 -610 -199 -39 59 29 107 -261
2210 -261 -585 -682 -89 378 -227 -659 -639 -312 212 -224 185 339 -548 -190 190 594 77 -376 -264 125 -16
2231 -16 356 -28 34 48 -501 216 701 177 -298 -231 90 787 193 271 113 -389 182 178 151 422 -374 -253 194
2254 194 233 203 -37 -210 481 -269 -241 971 -199 -47 -335 -115 632 48 33 -124 -529 -92 519 -40 259
$$ packed form
2113A480j628j016J626q64Q46M96j639Q30l40n90J576o42p23O97j100J506o40
2130a25o00J356r51n73Q75m53O37N6j320J166j33m15J226r02r1R9j064J828L12
2149I28j131k14m10Q00Q46j155K80p2m88R46k73J38M61j348L36P67j8j00k18j89
2169a14J26k75O41N09j273K67p4L15Q59p41m05N71n34K61K99m7J6r64j94J445
2189F88k47l16l73l72P74j55j22N39k13p73K21K31N11k63p40M11J60R8l0P8l68
2210b61l24r7N93M67o05m32K0L27N24m36M09J54q87L58L80M04n17m53J12L89j41
2231a6L72l84O2J4n49P17M85n24m75O7L21O97n94P8j58n02N71mk7K71p96J21M47
2254A94L9l0k40j73O91p50K8J212j170J52k88K20P47n84j5j57m05M37O11n59K99
$$ plain form
2275 259 -647 -980 998 253 -181 -512 -409 253 -221 -468 212 -491 -198 254 -991 167 599 -713 312
2294 312 -299 -577 95 -20 689 -327 -1176 225 475 -142 692 -1084 -463 986 -86 736 -186 -937
2312 -937 486 279 710 433 -1495 311 1401 -549 394 -216 18 1190 -513 -74 380 50 857 -146
2330 -146 -499 810 -426 612 1264 -903 -552 283 428 1104 -734 -984 257 230 920 41 -1841 450
2348 450 337 -745 703 -1101 -493 582 130 437 -1169 -756 1182 -86 -161 -435 -1394 769 752 -1211
2366 -1211 63 -467 -3 918 -628 -245 -573 -575 1448 193 -1464 49 -78 1029 1014 -1422 -260 525
2384 525 886 512 -1000 -350 632 -40 788 -25 -952 467 1148 309 31 -1069 286 900 446 81 -972
2403 -972 244 1378 -82 -648 -53 -288 522 819 100 -675 -246 900 712 -349 -373 -684 404 1204
$$ packed form
2275B59r06l33J978p45m34l31J03O62m74k47O80p03K93M52j245J158M32j312J025
2294C12o11k78O72j15P09j016q49J401K50o17Q34j776O21J449j072Q22r22p51
2312i37J423k07M31k77j928J806J090j950R43o10K34J172j703M39M54l30Q07j003
2330a46l53J309j236J038O52k167L51Q35J45O76j838k50J241k7O90q79j882K291
2348D50j13j082J448j804O08J075m52L07j606M13J938j268p5k74r59K163j7j963
2366a211J274n30M64R21j546L83l28kK023j255j657J513j27J107j5k436J162P85
2384E25L61l74j512O50R82o72Q28q13r27J419O81q39k78j100J355O14m54l65j053
2403i72J216J134j460n66N95k35Q10K97p19p75M29J146j88j061k4l11J088Q00
$$ plain form
2421 1204 -570 -1289 -168 760 588 -281 -926 -387 1 606 306 -1129 -711 315 715 27 -741 -676 122
2440 122 639 405 -1030 -480 551 317 -256 -646 -228 3 421 377 -618 -759 438 685 238 -415 -903
2459 -903 70 1117 441 -520 -666 263 823 171 188 -113 -596 486 837 297 -112 -603 476 1018 -90
2478 -90 -333 -646 537 1103 -289 -974 344 429 411 -283 -780 228 633 626 232 -1198 -152 457 289 280
2498 280 -852 -723 461 223 227 144 -738 216 -513 73 943 -903 -710 433 113 265 -867 -1130 794
2517 794 573 -420 -693 -421 1341 564 -1025 -321 58 741 552 -957 -826 179 171 1208 -438 -520 920
2536 920 -248 343 223 -487 250 137 -67 691 23 -13 231 -445 732 397 -605 463 250 474 -33
2555 -33 -711 348 742 22 -516 -433 232 902 -353 -378 -8 -185 609 61 -317 -62 -382 34 270 -385
$$ packed form
2421A204j774p19J121R28j72q69o45N39L88O05l00j435M18J026M00o88p68O5P98
2440A22N17k34j435N50J031k34n73l90M18K31M18m4r95j41J197K47m47o53m88
2459i03R73J047o76r61j46R29N60o52J7l01m83J082L51n40m09m91J079N42j108
2478i0k43l13J183N66j392o85J318Q5j8o94m97J008M05pl94j430J046O09j68r
2498B80j132J29J184k38Mq3q82R54p29N86Q70j846J93J143l20J52j132k63J924
2517G94k21r93k73K72J762p77j589P04L79O83j89j509J31J005qJ037j646q2J440
2536I20j168N91j20p10P37j13k04P58o68l6K44o76J177l35j002J068k13K24n07
2555c3o78J059L94p20n38Q3O65O70j255k5L70j77P94n48l78K55l20M16K36o55
$$ plain form
2575 -385 -187 -237 -447 299 -414 -188 240 -390 -179 -395 -17 405 -388 -165 59 -326 317 413 -139 329 -442
2596 -442 -158 509 193 -124 -122 -152 139 86 -38 422 -129 -191 323 276 269 -321 -223 367 354 92 64 -210 260 -33
2620 -33 -404 616 745 -38 20 -100 524 381 121 -4 -45 -387 182 185 179 -90 -236 -142 318 446 -88 -387
2642 -387 -24 -24 -67 194 285 -274 -441 -164 318 261 -276 -412 -172 -60 -69 -219 85 -171 -659 -201 449 289
2664 289 -251 -309 -109 216 24 339 164 -140 -179 -295 222 450 -287 -18 8 227 78 -45 230 103 -87
2685 -87 157 282 367 36 -233 366 95 196 131 20 229 -44 -134 -17 446 -127 147 43 165 298 -116
2706 -116 219 -72 -87 -96 90 461 70 -402 -220 102 -26 212 -59 -149 -216 -61 458 -43 -71 -388 -339 87
2728 87 402 -186 -256 54 -385 -201 19 -15 48 -642 -36 82 -51 -13 -309 21 360 -273 -51 308 13 -133
$$ packed form
2575c85J98n0k10P46p13K26M28o30K11k16L78M22p93K23K24l85O43R6n52M68p71
2596d42K84O67l16l17Kl0K91n3j24M60n51o2N14m7pn90R8N90j3k62k8k74M70k93
2620c3l71J020J29p83N8j20O24j43k60j25m1l42N69Lok69j46R4M60J28n34k99
2642c87L63%m3K61R1n59j67K77M82n7n37j36K40J12rj50L04k56m88M58O50j60
2664B89n40n8K00L25j92L15j75l04l9j16N17K28p37K69K6K19j49j23K75j27j90
2685h7K44J25Q5l31k69N99k71J01o5j11K09k73r0J17M63n73K74j04J22J33m14
2706a16L35k91j5rJ86L71l91m72J82L22j28K38k71r0o7J55N19n01k8l17M9M26
2728H7L15n88p0L10m39J84K20l4O3o90O06J18j33L8k96L30L39o33K22L59k95j46
$$ plain form
2750 -133 -22 -21 279 -107 -113 53 -344 254 278 10 284 -292 -357 568 41 58 339 -291 471 49 -206 678
2772 678 91 -200 611 -19 182 142 -611 519 -67 -104 180 -294 364 69 -600 435 -63 -180 203 -436
2792 -436 -217 397 -365 477 -142 -570 283 -314 87 193 -1048 188 450 -747 36 -359 -382 758 -688
2811 -688 231 243 -507 571 -208 -482 462 -593 -47 710 -712 76 64 -207 965 -762 -606 721 12
2830 12 603 76 -876 931 192 -212 965 -588 131 610 -596 782 -291 -683 1071 -177 -157 554
2848 554 -844 779 433 -597 776 -404 -60 723 -814 269 131 -730 1302 -195 -914 815 -479
2865 -479 350 479 -1320 617 336 -549 514 -1093 -179 769 -877 404 78 -1276 782 -364 -8
2882 -8 654 -1761 514 776 -934 587 -632 -452 1504 -726 -244 224 -956 1382 -285 -1236 931
$$ packed form
2750a33J11JL00l86oJ66l97N98K4k68K74n76o5R25n27J7K81o30P62m22k55Q84
2772F78n87k91Q11o30K01m0p53J130n86l7K84m74O58k95o69J035m98j17L83o39
2792d36K19O14p62Q42o19m28Q53n97M01J06j241J236K62j197P83l95k3J140j446
2811f88R19J2p50J078p79k74R44j055N46P57j422P88j2k71J172j727J56J327p09
2830A2N91n27r52J807p39m04J177j553P19M79j206J378j073l92J754j248K0P11
2848E54j398J623l46j030J373j180L44P83j537J083j38q61K032j497p19J729j294
2865d79Q29J29j799J937k81q85J063j607R14R48j646J281l26j354K058j146L56
2882hO62k415K275K62j710J521j219J80J956k230M82M68j180K338j667r51K167
$$ plain form
2899 931 -449 514 620 -1519 350 515 -446 731 -766 -279 1141 -961 362 156 -1061 960 -73
2916 -73 -140 963 -1142 9 543 -210 1163 -829 -885 1642 -244 -26 229 -559 1182 216 -1322 589
2934 589 -131 363 475 -1537 218 468 -589 615 -670 -847 645 -425 266 204 -940 536 -36
2951 -36 -405 848 -920 -34 463 -562 671 24 -986 563 16 -372 -66 -938 859 627 -1080 154
2969 154 29 438 880 -943 -497 574 137 724 -505 -269 560 -521 268 496 -500 229 -224 -9 892
2988 892 -362 -193 504 -86 254 -292 -134 750 391 -185 233 -493 447 298 -369 -75 -532 307 683 -562
3008 -562 -469 44 25 437 -27 -438 209 -169 -153 -64 -230 -25 -512 -424 370 -25 -211 -73 -401 239 23 -413
3030 -413 255 76 23 -184 -323 360 191 -271 -176 -95 92 284 -144 104 -169 -139 369 341 81 -346 6 127
$$ packed form
2899I31j380R63J06k139J869J65r61J177j497M87J420k102J323k06j217K021j033
2916g3o7J103k105J151N34p53J373j992n6K527j886K18K55p88J741r66j538J911
2934E89p20M94J12k012J755K50j057J204j285j77J492j070O91o2j144J476n72
2951c6l69J253j768Q86M97j025J233o47j010J549n47l88L06q72J797k32j707J234
2969A54j25M09M42j823M46J071m37N87j229K36Q29j081P89K28r96P29m53K15R01
2988H92j254J69O97n90L40n46J58Q84l59n76M18p26R40j49o67K94m57Q39L76j245
3008e62R3N13j9M12m64m11O47l78J6Q9j66K05m87Q8P94l95j86J38l28O40k16m36
3030d13O68j79n3k07j39O83j69m62R5Q1J87J92m28K48k73L0N08k8k60m27L52J21
$$ plain form
3052 127 85 -64 262 57 216 97 -95 233 4 -111 20 -222 230 232 -1 457 -26 -26 159 88 146 -186
3074 -186 -123 257 301 77 268 -132 264 -62 -93 362 -9 -213 42 -85 254 219 -400 73 -236 -348 240
3095 240 46 -48 77 -301 72 88 -109 280 -202 -470 -104 -100 170 142 -415 -10 -50 354 174 -323 -102 10
3117 10 -498 134 319 -145 -91 -48 342 358 102 179 -110 -110 100 64 -47 442 -41 -141 345 199 319 -80 7
3140 7 215 -66 172 285 -13 -192 -254 26 265 44 9 -78 54 -55 -178 145 202 -284 5 156 182 -157
3162 -157 -150 -259 -34 11 -201 -140 -313 115 -88 -253 72 40 -44 -292 85 12 -150 -7 -114 -100 -246 183 -183
3185 -183 21 -42 -152 105 29 -101 37 -155 -76 -83 -333 132 239 83 161 36 115 16 -15 53 64 240 4 170
3209 170 -111 147 36 85 441 195 -116 117 47 66 8 103 -73 -153 -32 -49 106 407 -130 7 124 -29
$$ packed form
3052A27m2j49L26k05J59j19j92L28k29j15J31k42M52Kk33M58m83%J85p1N8l32
3074a86O3L80M4k24J91m00L96l26l1M55l71k04K55j27L39l5o19M73l09j12N88
3095B40j94r4J25l78L73J6j97L89m82k68L66MK70k8n57M05m0M04j80m97K21J12
3117A0n08O32J85m64N4M3L90J6k56P7k89%K10l6j11M89m83j00M86j46J20l99Q7
3140GK08k81K38J13k98j79o2K80K39k21l5q7J32j09j23L23N7m86K89J51K6l39
3162a57Pj09K25M5k12O1j73M28k03j65L25l2q4k48L77p3j62J43j07J4j46M29l66
3185a83K04o3j10K57p6j30J38j92P9pk50M65J07j56P8j25P9r9l1O8J1J76k36J66
3209A70k81K58j11M9L56k46l11K33p0J9n8R5j76q0J21j7J55L01n37J37J17j53
$$ plain form
3231 -29 -55 -245 66 121 134 -93 89 -143 -234 -227 -119 -145 -211 -70 -53 -247 179 -218 -162 176 -297 -219 -105 -335
3255 -335 -217 -152 77 17 -445 154 145 -161 5 -59 -377 129 50 -166 -127 -137 78 172 69 -34 -316 -27 373
3278 373 -157 32 169 -58 430 6 -243 143 -60 187 284 -78 194 239 73 443 -143 -26 75 -101 239
3299 239 256 -324 210 179 6 179 -250 70 -30 -139 52 -190 -121 352 -9 -396 -160 -552 388 101 -442
3320 -442 -104 -498 133 349 -681 -246 -84 -185 288 -181 163 26 -372 109 74 -173 153 -166 160 399
3340 399 -291 -226 71 -175 206 -306 -442 567 -187 261 -183 -540 304 130 -138 325 -566 165 569 -62
3360 -62 354 167 -203 451 -8 -105 502 -127 220 208 -275 377 -149 -135 519 -189 7 -64 -174 322 -68 -442
3382 -442 189 -273 107 -111 -441 297 -124 -73 409 -533 -154 -175 -442 499 -155 -473 156 -464 139 533 -632
$$ packed form
3231b9k6j90L11N5J3k27J82k32r1PJ08k6o6J41J7j94M26l97N6L38m73P8J14k30
3255c35J18O5K29o0m62N99rl06J66o4l18N06p9k16L9j0K15R4j03j03k82K89M00
3278C73n30J89J37k27M88m24k49L86k03K47R7l62K72M5j66L70n86J17J01j76L40
3299B39J7n80N34l1j73J73m29L20j00j09J91k42O9M73l61l87K36l92R40k87n43
3320d42L38l94O31K16j030M35J62j01M73m69L44j37l98M81l5k47L26l19L26K39
3340C99o90O5K97k46L81n12j36J009p54M48m44l57Q44j74k68M63q91P31M04o31
3360f2M16j87l70O54m59r7O07o29L47j2m83O52n26J4O54p08J96p1j10M96l90l74
3382d42O31m62L80k18l30P38m21N1M82r42L79k1k67R41o54l18O29o20O03L94j165
$$ plain form
3403 -632 5 -96 -444 432 -484 -189 467 -539 272 -108 -730 267 -169 -271 283 -296 362 289 -828 171
3423 171 23 -174 502 -376 96 231 -476 412 169 -127 573 -320 512 750 -712 168 -26 111 416 -596
3443 -596 -27 614 -409 295 86 -663 835 -43 -234 483 -501 222 268 -491 307 -160 -475 559 -522
3462 -522 117 239 -831 337 -6 -269 515 -708 -349 510 -337 161 -173 -551 682 -345 -472 503
3480 503 -524 304 52 -393 740 175 -29 323 -546 4 220 -561 234 -23 -644 572 -345 159 356
3499 356 -661 95 167 -54 521 -219 -8 471 -448 354 246 -276 288 -111 -304 382 -355 248 182 -467
3519 -467 164 78 20 544 -439 16 531 -76 116 -22 -230 44 -358 -16 384 -471 -142 30 -176 430 -193
3540 -193 -155 9 -285 139 31 -342 251 -199 -332 479 -146 -31 79 -136 -101 -112 161 394 -75 224 -93
$$ packed form
3403f32O37j01l48Q76r16K95O56j006Q11l80o22R97m36j02N54n79O58p3j117R99
3423A71j48j97O76q78M72J35p07Q88k43k96P00q93Q32K38j462Q80j94J37L05j012
3443e96N69O41j023P04k09p49J498q78j91P17r84P23M6p59P98m67l15J034j081
3462e22O39J22j070J168l43k63P84j223L59Q59q47M98l34l78J233j027j27R75
3480E03j027Q28k52m45J133n65k04L52q69N50K16p81P95k57o21J216r17N04J97
3499C56j017P56P2k21N75p40K11M79r19Q02j08n22N64l99j93O86p37O03o6o49
3519d67O31q6n8N24r83M55N15o07J92j38k08K74m02L42M00q55L29J72k06O06o23
3540a93L8J64k94M24j08l73N93m50j33Q11o25J15J10k15L5j1K73K33m69K99l17
$$ plain form
3561 -93 -222 353 26 -316 275 -47 -107 125 88 77 -160 55 256 363 -6 -16 75 -24 63 -82 128 75 -126
3584 -126 137 62 109 258 41 119 34 45 514 33 -105 150 -265 463 141 -123 158 -35 60 120 -146 92
3606 92 -2 -344 77 -121 294 -83 -85 -145 305 -152 -12 166 -105 233 -84 -66 -123 -205 -121 227 -76 -316 -322 -20
3630 -20 88 -72 137 -152 -95 -61 -207 -211 -27 -100 -112 69 201 57 117 -32 95 -9 184 248 148 253 62
3653 62 57 158 -14 -43 47 56 -61 -125 -1 261 314 -113 151 -65 -176 -161 -106 -59 -21 -431 2 110 4 -37 -156
3678 -156 198 -27 -44 149 214 -302 -186 -179 -3 -39 18 -114 -13 -45 -165 -345 -84 281 -167 7 94 90 61 -166
3702 -166 74 180 -97 5 -15 6 49 -222 -103 388 -28 -52 171 20 -243 -6 -40 184 -136 -29 221 21
3724 21 37 -34 -254 111 -37 42 30 143 237 100 -267 52 386 -7 185 170 176 21 76 207 78 -58 119
$$ packed form
3561i3j29N75l27l42N91l22o0K32l7j1k37K15K01J07l69j0R1r9Q7j45K10n3k01
3584a26K63p5M7J49k17P8q5J1M69m81j38K55m15P28l22k64K81j93R5O0k66K38
3606I2r4l42M21j98M15l77ko0M50m57J40J78k71L38l17J8n7q2Q4L48l03k40oL02
3630b0J08j60K09k89N7L4j46mJ84p3j2J81J32j44O0j49J27j04J93O4j00J05j91
3653F2nJ01j72k9R0Rj17o4J24K62N3m27K64k16j11J5N5M7L8m10M33J08j06m1j19
3678a56L54k25j7J93O5n16J16PJ76l6N7j32J01l2j20j80K61L65m48J74Q7mk9k27
3702a66K40J06k77J02k0K1M3k71J19M91m16k4K23j51k63K37l4K24l20J07K50k00
3724B1J6p1k20L65j48P9j2J13R4j37l67L19L34l93J92j5Oj55N5J31j29j36J77
$$ plain form
3747 119 95 302 411 -67 -123 200 -230 15 -1 -258 197 -323 -98 -25 -158 -35 -1 -281 288 -332 -28 26
3769 26 -296 75 -225 -50 127 55 -219 260 -108 89 334 -476 -282 236 -43 298 -321 -14 251 13 49
3790 49 -257 -16 274 -230 -244 150 -101 73 216 -257 -66 -51 -83 288 42 -46 66 -95 39 133 -99 258
3812 258 57 -95 337 170 -90 119 43 132 -53 199 120 59 58 -58 -339 45 -6 39 -115 -273 -71 323 -289
3835 -289 -68 -126 -81 254 209 -202 -325 -329 52 194 -112 110 -342 -220 180 -129 -151 318 -210 -56 94 -253
3857 -253 234 56 -25 101 101 -115 291 -50 198 -191 -322 236 285 164 164 -174 277 276 -191 395 -104 113 239
3880 239 -27 -73 -89 -69 401 -140 164 157 -35 234 249 -315 172 -47 -23 190 -161 -183 -95 -135 281 71 -560
3903 -560 200 53 -169 24 -439 -168 27 -148 191 -112 -290 161 247 -79 114 -347 263 114 -152 -28
$$ packed form
3747A19k4K07J09m78n6L23m30K45j6k57M55n20K25P3j33J23L4k80N69o20L04N4
3769B6l22L71l00J75J77p2k74M79l68J97K45q10J94N18k79L41o19L07K65k38L6
3790D9l06K41K90n04j4L94k51J74J43m73J91J5l2L71k46q8J12j61J34R4k32L57
3812B58k01j52M32j67k60K09p6Q9j85K52p9o1jj16k81L84n1M5j54j58K02L94o12
3835b89K21n8M5L35m5m11j23mL81J42l06K22m52J22M00l09k2M69n28J54J50l47
3857b53M87j78q1J26%k16M06l41K48l89j31N58M9j21%l38M51jm67N86m99K17J26
3880B39k66m6j6K0M70n41L04pj92K69J5n64M87k19K4K13l51k2Q8m0M16k10o31
3903e60P60j47k22J93m63K71J95j75L39l03j78M51Q6l26J93m61O10j49k66J24
$$ plain form
3923 -28 -56 -66 144 -358 12 -117 -289 66 -293 -6 207 -44 -124 -96 -224 176 -406 5 -38 -167 -50 -5
3945 -5 -165 366 -189 -186 205 34 22 162 -56 111 -12 -177 143 -171 172 223 -112 -24 133 -149 330 -150
3967 -150 -463 138 -166 229 34 -186 367 -104 -43 52 -22 97 -2 -310 134 -277 -128 82 -78 -135 318 -115
3989 -115 -17 104 44 35 -42 -69 64 147 -9 -82 -288 131 -229 -229 52 -273 148 217 113 21 116 -140 231 -223
4013 -223 -71 264 -27 201 -12 -117 180 125 -108 156 -70 160 53 28 189 -80 148 192 -33 41 48 149
4035 149 10 228 -33 95 -59 -9 -161 -155 172 -213 16 -12 -56 -286 -20 -318 83 18 -7 96 -23 96
4057 96 -120 -282 -15 -184 -315 -37 -99 44 -161 26 -36 -66 -28 -102 -48 -39 -19 -243 -52 -54 -132 -74 70 -171 157
4082 157 11 31 101 87 -33 8 55 -21 -81 106 381 -185 122 -125 32 370 67 262 63 167 262 54 52
$$ packed form
3923b8k8j0K10n02L70j29j72L55l59K87K13k51q0K8j28M00n82M11m3j29J17M5
3945ej60N31n55LL91j71j2J40k18J67j23j65L20l14L43N1l35Q8J57k82M79m80
3967a50l13O01l04L95j95k20N53m71O1R5p4J19r9l08M44m11J49K10j60n7M53m33
3989a15R8J21o0rp7k7J33Q3j56p3k06M19l60%K81l25M21O9j04r2R5k56L71m54
4013b23J52L35k91K28k13j05K97n5k33K64k26K30j07k5J61k69K28M4k25P4PJ01
4035A49j39K18k61J28j54N0j52OL27l85K29k8m4k30K66k98M01o5k5J03j19J19
4057I6k16j62K67j69j31K78o2J43k05J87o2l0L8p4N4RK0k24J91kp8N8J44k41L28
4082A57j46K0P0j4j20M1M7p6o0J87K75n66L07k47J57L38l03J95j99J04R5k08k
$$ plain form
4105 52 -38 -46 -158 301 46 -130 80 72 11 -37 91 38 -85 124 -57 -54 -79 108 -90 106 -124 -86 222 -131
4129 -131 -287 43 -134 4 -230 -153 139 -187 -65 54 -92 -171 11 54 -41 -52 22 -88 -72 -85 -25 30 203
4152 203 -228 -7 127 58 97 84 -175 -57 -73 18 -39 -164 25 153 -332 -37 111 -201 223 -33 79 95
4174 95 -58 -20 -74 -23 386 -163 252 232 19 24 -46 -271 -16 110 -147 108 20 79 -192 -63 314 46 217
4197 217 242 280 -167 150 -398 137 -181 -116 70 124 -218 -43 5 -168 26 -78 164 -193 -129 229 -97 -168
4219 -168 -126 -156 -134 226 -153 -68 -256 111 8 -443 351 29 -254 -20 3 -60 -112 -210 485 68 -223 181 -180
4242 -180 -25 388 -174 72 -129 -349 97 -43 -59 259 -231 133 -3 9 125 50 -223 134 -187 -110 255
4263 255 -299 -43 -152 -64 47 -73 46 129 -221 165 -8 -322 179 -47 -293 213 -111 178 -211 -251 112
$$ packed form
4105E2r0qj12M59k55j76K10qo1m8J28n3j23K09j81Lk5J87j98J96k30L8L08l53
4129a31j56L30j77J38k34P7K92l26J22J19j46p9J82M3r5j1P4j10J6j3O0N5J73
4152B03m31K21J34o9L9j3k59J18j6R1n7j25J89J28m85K95J48l12M24k56J12J6
4174I5j53L8n4N1M09n49M15k0k13Np0k25K55J26k57K55q8N9k71J29L77k68J71
4197B17K5L8m47L17n48N35l18O5J86N4l42J75M8j73J94j04K42l57O4L58l26p1
4219a68M2l0K2L60l79Q5j88L67j03m51P94l22k83K34K3o3n2r8O95m17k91M04l61
4242a80J55M13n62K46k01k20M46j40j6L18m90L64j36J2J16p5k73L57l21P7L65
4263B55n54K56j09Q8J11j20J19Q3l50L86j73l14N01k26k46N06l24K89l89m0L63
$$ plain form
4284 112 -212 -12 111 -291 312 -2 -207 140 -231 -315 -17 -163 200 416 -62 69 -2 -152 398 -61 -189
4305 -189 140 -356 26 335 -83 157 -169 -122 8 -353 -51 -16 -193 332 -164 84 340 -166 -293 230 -88
4326 -88 175 110 -18 180 -267 74 -30 -370 382 -94 -161 359 -50 -31 28 -247 117 70 -200 246 -116 -85
4348 -85 105 -135 -76 -7 -93 -133 377 75 105 -224 -8 -27 -275 -104 -93 -167 -190 -26 160 165 -246 -15 -121 186
4372 186 -221 -87 255 -191 -52 203 -54 -201 189 -150 72 128 104 -40 194 -24 -32 141 223 127 10 -28
4394 -28 80 -120 -6 208 72 17 -311 -18 340 -43 60 -41 -231 78 -73 -294 -111 -196 -170 100 -39
4415 -39 243 27 -309 -24 -70 -269 -114 -487 -80 162 -235 54 -66 42 98 188 -108 -3 106 -277 31
4436 31 -216 176 270 55 -131 -138 29 152 78 80 -184 15 -45 -61 -80 -51 -85 60 -168 -58 210 179 -63 -89 49
$$ packed form
4284A12l24K00J23m02O03l14k05L47l71q4K98j46L63K16m78J31p1j50N50m59j28
4305a89L29m96L82L09m18K40l26M7J30l61L02L5j77N25m96K48K56n06j27N23l18
4326h8K63o5j28J98m47L41j04l40P52m76o7N20m09J9N9k75L64m7k70M46l62L1
4348h5J90k40N9O9q6m0N10l02L0l29K16j9k48J71J1p4k3J64J86Nm11K31j06L07
4372A86m07J34L42m46J39K55k57j47L90l39K22N6k4j44K34k18qJ73Q2r6j17l8
4394b8J08k00J14K14j36n5l28K93L58l83J03j01j90L09j51k21J83q5K6K70j39
4415c9K82k16l36K85m6j99J55l73M07K42l97K89j20J08N6R0k96J05J09l83L08
4436C1k47L92R4k15j86pJ67J23p4Kk64J99o0j6j9K9l4J45k28J10K68l1k42k6J38
$$ plain form
4461 49 -5 5 -79 -122 -119 31 138 -85 64 -13 101 19 102 116 67 141 -145 149 188 -59 24 -74 -102 -1 -41 -12
4487 -12 -54 -61 -44 -262 156 -131 -201 154 59 -11 -69 61 -75 11 2 -193 -230 119 -102 289 97 216 55 31 16
4512 16 161 -101 172 -54 49 80 77 17 -180 -97 146 62 117 81 107 312 132 5 205 82 245 97 154 70
4536 70 83 135 -81 140 48 -39 -135 51 -7 -243 20 -52 -115 104 199 30 104 85 182 73 44 -32 -158 -65 -59 -103
4562 -103 -23 -142 -34 -107 -228 103 -217 108 -188 -172 301 47 -103 -192 -191 75 -267 183 -142 192 -21 -274
4584 -274 102 -84 140 223 -32 -125 157 -87 -12 116 -185 -106 -123 -165 113 51 163 -49 -178 -193 17 -149 224
4607 224 -3 71 149 105 -73 40 -9 270 313 30 144 303 -13 37 29 39 -67 129 221 144 -144 45 -14 126
4631 126 280 -95 208 47 103 56 118 175 154 -48 86 -95 -147 186 -66 -214 -54 -2 119 68 -109 -75 -4
$$ packed form
4461D9n4J0q4m3LJ50J07k23J49p7J14q2Q3J4m9P4k86K94L9k47Q3r8k8J01m0K9
4487a2m2pJ7k18M18k87p0L55r5p0n8J30j36Q6rj95l7L49k21L91j92J19j61k4j5
4512A6J45k62K73k26J03L1lo0j97Q3K43q4N5l6K6K05j80j27K00j23J63j48N7q4
4536G0J3N2k16K21r2q7r6J86n8k36K63p2o3K19R5j69P4j9R7j09k9p6j26R3Om4
4562a03Q0j19J08p3j21L31l20L25k96J6M73k54j50q9JK66l42M50l25L34k13k53
4584b74L76j86K24Q3k55r3K82k44P5J28l01P9j7m2K78o2J12k12j29j5K10j66L73
4607B24k27P4P8m4j78J13m9K79M3k83J14J59l16N0qJ0j06J96R2p7k88J89n9J40
4631A26J54l75L03j61N6m7O2N7k1k02J34j81n2L33k52j48J60N2J21n1j77L4P1
$$ plain form
4654 -4 -77 62 -79 -67 68 14 -67 54 -70 -93 -111 -118 -257 -64 -125 181 41 -109 121 67 -167 72 39 153
4678 153 -237 -201 173 -75 -50 -261 45 128 -7 1 -78 84 -37 -102 -149 -171 158 60 -66 200 -58 62 32 4
4702 4 -91 -227 -58 -59 6 -92 -214 -124 -183 167 276 -240 -194 2 -35 160 123 -147 -190 112 -36 -101 222 101 82
4727 82 -125 164 -98 -30 -8 -282 -120 2 -189 153 -90 -112 75 -69 -195 136 133 -182 34 -23 149 -251
4749 -251 97 -17 -223 -34 167 -25 377 113 89 -15 -123 250 191 117 36 -119 -26 199 -72 195 61 196
4771 196 95 -5 69 90 -133 -153 -40 114 -36 -129 -2 -62 -139 -204 -82 -51 -131 -13 -82 87 -87 147 97 -55
4795 -55 -79 -39 -43 -27 144 312 25 -188 89 305 49 -308 -165 -157 -6 -151 52 473 -163 88 -53 -105 91
4818 91 33 -106 -12 -2 106 -40 114 275 120 -43 -30 326 -109 126 -161 40 97 -81 -25 103 3 -162
$$ packed form
4654dp3J39j41J2J35n4q1J21j24k3j8pj39J93o1L06j40j50K30n4k34K39l3J14
4678A53l90L6L74k48K5k11L06Q3j35Qp9J62j21o5m7k2L29r8j26K66k58J20l0k8
4702Dr5j36J69jO5r8j22R0n9L50J09n16M6J96l7J95l7k70m3L02j48o5L23j21j9
4727H2k07K89k62O8K2k74J62J22j91L42k43k2J87j44j26L31ll15K16n7J72m00
4749b51L48j14k06J89K01j92M02k64k4j04j08L73n9p4q1j55R3K25k71K67j34J35
4771A96j01j00P4K1k23k0J13J54j50r3J27o0p7o5J22L1q0J18o9J69j74K34n0j52
4795e5k4M0mJ6J71J68k87k13K77K16k56l57J43QJ51j45K03M21o36K51j41n2J96
4818I1n8j39R4J0J08j46J54J61j55j63J3L56m35K35k87K01N7j78N6J28j00j65
$$ plain form
4840 -162 1 64 3 1 94 -117 -33 -6 -292 80 165 69 -83 -87 124 156 -16 181 -155 59 60 -163 32 287 -227
4865 -227 4 117 -77 351 1 186 158 26 34 -155 -37 107 -99 -176 -36 -98 -346 144 -253 78 -37 -48
4887 -48 -14 202 -161 4 -51 271 162 -7 248 134 -76 28 49 -19 12 27 300 108 -104 322 -93 110
4909 110 30 -121 -147 -12 276 -106 16 -320 -47 173 -91 -20 -63 -14 37 26 -44 -114 -59 -197 92 -113 -27 108
4933 108 115 -141 2 21 -45 -31 104 -20 -7 65 -11 -26 -199 -114 -42 51 25 -32 -137 70 -46 187 -21 -187 109
4958 109 39 115 -62 -155 24 -118 -103 -51 -20 -102 -194 225 85 8 55 78 153 -35 42 200 110 -238 -46 71 192
4983 192 134 182 4 94 203 81 28 -30 -281 164 177 -37 80 -99 14 -3 -249 -96 -121 -29 249 -61 160
5006 160 283 19 91 67 171 -77 -206 -173 -140 163 -94 -24 79 212 199 104 -8 8 -220 43 99 60 33 76
$$ packed form
4840a62J63O3o1kR3k11Q4K7k86L72Q5r6j52mK11L2j72J97l36K14Jk23J95K55n14
4865b27K31J13j94M28l50J85k8j32Qj89J18J44k06p7J40o2k48M90l97L31j15j1
4887d8L4K16l63J65n5L22j09j69K55j14k10J04K1o8L1J5K73j92k12M26m15K03
4909A10q0j51k6J35K88l82J22l36K73K20k64P1m3M9N1j1p0p0N5j38K89k05Q6J35
4933A08Pk56J43J9o6J4J35j24J3P2p6j5j73Q5P2R3k6n7j05K07j16K33k08j66K96
4958A09p0P6j77r3J79j42J5N2L1q2r2M19j40p7M7K3P5j88P7J58r0l48J92J17J21
4983A92n8M8j78R0J09j22n3n8k51M45J3k14J17j79J13j7k46J53k5R2K78l10K21
5006A60J23k64P2k4J04k48j29L3L3L03k57P0J03J33j3r5j12J6k28K63N6l9k7M3
$$ plain form
5030 76 -3 117 115 183 -236 57 -30 -2 121 -186 130 140 -195 -108 39 -40 171 53 205 148 23 -102 -319 -84
5054 -84 18 21 30 177 20 46 -211 -151 144 -114 23 175 73 -21 53 24 -81 95 -10 14 -142 121 9 -3
5078 -3 89 56 -26 -215 21 -21 23 95 94 51 -70 -190 -179 110 -31 143 54 151 -24 139 47 -140 68 179 1
5103 1 -196 -234 -89 17 -37 -19 -206 -221 115 134 -36 -104 -14 81 -220 -14 -38 -32 -155 -116 77 52 -281 -97 231
5128 231 -62 -204 -204 -103 70 -13 -127 14 99 38 156 118 -25 2 -62 5 25 -111 -23 -135 37 -27 -130 -40
5152 -40 21 -57 -54 -162 61 14 -40 -60 326 58 131 89 -87 -26 141 45 -82 31 33 -110 -102 33 -32 -180 -140 -51
5178 -51 -125 -260 114 -98 -81 133 83 115 -298 -276 -71 78 -103 -59 -213 -236 147 132 -29 -9 12 33 -121 6
5202 6 -85 -174 -241 3 67 -231 -97 -28 97 -1 269 243 14 21 -59 55 -5 -142 41 94 -173 -55 -16 -236 1
$$ packed form
5030G6p9J20kO8m19K93q7K8J23l07L16J0l35Q7J47p9K11j18J52n7j25j25k17K35
5054h4J02LRJ47j57K6k57O0K95k58J37J52j02r4P4k9j05J76j05K4j56K63j12j2
5078cR2l3q2j89K36m2M4P2jm3j21j20J1K89j41J74q9R7j75J63r2j87K08J11j78
5103Aj97l8J45J06n4J8j87j5L36J9j70o8R0R5l01K06k4Oj23L9J93k5l33J84L28
5128B31k93j42%J01J73q3j14J41Q5o1J18l8j43K7o4O7K0j36Q8j12J72o4j03R0
5152d0O1p8Lj08K23m7n4k0L86k68P3m2j76O1J67r6j27J13Kj43QJ35o5j48M0Q9
5178e1p4j35L74k12J7K14n0L2m13K2K05J49j81M4j54k3L83j5j61K0K1K1j54J27
5202Fr1q9o7K44O4k98J34O9J25r8K70k6k29Pq0J14o0j37J83N3k67J18L9k20K37
$$ plain form
5227 1 23 170 147 60 -15 344 -12 -29 -80 -170 -299 -347 -23 -18 -139 -28 153 189 110 183 6 -43 153 6 -51 121
5253 121 -125 -96 10 28 -27 -69 148 90 -25 -29 17 157 -148 56 5 -228 167 50 -41 -23 265 -139 -52 262
5277 262 -224 -126 -141 -357 44 29 -87 45 -145 83 -69 -173 163 -7 -68 223 -97 -42 30 -151 224 -353
5299 -353 31 77 -23 -13 122 -135 102 -3 -34 -63 -73 149 13 -268 161 -84 159 86 36 216 100 216
5321 216 130 42 -157 27 -176 -180 -170 33 6 205 252 258 73 8 -6 -5 93 129 -46 238 61 -185 235 -109 -115 132
5347 132 -294 -73 -322 95 407 -19 -5 -102 120 211 -19 -184 147 152 111 58 -3 -102 156 -55 -4 -6 -160 -43
5371 -43 29 197 144 159 -166 -126 66 165 -23 -132 -140 -176 30 -337 -94 -31 -94 -87 -104 -86 -34 95 -190 -164 -6 48
5397 48 -36 -50 -153 -89 -123 114 33 -260 81 262 -78 -110 67 30 -151 -156 -163 -30 -342 -50 107 274 65 230
$$ packed form
5227AK2J47k3q7p5L59l56j7n1r0j29m8L24Nj21J11J81L6p9P3j77m9J96j47n7J72
5253A21k46K9J06J8n5m2K17n8j15mM6J40l05K04n1k33L95j17r1J8K88m04Q7L14
5277B62m86R8j5k16M01j5j16J32j90K28j52j04L36j70o1K91l20N5P2j81L75n77
5299c53L84M6j00J0J35k57K37j05l1k9j0K22j36k81M29k45K43p3n0J80j16J16
5321B16q6q8j99J84k03mJ0K03k7J99M7Oj85o5j4JR8L6j75K84j77k46M20l44oK47
5347A32m26K21k49M17L12m26J4r7K22R1k30j65L31Nm1n3o1r9K58k11N1kj54J17
5371d3P2J68n3J5l25M0J92R9j88j09ql6K06l67K43O3o3Pj7J8N2J29k85K6J58N4
5397D8q4j4j03O4l4K37q1k93L41J81l40l2J77l7j81npJ33l12K92J57J67k09J65
$$ plain form
5421 230 148 -245 -94 185 -9 68 61 -103 127 -215 -114 5 -5 -125 -182 98 97 -40 -17 -290 130 -294 58
5444 58 10 -191 167 306 -44 -5 -75 -159 -100 46 53 129 231 294 -18 220 -3 -324 150 190 135 -41 -303 -85
5468 -85 -134 46 -153 -216 -185 -123 -94 -29 -192 46 -31 -162 11 64 -6 -183 -280 49 -123 55 -102 59 125 63
5492 63 -115 -56 246 -178 -241 55 189 116 -65 58 72 -4 1 -14 14 36 135 -48 -112 54 -92 -193 80 49 89
5517 89 -101 436 21 185 -161 -65 -134 112 -99 -13 -93 -54 -160 -11 -2 -93 67 46 133 85 -191 -128 212 -138
5541 -138 148 -65 35 103 36 104 62 -33 68 -302 -179 -219 -35 -106 110 -141 -37 -160 -173 19 127 -85 214
5564 214 46 57 98 -342 -144 -168 -138 68 205 -59 -149 -65 139 18 -130 -111 -49 62 46 -43 -74 55 -14 60
5588 60 -104 -516 91 -183 55 58 -35 -178 13 -38 164 -119 42 34 -101 -181 95 210 -177 -12 88 -105 -1
$$ packed form
5421B30q2l93J51K79j94P7pj64K30l42J01J19j0j20n7K80jj37K3k73M20m24L52
5444E8m8k01L58J39l50L9p0q4N9J46PP6J02O3l12K38k23l21M74M0n5j76k62K18
5468h5m9J80j99o3L1O2K9O5j63K38p7j31J73N3p0j77r7L29j72J78j57J61O6o2
5492F3j78N9L02m24o3K96J34p3j81J23J4p6Nj5K8K2R9j83o4J66j46j01K73l1M0
5517H9j90N37m15J64l46R6o9K46k11Q6q0L9j06J49Rr1J60k1Q7m8k76O3L40l50
5541a38K86k13J00O8o7O8m2r5J01l70J23m0J84p1K16k51J04j23j3J92J08k12K99
5564B14j68J1M1m40J98k4L0K06J37k64r0Q4K04j21j48J9O2J11j6q9l1J29o9P4
5588F0j64m12O07k74K38Lr3j43J91n1K02k83J61qj35q0K76J15l87J65J00j93J04
$$ plain form
5611 -1 37 297 -43 -71 184 -96 102 -79 -99 230 59 -85 76 -63 166 -172 -37 -173 -58 8 -37 -47 44
5634 44 131 -61 49 57 -45 10 140 -112 24 -25 177 170 -41 -33 -109 136 118 89 -240 -66 37 -146 11 -91
5658 -91 102 -149 -270 210 17 364 -112 -59 -83 -94 54 170 -301 -52 295 -294 115 -40 201 -52 -187
5679 -187 -151 -249 -74 -60 -34 -401 -11 -110 -143 84 -58 33 134 7 24 102 14 65 -52 -101 18 85 -97 114
5703 114 -268 367 -66 -118 -16 -219 207 -77 -205 151 210 14 -31 -248 109 -78 237 93 -16 -224 -226 108
5725 108 77 -106 -204 121 -110 -21 32 -285 -165 85 -138 269 -46 -317 137 -104 -39 -242 109 61 50 -95
5747 -95 27 -278 -186 151 -145 -77 -9 -162 110 158 -63 46 46 203 93 -131 -42 -117 251 217 95 103 155 33
5771 33 132 -81 -296 -114 -108 202 64 122 82 -11 -85 188 192 -43 83 124 -36 -171 -85 -105 -37 -22 -237 -152 -147 -161
$$ packed form
5611aL8K60l40k8K55k80J98j81k0L29j71j44J61j39K29l38J35j36J15O6m5j0R1
5634D4Q7j92J10Qj02N5J30k52J36m9K02pk11Qp6K45j8k9l29J74J03j83J57j02
5658i1J93k51j21M80j93L47m76N3k4j1J48J16m71K49L47n89M09j55K41k53j35
5679a87L6r8J75J4K6l67L90r9l3K27j42R1J01j27J7P8q8N1j17m9J19O7j82K11
5703A14l82O35m33n2J02k03M26k84j28L56N9j96m5k17L57j87L15j44j09k08kL34
5725A08l1j83r8L25k31Q9N3l17J20K50k23M07l15k71M54k41O5k03L51m8j1j45
5747i5J22l05R2L37k96O8O8j53K72M8k21J09%J57j10k24Q9p5L68l4j22QN2j22
5771C3R9k13k15J82OL10j38N8m0r3p4K73Mk35J26M1j60j35Q6k0O8J5k15Q5Nj4
$$ plain form
5797 -161 -10 37 -204 13 -22 78 -53 -198 -102 200 -42 -137 -50 -292 55 15 -168 -87 -21 -12 -78 -261 84 -213
5821 -213 -88 154 -34 -4 -170 -70 -7 -107 -137 25 106 -385 -60 77 -200 -102 -117 -49 -97 -17 66 170 78 -170
5845 -170 -63 192 -24 -113 -74 203 -35 121 182 135 -1 -14 -149 -1 24 -252 -150 -15 124 -37 -94 -50 77
5868 77 -91 132 -7 22 247 -185 175 28 -5 -84 -63 -227 84 267 44 -33 -20 163 44 133 -190 21 -107
5891 -107 -181 -199 103 -69 80 -151 266 164 11 29 -162 98 33 -111 -158 95 -24 -92 193 -84 131 5
5913 5 -14 -218 -96 -43 352 -39 -29 181 171 -211 -158 -199 81 -26 110 71 -54 -93 -115 -227 -82 -127 31 93
5937 93 -78 -116 -198 -235 -161 -27 -131 48 -76 123 21 -96 107 37 -51 -86 273 81 132 -114 29 41 -20 0
5961 0 194 -281 -24 82 -38 301 -68 -36 -52 -249 73 -1 -221 152 -194 -273 -184 -226 -36 -75 -25 95 -42
$$ packed form
5797a61J51M7k41K17l5J00j31j45R6L02k42r5Q7k42L47m0j83Q1O6Ro6j83L45k97
5821b13J25K42j88L0j66J00O3j00l0J62Q1m91L25J37k77R8j5O8m8Q0Q3J04r2k48
5845a70J07K55k16q9L9K77k38J56O1m7j36j3j35J48K5k76J02J35J39j61n7M4J27
5868G7j68K23j39K9K25m32L60j47l3p9K1j64L11J83k23p7J3J83j19Q9l23K11j28
5891a07p4j8L02j72J49k31M17j02j53J8j91K60o5j44m7K53j19o8K85k77K15j26
5913Ej9k04J22N3L95l91J0K10j0l82N3m1K80j07J36l9j25l9k2j12J45m5J58O2
5937I3j71l8q2l7P4J34j04J79j24J99j02j17K03p0q8l5L59j92N1k46J43J2o1K0
5961@J94m75K57J06j20L39l69L2j6j97L22p4k20L73l46p9Q9m2J90l9N0J20j37
$$ plain form
5984 -42 261 134 18 75 -16 -299 145 -9 -100 100 203 -75 -123 -202 91 -118 -155 -62 233 -49 -75 -192 -135
6007 -135 -61 60 47 -32 210 17 -36 -133 -49 -32 5 109 -173 -28 173 -59 -198 -69 128 32 -87 -27 127
6030 127 -196 -4 77 -210 111 -91 267 -118 0 11 -22 107 -35 -295 -148 107 39 1 -179 -8 208 -55
6052 -55 85 -99 -162 -70 -93 -159 145 18 195 102 77 136 -18 27 -99 -61 -8 141 -57 252 93 9 72 28 -103
6077 -103 -115 -208 226 -122 -1 320 -252 131 -68 -169 -73 -83 17 57 -36 84 151 -203 -14 -130 -89 291 -86
6100 -86 -152 159 -216 106 -48 -14 101 141 99 68 -96 134 179 -74 -11 22 46 -69 -105 -200 -35 235 233 -156 -157
6125 -157 -18 187 127 25 -103 151 -61 -207 151 66 -16 255 8 -116 143 -90 -72 59 -472 -80 -78 -70 -66
6148 -66 -90 -38 -77 -98 118 -256 -126 37 -143 30 56 -276 124 -48 -113 118 -224 -43 -47 -338 61 -120 -135
$$ packed form
5984d2L03j27j16N7r1k83M44j54r1K00J03k78m8p9K93k09l7R3K95k82k6j17N7
6007a35P4J21j3p9K42j93n3r7Q4J7L7J04k82J45K01k32j39J29J97r6j19O0J54
6030A27l23J92Q1k87L21k02L58l85J18J1l3J29j42k60J47K55o8l8j80J71K16k63
6052e5J40j84o3R2k3o6L04j27J77r3k5N9j54M5j26L8N3J49j98L09j59q4O3m4j31
6077a03j2r3M34l48J21L21n72L83j99j01R6j0J00M0r3J20O7l54J89j16M1L80l77
6100h6o6L11l75L22j54L4J15M0m2l1j64K30M5k53O3L3K4j15l6r5J65K70kl89j
6125a57J39K05o0j02j28K54k12j46L58q5q2K71k47j24K59k33J8J31n31L92KQM
6148f6k4N2l9k1K16l74J30J63j80J73K6l32M00j72o5K31l42J81mk91L99j81j5
$$ plain form
6171 -135 191 -260 14 73 0 106 -107 -60 187 73 -87 154 -3 -26 60 -44 4 147 -96 130 -236 160
6193 160 99 143 310 -41 -88 96 -132 68 33 -153 57 -133 -90 346 -156 248 33 -161 -34 -247 -166 204
6215 204 -24 -142 175 143 235 -223 -103 327 56 19 158 -81 -98 -18 -142 348 -99 -224 356 -93 78 -140
6237 -140 71 117 35 -62 82 -26 -59 99 -378 85 96 -264 -116 44 -145 265 45 166 203 -55 111 -91
6259 -91 -133 383 -198 296 86 -224 80 -34 -190 9 -288 -278 192 -87 188 -143 -155 145 31 -79 -50 -154
6281 -154 6 55 -232 62 -35 -64 165 -168 85 29 103 92 -82 -149 112 21 25 132 -8 -129 86 -286 277
6304 277 -293 -66 237 -276 -96 -114 -199 123 19 81 222 -25 -118 -78 -94 96 -123 -175 157 -22 158 83 147
6327 147 248 -242 5 206 -76 -18 213 -32 -58 33 28 144 -159 40 197 -85 30 154 -60 128 -180 -51
$$ packed form
6171a35L26m51K74N9p3J06k13M7K47j14j60K41j57k3Q6j04M8J43k43K26l66L96
6193A60o1M4J67l51m7J84k28K00l5j86K10j90M3M36n02M04k15j94J27k13Q1L70
6215B04k28j18L17l2R2m58J20M30k71l7J39k39j7Q0j24M90m47j25N80m49J71k18
6237a40K11M6q2r7J44j08l3J58m77M63J1l60J48J60j89M10k20J21L7k58J66k02
6259i1m2N16n81M94k10l10L04j14j56J99k97J0M70k79K75l31j2L00j14j10K9j04
6281a54J60M9k87K94r7k9K29l33K53n6P4j1j74o7K61r1MJ07j40j21K15l72N63
6304B77n70K27L03n13J80j8q5L22j04O2J41k47r3M0j6J90k19n2L32j79J80p5O4
6327A47J01m90K47K01k82N8K31k45k6R1nJ16l03J99J57k82J15J24k14J88l08J29
$$ plain form
6349 -51 113 -165 321 -38 -103 124 -64 170 138 35 63 -109 -190 31 -90 -39 266 -102 -162 196 100 241 79
6372 79 201 143 -146 -223 33 44 -320 -47 43 108 -19 190 -149 -323 132 47 -102 -83 -127 -144 149 4 -61 -203
6396 -203 -169 -128 -174 139 -103 -167 -98 192 -47 26 43 -7 -148 100 -203 -9 -68 -71 -126 -10 202 -27 -72 86
6420 86 162 96 -65 37 23 132 127 183 15 -47 187 85 16 -331 107 9 129 47 78 -28 10 92 -341 82 -204
6445 -204 46 150 -36 209 41 -99 219 59 108 206 -85 145 -61 -42 -187 -12 -15 -41 -91 22 23 52 219
6468 219 -178 14 166 213 -332 111 -121 -43 -83 -177 232 34 170 -112 -72 -63 -115 -18 173 -103 33 -98 48
6491 48 48 23 178 -204 4 97 31 123 -253 121 56 186 -126 66 190 -53 -178 -91 -97 49 59 -49 263 -205
6515 -205 -4 -186 91 15 -32 -291 -180 389 309 305 158 -121 22 -110 -229 11 -125 164 -149 -49 145 -139
$$ packed form
6349e1J64k78M86l59o5K27j88K34l2j03K8j72q1K21j21N1L05l68o0L58r6J41j62
6372G9J22n8k89p7K56J1l64K73R0O5j27K09l39j74M55q5j49J9m4j7K93j45o5j42
6396b03L4M1m6L13k42o4O9K90k39P3J7n0j41K48l03J94n9ln5J16K12k29m5J58
6420H6P6o6j61J02j4J09nN6j68o2K34j02o9l47M38r8J20q2L1j06L8Q2m33M23k86
6445b04K50J04j86K45j68j40L18j60M9R8k91K30k06J9j45J75lk6n0J13JK9J67
6468B19l97J92J52M7n45M43k32P8m0r4M09j98J36k82M0Rn2R7J91k76J36j31J46
6491D8%k5J55l82K08R3o6R2l76L74o5J30l12J92J24k43j25Q7oJ46J0j08L12m68
6515b05K01j82K77p6m7k59J11N69q0mj47k79J43j32j19K40j36K89l13J00J94k84
$$ plain form
6537 -139 -21 -19 -44 44 -81 -164 279 -109 -104 -44 35 300 41 -182 73 -139 22 -134 -31 -222 -23 105 -1
6560 -1 -9 111 244 -132 -18 110 -198 -117 223 95 67 16 -22 255 -98 -51 76 -137 -91 10 -149 111 96 6
6584 6 112 -123 -55 33 59 169 -184 -83 140 10 40 -7 -96 196 104 -132 12 -177 156 158 -125 -23 1 -222
6608 -222 -33 -127 -220 26 -141 -256 122 -98 210 17 -83 122 17 -3 -85 98 -36 119 -210 -152 -39 -34
6630 -34 -90 -51 12 117 -99 150 -97 -126 19 -29 -41 159 3 54 361 -98 200 -14 165 252 -332 87 -230
6653 -230 -129 319 107 -20 -64 180 318 146 -156 -15 133 -105 352 265 -5 103 24 11 59 -21 -23 81 -10
6676 -10 20 -134 45 -74 -160 235 -229 135 40 -71 57 -21 -151 218 82 -221 60 -28 -65 155 -220 163
6698 163 160 -231 -148 -280 -421 68 -79 27 267 -26 59 -15 37 68 -109 194 133 -147 60 75 -68 5 29 -13
$$ packed form
6537a39J18Kk5Q8j25q3M43l88NO0P9K65k59k23K55k12J61j56J03j91J99J28j06
6560aqJ20J33l76J14J28l08Q1L40j28k8n1l8K77l53M7J27k13M6J01j59K60j5r0
6584FJ06k35O8Q8K6J10l53J01K23j30L0m7q9K92r2k36J44j89L33Kk83J02K4k23
6608b22J89r4r3K46j67j15L78k20L08j93j00K05j05k0q2J83j34J55l29N8J13N
6630c4n6L9O3J05k16K49k47k9J45m8j2K00j56N1L07m59K98k14J79Q7n84M19l17
6653b30J01M48k12j27m4K44J38j72l02J41J48k38M57q7k70J08p9j3M8q0kJ04r1
6676a0L0j54J79j19q6L95m64L64r5j11J28p8j30L69j36l03K81q8l7K20l75L83
6698A63ll91Q3j32j41M89j47J06K40k93Q5p4N2L1j77L03o1k80K07J5j43P3K4m2
$$ plain form
6722 -13 149 -117 290 137 105 24 11 -18 40 -4 62 203 -75 144 239 136 32 -102 -4 5 -149 164 160 -158 49
6747 49 126 49 320 -225 127 104 -269 83 8 -24 -83 -135 228 136 -170 178 -244 -180 271 28 367 -31 -349
6770 -349 69 -128 -80 144 2 196 193 -209 -49 96 25 -70 -192 -138 109 -161 57 248 78 6 -283 8
6792 8 317 -110 221 178 83 267 18 -269 90 -198 -98 160 -27 -86 -91 -201 -218 -53 -149 409 124 177 42
6815 42 -134 62 80 -22 154 -127 5 -170 -11 304 -65 -206 66 -161 -54 37 -192 157 99 -39 1 -167
6837 -167 -143 116 112 -118 36 -212 144 42 -70 112 31 -193 89 -32 -112 39 123 152 13 68 67 -74 -92 281
6861 281 -14 -104 68 -118 143 -27 -205 -30 -225 22 149 -49 -27 -86 164 -63 21 -60 56 54 130 -114 -56
6884 -56 -186 -75 -57 115 -141 141 -22 12 31 -124 85 -50 -48 45 -52 -227 168 -186 53 126 -288 -30 -196
$$ packed form
6722a3J62k66M07j53l2q1j3k9N8m4O6J41k78K19R5j03j04j34R8Rj54L13ml18K07
6747D9P7p7K71n45L52k3l73L52p5l2n9n2L63r2l06L48m22O4M51k43L39l98l18
6770c49M18j97M8K24j42J94lm02J60J45p1r5j22N4K47k70K18J91j70p2k89K91
6792HL09m27L31m3r5J84k49k87L59k88J00K58j87n9nj10j7J65r6N58k85N3j35
6815D2j76J96J8j02J76k81J32j75J59L15l69j41K72k27J07R1k29L49n8j38M0j68
6837a67K4K59mk30J54k48L56j02j12J82q1k24K82j21q0J51Q4K9j39N5jj41j8L73
6861B81k95r0J72j86K61j70j78J75j95K47J27j98K2n9K50k27Q4q1J16kP6k44N8
6884e6j30J11J8J72k56K82j63L4J9j55K09j35KR3r7j75L95l54K39P3m14K58j66
$$ plain form
6907 -196 -32 9 -106 -72 84 174 121 132 -184 -168 43 -116 -103 -9 177 -114 -182 64 33 -45 17 -142 157 75
6931 75 -33 -51 246 -77 169 -6 43 90 -143 -166 56 104 -146 313 -306 184 182 113 136 85 142 -43 -257 27
6955 27 165 -131 264 -48 167 19 28 -42 26 223 -17 -82 43 -30 68 -85 -443 136 -62 -18 -47 117 11
6978 11 -239 -134 124 -290 -198 -96 -70 -73 84 132 -135 44 -140 -3 -31 24 2 -103 -109 111 -202 47 -201 -325
7002 -325 105 -32 -246 249 -180 158 121 66 -81 56 -234 -86 -281 -36 -22 -312 195 71 20 122 122 132
7024 132 104 15 350 53 -73 -102 -20 -26 8 125 -115 -29 37 -40 144 19 -7 -165 -62 22 -186 35 117 -236
7048 -236 188 -199 -92 271 -23 -8 -89 -37 -119 24 -213 -48 -220 -54 42 -188 -66 63 62 189 -180 -104 84
7071 84 -68 -192 20 -65 162 -48 -75 121 -138 -45 -86 143 146 73 -94 54 -29 -284 118 -3 36 113 0 148
$$ packed form
6907a96J64M1j15L4J56R0n3J1l16J6K11j59J3R4J86k91o8K46l1p8O2j59K99q2
6931G5j08j8K97l23K46j75M9M7k33k3K22M8k50M59o19M90ko9K3n1N7j85k14K84
6955B7J38k96L95l12K15j48Rp0O8J97k40o5J25p3R8j53l58N79j98M4k9J64j06
6978A1k50J05K58m14R2J02K6lJ57M8k67J79j84J37k8N5k2j05oK20l13K49k48j24
7002c25M30j37k14M95m29L38l7n5j47J37k90J48j95K45J4k90N07j24n1J02%J0
7024A32k8q9L35k97j26k9Q2oL4J17k40Q6O6p7J84j25k6j58J03Q4k08K21Q2l53
7048b36M24l87J07L63k94J5q1N2q2J43k37J65j72J66R6k30J22J29jJ27l69P6J88
7071H4j52j24K12q5K27k10k7J96k59R3m1K29Lp3j67J48q3k55M02j21L9P7j13J48
$$ plain form
7095 148 131 180 -87 291 -42 1 74 65 -59 -40 352 -36 281 -31 192 212 -30 -31 113 -104 31 21 39 5
7119 5 -110 -4 207 4 195 374 180 -111 215 -138 113 184 75 167 -61 104 50 -323 286 -17 270 -75
7141 -75 -3 -44 125 -139 37 53 -153 38 -169 167 449 -312 -182 -77 88 -236 71 226 168 -43 13 40
7163 40 171 38 -192 -157 6 -167 -29 -57 -255 57 27 -373 -21 6 -46 -82 -54 46 67 -141 -27 -193 15
7186 15 -125 128 -68 21 178 289 43 -307 -27 62 -173 88 56 150 -184 32 193 170 319 199 -137 -192
7208 -192 -83 -47 -138 0 -184 39 -186 40 145 91 244 -140 -139 39 -95 147 -276 -70 229 -187 49 62
7230 62 -221 30 -61 -112 147 -124 -276 -33 -209 82 83 -178 -137 -213 -216 -268 192 116 223 -139 -53 235 -9 173
7254 173 -131 -107 236 -6 -240 -78 -25 115 154 32 3 -64 -8 10 -119 191 149 -147 -2 193 -46 -31 123
$$ packed form
7095A48j7M9k67L78l33M3P3rj24J9L92l88L17l12K23K0k42jJ44k17J35j0J8l4
7119Ej15J06K11k03J91J79j94k91L26l53K51P1j09R2k28J65n4l73O09l03K87l45
7141g5P2m1J69k64J76J6k06J91k07L36K82p61J30J05J65l24L07J55n8k11N6K7
7163D0J31j33k30L5J63j73J38k8j98L12l0m00L52K7n2l6K8J00K1k08J14j66K08
7186A5j40K53j96Q9J57J11k46l50K80Q9k35K61l2R4l34K16J61k3J49j20l36n5
7208a92J09L6r1J38j84K23k25K26J05n4J53l84JJ78j34K42m23K06K99m16K36J3
7230F2k83K51r1n1K59k71j52K43j76K91Jk61M1p6ln2M60p6J07l62Q6K88k44J82
7254A73l04K4L43k42k34J62N3J40L9j22k9o7N6J8j29L10m2k96J45J95k39J5J54
$$ plain form
7277 123 91 150 86 184 -127 59 -35 1 31 154 49 -20 -23 -85 -184 -39 34 136 -112 -107 205 -159 -84 71 68 -115
7303 -115 55 -53 -291 -140 -237 -119 -200 88 -144 -237 -91 -180 8 8 -100 74 57 -152 -131 -167 -41 -88 160
7326 160 83 4 25 -46 -71 -85 88 16 252 -140 -79 164 -178 73 -102 183 -97 130 -52 -169 88 67 -256
7349 -256 -90 -20 -92 -79 281 131 -198 130 185 -18 307 261 -2 151 -130 -14 126 -64 27 -127 -94 -44 190
7372 190 -171 148 26 -125 -11 -3 -103 -38 123 -58 105 143 146 45 12 -128 22 148 113 -196 131 181 -13
7395 -13 -38 210 -266 156 9 21 141 1 244 -105 87 47 16 235 -11 264 61 -15 -159 293 -192 220
7417 220 -23 -150 156 -9 -241 78 -165 -53 152 173 190 42 213 -99 112 197 -56 70 -58 -73 -136 -77
7439 -77 -216 6 142 -28 -325 50 -62 -20 -113 -149 -11 -17 67 -134 -47 -151 211 -82 179 -31 -83 -85 109 158
$$ packed form
7277A23l2N9o4R8l11J86r4L6L0J23j05o9lo2r9J45P3J02k48NL12l64P5J55lj83
7303a15J70j08k38J51r7J18q1K88k32r3J46q9J88%j08J74j7k09K1l6J26m7K48
7326A60p7p9K1p1k5j4J73p2K36l92O1K43l42K51j75K85k80K27j82j17K57k1l23
7349b56J66P0p2J3L60j50l29L28N5k03L25m6k63J53k81J16J40j90R1j54L3N0K34
7372A90l61L19j22j51J14Qj00O5J61j81J63L8Lj01l3j40J50J26l5l09L27N0j94
7395a3k5K48m76M22j47J2J20j40K43l49J92m0l1K19k46K75k03p6j44M52m85M12
7417B20k43j27L06j65k32L19k43J12K05K1J7j48J71l12K11Q5k53J26j28j5o3N9
7439g7j39K22J36j70k97L75j12M2r3l6J38oQ4k01Q7j04L62k93K61k10n2kJ94M9
$$ plain form
7463 158 53 188 184 -107 -88 27 -83 -33 183 -10 39 -185 -12 52 201 -48 62 165 90 84 272 -102 -176
7486 -176 106 -110 -204 228 -119 70 38 73 90 -67 -23 162 -10 -73 -32 -123 105 50 -250 -17 86 -31 -158
7509 -158 110 193 -3 23 211 176 204 40 32 -45 165 235 -45 -22 -131 -265 72 78 51 77 43 -29 157 32 -147
7534 -147 273 -75 40 91 30 13 38 36 -141 -99 -48 74 170 127 386 100 -199 -58 -68 221 332 -87 249 14
7558 14 21 112 108 35 156 101 93 -33 -8 -14 156 -59 12 -77 70 80 -266 81 -3 -15 34 -176 154 199 189 140 -13
7585 -13 -47 -63 -306 -112 -3 -45 -16 -150 30 21 -13 -35 -20 -86 44 -313 -255 158 -100 -51 58 49 -103 178 202
7610 202 226 49 -142 339 -41 -87 -198 -27 157 -94 180 15 -31 -133 24 13 103 112 -32 13 97 -184 422
7633 422 -207 204 -66 -40 222 -138 -84 -66 177 6 28 199 -288 -170 -102 123 -53 -2 260 -106 21 -83
$$ packed form
7463A58j05J35mk91J9J15j10N0K16j93M9k24J73O4J49k49J10J03p5oJ88l74p4
7486a76K82k16r4M32l47J89l2L5J7j57M4J85j72o3M1r1K28n5l00K33J03j17j27
7509a58K68Q3j96K6J88l5K8j64qp7K10P0k80K3j09j34L37Ok7K6l4p2J86j25j79
7534a47M20l48J15N1o1j7K5kj77M2N1J22R6m3K59k86k99J41j0K89J11m19L36k35
7558A4PR1mp3J21n5qj26K5oJ70k15P1q9J47J0l46L47q4j2M9k10L30M5j0m9j53
7585a3l4j6k43J94J09m2K9j34J80rl4k2J5o6J30l57N8M13k58M9J09rj52K81K4
7610B02K4j77j91M81l80m6j11J71J84k51K74j65m6j02J57j1R0Rj44M5Q4k81O06
7633D22o29M11k70K6K62l60N4J8K43j71K2J71m87J18O8K25j76N1K62l66J27j04
$$ plain form
7655 -83 100 2 -3 -79 41 10 20 -141 162 -82 -3 151 72 -136 60 -256 137 -146 -121 32 163 -36 28 -144
7679 -144 -26 327 185 193 -68 132 -144 -213 -57 175 -93 -223 34 -4 15 -53 33 4 -3 220 -21 -205 -125 -29
7703 -29 -164 67 -162 21 -167 -22 100 160 -169 -26 21 4 5 117 84 -97 116 49 -7 8 132 184 -45 129
7727 129 155 101 43 -176 224 -103 12 -3 -43 -52 -42 1 -79 110 4 -1 -144 172 74 -72 173 -96 -117 142 -91
7752 -91 194 190 29 -19 125 -131 51 27 -26 -57 -56 -117 124 -87 -9 -69 -20 -149 -10 27 118 -99 -94 66 162 59
7778 59 -252 118 -51 138 -22 33 86 215 136 -95 -132 -28 122 -268 -104 31 -70 55 106 267 -38 -127
7800 -127 -3 54 -196 -40 73 20 -67 -1 0 0 -112 54 266 138 139 -74 -211 16 -116 -61 64 -66 236 -86
7824 -86 -53 100 -26 -135 -50 51 77 -259 -219 71 64 -5 -54 32 284 -4 70 50 -11 52 56 178 46 -60 56
$$ packed form
7655h3J83r8np6J20l1J0j61L03k44P9J54p9k08J96l16L93k83K5J53J31j99O4j72
7679a44J18L53j42Qk61K00k76o9J56K32k68j30K57l8J9o8Q6k9pK23k41j84Q0R6
7703b9j35K31k29J83j88J45J22O0l29J43M7j7JJ12l3j81K13o7n6J5J24N2k29J74
7727A29K6n4n8k19M00l27J15j5m0rJ0M3q0J89j06nj43L16r8j46K45k69k1K59k33
7752i1K85mj61m8J44k56J82k4n3l1Jo1K41k11P8o0M9j29J39L7R1k17NJ60R6j03
7778E9l11L70j69J89j60N5N3J29p9k31l7J04J50l90J64J35j01J25N1J61l05q9
7800a27J24N7k50J56J13n3q7O6J%j12J66K12j28Jk13j37K27j32N5J25j30L02l22
7824h6L3J53j26j09Q5J01K6l36M0K90po9m9Q6K52k88P4k0o1O3MJ22j32j06J16
$$ plain form
7849 56 -68 -109 131 77 -79 -22 -86 -286 119 18 120 246 -133 144 -89 -214 -93 -205 -51 -83 18 -19
7871 -19 -87 -189 164 76 -108 -164 57 111 -4 44 -132 -35 51 -202 77 217 78 61 -63 -339 -182 60 244
7894 244 -24 53 -140 -118 -53 83 -252 310 -96 -54 0 -15 -69 -179 -135 -222 26 106 -65 -6 13 247 -77 49
7918 49 -42 -150 230 -103 260 -40 67 322 41 4 238 135 160 218 -70 187 110 232 8 -55 -19 22 165
7941 165 -115 110 -43 -64 -83 -27 -110 -123 -210 84 192 -7 24 137 146 -78 -40 73 -137 -133 57 56 -295 -20 -66
7966 -66 27 131 143 57 -58 -63 -42 -391 93 -69 -251 -24 -121 -66 -145 88 63 28 -188 -41 80 -4 -159 -117 -2
7991 -2 57 82 227 -80 -3 136 136 252 -1 124 -104 -3 -224 -18 228 -17 -116 35 -89 -49 234 84 -23
8014 -23 -172 54 46 -228 -183 147 -128 -89 -90 -43 -23 -288 131 7 108 161 -35 -39 -91 25 110 -176 95 49 -142
$$ packed form
7849E6j24m1K40n4j56N7o4k00M05j01J02J26l79K77k33j25J21j12J54l2J01l7
7871a9o8j02L53q8j84n6K21N4j15M8j76R7Q6k53K79J40j39j7j24k76J57K42J84
7894B44k68P7j93K2O5J36l35N62m06M2N4j5n4j10M4q7K48Q0j71N9J9K34l24J26
7918D9r1j08L80l33L63l00J07K55k81l7K34j03K5N8k88K57p7J22k24o3L6M1J43
7941A65k80K25j53k1j9N6q3j3q7K94J08j99L1J13Rk24L8J13k10MJ90jl51K75m6
7966f6R3J04J2q6j15nK1l49M84j62j82K27r7N5p9K33k5l5k16J47J21q4j55M2J15
7991bN9K5J45l07P7J39%J16k53J25k28J01k21K06K46k45r9J51j24M0K83j50j07
8014b3j49K26qk74M5L30k75L9jM7K0k65M19j24J01N3j96mn2J16Q5k86K71m6j91
$$ plain form
8039 -142 19 -86 143 199 -72 -19 152 215 10 69 -195 6 -79 -61 63 -22 25 -221 182 -92 88 -47 45
8062 45 64 12 -54 -58 -139 -88 -274 152 62 -159 68 63 156 73 -84 -156 195 -239 251 69 1 249 36 -110 -38
8087 -38 250 75 112 165 194 -108 -16 84 109 40 -116 30 93 54 192 83 -58 57 -14 -45 90 -37 -70 78
8111 78 185 -154 197 -201 -121 76 -118 -2 -80 46 -104 -66 293 -57 -58 149 24 126 176 32 -56 327 14
8134 14 121 5 40 157 -7 91 68 -4 -40 17 -201 16 -208 -37 -13 -186 -95 76 212 156 -68 -231 -9
8157 -9 -116 122 61 -123 246 50 -280 -78 -82 -119 -153 165 -15 65 -145 128 161 -78 79 -262 -131 68 -180
8180 -180 67 -60 93 -88 29 27 -12 -288 113 -36 -77
$$ packed form
8039a42J61j05K29N6k71N3J71O3k05N9k64K01q5J8J24q5M7k46M03k74J80j35R2
8062D5J9n2o6mq1N1j86M26r0k21K27nR3q3j57p2L51m34M90j82o8K48k13j46P2
8087c8K88j75L7N3K9l02R2J00K5o9j56J46O3l9J38j09j41J15p1l1J35j27l3J48
8111G8J07l39L51l98Q0J97j94J16p8J26j50L8L59l50jK07j25J02N0j44q8L83l13
8134A4J07j16L5J17j64R8k3p2l6N7k18K17k24J71K4j73R1J71J36n6k24j63K22
8157ij07K38o1j84L69j96l30K02ml7l4L18j80Q0k10K73L3k39J57l41J31J99k48
8180a80K47j27J53j81J17kl9k76M01j49m1
8191g7
$$ Imaginary data points
##PAGE= N=2
##DATA TABLE= (X++(I..I)), XYDATA
$$ plain form
0 0 0 0 0 0 0 0 -8 8 -8 11 -16 16 -24 32 -40 51 -64 80 -96 112 -136 163 -194 227 -267 311 -362 416 -476
29 -476 548 -628 715 -812 917 -1030 1159 -1302 1457 -1628 1814 -2016 2238 -2482 2747 -3032
45 -3032 3351 -3697 4073 -4487 4941 -5442 5993 -6608 7293 -8060 8929 -9918 11056
58 11056 -12384 13956 -15850 18182 -21133 24996 -30286 37988 -50238 72660 -126586 507252
70 507252 349375 -613087 196872 -384376 312061 507907 -576461 46373 13089 -134523
80 -134523 627656 -460886 -235078 462803 -347943 270571 109555 -513946 394580 -81561
90 -81561 -66328 360652 -478678 86849 251143 -298662 417053 -215093 -392645 480244
100 480244 -145149 76437 126502 -556919 307657 201895 -185153 202354 -425039 37025
$$ packed form
0@%%%%%%qJ6j6J9k7L2m0N6p2R1j15J44j76K08k48K99l57M21m94N78o73P78q92
29d76J024j176J343j527J729j947K189k461K759l085L442l830M254m720N229n779
45c032O383p048P770q560R428j0383J1435j2601J3901j5353J6989j8847K0974
58A1056k3440K6340k9806L4032l9315M6129n5282O8274q8226J22898j99246O33838
70E07252j57877r62462Q09959n81248O96437J95846j084368O22834l3284j47612
80a34523P62179j088542K25808O97881q10746O18514j61016o23501R08526m76141
90h1561J5233M26980q39330N65527J64294n49805P15715o32146j77552Q72889
100D80244o25393K21586N0065o83421Q64576j05762l87048L87507o27393M62064
$$ plain form
110 37025 489280 -346700 68074 -20016 -271623 475776 -123908 -238499 214500 -239258
120 -239258 216796 120681 -375446 226530 -76178 -76247 348177 -337929 -46732 222245 -182912
131 -182912 234487 -88998 -249985 286823 -99828 31919 139680 -321756 165361 96675
141 96675 -172235 222572 -166659 -86670 228374 -164569 100124 41127 -215217 202847
151 202847 -29087 -68131 164223 -200021 66195 146259 -178789 121070 -51118 -95946
161 -95946 216285 -111245 -37615 60624 -129117 177486 11509 -181385 112427 -48967
171 -48967 32989 116844 -187868 46745 62108 -79790 113971 -83778 -46702 112219 -107393
182 -107393 42696 48741 -116517 80302 -23899 -44771 94088 -95005 11567 63838 -81756
$$ packed form
110C7025M52255q35980M14774q8090k51607P47399n99684j14591M52999m53758
120b39258M56054r6115m96127O01976l02708o9M24424o86106K91197K68977m05157
131a82912M17399l23485j60987N36808l86651J31747J07761m61436M87117o8686
141I6675k68910L94807l89231P9989L15044l92943K64693n8997k56344M18064
151B02847k31934l9044K32354l64244K66216Q0064l25048K99859j72188m4828
161i5946L12231l27530P3630R8239j89741L06603j65977j92894K93812j61394
171d8967Q1956Q3855l04712K34613J5363j41898J93761j97749L7076J58921k19612
182a07393J50089O045j65258J96819j04201k0872J38859j89093J06572N2271j45594
$$ plain form
193 -81756 58096 -23540 -51485 93446 -52158 -7858 38900 -81307 59076 23915 -59601
204 -59601 42044 -49271 3509 71391 -60760 7265 7836 -31352 64964 -26013 -25600 48514
216 48514 -36365 19840 18040 -36360 45432 -16873 -25130 47546 -24093 -2271 18818 -21741
228 -21741 28564 -12373 -20160 42691 -16652 1117 16178 -26917 25694 7778 -17614 17930
240 17930 -10525 -4091 12486 -13151 14068 -5905 -26202 23719 -1871 -9643 6468 -12647
252 -12647 8758 -103 -10652 10441 -1722 -6857 1111 -7860 6930 1321 -20747 7922 1468
265 1468 -10952 -1868 -5571 6254 -3455 -9208 2242 1474 258 -760 -6383 4514 8310 -11761
279 -11761 114 6781 -1045 -4036 -2806 9593 -3282 -6973 3984 4698 923 -1802 -1335 3913
$$ packed form
193h1756J39852q1636k7945J44931j45604M4300M6758j20207J40383l5161q3516
204e9601J01645r1315N2780O7882j32151O8025N71l9188R6316r0977M13P4114
216D8514q4879N6205j800n4400Q1792o2305q257P2676p1639K1822K1089m0559
228b1741N0305m0937p787O2851n9343J7769J5061m3095N2611j7916k5392L5544
240A7930k8455O434J6577k5637K7219j9973k0297M9921k5590p772J6111j9115
252a2647K1405q861j0549K1093j2163n135P968q971J4790n609k2068K8669o454
265A468j2420R084l703J1825r709n753J1450p68j216j018n623J0897L796k0071
279a1761J1875O667p826k991J230J2399j2875l691J0957P14l775k725M67N248
$$ plain form
293 3913 8437 -3588 596 7222 4488 -1780 -1531 12135 2014 -4915 224 4377 3935 -409 -2099
308 -2099 582 4488 -3688 -78 5211 4249 -2745 -6425 6974 7374 -1687 -4613 1813 2532 -2993 -3204
324 -3204 2641 3287 -11147 -5054 3499 854 -2373 -7443 -2381 1688 -359 -2984 1473 -62 -2968
339 -2968 -6825 -2016 12064 -3392 -10929 -4157 53 3322 -3346 -2096 768 -7751 -6560 10154
353 10154 4096 -1351 -4207 -7513 9133 4304 -298 2067 -2155 874 -3179 77 14669 -267
367 -267 -14004 5886 2913 976 5642 -2802 7055 -2257 -7694 8191 8083 10749 -3009 -21682
381 -21682 9930 20962 -3587 1088 -7408 -5405 8658 219 10174 -4973 -16629 9129 1457
394 1457 -438 8922 -13401 43 10013 -11096 3408 145 1709 7184 -20445 -495 10482
$$ packed form
293C913M524j2025M184O626k734o268K49J3666j0121o929N139M153m42m344j690
308b099K681L906q176L610N289r62o994l680J3399M00r061k926O426P19n525k11
324c204N845O46j4434O093Q553k645l227n070N062M069k047k625M457j535k906
339b968l857M809J4080j5456p537O772M210L269o668J250K864q519J191J6714
353A0154o058n447k856l306J6646m829m602K365m222L029m053L256J4592j4936
367b67j3737J9890k973j937M666q444R857r312n437J5885j08K666j3758j8673
381b1682L1612J1032k4549M675q496K003J4063q439R955j5147j1656K5758p672
394A457j895R360k2323J3444R970k1109J4504l263J564N475k7629J9950J0977
$$ plain form
407 10482 -9803 8505 -3742 -19766 3347 -1594 9991 9140 -27107 -5144 6537 6998 15547
420 15547 -22166 -11044 15351 -7106 6928 6022 -17187 2249 -4164 4148 14582 -19879 -1248
433 -1248 9448 -2103 11583 -16438 -7279 31976 45 -14880 -6830 108 32519 895 -25729
446 -25729 1176 -301 19454 13851 -22272 -4942 2893 7590 18960 -11832 -8024 8678 -6405
459 -6405 12801 5754 -10119 6305 -6388 521 10272 -3147 -176 -8005 -1217 17735 -10685
472 -10685 -18358 10145 11837 4914 -21658 -19201 21057 17921 -1667 -24774 -18101 22105 16621
485 16621 -7057 -11729 -15149 2801 12726 -124 -867 -17062 -8057 12692 516 6237 -10491
498 -10491 -15064 17553 5649 -6915 -4315 -5033 16647 4227 -15967 2202 -8796 12761 24302
$$ packed form
407A0482k0285J8308j2247j6024K3113m941J1585q51l6247K1963J1681M61Q549
420A5547l7713J1122K6395k2457J4034r06k3209J9436o413Q312J0434l4461J8631
433a248J0696j1551J3686k8021R159L9255l1931j4925Q050O938L2411l1624k6624
446b5729K6905j477J9755n603l6123J7330P835M697J1370l0792L808J6702j5083
459f405J9206p047j5873J6424j2693O909R751j3419K971p829O788J8952k8420
472a0685p673K8503J692o923k6572K457M0258l136j9588k3107O673M0206n484
485A6621k3678m672l420J7950R925j2850p43j6195R005K0749j2176N721j6728
498a0491m573L2617j1904j2564K600p18K1680j2420k0194J8169j0998K1557J1541
$$ plain form
511 24302 -28147 -11366 6237 8043 27186 -17353 -21043 12226 1763 23807 3126 -29937
523 -29937 15375 -2111 -260 32764 -21944 -10885 4481 -5089 37181 -11821 -34466 21120
535 21120 2088 16251 13 -47044 32861 24121 -22049 6507 -31318 15043 45336 -35297
547 -35297 -6497 -6719 -12250 51855 -18661 -31133 16963 -26739 31071 18777 -48037 18173 -10787
560 -10787 -6305 40763 -36693 52 16693 -38459 36800 3270 -32712 26892 -28771 12218
572 12218 31943 -54656 17002 14457 -17931 34283 -43077 -12200 56572 -25565 7511 -5747
584 -5747 -39603 60609 -2611 -25060 26115 -44649 23873 38010 -42580 22170 -15045 -18876
596 -18876 57688 -31740 -6491 27561 -39150 39178 2447 -37528 47022 -23557 -5734 37173
$$ packed form
511B4302n2449J6781J7603J806J9143m4539l690L3269j0463K2044k0681l3063
523b9937M5312j7486J851L3024n4708J1059J5366r570M2270m9002k2645N5586
535B1120j9032J4163j6238m7057P9905q740m6170K8556l7825M6361L0293q0633
547c5297K8800k22n531O4105p0516j2472M8096m3702N7810j2294o6814O6210k8960
560a0787M482M7068p7456L6745J6641n5152P5259l3530l5982N9604n5663M0989
572A2218J9725q6599P1658k545l2388N2214p7360L0877O8772q2137L3076j3258
584e747l3856J00212o3220k2449N1175p0764O8522J4137q0590O4750l7215l831
596a8876P6564q9428K5249L4052o6711P8328l6731l9975Q4550p0579J7823M2907
$$ plain form
608 37173 -43582 20301 13832 -34229 43656 -23639 -24564 43984 -28605 18371 9741 -54292 42317
621 42317 5250 -22850 32112 -40802 4163 34305 -37077 26302 -7731 -35415 44665 -20498
633 -20498 -6574 24084 -44629 25097 13596 -38387 31154 -16468 -10013 35344 -39894 10254
645 10254 17897 -31861 33695 -12957 -23512 34470 -25488 9857 21542 -43892 20629 6924
657 6924 -15867 30902 -31027 -2261 31331 -28138 17696 4757 -23926 30582 -13027 -7809
669 -7809 28615 -25973 8826 12355 -21974 25155 -12336 -11710 31775 -20511 -717 13430 -17682
682 -17682 21795 -903 -18809 21572 -11239 1993 16124 -22998 12827 960 -15741 22296
694 22296 -12060 -9967 15172 -12848 5918 2581 -16201 17159 -4778 -9664 12758 -13797 5332
$$ packed form
608C7173q0755O3883o469m8061P7885o7295r25O8548p2589M6976q630o4033R6609
621D2317l7067k8100N4962p2914M4965L0142p1382O3379l4033k7684Q0080o5163
633b0498J3924L0658o8713O9726j1501n1983O9541m7622O455M5357p5238N0148
645A0254P643m9758O5556m6652j0555N7982n9958L5345J1685o5434O4521j3705
657F924k2791M6769o1929K8766L3592n9469M5834j2939k8683N4508m3609N218
669g809L6424n4588L4799L529l4329M7129l7491O26M3485n2286J9794J4147l1112
682a7682L9477k2698j7906M0381l2811J3232J4131l9122L5825j1867j6701L8037
694B2296l4356K093K5139k8020J8766l337j8782L3360k1937m886K2422k6555J9129
$$ plain form
707 5332 6590 -16795 10873 -1315 -10957 9334 -6920 452 4484 -15011 9373 3010 -12033
720 -12033 7544 -4367 118 5921 -10157 4632 4762 -6865 4438 -2630 -629 7657 -8163
733 -8163 2791 5697 -7238 3298 858 332 3832 -5409 1402 6467 -3037 1869 2045 -413 4551
748 4551 -3425 2118 6044 -2386 -191 165 1284 3531 -2332 -2030 3492 -779 -1458 2072 1206 1721
764 1721 -4317 -325 4318 -140 -22 -1133 -933 -127 -840 -1348 2365 -474 -5319 -2775 1299 3448
780 3448 -3086 -3101 743 -1925 -923 740 1253 -441 -3733 -3127 2078 2991 -1483 -2856 -2905 1303 -1272
797 -1272 -808 3411 -1161 -4127 -1401 1899 4465 555 -4022 234 1196 970 2986 231 1453 -1667
813 -1667 -4447 4918 5199 -845 -1207 -2729 1911 3774 -995 4298 300 -4702 2371 1068 4635 4388
$$ packed form
707E332J258k3385K7668j2188r642K0291j6254P372M032j9495K4384o363j5043
720a2033J9577j1911M485N803j6078J4789J30j1627J1303p068K001Q286j5820
733h163J0954K906j2935J0536k440n26L500r241O811N065r504M906J76k458M964
748D551p976N543L926q430K195L56J119K247n863L02N522m271o79L530q66N15
764A721o038L992M643m458J18j111K00Q06p13n08L713k839m845K544M074K149
780C448o534j5L844k668J002J663N13j694l292O06N205R13m474j373m9M208k575
797a272M64M219m572k966K726L300K566l910m577M256R62k26K016k755J222l120
813a667k780R365K81o044l62j522M640J863m769N293l998n002P073j303L567k47
$$ plain form
829 4388 -6385 -779 4172 -467 3703 -357 -1829 1143 -5879 4059 5829 -5309 -578 -3336 -784
844 -784 7313 -3894 -1790 3893 -6558 -235 1892 -92 5837 -9232 -5387 5411 -3234 4519
858 4519 -1257 -9489 3256 -2604 -1140 8949 -6949 -3785 654 -3518 10362 -3478 -6362 6615
872 6615 -6869 1284 5928 -5171 4811 -3539 -7404 9460 -1499 529 3809 -9128 6648 -256
886 -256 -5071 14338 -3050 -6620 2992 -4130 11469 4962 -10971 3678 -3569 2217 11521 -8612
900 -8612 3226 629 -10758 12788 2763 -5564 3853 -7474 5471 5637 -9148 8312 -2239
913 -2239 -4516 9095 -11371 3239 9852 -10554 3968 -3719 -7846 11361 -2295 243 -1699
926 -1699 -16533 13572 7894 -8963 3026 -13163 2594 14767 -10438 3 -1558 -7367 11362
$$ packed form
829D388j0773N606M951m639M170m060j472K972p022R938J770j1138M731k758K552
844g84Q097j1207K104N683j0451O323K127j984N929j5069L845J0798q645P753
858D519n776q232J2745n860J464J0089j5898L164M439m172J3880j3840k884J2977
872F615j3484Q153M644j1099R982q350l865J6864j0959K028L280j2937J5776o904
886b56m815J9409j7388l570R612p122J5599o507j5933J4649p247N786R304k0133
900h612J1838k597j1387K3546j0025q327R417j1327J2945J66j4785J7460j0551
913b239k277J3611k0466J4610O613k0406J4522p687m127J9207j3656K538j942
926a699j4834L0105n678j6857J1989j6189J5757J2173k5205J0441j561n809J8729
$$ plain form
939 11362 -6161 -2723 8029 -14099 6612 5613 -11254 8592 -5415 -467 11953 -13908 199
952 199 7560 -4883 12041 -9462 -11332 15428 -4131 6564 3463 -20917 9374 6887 441
965 441 9852 -19629 -1674 18695 -4017 6143 -8654 -10047 23776 -6191 -5933 8386 -12746
978 -12746 13256 4262 -16014 10703 -4252 59 13671 -16432 2023 4331 -8699 20521 -8856
991 -8856 -16383 14434 -6891 8405 7316 -22191 6078 1659 -1746 15400 -18958 -5099 11419
1004 11419 -10546 15758 -4801 -22154 17988 -481 -3262 4623 -18462 12667 8684 -15496
1016 -15496 8627 -11033 -281 21531 -18378 -1851 5135 -12422 19582 -723 -15038 6549
1028 6549 -8741 13387 11916 -23685 7398 2727 -4206 19550 -15071 -6514 14823 -8841 8284
$$ packed form
939A1362j7523L438J0752k2128K0711r99j6867J9846j4007M948J2420k5861J4107
952A99P361j2443J6924k1503j870K6760j9559J0695l101k4380L0291k487o446
965D41R411k9481J7955K0369k2712J0160j4797j393L3823k9967K58J4319k1132
978a2746K6002q994k0276K6717j4955M311J3612l0103J8455K308j3030K9220k9377
991h856p527L0817k1325J5296j089k9507K8269m419l405J7146l4358J3859J6518
1004A1419k1965K6304k0559j7353M0142j8469k781P885k3085L1129l983k4180
1016a5496K4123j9660J0752K1812l9909J6527O986j7557L2004k0305j4315K1587
1028F549j5290K2128j471l5601L1083m671o933K3756l4621Q557K1337k3664J7125
$$ plain form
1041 8284 752 -11732 13050 -6220 283 13576 -18535 6293 11900 -12001 10562 -6044 -7475
1054 -7475 17415 -5333 -785 512 -11964 16022 1718 -10816 8986 -12978 1896 18076
1066 18076 -13640 -2011 -198 -3744 14812 -8284 -8228 7984 -6646 7220 23 -14725 13187
1079 13187 -1166 -9449 9002 -6798 453 3678 -8354 7923 -1896 -7764 8096 -5343 2481
1092 2481 7049 -14886 4056 7759 -5438 3997 -5744 -2032 7900 -3594 2337 -1990 -7801 11941
1106 11941 453 -7387 5552 -3861 2456 5976 -6441 1358 2583 64 3686 -4975 2825 5930
1120 5930 -8169 3329 5212 -4681 2634 -2082 -523 6248 -2332 -2167 547 895 5396 -3964 -3643
1135 -3643 6343 -1959 -1163 2621 -4289 628 1952 -1044 -194 -3123 -179 2598 -2039 -40 -941 -3299
$$ packed form
1041H284p532j2484K4782j9270O503J3293l2111K4828N607k3901K2563j6606j431
1054g475K4890k2748M548J297j2476K7986j4304j2534J9802k1964J4874J6180
1066A8076l1716J1629J813l546J8556k3096N6J6212j4630J3866p197j4748K7912
1079A3187j4353q283J8451j5800P251L225j2032J6277r819n868J5860j3439P824
1092B481M568k1935J8942L703j3197R435r741L712R932j1494N931m327n811J9742
1106A1941j1488p840J2939r413O317L520j2417P799J225k519L622q661P800L105
1120E930j4099J1498J883r893P315m716J559O771q580J65K714L48M501r360L21
1135c643R986q302P96L784o910M917J324k996Q50k929K944K777m637J999r01k358
$$ plain form
1151 -3299 4384 -120 -4441 440 433 -300 -819 -823 978 -1690 -2585 2513 -32 -1864 17 -2641 1262
1168 1262 1668 -2138 -999 1097 316 -885 -529 1498 1171 -2138 534 1084 -518 1155 62 155 454
1185 454 -976 -327 2876 1327 -1751 -1229 1031 3207 -7 -486 1358 -7 44 1125 1505 665 -321
1202 -321 -1530 1052 1448 -71 -51 -1226 343 -552 -569 1727 1058 -1404 -1871 523 1441 361 -1329
1219 -1329 -324 -204 -1976 13 468 625 -1569 -2610 -446 1459 79 -1788 -528 -481 -202 -822 478
1236 478 886 -1334 -1578 -860 1094 1051 -1265 -1297 471 -343 -515 932 845 -403 -2067 200 2208 902
1254 902 -582 -528 433 619 571 691 1635 168 -1369 108 1901 2271 -498 -1172 601 791 503 579 956
1273 956 87 -968 -593 2383 1935 -523 -1151 -631 1795 968 -906 409 -437 -1838 -366 1144 769
$$ packed form
1151c299P683m504m321M881pp33n19mJ801k668q95N098k545j832J881k658L903
1168A262M06l806J139K096p81j201L56K027l27l309K672N50j602J673j093R3K99
1185D54j430O49L203j549l078N22K260K176l214m79J844j365N1J081L80q40r86
1202c21j209K582L96j519K0j175J569q95j7K296o69k462m67K394R18j080j690
1219a329J005J20j772J989M55J57k194j041K164J905j380j867J260M7K79o20J300
1236D78M08k220k44P18J954m3k316l2J768q14j72J447q7j248j664K267K008j306
1254I02j484N4R61J86m8J20R44j467j537J477J793L70k769o74J773J90k88P6L77
1273I56q69j055L75K976m48k458o28N20K426q27j874J315q46j401J472J510l75
$$ plain form
1290 769 -808 -2233 -222 69 329 1144 -1535 -634 -934 -2118 1763 2110 -2064 -2735 -680 919 559
1307 559 -1142 26 -1102 -2441 1051 739 339 588 -2981 -1462 2686 1180 -380 -868 -487 54 -1768
1324 -1768 1558 2816 -2298 -768 83 -669 2490 1327 -1106 -3 -1066 606 2418 1030 1594 -3604
1340 -3604 -1789 5745 1077 -1315 1016 -1419 290 1708 273 1777 -1386 -775 1026 -1340 3481
1355 3481 1365 -4861 1923 1140 -2396 2464 829 -573 -1089 -2928 2567 988 -1307 1800 -4425
1370 -4425 -1647 3383 -1779 972 406 -5243 -262 1993 1414 825 -5542 34 2756 -2625 2570 -987
1386 -987 -3805 2288 -1836 -478 2591 -2560 -359 121 -1252 3314 -2213 -384 4714 -4139 -1075
1401 -1075 2514 -283 3398 -1062 -3596 1957 245 2667 2012 -4635 1001 620 174 5810 -2803 -3774
$$ packed form
1290G69j577j425K011K91K60Q15k679R01l00j184L881L47m174o71K055J599l60
1307E59j701J168j128j339L492l12m00K49l569J519M148j506j560m88L81N41j822
1324a768L326J258n114J530Q51p52L159j163k433J103j063J672J812j388N64n198
1340c604J815P534m668k392K331k435J709J418j435J504l163O11J801k366M821
1355C481k116o226O784p83l536M860j635j402n16j839N495j579k295L107o225
1370d425K778N030n162K751n66n649M981K255n79n89o367N576K722n381N195l557
1386i87k818O093m124J358L069n151K201M80j373M566n527J829N098q853L064
1401a075L589k797L681m460k534N553j712K422o55o647N636l81m46N636q613r71
$$ plain form
1417 -3774 2635 801 2343 90 -2919 2556 240 -914 2809 -2170 961 1662 -2905 2589 500
1432 500 -2521 2169 4 -771 -298 -3356 3486 3128 -3649 -1505 -2079 1867 5009 -2700 -3773 -1107
1448 -1107 384 4069 -402 -5004 -1067 -83 2661 1901 -5607 -1059 2565 902 -210 -3163 -784
1463 -784 3197 -37 -1966 -825 -891 2982 288 -2365 350 -1336 344 2741 979 -1721 -2119 58
1479 58 3877 2080 -2682 -1311 -486 2509 3721 -1587 -2713 -5 2033 2900 155 -3427 -260 2839
1495 2839 2578 -112 -4931 690 5746 822 -3169 -2568 386 4851 1316 -4434 -1725 587 3358
1510 3358 1514 -3904 -843 142 461 3054 -2287 -3769 1261 414 632 116 -3069 528 76 -327 1759
1527 1759 -2947 -1198 1050 -1374 2281 -212 -5158 1326 2398 667 -1365 -4943 2377 4204 -2065
$$ packed form
1417c774O409j834J542k253l009N475k316j154L723m979L131P01m567N494k089
1432E00l021M690k165p75M73l058O842l58o777K144n74L946L142p709j073K666
1448a107J491L685m471m602L937R84K744p60p508M548L624j663j112k953K379
1463g84L981l234j929J141o6L873k694k653K715j686J680K397j762k700l98K177
1479E8L819j797m762J371Q25K995J212n308j126K708K038Q67k745l582L167L099
1495B839k61k690m819N621N056m924l991O01K954M465l535n750K709K312K771
1510C358j844n418L061R85L19K593n341j482N030q47K18n16l185L597m52m03K086
1527A759m706J749K248k424L655k493m946O484J072j731k032l578P320J827o269
$$ plain form
1542 -2065 -1113 -2625 693 5577 -2023 -3582 679 -29 3320 -299 -3483 1365 -464 2154 2606 -4410
1558 -4410 289 2907 -143 2257 -1357 -1562 3534 -881 482 828 -1923 2320 -236 -778 3468 -2260
1574 -2260 -1586 2897 -640 979 -541 -2755 3650 660 -1366 366 -2510 2495 1574 -3506 746
1589 746 -28 -855 2345 -1775 -1695 641 -1190 2742 -1011 -3756 1754 -237 64 1046 -2868 293 1151
1606 1151 -1494 1040 -806 -329 1362 -2723 673 1995 -2565 693 258 -920 1089 -1321 217
1621 217 1807 -1504 474 -170 -439 2786 -1344 -881 1710 -1102 1429 2064 -1354 -88 -591 571
1637 571 2707 -1451 -465 811 -735 1960 226 -739 1626 -457 -863 1100 514 1128 -971 -1633 1939
1654 1939 -302 -492 1236 -913 -221 -243 -508 1077 26 -937 -414 -648 862 957 -1817 251 -717 -1276
$$ packed form
1542b065R52j512L318M884p600j559M261p08L349l619l184M848j829K618M52p016
1558d410M699K618l050K400l614k05N096m415J363L46k751M243k556n42M246n728
1574b260O74M483l537J619j520k214O405k990k026J732k876N005r21n080M252
1589G46p74q27L200m120Q0K336j831L932l753k745N510j991L01R82l914L161Q58
1606A151k645K534j846M77J691m085L396J322m560L258m35j178K009k410J538
1621B17J590l311J978o44k69L225m130M63K591k812K531O35l418J266n03J162
1637E71K136m158R86J276j546K695j734r65K365k083m06J963n86O14k099o62L572
1654A939k241j90J728k149O92k2k65J585j051r63N23k34J510R5k774K068r68n59
$$ plain form
1672 -1276 1203 260 -505 -1163 -1432 491 709 -695 45 -585 -627 1 -819 1005 711 -1536 -734 453
1690 453 721 320 -857 -388 357 -306 523 726 -304 -279 -912 196 1641 362 -381 -183 122 454 767
1709 767 574 852 -577 -738 1015 1125 547 -807 -551 709 178 610 571 479 -690 -341 218 1475 527
1728 527 -850 -447 -267 940 62 55 107 -576 -933 -147 1128 40 -889 -1052 -31 176 -492 320 -314
1747 -314 -591 -697 95 496 515 -1207 -1301 191 178 258 -430 137 -594 -872 448 359 247 -565 -1003 -129 1279
1768 1279 363 -244 50 -58 -131 124 1098 789 -910 -554 309 347 867 217 -161 182 -133 251 1287 452
1788 452 -221 -953 246 1566 217 -347 297 -303 142 590 34 678 -497 -590 253 259 682 -211 -626 448
1808 448 -202 -930 1159 497 -426 -554 -877 757 368 -572 -333 -1314 -240 841 -391 164 -583 -1847
$$ packed form
1672a276K479r43p65o58k69J923K18j404P40o30m2O28q20J824k94k247Q02J187
1690D53K68m01j177M69P45o63Q29K03j030K5o33J108J445j279p43J98L05L32L13
1709G67j93K78j429j61J753J10n78j354K56J260n31M32l9r2j169L49N59J257r48
1728E27j377M03J80J207q78pN2o83l57P86J275j088r29j63J021K07o68Q12o34
1747c14k77j06P92M01J9j722r4J492j3Q0o88N67p31k78J320q9j12q12m38Q74J408
1768A279r16o07K94j08p3K55R74l09j699L56Q63L8N20o50l78L43l15L84J036q35
1788D52o73p32J199J320j349n64O44o00M45M48n56O44j175r3Q43OM23q93m15J074
1808D48o50p28K089o62r23j28l23J634l89r40K39r81J074J081j232N55p47j264
$$ plain form
1826 -1847 766 1229 -394 -733 -1298 728 459 -904 -48 -27 -268 418 -742 -129 1630 -617 13 233
1844 233 -751 815 516 491 113 -1449 296 1499 335 254 -1011 -682 2077 525 7 507 -1097 137
1862 137 736 763 854 -1241 -692 1877 456 -468 -246 -631 2040 73 -1703 360 518 1016 -358 -2139
1880 -2139 115 1167 54 430 -1232 -1987 1331 391 411 -763 -1897 600 1110 71 -746 -1723 103
1897 103 1145 -863 -110 -472 -1262 829 -247 -280 -79 -1097 594 951 -707 -741 -686 1202 1769 -1569
1915 -1569 -1208 634 192 1444 -270 -1507 425 508 1035 759 -1369 -372 931 1175 1322 -1677 -1293
1932 -1293 2144 777 141 -872 -765 1467 799 -290 -586 -361 1012 845 -716 95 -414 -73 1240
1949 1240 91 -1025 -416 236 1058 -89 -637 -231 -359 471 884 -716 -936 -636 -149 1034 240 -1726
$$ packed form
1826a847K613M63j623l39n65K026k69j363Q56K1k41O86j160O13J759k247O30K20
1844B33r84J566k99k5l78j562J745J203j164q1j265L29K759j552n18N00j604J234
1862A37N99K7R1k095N49K569j421r24K22l85K671j967j776K063J58M98j374j781
1880b139K254J052j113L76j662p55L318r40K0j174j134K497N10j039q17r77J826
1897A03J042k008P53l62p90K091j076l3K01j018J691L57j658l4N5J888N67l338
1915a569L61J842m42J252j714j237J932Q3N27k76k128R97J303K44J47k999L84
1932a293L437j367o36j013J07K232o68j089k96K25J373j67j561Q11n09L41J313
1949A240j149j116O09O52Q22j147n48M06j28Q30M13j600k20L00M87J183p94j966
$$ plain form
1967 -1726 -1436 1029 1596 -1038 -1855 -355 1101 813 -697 -1669 -212 1191 958 -1057 -868 466 -67
1984 -67 417 427 -1251 -651 480 687 125 -965 -287 456 734 894 -234 -1134 860 239 583 403 -1147
2003 -1147 -362 1164 1058 -28 -1516 -155 2027 476 -672 -761 -341 1927 856 -885 -417 -5 773
2020 773 712 -408 -257 -745 -131 1743 -94 -1179 361 -251 985 341 -1597 -163 245 394 214 -1287
2038 -1287 -32 576 -545 1012 -893 -1892 1096 275 354 -181 -1973 143 1557 -120 -454 -1467 193
2055 193 1493 -848 -6 132 -969 1099 163 -770 402 -707 206 1174 -1078 121 -108 121 1592
2072 1592 -1513 -915 1332 147 347 3 -1362 586 260 428 945 -1228 -197 716 -25 1428 -550
2089 -550 -1206 1286 174 71 529 -530 589 337 -513 1028 -608 -147 795 -991 407 -106 -622
$$ packed form
1967a726K90K465N67k634q17J500J456k88j510r72J457J403k33k015J89J334n33
1984f7M84J0j678O00J131K07n62j090O78P43K78J60j128r00J994o21L44j80j550
2003a147P85J526j06j086j488J361K182j551j148q9M20K268j071j741M68M12P78
2020G73o1j120J51m88O14J874j837j085J540o12J236o44j938J434M08J49j80j501
2038a287J255O08j121J557j905r99K988q21P9n35j792K116J414j677l34j013J660
2055A93J300k341Q42J38j101K068r36r33J172j109R13R68k252J199k29K29J471
2072A592l105N98K247j185K00l44j365J948l26J68N17k173J031R13p41J453j978
2089e50o56K492j112j03M58j059J119k52q50J541j636M61R42j786J398n13n16
$$ plain form
2106 -622 957 103 -1113 96 -5 973 202 -1596 282 189 -514 412 -814 -372 48 -660 479 419
2124 419 -959 -253 -295 -17 769 -616 -37 109 -926 529 104 100 493 -698 -355 558 41 416 -26
2143 -26 -463 -67 -749 455 1205 -478 -508 29 340 943 -37 -186 551 -37 405 456 38 673 -531 -506
2163 -506 973 488 -118 -357 -237 183 3 -79 630 -436 -561 125 -110 874 -54 -595 42 -212 -78 111
2183 111 33 -201 -777 -759 383 197 -270 -572 -494 93 104 -358 113 -72 -837 -240 92 215 211 -883 -574
2204 -574 -45 -175 81 31 -341 -203 -178 570 389 -108 -243 -358 95 631 -151 20 104 -60 62 341 721
2225 721 -26 -419 -60 339 213 318 173 -368 225 99 114 671 251 -450 -227 411 651 -32 -119 329 -196
2246 -196 -142 218 115 -75 -548 -467 389 315 -115 30 -355 -74 -148 -529 593 -131 -570 -164 -358 407 118
$$ packed form
2106f22J579q54j216J209j01R78p71j798J878r3p03R26j226M42M20p08J139o0
2124D19j378P06m2K78P86j385N79J46j035J455m25mL93j191L43R13n17L75m42
2143b6m37L96o82J204P50j683l0N37L11O03r80j49P37n88M42N1m18O35j204K5
2163e06J479m85o06k39J20M20j80q2P09j066j25O86k35R84r28n41O37k54J34J89
2183A11p8k34n76J8J142j86m67l02P8N87J1m62M71j85p65N97L32J23mj094L09
2204e74N29j30K56n0l72J38K5P48j81m97j35j15M53N36p82J71Q4j64J22K79L80
2225G21p47l93L59L99j26J05j45n41N93j26J5N57m20p01K23O38K40o83q7M48n25
2246a96N4L60j03j90m73Q1Q56p4m30J45l85K81p4l81J122p24m39M06j94P65k89
$$ plain form
2267 118 -737 -301 -284 21 346 -204 -157 -302 -1119 567 573 -777 -308 -280 253 302 -703 295 20 -417 265
2288 265 -324 -9 772 -801 -35 524 -594 592 341 209 236 -914 82 1169 12 465 -320 -579
2306 -579 1163 113 -121 131 -788 360 809 385 -30 -1160 -26 1501 -470 -132 291 -228 685 -342
2324 -342 -713 681 -196 313 75 -1548 313 -2 -275 1010 -784 -1212 842 313 525 -677 -1606 631
2342 631 234 405 15 -1895 281 996 -783 356 -696 -834 863 193 -26 -475 -811 1324 406 -993
2360 -993 116 -635 550 1130 -1118 -241 681 -75 725 -99 -783 228 186 1379 385 -1635 151 810
2378 810 637 799 -1464 -438 1306 762 178 -809 -423 1162 321 188 43 -1100 310 1173 -148 -216
2396 -216 -674 276 1164 -77 -462 -754 -373 1283 -34 -1195 -37 -34 258 627 -790 -728 -180 495 592
$$ packed form
2267A18q55M36J7L05L25n50M7j45q17J686Oj350M69K8N33M9j005R98k75m37O82
2288B65n89L15P81j573P66N59j118J186k51j32K7j150R96J087j157M53p85k59
2306e79J742j050k34K52r19J148M49m24m15j130J134J527j971L38M23n19R13j027
2324c42l71J394q77N09k38j623J861l15k73J285j794m28K054n29K12j202r29K237
2342F31l97J71l90j910K176P15j779J139j052j38J697o70k19m49l36K135r18j399
2360i93J109p51J185N80k248Q77R22p56Q00q24o84J011m2J193r94k020J786O59
2378H10j73J62k263J026J744n44n84r87L86J585q41j33j45j143J410Q63j321o8
2396b16m58R50Q88j241l85k92L81J656j317j161J158LK92L69j417O2N48O75R7
$$ plain form
2415 592 -787 -536 -175 549 656 -441 -1301 195 627 438 -522 -890 244 382 346 -3 -810 -554 668
2434 668 937 -52 -1034 -588 635 603 138 -559 -338 1227 146 -92 -544 -65 614 521 102 -483 -225 590
2454 590 921 -166 -155 -485 300 1239 82 -605 -322 271 903 108 -196 158 -467 403 783 -323 -478
2473 -478 -120 270 822 -263 -514 -340 260 832 -550 -1179 505 621 -157 -547 -1078 551 514 99 -250
$$ packed form
2415E92j379K51L61P24J07j097q60J496M32j89r60l68J134J38l6l49q07K56J222
2434F68K69r89r82M46J223l2m65o97K21J565j081k38m52M79O79r3m19n85K58Q15
2454E90L31j087J1l30P85R39j157o87K83N93O32p95l04L54o25Q70L80j106j55
2473d78L58L90N52j085k51J74O00N72j382o29J684J16p78l90n31J629l7m15l49
$$ [...]
8191a55
##END NTUPLES=NMR FID
##END=
