##TITLE=1H_LR-723-R4-C1
 CDCl3
 8 sc, 
 2.10.2024
##JCAMPDX= 6.0         $$ Bruker NMR JCAMP-DX V2.0
##DATA TYPE= NMR FID
##DATA CLASS= NTUPLES
##ORIGIN= UXNMR, Bruker Analytische Messtechnik GmbH
##OWNER= root
$$ XWIN-NMR		Version 3.5
$$ Wed Oct  2 16:40:32 2024 Russian Standard Time (UT+4h)  she@DPX200
##.OBSERVE FREQUENCY= 200.1318
##.OBSERVE NUCLEUS= ^1H
##.DELAY= (6, 6)
##.ACQUISITION MODE= SIMULTANEOUS
##.ACQUISITION SCHEME= undefined
##.AVERAGES= 8
##.DIGITISER RES= 18
##SPECTROMETER/DATA SYSTEM= spect
##.PULSE SEQUENCE= zg30
##.SOLVENT NAME= DMSO
##.SHIFT REFERENCE= (INTERNAL, DMSO, 0, 15.7039)
##AUDIT TRAIL= $$ (NUMBER, WHEN, WHO, WHERE, WHAT)
$$ ##TITLE= Audit trail, XWIN-NMR		Version 3.5
$$ ##JCAMPDX= 5.01
$$ ##ORIGIN= Bruker BioSpin GmbH
$$ ##OWNER= she
$$ F:/spectra/data/she/nmr/H-F/1/audita.txt
$$ ##AUDIT TRAIL=  $$ (NUMBER, WHEN, WHO, WHERE, WHAT)
(   1,<2024-10-02 16:39:14.46 +0400>,<she>,<DPX200>,
      <created by zg, POWCHK disabled, PULCHK disabled
       configuration hash MD5:
       00 E9 B6 7A A2 85 ED C7 34 08 36 98 17 FE 4E 26
       data hash MD5: 16K
       AB 68 17 B2 53 03 71 5C FE FF D7 5F 4D 71 ED 0A>)
$$ ##END=
$$ 
$$ hash MD5
$$ D5 75 42 25 08 58 77 9B 53 E5 B2 68 4A 0A AD 6B
##$RELAX= 
##$RELAX= 
##$RELAX= 
##$RELAX= 
##$RELAX= 
##$RELAX= 
$$ Bruker specific parameters
$$ --------------------------
##$DU= <F:/spectra>
##$EXPNO= 1
##$NAME= <H-F>
##$PROCNO= 1
##$TYPE= <nmr>
##$USER= <she>
##$AMP= (0..31)
100 100 100 100 100 100 100 100 100 100 100 100 100 100 100 100 100 100 
100 100 100 100 100 100 100 100 100 100 100 100 100 100 
##$AQSEQ= 0
##$AQ_mod= 1
##$AUNM= <au_zg>
##$AUTOPOS= <>
##$BF1= 200.13
##$BF2= 200.13
##$BF3= 200.13
##$BF4= 200.13
##$BF5= 200.13
##$BF6= 200.13
##$BF7= 200.13
##$BF8= 200.13
##$BYTORDA= 1
##$CFDGTYP= 0
##$CFRGTYP= 5
##$CHEMSTR= <none>
##$CNST= (0..31)
1 1 145 1 1 1 1 1 1 1 1 1 1 1 1 1 1 1 1 1 1 1 1 1 1 1 1 1 1 1 1 1 
##$CPDPRG= <>
##$CPDPRG1= <>
##$CPDPRG2= <>
##$CPDPRG3= <>
##$CPDPRG4= <mlev>
##$CPDPRG5= <mlev>
##$CPDPRG6= <mlev>
##$CPDPRG7= <mlev>
##$CPDPRG8= <mlev>
##$CPDPRGB= <>
##$CPDPRGT= <>
##$D= (0..31)
0 1.2 0 0 0 0 0 0 0 0.06 0 0.03 0 0 0 0 0.0002 0 0 0 0 0 0 0 0 0 0 0 0 
0 0 0 
##$DATE= 1727872753
##$DBL= (0..7)
120 120 120 120 120 120 120 120 
##$DBP= (0..7)
150 150 150 150 150 150 150 150 
##$DBP07= 0
##$DBPNAM0= <>
##$DBPNAM1= <>
##$DBPNAM2= <>
##$DBPNAM3= <>
##$DBPNAM4= <>
##$DBPNAM5= <>
##$DBPNAM6= <>
##$DBPNAM7= <>
##$DBPOAL= (0..7)
0.5 0.5 0.5 0.5 0.5 0.5 0.5 0.5 
##$DBPOFFS= (0..7)
0 0 0 0 0 0 0 0 
##$DE= 6
##$DECBNUC= <off>
##$DECIM= 24
##$DECNUC= <off>
##$DECSTAT= 4
##$DIGMOD= 1
##$DIGTYP= 9
##$DL= (0..7)
0 120 120 120 120 120 120 120 
##$DP= (0..7)
150 150 150 150 150 150 150 150 
##$DP07= 0
##$DPNAME0= <>
##$DPNAME1= <>
##$DPNAME2= <>
##$DPNAME3= <>
##$DPNAME4= <>
##$DPNAME5= <>
##$DPNAME6= <>
##$DPNAME7= <>
##$DPOAL= (0..7)
0.5 0.5 0.5 0.5 0.5 0.5 0.5 0.5 
##$DPOFFS= (0..7)
0 0 0 0 0 0 0 0 
##$DQDMODE= 0
##$DR= 18
##$DS= 0
##$DSLIST= <SSSSSSSSSSSSSSS>
$$ [...]
##$SUBNAM2= <"">
##$SUBNAM3= <"">
##$SUBNAM4= <"">
##$SUBNAM5= <"">
##$SUBNAM6= <"">
##$SUBNAM7= <"">
##$SUBNAM8= <"">
##$SUBNAM9= <"">
##$SW= 24.0689170037331
##$SWIBOX= (0..15)
0 0 2 0 0 0 0 0 0 0 0 0 0 0 0 0 
##$SW_h= 4816.95568400771
##$TD= 16384
##$TD0= 1
##$TE= 0
##$TE2= 300
##$TE3= 300
##$TEG= 300
##$TL= (0..7)
0 120 120 120 120 120 120 120 
##$TP= (0..7)
150 150 150 150 150 150 150 150 
##$TP07= 0
##$TPNAME0= <>
##$TPNAME1= <>
##$TPNAME2= <>
##$TPNAME3= <>
##$TPNAME4= <>
##$TPNAME5= <>
##$TPNAME6= <>
##$TPNAME7= <>
##$TPOAL= (0..7)
0.5 0.5 0.5 0.5 0.5 0.5 0.5 0.5 
##$TPOFFS= (0..7)
0 0 0 0 0 0 0 0 
##$TUNHIN= 0
##$TUNHOUT= 0
##$TUNXOUT= 0
##$USERA1= <user>
##$USERA2= <user>
##$USERA3= <user>
##$USERA4= <user>
##$USERA5= <user>
##$V9= 5
##$VALIST= <valist>
##$VCLIST= <CCCCCCCCCCCCCCC>
##$VD= 0
##$VDLIST= <DDDDDDDDDDDDDDD>
##$VPLIST= <PPPPPPPPPPPPPPP>
##$VTLIST= <TTTTTTTTTTTTTTT>
##$WBST= 1024
##$WBSW= 4
##$XGAIN= (0..3)
0 0 0 0 
##$XL= 0
##$YL= 0
##$YMAX_a= 960151
##$YMIN_a= -974541
##$ZGOPTNS= <>
##$ZL1= 120
##$ZL2= 120
##$ZL3= 120
##$ZL4= 120
##$ABSF1= 10
##$ABSF2= 0
##$ABSG= 5
##$ABSL= 3
##$ALPHA= 0
##$AQORDER= 0
##$ASSFAC= 0
##$ASSFACI= 0
##$ASSFACX= 0
##$ASSWID= 0
##$AUNMP= <proc_1d>
##$AZFE= 0.1
##$AZFW= 0.1
##$BCFW= 1
##$BC_mod= 2
##$BYTORDP= 1
##$COROFFS= 0
##$CY= 11.3945322036743
##$DATMOD= 1
##$DC= 2
##$DFILT= <>
##$DTYPP= 0
##$F1P= 15.6554695791079
##$F2P= 12.8336369535428
##$FCOR= 0.5
##$FTSIZE= 0
##$FT_mod= 4
##$GAMMA= 1
##$GB= 0.15
##$INTBC= 1
##$INTSCL= 1
##$ISEN= 128
##$LB= 0.24
##$LEV0= 0
##$LPBIN= 0
##$MAXI= 10000
##$MC2= 0
##$MEAN= 0
##$ME_mod= 0
##$MI= 1.114404
##$NCOEF= 0
##$NC_proc= 0
##$NLEV= 6
##$NOISF1= 3.799351
##$NOISF2= 2.8
##$NSP= 1
##$NTH_PI= 0
##$NZP= 0
##$OFFSET= 15.70392
##$PC= 1
##$PHC0= -26001.46
##$PHC1= 16.18747
##$PH_mod= 1
##$PKNL= yes
##$PPARMOD= 0
##$PSCAL= 0
##$PSIGN= 0
##$REVERSE= no
##$SF= 200.130013532006
##$SI= 16384
##$SIGF1= 3
##$SIGF2= 2
##$SINO= 400
##$SIOLD= 16384
##$SREGLST= <1H.CDCl3>
##$SSB= 0
##$STSI= 0
##$STSR= 0
##$SW_p= 3612.71676300578
##$SYMM= 0
##$S_DEV= 0
##$TDeff= 0
##$TDoff= 0
##$TI= <>
##$TILT= no
##$TM1= 0
##$TM2= 0
##$TOPLEV= 0
##$USERP1= <user>
##$USERP2= <user>
##$USERP3= <user>
##$USERP4= <user>
##$USERP5= <user>
##$WDW= 1
##$XDIM= 8192
##$YMAX_p= 0
##$YMIN_p= 0
$$ End of Bruker specific parameters
$$ ---------------------------------
##NTUPLES= NMR FID
##VAR_NAME=  TIME,          FID/REAL,        FID/IMAG
##SYMBOL=    X,             R,               I
##VAR_TYPE=  INDEPENDENT,   DEPENDENT,       DEPENDENT
##VAR_FORM=  AFFN,          ASDF,            ASDF
##VAR_DIM=   8192,          8192,            8192
##UNITS=     SECONDS,       ARBITRARY UNITS, ARBITRARY UNITS
##FACTOR=    0.0002076,     1,               1
##FIRST=     0,             0,               0
##LAST=      1.7004516,     0,               0
##MIN=       0,             -974541,         0
##MAX=       1.7004516,     960151,          0
$$ Real data points
##PAGE= N=1
##DATA TABLE= (X++(R..R)), XYDATA
0@%%%%%Qj6J6k4L2m0O0p6Q4j00J28j61J97k34K74l19L76m49N26o02O87p89R06
$$ 0 0 0 0 0 0 8 -8 8 -16 16 -24 36 -40 44 -56 72 -89 108 -126 148 -171 205 -244 282 -320 367 -422 484
28D84j036J177j329J494j684J900k130K376k645K944l276L642m040M470m944N474
$$ 484 -552 625 -704 790 -894 1006 -1124 1252 -1393 1551 -1725 1917 -2123 2347 -2597 2877
44B877o064O716p436Q243r159J0200j1402J2802j4438J6395j8797K1805k5666
$$ 2877 -3187 3529 -3907 4336 -4823 5377 -6025 6777 -7661 8734 -10063 11742 -13924
57a3924L0773l7650M6095n3194R88051o92698q35101P79533m23503Q7291R88755
$$ -13924 16849 -20801 25294 -27900 960151 267453 -567648 211885 -211618 -124327 864428
68H64428r66785p96803J446847n2315j071848O55310J21459o28906Q64449l9447
$$ 864428 -102357 -899160 547687 495372 -576476 78834 200293 -428613 435836 396389
78C96389j126087Q17652O25774j166466J97882P12452p25264J49581N31291r40031
$$ 396389 -729698 87954 713728 -452738 -254856 457596 -267668 -118087 413204 -526827
88e26827J42424J058671p45655m45198R01564l43079m23741P35493l17579m42296
$$ -526827 -384403 674268 -71387 -516585 384979 41900 -381841 353652 36073 -406223
98d06223Q46150k77557q46321Q08253L48460p35619K76343J41992n07121O29365
$$ -406223 439927 162370 -683951 124302 472762 -262857 13486 155478 -351643 277722
108B77722K82750j020123J63535P79388m43647j33769K51528n50669J86231P59111
$$ 277722 560472 -459651 -296116 483272 39625 -94144 157384 -393285 -207054 552057
118E52057n67224m22480O08871j19741k44917M52780k67021l47527N78741o7338
$$ 552057 -15167 -437647 171224 51483 -193434 259346 -7675 -355202 223539 156201
128A56201n19130L86833J10516l85103L39347J13895m52487K67592K40451m08176
$$ 156201 -362929 23904 134420 -250683 88664 202559 -249928 17664 258115 -150061
138a50061J51767K55653l79390P9092K77859l73447k0387L51405j99186m0642
$$ -150061 1706 257359 -122031 -42939 234920 -138527 -158914 192491 -6695 -47337
148d7337K30029l04328p2121M21146j16644k28464J75983j27324r8696L05763
$$ -47337 182692 -121636 -193757 227389 110745 -117719 58264 -69060 -167756 138007
158A38007j21375k50444K66525L0795j98204J85303r443j98651K36165O8587k44622
$$ 138007 16632 -233812 32713 63508 -134696 50607 41164 -157487 78678 147265 -97357
169i7357J30463M1513k54027J74598J90169k23519K4603P8350k01989J64444K27384
$$ -97357 33106 74619 -179408 -4810 185359 -38160 -13557 64793 -137196 27248 254632
180B54632k86153n5917K18682j54522l3681J68248k02020k2613K78669j97031
$$ 254632 -31521 -87438 131244 -23278 -56959 111289 -90731 -113344 165325 -31706
190c1706j79062K81837k4529j46669J86136r2004j50392K90472m7322l24561K11566
$$ -31706 -210768 71069 46540 -100129 86007 -5997 -156389 134083 86761 -237800 -26234
201b6234J54566j99826J03038J1135k52120K37566K25990l12540l988K05808j95884
$$ -26234 128332 -71494 31544 42679 -209441 28125 254115 -58425 -62413 143395 -52489
212e2489K4709K03804k41176l9806K70612j91156j26916K80903r8366j69732K39045
$$ -52489 -27780 176024 -65152 -104958 165654 -25502 -152418 128485 30119 -139613 99432
223I9432n0314j72802K27839n3414k63849K30035J09366k48727R8182P7429k18857
$$ 99432 49118 -123684 104155 50741 -213108 16927 126293 -122434 -24252 53177 -165680
234a65680J50316J74162k44705L8858J98617k09021k5809K15622j43348n2420
$$ -165680 -15364 158798 -85907 -47049 151568 -57453 -83262 132360 -10988 -63408
244f3408J95770j57899j08105K48537n6257j62523J83728o524j51194J56030j4778
$$ -63408 132362 -25537 -133642 114895 58638 -103885 79843 73319 -77875 78155 63377
255F3377k02549J59869J00391k01101M3578P4320j63087Q5250J52564j63530r367
$$ 63377 -139172 20697 121088 -80013 -36435 37885 -125202 -39952 112612 -50918 -60285
266f0285J38270j33226k6505J71701q4433p1795J29581q0179q7692J59906j1689
$$ -60285 77985 -55241 -81746 89955 5522 -66273 63308 -16871 -104563 55343 43654
277D3654j08463J18970Q817j17241R1531L0890j14391P8699N7809j31150J7987
$$ 43654 -64809 54161 62978 -54263 37268 68158 -46233 32466 90275 -40875 -22888
288b2888O4992r3220K6731R2660q6495k1006P7171o6857k0825R8013m0015n7192
$$ -22888 42104 -51116 -24385 68275 -18220 -39226 37945 -28912 -49737 48276 8261 -48931
300d8931N9455l2256m7000P8580K03n8722N6219J5218n3639M1132K3162m7644
$$ -48931 10524 -21732 -68732 9848 10051 -48671 7548 22766 -30873 10259 33421 -14223
312a4223L4855L1104n7657J552K8637l8170J0573M2616l0896j2582K7214k6912
$$ -14223 20632 51736 -5921 -4369 24268 -13902 -3329 39287 8391 -4191 23023 -3889
324c889p851M0740j2950k4523J4453j8919k3468K5237K033j5711J9773N95k2403
$$ -3889 -11740 29000 16050 -8473 5980 -12939 -36407 -11170 -9137 -24848 -5075 -4480 -26883
337b6883J2769J1359p118J9568R579k3116m258M285q789J4168J9038q277n836
$$ -26883 -14114 -2755 -9873 9695 19274 -3842 -8100 -3815 -12604 1564 20602 12325 6489
350F489J033r829P467K2735J932p375p552j9052r050J2179O393J84k325j5738
$$ 6489 7522 -2307 5160 27895 29827 22452 14900 -4152 -13202 -1023 5370 5554 3229 -12509
364a2509j3492P397J1922Q798N863r014j5842m065M182O062R040J889q261m311
$$ -12509 -26001 -18604 -6682 2116 7979 -1035 -16877 -20942 -16760 -10698 -1658 231 -8030 -12341
378a2341J424M706J1190J1579L881k255o831p938J49Q197P041L42q812j2990o407
$$ -12341 -10917 -6211 4979 16558 20439 18184 11353 3415 3564 11761 18802 19144 10332 -2658 -9065
393i065N270J1585P868l174j2908j1336m88O136N193k568r003p152p78L679N053
$$ -9065 -3795 7790 15658 12484 -424 -11760 -12248 -6112 -919 -3487 -12490 -19642 -20420 -16741 -11688
408a1688K451J722L627N260K232l035k723K245O577Q135J62j0615q376K537R296
$$ -11688 -9237 -7515 -3888 1372 3604 569 -2154 91 6668 14803 14965 4350 -4026 -1489 7807
423G807J1579M610j0936j1854M00L677L799L411q806j3722o1J075n238M213K365
$$ 7807 19386 23996 13060 1206 1606 5283 9082 12493 3687 -10035 -10096 -9021 -14259 -10046 -7681
438g681m367P363M902j3513l298R999J464R466Q453k0585j4159J4098P812Q725
$$ -7681 -12048 -4685 217 -13296 -16594 -6595 -5131 4335 12788 -7797 -21956 -7858 -46 8679
452H679J7505j4041k1702J2989P992j358J9206n412l0366M760P881j4478J2610
$$ 8679 26184 12143 -9559 3430 11422 10064 29270 23858 -6508 -1748 6133 -8345 4265
465D265J0571k4595K790J4886k3988j616K6022j1947l149J8082k9266k0936L3806
$$ 4265 14836 -9759 -6969 7917 -16071 -17687 8335 -3612 -6761 11321 -17945 -38881 -5075
478e075N134j0131K2957j6570l1859L3376K0463j7999K0618J142m0444J8253K8355
$$ -5075 59 -10072 12885 -3685 -35544 -2168 18295 296 20914 22056 -18388 -135 28220
491B8220k9070N575K0030l3341M598L3963l2912j3373L9133j4396j4119K8376
$$ 28220 -850 4725 24755 -8586 -3988 29975 -2937 -16310 22823 8427 -5692 22684
503B2684k9700l0781M3576K266l1307K5589o810l8061L3965K0746l1449K2226
$$ 22684 -7016 -37797 5779 8045 -23262 2327 -4483 -42544 -8579 12167 -19282 2944
515B944J4549m4840J5414L6868k9217k57K2082l3751Q189M6630l1855k7078L3933
$$ 2944 17493 -27347 -11933 24935 -4282 -4539 17543 -16208 -8019 38611 6756 -20322 13611
528A3611j919K0L2122l7296m2270M0625J7452k0034J3247k0865l7973L5370K2773
$$ 13611 11692 11712 43834 6538 -35732 4893 22345 2311 15558 -5307 -43280 -7910 14863
541A4863k5178J1890K575l2940J8550K3377k4953M216J1677k5238J3039K5195
$$ 14863 -10315 1575 4150 -28790 -10240 13137 -11816 -7600 4077 -21161 -8122 17073
553A7073k9348o310K5712m321J3945J6547l9102j2413L5251j795j025J3904l5655
$$ 17073 -12275 -18585 7127 2806 16751 33298 -5804 -18217 17034 15239 14214 28118 -7537
566g537j7608L0456o013R24L4973k9910m0646K7937R501J349K9502m2357n1187
$$ -7537 -25145 5311 -702 222 35195 5285 -35361 -7424 2077 3426 32928 -9429 -60616
579f0616N6398K8921m1010N796p194j9119O9016J1786q8294J5795N8445k4638
$$ -60616 -4218 24703 -16307 -10511 -17705 -36824 32192 43978 -44316 -28521 29924 5286
591E286J5249J0116p6115K4681P4356n9709j6242O8329m5547k7507O5044l8154
$$ 5286 20535 30651 -45464 -20783 53573 -6136 -22378 45951 404 -27103 37941 -213
603b13k3850Q5657m7412q1981Q5673J1377p3141N6040j511p9260Q3673L7465j12855
$$ -213 -24063 61594 14182 -67799 17874 29251 -43890 12150 10639 -68621 15052 52517 -60338
616f0338M1633O7702r1781K8246P8641j00401n878R0078q3168l661J27361q6112
$$ -60338 -18705 48997 -42784 -14538 64103 -36298 -42176 47902 -35266 -38927 88434 2322
628B322q2183J20492j1089n6353R6956n6162j05134J43839L0183j53456N5072
$$ 2322 -79861 40631 29542 -26811 70145 13983 -91151 52688 82871 -70585 -15513
639a5513N5230r0317Q1111M1416j68687N0868J44003j15771k3807J00843j05464
$$ -15513 39717 -50600 30511 71927 -96760 -45892 98111 -17660 -41467 59376 -46088
650d6088j3506J40125j03663o8291J62414m9731j12672J28755j0733r9202J38076
$$ -46088 -59594 80531 -23132 -91423 70991 21260 -91412 37343 26610 -72592 65484
661F5484O16j61550J06282O9250j43208O7153P5110j51719M9457J25734j43428
$$ 65484 66100 -95450 10832 80082 -63126 4027 79137 -72582 -23125 102609 -40819
672d0819j2726J34344j00917k0070J43526j18396r5695J64902k0500r5459J10818
$$ -40819 -53545 80799 -20118 -40188 103338 -15058 -110753 54149 33649 -61810 49008
683D9008m9876j21663J59475M5111j55055O8790N4457j20670Q0541P7339j56150
$$ 49008 -868 -122531 36944 82055 -73000 -4210 50247 -70423 10118 87457 -68693
694f8693K6100J24691j11156j0856J12901j02281k9703J44605o7184p5739J17969
$$ -68693 -42593 82098 -29058 -39914 72987 -29294 -58997 85608 18424 -57315 60654
705F0654m1557q5759J19238j3293j14785R8203K7181j19871O3078N1006r5687
$$ 60654 19097 -66662 52576 39283 -75502 22701 49882 -69989 -6911 44095 -51592
716e1592O0972N8738j32950J6247J16646p0604k9456N7711p2930O402J20870p4865
$$ -51592 9380 68118 -64832 -48585 68061 -2543 -31999 25712 -47218 -40816 80054 5189
728E189r0581R6457K1155l7056N2571m6964p3978J03228L9462r3281J5081K6088
$$ 5189 -85392 11065 32220 -4836 47735 771 -73207 30021 69483 -23798 -8717 17371
740A7371n2025M1537L6444p1065J6459N4174n5431p834N0229l6038j3708M2202
$$ 17371 -34654 6883 43327 -27738 -11279 42895 -12536 -20370 29859 -6179 -19887 22315
752B2315l1139k0659L9924k2026k1982M7545j511l0846K0854J123j4868K2494
$$ 22315 -8824 -29483 10441 -11585 -33567 13978 12467 -18379 2475 3598 -11270 11224
764A1224l473j9820K5119K035l4659K044J9367J5156J5155k8641l4743K8189L3838
$$ 11224 7751 -12069 13050 15085 -19574 -17530 1837 16993 32148 3507 -31236 -3047 30791
777C0791o003j5530k7972m650M2492j152m2287N736J7089m91J9336j6974l8718
$$ 30791 24788 9258 -18714 -23364 19128 17976 -24311 -18575 -1486 -1977 17359 385 -38333
790c8333L6288L1165l5369K407R362l4631K0841L2306m1912M939M1423l9474o914
$$ -38333 -2045 29120 -6249 -3842 5520 -29111 -8270 24036 -17876 -12937 28486 -10988 -17902
803a7902N0435k8922j7348N0861l0934l4750N5351j6497m6195N6780o06n8188
$$ -17902 32533 3611 -13737 37124 6190 -28560 26791 10294 -35901 20879 20273 -37915
815c7915M7931J7957o0425L8018K6949o9053L2366N1038p7335m874O0061m6379
$$ -37915 10016 27973 -32452 5566 32515 -36538 -4172 46866 -30469 -35343 24718 -21661
827b1661K043O3817o5956l0247R0890k1498m9712O2691k0039n1434P4782n115
$$ -21661 -19618 44199 -21757 -52004 38886 17388 -32324 30367 10328 -41106 33676 28561
839B8561q2546O0176L4607p2327L7293L2880p7897L3226O3568p5287R69O6461
$$ 28561 -53985 6191 40798 -31529 5764 38644 -39253 -6027 57541 -17746 -16777 49684
851D9684o8558k1209P7441m3106l1086P4560m1160n4692Q2446k428o2870O3244
$$ 49684 -18874 -40083 37358 -5748 -36834 37726 -3434 -58126 24320 21892 -40978 22266
863B2266M979p4647N2478K6935p4212M0074M5774p8283J4714O0681o0370J939
$$ 22266 27245 -47402 5076 32011 -42201 -2127 43647 -34636 -19922 40759 -19611 -17672
875a7672O7538n4255j8641O9511m7054m0943P4745j5541n0649N4583j3542n6526
$$ -17672 49866 -4389 -23030 46481 -573 -41516 33229 17688 -32961 21622 8080 -48446
887d8446O4591J7909o6440L5852K6234o3196K4462M0657n7397J0289M6337n5475
$$ -48446 16145 34054 -32386 3466 29700 -33496 -9034 31623 -25774 -15485 30852 -24623
899b4623o451O0174l4615k0132N4119k3675k7607N0226j7331m0733M9500M310
$$ -24623 -31074 29100 -5515 -25647 28472 4797 -22810 27416 10085 -30648 18852 23162
911B3162m7474K9480J1700m0870K8343K2750m4137J4247L1557l9606j392L2899
$$ 23162 -24312 5168 16868 -24002 4341 27091 -17046 -2799 28758 -10848 -12240 20659
923B0659k8734o554L2098k5234j6997L4985j1485k0853L2230j132k4082K1671
$$ 20659 -8075 -14629 17469 -7765 -24762 10223 -1262 -22115 10115 8983 -15099 6572
935F572P69k5037K1364J1341k6620Q981J2405k2931O916K1440j4331J15J4514
$$ 6572 7341 -17696 3668 15009 -11611 -2630 9775 -13156 -6240 15200 869 984 15498
948A5498j7749m727K1011p215j1145J1913o660j1124J0999j819q754J5210L376
$$ 15498 -2251 -6978 14033 6818 -4327 7586 926 -10198 801 -1018 -9772 5438 8814
961H814j4807J178M003m782Q481M025j2647k660M770m853L455R368j439k331K33
$$ 8814 -5993 -4815 -812 -5594 2887 6912 -5735 -8395 -3625 -8478 -5023 4345 2906 575 808
976H08l502J953Q553M55m293k246l379j208L186K342O96j16k894j258R60J920
$$ 808 -2694 -741 7812 8267 3974 1728 -1651 -2859 327 2669 3365 3249 355 -903 57 1977
992A977J071l03l200j491j097l740M88L770O03Q27l94l783R48O421R26j618J404
$$ 1977 3048 2745 -455 -1946 -3043 -6783 -6295 -2525 -1922 -1095 -1489 -5272 -4324 2097 3023 1405 2809
1009B809l264k541L001N64m25L870r26m736L267L131j582J833m85m966J782J878
$$ 2809 -455 -2996 5 569 144 4014 3088 -1648 1619 4750 3168 5001 4516 -450 1332 3210
1025C210m811k180J890j744J805L886l258m051K293P63J895M626k938o686k60
$$ 3210 -1601 -3781 -1891 -3635 -1830 2056 -1202 -5253 -2960 -2197 -302 4324 1386 -5300 -5560
1040e560J740J904M694K02n473q44L286J728L085J333l581j909J149q34o61J003
$$ -5560 -3820 -1916 2778 2980 -2493 -3337 -51 1677 4762 6095 2514 605 1754 920 259 1262
1056A262r10N1J978j528k827r3J883K564K154k735o399k863K548M748L251k017
$$ 1262 352 403 2381 853 -1974 -2067 -184 2380 4534 1799 -4600 -7463 -4915 -167 3084 1067
1072A067o097l178K882O224M419pn384m106J065M405K714k81l275k343M02K760
$$ 1067 -5030 -8208 -5326 898 5317 5310 -74 -4180 -3115 1290 4004 3723 448 -1895 -1493 1267
1088A267J299J92m08l15O95k76k160j748M62J255J240q37m135k065K445K975K361
$$ 1267 2566 2758 2350 2035 2730 2454 294 -1454 -992 263 1503 666 -3469 -5534 -3089 -114 2247
1105B247q74l690k692K762K463J042l44k471k492K768L385p50N29n10j991L074
$$ 2247 1373 -2317 -5009 -2247 216 1258 914 -1557 -4049 -1281 2104 1354 1883 1373 -618 2456
1121B456K326l064q13K19j547J716K735l428l045J714l97M13M039k653m422K506
$$ 2456 4782 1718 905 1124 -423 1293 4028 600 -2445 -731 -1128 -715 3324 671 -3751 -1245
1137a245p3j933L724J03m447K072J595l555J911L861k274J373K293n101j725N673
$$ -1245 -1318 -3251 473 576 -3871 -1799 -204 -3759 -1848 2013 -261 1112 3405 -1696 -3421 2252
1153B252K84o46K823n083l930N721K263j916K072k255n463L306K422k894J993
$$ 2252 2536 1890 4713 -370 -4300 1421 3684 1768 3840 1585 -3878 -572 1850 -1044 949
1168I49J130m763K38K503l653J595M588j908k186L19l035M94O067R91l739n21
$$ 949 2079 -2684 -2446 57 -3596 -2001 2587 679 -1507 -1188 -4223 -3729 2338 3329 -410 -931
1184i31j217p64L938K449k70j256l052j847K168M891Q47l793m582P67M113J979
$$ -931 -2148 -2912 1026 3475 3205 1949 -1103 -2950 -782 4109 4956 1163 -3419 -2652 1461 3440
1200C440n49l800l461M471L575m144k273J164j738L717L761p239k383O546j551
$$ 3440 2891 -909 -4370 101 3676 -468 -2741 -1577 -3315 402 4163 -3076 -5459 1087 -464
1215d64r22O398n162o412Q558N91o154P932j425j0389R100N960j0790M591N347
$$ -464 -1386 5012 -150 -6562 1996 2587 -3567 4365 2940 -7449 1651 7611 -3179 1412 6759
1230F759j2515M650J1182j2957j233J1333j2948k889J8875p845j1290J3191p214
$$ 6759 -5756 -1106 10076 -2881 -4114 7219 -5729 -8618 10257 2412 -8878 4313 -2901
1243b901q794K3662k674k3340J2097N957j4189J6283N622k7400J0712J9851k1269
$$ -2901 -11695 11967 9293 -14047 -1950 4007 -10182 6101 11723 -15677 -4965 14886 -6383
1256f383J690J8693k1072J121K5271k2377j2326K8656j0665j5274K6447r926k3646
$$ -6383 -4693 14000 -7072 -5951 19320 -3057 -15383 13273 2608 -12666 13781 3855 -19791
1269a9791K9207J431k8375K4283Q737l2836J5512J5553l0798J4416K5167l6171
$$ -19791 9416 10847 -17528 6755 15492 -17344 -1832 13721 -17077 -2661 22506 -13665
1281a3665j162L0920k3698k612L3522k6907j7821L8581j1816k3557L3010p383
$$ -13665 -14827 16093 -7605 -10217 23305 -3602 -21423 17158 5342 -18215 14795 7412
1293G412l0489L3430M750l7192K4744J5863l5380J8393K0739m0283Q283L4096
$$ 7412 -23077 10353 15103 -22089 2655 18518 -16862 1531 22270 -18013 -9730 24366
1305B4366l1858m744L1126k8774q575M1465k1046k4718L7076p142k6332L2927
$$ 24366 -7492 -12236 18890 -9884 -18459 23006 1960 -22758 14318 7176 -19156 13771
1317A3771l384l4420L1481J0674l9838J9034K0646l3368J2671K2556l5523O205
$$ 13771 10387 -24033 7448 18122 -21716 -2682 17964 -15404 -2733 19823 -15700 -9495
1329i495L5438k9422j1921L2048j9301j2008L4049j7897k4815L5202j226k8579
$$ -9495 25943 -3479 -15400 16648 -2653 -14661 19388 1491 -23324 11878 10652 -17927
1341a7927K4949L742k7554K2247J1672l4317J1840K0829k6003M842K0801k6348
$$ -17927 7022 10764 -16790 5457 17129 -17188 -5348 15481 -10522 -5680 15121 -11227
1353a1227k952K8973j4783r111K2480j4145j4606K6736k164k0878J5582J648j7066
$$ -11227 -14179 14794 11 -9100 13380 -765 -15371 11365 9201 -11677 3905 5553 -11513
1366a1513J4695N805k0431J0455J4886j7270k583J2237q769J056J1651j3907q087
$$ -11513 3182 8987 -11444 -989 13897 -3373 -5956 6281 -2488 -1432 10219 -3688 -11775
1379a1775J6315n11j0898O096J978l975P093n26j1545N474J1773o315q189K557
$$ -11775 4540 4029 -6869 -773 1205 -2770 4323 3797 -7748 -2274 9499 3184 -5005 -2448
1393b448O2O29O663k731q607N280O918o660k87P755n721n567P459k268n637Q715
$$ -2448 -2386 -1757 4906 2175 -6432 -1152 5766 -894 -1181 6574 853 -4714 2745 477 -5160 3555
1409C555j781j1286J1115O713j4475L459J0875j0323Q70R883j5501j227K0801
$$ 3555 1774 -9512 1603 8316 -6159 -2700 8175 -2148 -1278 8605 -6896 -8123 12678
1422A2678j2229j3822J7927j535j1916J7226l041j8863K0109O596k6223J1143
$$ 12678 449 -13373 4554 3019 -8897 8329 5288 -13575 6534 13130 -13093 -1950
1434a950J5946k2929M177J5538k2699L841K7144k2676j0317K8082j2670j4410
$$ -1950 13996 -8933 -4756 10782 -11917 -8076 19068 -3608 -13925 14157 1487 -12923
1446a2923K7400r870k2240K7082j676k7518K4495R238l1742J7189J7932l0479
$$ -12923 14477 4607 -17633 9449 7773 -19745 4750 13988 -17754 -565 17367 -13112
1458a3112R340K2852k9606K697K8887k8919r869L4854j6641j7286L1790j2040
$$ -13112 -3772 19080 -10526 -7829 21058 -7861 -17730 17124 483 -16803 14987 2947
1470B947k2664L2870k486l0053K9715O676l8572J8472K0788l1093J0923J9226
$$ 2947 -19717 13153 10667 -19386 10329 17005 -21567 -3095 17693 -13400 -2477 16749
1482A6749l5215Q379L6002l1782j1329L5708j6465j5676K9003j7421j8913L9593
$$ 16749 -18466 -10087 25915 -5867 -17196 18512 2047 -13629 15374 -2047 -20960 18633
1494A8633p324l8199K8726J4043k9227J7515Q496l1648K1935K2359m1015J390
$$ 18633 11309 -26890 1836 15879 -13348 4167 12663 -18985 2950 25309 -15706 -14316
1506a4316L4589k2939q949K3222k0993m172L5540j9395k5902L5187J215k8464
$$ -14316 20273 -2666 -11615 11607 -9386 -13558 21982 2587 -23315 11872 13087 -15377
1518a5377K0075M212k3009K1155M137l4235J9964K6462l1002m583K2890j3787
$$ -15377 4698 8910 -14099 7056 11193 -23042 -3078 23384 -7618 -12201 10689 -3098
1530c098J795J8732k5928o929L4964j2853k7618K2270N950j3462J3585p473k0111
$$ -3098 -1303 17429 -8499 -15428 19536 6683 -20935 1335 7285 -6177 7408 -65 -20176
1543b0176K8906J2974l3903J328K0368j1099J484P874k1785N824K6423j8411j6052
$$ -20176 8730 21704 -12199 -10871 9497 -1602 -118 7756 -14029 -8205 18218 -193 -16245
1556a6245K2308Q92j0823J1363p550j1048K0773l58k3465J1344J3343j5245N75
$$ -16245 6063 6955 -3868 7495 -55 -11103 9670 9312 -14153 -2809 10534 -4711 -4136
1569d136Q590j0200P247J1012j7989l878J8864o577j0217J0085k608o663R637
$$ -4136 4454 -5746 1501 12513 -5476 -9354 9510 2933 -7284 2801 193 -6470 3167
1582C167l764q178J4411L924j6730K019J0839m391J282R85j1621L094J3404p950
$$ 3167 -597 -8775 5636 9560 -7170 -5151 5688 1297 2579 3564 -8057 -4963 8441 491
1596D91p479Q896N66m714N349j723m641P938O01j0361K794O078o200J89M117l997
$$ 491 -6988 1908 2474 -2240 3109 1386 -3255 4683 5284 -5077 -2283 3795 -2405 -2216 1901 -2096
1612b096K22N182m892j575P337j586n615L243P10m770L344K604m574K139J784
$$ -2096 -1874 3308 -1584 -3159 4178 2592 -3023 220 930 -3840 -496 2108 -2466 -327 1457
1627A457n385K476Q430l635n089K339o11o40M636l016n539M349J979n054K598
$$ 1457 -3928 -1452 6978 3343 -1746 593 -18 -658 3978 962 -4577 -228 1751 -3303 -705
1642g05M050l166m41J599m084J788N286m889m467M775J98k983L768o56k960M705
$$ -705 3345 179 -262 1337 -2747 -959 4327 -562 -5029 -254 -56 -3039 729 73 -2887 1818
1658A818J019m864K812L219m838l00L097l054l21L361l336o38N890j520m923L776
$$ 1818 2837 -2027 785 4004 -834 -1134 1963 -1091 -1412 1949 -1387 -2025 3865 2345 -2578 1198
1674A198Q21k289K435k085m387L248K658l915N53K606l131L16L854j504QK463
$$ 1198 2019 -270 2165 80 -4307 -1059 1599 -2316 -1763 843 -2288 -1972 1882 378 386 2849
1690B849m361j937M396Q19k051L11j231k183M421K103k614N70J078k831J028J736
$$ 2849 -1512 -3449 947 1766 -285 26 -1205 -3388 1033 3136 522 1092 2170 -661 367 2103
1706B103j721n33J288k927o28K781j46p91J983m25k006J251k20j081J964j0k746
$$ 2103 382 -151 1137 -1790 -2418 363 217 -574 1409 984 -1022 229 9 -1072 892 882 -1864
1723a864m44P99j38J787J908j606p53N97n13R18J812j243j446m40l32l4J731Q67
$$ -1864 -2308 -1509 -1647 140 2048 442 -311 286 -227 691 2503 1260 -186 -626 -958 -992 739 1606
1741A606q34l27j51p83J085Q61j55j177j145j022N9J077P18n94Q9o15O6J752N03
$$ 1606 772 445 294 -489 596 1457 1302 125 -1020 -2042 -1983 -906 -188 -782 -693 -1308 -1242 510 1013
1760A013o74r63j82L77Q79L01j112j45L77R74Q45K36j569m57Q86J079l21o80j185
$$ 1013 339 -624 -806 -429 450 751 -361 -506 -129 845 1690 1926 357 -100 786 1865 1544 864 -321
1779c21r44Q05Q10l48l65q80J58J384L34j094n73L3M66J160p5k357j241J949J680
$$ -321 -1265 -460 350 2 -363 -1243 -1085 299 633 -461 -1034 -1001 -535 625 550 -1807 -3048 -1099 581
1798E81J672k06k863j332K091K312J220q59l272k125J652K855N89p61j649j725
$$ 581 2253 2047 -816 -2148 -57 2255 3475 2616 -656 -2781 -1129 1726 2315 1554 -95 -1820
1814a820J014K488j22q72l47j334j52J099r13j195J398P15k87K92j152j102K342
$$ -1820 -806 1682 1560 688 341 -993 -1145 -46 -959 -2154 -756 -41 -328 -36 -1188 -2290 52
1831E2K622p04j558j727j649J826L832l2j855j371j454J294M439P83l641j649
$$ 52 2674 1970 412 -1315 -2964 -1138 2694 2662 807 -564 -2018 -724 3715 4498 857 -792
1847g92J41n04K419Q18l306q96J933K4n06J240j934m35L253j16k892M52m47p61
$$ -792 -651 -1155 1264 2082 -1224 -2120 -187 -163 -669 571 -1363 -1798 1455 1339 -1553 -1101 -1548 -2309
1865b309L262J429l897j35K255j020J443K682l540j506L317p93j252K552k047
$$ -2309 953 2382 -1515 -1650 605 -415 1028 3710 170 -1336 1981 1188 -64 2488 441
1880D41l143L936J404l698J796O42m434L615L833n404j552K140l019J133O234
$$ 441 -2702 1234 2638 -1060 736 1378 -3056 559 4392 -1012 -2564 -424 -3443 -2310 3924
1895C924m354m223M103o00j235O276j500o519M474K550n274L058K047n998L963
$$ 3924 -430 -4653 -550 -1150 -2385 3891 2391 -4128 346 2896 -2378 680 2727 -3271 692
1910F92N297p678j331O627k953l40O202o854n630P850j055m212P886j609r801
$$ 692 5989 -1689 -3020 3607 654 314 6516 -338 -5968 1882 827 -3385 4501 2892 -6909
1925f909N186L464m886N945K836j1959J267Q997n422p25O722p466j623R687n582
$$ -6909 -1723 1741 -3145 2800 5636 -6323 -5056 3941 -1481 -2206 4516 -2950 -4573 5114 -468
1940d68n942J1632q90q108P162m70q212P804K468r781O473N676j2669k53J0558
$$ -468 -6410 5222 4332 -3776 3386 2916 -5296 2508 4976 -4805 1668 7344 -5325 -5578 4980
1955D980m501L03N684j2698j861J5497l982j0934Q227l36o107Q830j548j0170
$$ 4980 479 782 6466 -6232 -8093 7404 3422 -7512 715 379 -5728 3102 1554 -8616
1969h616J0382N756j3845K752R774p633l68N955q984L063J2735j1621j0052J4455
$$ -8616 1766 7522 -6323 -3571 6203 -1430 -1798 4157 -4827 -1764 10971 -650 -10702 3753
1983C753K959p197M374n139o132J4533J052j7430N509J0954q396j612L941p622
$$ 3753 6712 -485 3889 -1250 -7382 7151 8203 -9227 -3718 7236 -1160 -2772 1169 -6453
1997f453N467J0856j3934n752J5570k447j0213N945N59k241J0055o277j5319J4079
$$ -6453 -986 9870 -4064 -9816 5754 3307 -6906 -961 -402 -2643 7412 1135 -14184 -105
2011a05J2820j1864l270M288n695O128P122j3730j485J5418o476j1407Q722J548
$$ -105 12715 851 -2419 1869 -3826 2302 9424 -4306 -5791 9627 3151 -8256 466 2014
2025B014l219P498n841j0857J3386N394j5911J637J0926n278n49J163j1057O281
$$ 2014 -1205 6293 452 -10405 2981 8375 -7536 -5899 5027 -251 -800 363 -10694 -4413
2039d413J8294r925j4549R279L312k175O734n598j0024J2640M513j5115L010J1466
$$ -4413 13881 3956 -10593 -1314 1998 -177 6557 959 -9065 3575 8088 -7027 -4017 7449
2053G449o473l75L400j0270L894J4374j1342j0869J2608K125p892M446m562n543
$$ 7449 976 601 4001 -6269 -2375 11999 657 -10212 2396 4521 -3371 1075 -3487 -9030
2067i030J6055K967j9332J703J2071n214J796L934j3047L019J4804j0630q689
$$ -9030 7025 9992 -9340 -7637 4434 -780 1016 4950 -8097 -5078 9726 -904 -9593
2080i593J4811n32q860P583k569o537J4286o21j8909Q799J3816j1875l238M172
$$ -9593 5218 4686 -4174 3409 840 -5697 8589 7968 -10941 -2142 11674 -201 -3439 733
2094G33q131Q626J3699j8550j0330J9082L45r649O767m588o464J5110l658j8445
$$ 733 -7398 1228 14927 -3623 -13953 5129 5474 -4175 2592 -1996 -8460 6650 2992 -15453
2108a5453J4275J3368j5170j728O510p535Q755R034j9528k415K2315o346j4939
$$ -15453 -1178 12190 -2980 -4708 1802 -5733 3022 12056 -7472 -9887 12428 6082 -8857
2121h857Q879L55j522J3668j0007j8411J7875J2076j7424N01O891r222N545O150
$$ -8857 22 377 -1145 12523 2516 -15895 1980 14056 -3368 -2867 4024 -5198 347 6497
2135F497j7725M784K0887j3584j4275J3869O39l212J1389j0922j2681K0504L888
$$ 6497 -11228 -6444 14443 859 -13416 453 1092 -2120 9269 -1653 -14334 6170 10058
2148A0058k0216O128J0793q765N133K670j7141Q871J9353j6127r008J4110n140
$$ 10058 -10158 -4030 6763 -2002 3131 5801 -11340 -2469 16884 757 -8251 5859 719
2161G19m633J1599r431q391J9071k342j8611J1232O759j0918P303K801j5693Q609
$$ 719 -3914 7685 -1746 -10137 8934 6592 -12019 -787 5972 -4946 2357 5158 -10535 -1926
2175a926J2515j7562j698J6003p925m396J0625r288l726J8412n990j5240J3271
$$ -1926 10589 -6973 -8671 7332 -593 -4989 5636 -3652 -7378 11034 5044 -10196 3075
2188C075L429j2047Q207J700j2944J1534Q261j7934J496J3858r099k014R606j0500
$$ 3075 6504 -5543 2664 4364 -8580 2954 11215 -6719 -5223 8635 -464 -2478 7128 -3372
2202c372k159J4085r520j1124J5716J695j1092O007j453q457J4476N122j8165
$$ -3372 -5531 8554 -966 -12090 3626 5321 -5771 236 -1217 -9674 4802 9924 -8241
2215h241L185J1487r601O01P825j0016J638J3113j1388p852J4743L19p906P444
$$ -8241 -5056 6431 -3170 -2569 5256 -4760 -3122 9991 -1397 -9249 5494 5813 -2093 5351
2229E351l341q498J1194P81j3249P751Q196j1804l93O091o837M793Q784j2647
$$ 5351 2010 -6488 4706 5487 -7762 -11 8185 -3619 -4012 2079 -4758 35 8819 -3828
2243c828m306J2523m045o005Q223k489n492Q264k749q270J1074M929j0581J523
$$ -3828 -8134 4389 344 -5661 2562 73 -5419 2845 96 -8174 2900 7829 -2752 -1229
2257a229M997o461M141M785r391R60Q933p023n197Q674j075k903N217m719n332
$$ -1229 3768 -2693 1448 6233 -3158 -2198 6735 -288 -5485 3189 2114 -789 4428 -291 -5623
2272e623Q922P38r366L103M545n022K034J310p065M056Q078o144k844N179k501
$$ -5623 3299 4037 -5329 -2226 2319 -2703 -669 641 -6424 -2368 5710 -434 -3278 1901 -600
2287f00j715N597k593l566N104q47n498N250K751m725J966J920l892K011K869
$$ -600 -2315 3282 689 -2877 2227 1380 -4118 1132 3883 -842 1124 3044 -848 1163 4032
2302D032n966n59N839k158l121J876k308r09N719n7m160J169k18l239L781L388
$$ 4032 -1934 -2493 3346 1188 -1933 -57 -2365 -3274 2445 2388 -1772 -603 -821 -4060 -279 3109
2318C109l471j428L97k424K584M807k494k479K457j56o63K037p67k641L001J031
$$ 3109 -362 -1790 -1393 -3817 -1233 3574 1080 -1399 1058 902 239 2276 1509 -1132 1869 2900
2334B900l756k01J296j310K611K586m022k328J592m76J023K810k105m582Q86J118
$$ 2900 -856 -1057 239 -1071 1540 4126 104 -2224 -632 -1108 -85 2725 620 -3962 -3076 -1958
2350a958P14K953l84m464O51K725o5P41Q93k798m60L186r16j486J344m91J92K679
$$ -1958 -1244 1709 1325 -3139 -2488 237 172 913 1806 -992 -1452 1734 818 -668 676 185 377 3056
2368C056p32k830L35J378j44J705j060m196j35K405N89j51n9k529j53K904M67
$$ 3056 2324 -506 -171 1207 1063 2768 1708 -2488 -2623 -218 371 220 161 -2368 -2521 383 850
2385H50j518K12j019j67K340l07k205k03J471O73K166L59l293p15K256J055R22
$$ 850 -668 -456 -1475 -1642 698 391 -1814 -2017 -546 127 2293 2652 -641 -1356 900 1955 2877
2402B877l51l176j337K184J452m00l58j508j032J847J176j523l83K05n88J071
$$ 2877 2526 -650 -1987 197 1649 1249 891 -617 -1649 198 1374 -149 -532 -327 -915 156
2418A56l36k460o03K095J725P63j017k595r22K997K888J69j885k882j121L115
$$ 156 -180 -2640 -3243 -1148 577 1340 323 -2272 -3194 -197 2691 2860 975 -1907 -3028 87
2434H7K626J49j840j752o22K156J814n22j500l72m32N74K61j512j018O54J400
$$ 87 2713 2862 1022 -730 -1352 804 2618 2096 596 224 -208 366 627 -885 -1903 -1249 151
2451A51K82j112j709n41K555K447o38j992k416O1K446K538n09j942j400M29K666
$$ 151 433 -679 -2388 -2929 -374 2073 1435 -557 -2973 -2912 -466 2072 1563 -379 -1779 -1350 1316
2468A316J988j013j885l79M80J364N97j984j791Q22J333L45l19k202j141J802
$$ 1316 3304 2291 406 27 507 1871 2468 484 -1307 -485 848 1193 874 -1328 -2469 -667
2484f67K346k57j785k075j107K229K140o08j811o77K84J765K160j208j182J76
$$ -667 1679 1422 -363 -2438 -3545 -1316 824 216 -1595 -2272 -1988 -223 1937 729 -453 -277
2500b77P26J066M14j941j441J907J706K4j133j828j517K957K597o86j780k159
$$ -277 449 1515 1929 -12 -1453 454 2160 2184 1051 -777 -2294 663 3260 2574 794 -1365
2516a365j483J950K778o36k380j399l72J349K247J00j673j66l54R89J132j117
$$ -1365 -2848 -898 1880 1244 -1136 -2535 -2907 -1558 689 789 -884 -1050 -1404 -415 717 -400
2532d00j212J010J672Q73k031j768Q84K480K294o68k866k558J736K403R10n37
$$ -400 -1612 -602 1070 1943 -88 -1856 -972 1508 3802 3134 268 -2290 -554 1849 2759 2222
2548B222k274k684Q48K085J366J22j519k913J31L600J43k140p04o54R13L348k205
$$ 2222 -52 -2736 -1888 197 1563 1685 166 -2747 -2616 984 1127 -1013 -1717 -2371 -1458 1890 -315
2565c15l260K261K558l79J122r02l816K393L579k831R86J190m913l2N067r30m78
$$ -315 -3575 -1314 1244 865 1987 1085 -2731 -338 3241 410 1396 2586 -2327 -2359 2708 1778 1300
2582A300J978n479j080P279j194n625K243k28k130N948j740p698M685M455m627
$$ 1300 3278 -2201 -3281 3998 2804 -2821 -578 -806 -2936 3012 1272 -6426 -1741 2714 -1913
2597a913K239K513p168J349O212m915J393N506p451l412Q929r25k667N400m952
$$ -1913 326 2839 -4329 -2980 3232 -1683 -290 5216 -2235 -5647 3282 2357 -310 5090 138
2612A38n524J0150p2r373N931K324p207N241J714j0060N366P212q410P14O757
$$ 138 -5386 4764 4692 -4681 1250 3574 -3633 1608 3322 -6738 -1372 5840 -2570 -1856 4901
2627D901r377j025J0194n585l182R218p560o653J2792j5p426P499k257r452J0594
$$ 4901 -4476 -5501 4693 -892 -4074 5144 -2416 -9069 3723 3708 -3718 3781 1524 -7928 2666
2642B666M175j0802N315M123j0423M549P114j0709R25J0680q507j983Q636q074
$$ 2666 6841 -3961 1354 5477 -4946 -397 6717 -3992 -3067 7613 -894 -2877 5759 -2315
2656b315l335J2760n147q113Q701k548p982J0613J099j0424Q005K206j0798P047
$$ -2315 -5650 7110 1963 -6150 2551 3 -7979 2634 3733 -6691 1314 3520 -7278 -231
2670b31O719j0255K006O350q879K266R474j0243k228J1395m585m681P805m983
$$ -231 6488 -3767 -1761 4589 -4290 -2024 7450 -2793 -5021 6374 1789 -2892 4913 -70
2684g0m426J0914k718r445P883R58q188N032L137o838N099J768r810L989Q200
$$ -70 -4496 6418 3700 -5745 2138 3096 -5092 -60 3077 -3761 1338 3106 -6704 -2715 5485
2699E485o615k387M158l175J968M614p753k689J0335N01o041J282j172k13P297
$$ 5485 -1130 -3517 641 -2534 -566 4048 -3705 -6394 3941 4442 -1599 -317 -1489 -1702 5595
2714E595k298o455L604J814l571J200J883p62J642k359m609M061M523k910k349
$$ 5595 3297 -3158 446 2260 -1311 -111 1772 1010 2652 293 -4316 -255 4268 1358 -991
2729i91j180O42L149j769m000K444L567j310j320j783n59N755J86n268J809K379
$$ -991 -2171 -1529 1620 -149 -4149 -1705 1862 552 -768 -2551 -3110 2645 2831 -2437 -628 1751
2745A751l217M38J655j853N021Q32r083R27Q389j684k176J291o180J342Q799o076
$$ 1751 -1466 -1028 627 -1226 3795 4627 -4456 -3529 4860 3176 1000 2291 -3889 -2547 6252 176
2761A76o191Q713j417m958O012l041n314R795J3j0511P082L363r571M993M900
$$ 176 -6015 2698 1281 -3677 2335 -706 -6020 3775 3788 -6723 359 3722 -5849 -856 4044
2776D044q953M919O378j1893J896J1749r040k582J0485p774l722J1357o817p093
$$ 4044 -4909 10 6388 -5505 -3609 8140 -900 -3482 7003 -771 -4493 6864 47 -7046
2790g046J4413l189j2332J1256J021j0714J0331J909j4836R724P557j5608L131
$$ -7046 7367 4178 -8154 3102 4123 -6591 3740 5649 -9187 537 8094 -7514 -4383
2803d383J0967j1522K005J1893j4948k861J7454q401o906J4197o926r275J5360
$$ -4383 6584 -4938 -2933 8960 -5988 -8849 8605 204 -6702 7495 569 -8706 6654
2816F654l599j2383J4568K258j5784J0301M469j4629J0441Q895j6940K485J1038
$$ 6654 3055 -9328 5240 7498 -8286 2015 6484 -8145 2296 11191 -5749 -3264 7774
2829G774j3147J688J3684j3356m221J5341r360p167J5647n696r745J5143l112
$$ 7774 -5373 -3685 9999 -3357 -7578 7763 -1597 -8764 6883 1187 -8558 6585 3473
2842C473j4348J2522K917j2309J0851L494j5862P255J0401j2561L400R566j2473
$$ 3473 -10875 1647 4564 -7745 3106 6600 -9262 -2007 8394 -4167 -767 8799 -3674
2855c674n20J2621j0279l358J3884p748p200J0928m056p471J2618j484j1679Q838
$$ -3674 -4194 8427 -1852 -5210 8674 926 -6274 4654 598 -6873 5745 4261 -7418 1420
2869A420K496r962O659L663j0835N461O972j0797J031Q198p036M76Q871q031m065
$$ 1420 3916 -6046 613 4276 -6559 -1098 5874 -4923 -3892 4306 -2730 -2254 6617 -1414 -5479
2884e479R658l037l892P112l436n987Q282J75p164N110J874n511M574J951p754
$$ -5479 4179 1142 -2750 4362 926 -5061 3221 3396 -3768 1342 3216 -2295 2279 4230 -3524
2899c524K155M771m753P53L215n626n6N254k975j345M469k518k675L307q69j368
$$ -3524 -1369 3402 -1351 -598 2617 -3009 -3065 2189 -786 -2131 2338 -180 -2855 452 -417 -1785
2915a785L859p65m049K044J233j863K433L30j918K143L79k555K42J178l08J254
$$ -1785 2074 1309 -2740 -696 537 -1326 1107 1437 -481 1662 2041 -514 -272 906 598 1852
2931A852o82l023K26J581J049J345j510k872J74J069Q53J267j014l103R19J821
$$ 1852 1170 -1853 -1627 -46 1003 2348 838 -2034 -1860 -791 62 1329 315 -2788 -1869 -48
2947d8j432J391L07j928J701J879l105P09J849j476J390J876l998r90L139r39
$$ -48 -1480 -89 218 -1710 -9 1870 -1235 -526 1323 -153 1237 3113 -885 -1875 1264 325
2963C25L3L260k925l050L452m62j508L807j524m849K337J994k564K078O49m636
$$ 325 358 3618 693 -2357 1095 633 -875 2932 1408 -3441 -1104 890 -1674 404 1053 -3583
2979c583K431L767l742o6K532l557R31M489l729k688L841j107k26M631k444m609
$$ -3583 -1152 2615 -1127 -1193 1339 -2218 -1287 3202 -527 -3215 626 -481 -707 3924 1480 -3129
2995c129L722J328k368L280p02n088K745K552l680Q36K571m237R79M122m128j175
$$ -3129 593 1921 -447 2833 2131 -2957 -212 2340 -1340 -504 2067 -2170 -1191 2931 -1197 -2372
3011b372L413k019l35L690k714l674L303J92q97L856j181m702K426K547j676K475
$$ -2372 1041 -978 -1313 2377 -337 -4011 -708 -516 -1413 2443 1262 -3440 -1014 1533 -143 2332
3027B332M40m929Q26L291k129L82J769k434r36L879k042j716K592q80j216K645
$$ 2332 2772 -2157 -1331 1960 -169 213 1982 -452 -1388 2491 449 -1267 1325 445 -771 1874
3043A874j550l604K274J438q94J549r08l819J363L250j39J46l78l069K87L505
$$ 1874 324 -3280 -1006 432 -462 1087 179 -3640 -2277 973 834 980 602 -2467 -2180 1325
3059A325n66m81J94j226k58K608kj575Q86m15l44J556o25k331L47J438p6M66q56
$$ 1325 759 278 472 -754 -1012 1596 1594 19 905 490 146 1702 1077 -1254 -907 531 455 921 65
3078F5k568O51K327K86j25o98k108L07J923N49j000l62r35L82J988L36j216q3
$$ 65 -2503 -1852 475 761 636 -62 -2170 -1863 60 609 -391 -753 -1688 -1306 682 1018 -198 -281
3096b81J27J076R91r39j641k64J484O90L97r12j691k79J501J445j03j196j826
$$ -281 -154 922 1913 974 -667 -931 553 1243 1640 728 -963 -1242 259 1704 1601 405 -1421
3113a421k97J316Q85j39p61j222M38Q14L57J1m71K45N54L85q65p18j02J229J030
$$ -1421 -1718 -402 483 344 -417 -1639 -1201 -387 -30 -19 -490 -245 309 694 -171 -889 -991 238 1268
3132A268j99j165j000K41J782J453k64j618j316l6J029J273m64q71j265n5R85
$$ 1268 1069 -96 -1096 -855 927 2380 2116 498 -818 -854 175 1448 984 113 -1152 -1207 -222
3149b22L00J78k52o02R2M82o28k20R2L77O03J2q58o76P40J064Q93K79j567j119
$$ -222 78 256 4 -598 -506 -24 -652 -872 -780 -403 200 212 -646 -1322 -582 482 1375 1654 87 -1032
3169a032J151J198J67j93j265j052Q50R09N8r1o83o97P58O46p66j014M79j60N80
$$ -1032 119 1317 1484 1291 26 -1026 -176 733 791 700 17 -680 78 724 -42 -1056 -577 -737 -157
3188a57O15j318j059J237N26O54N66j409j500J497J220p99J007q93j706J869Q48
$$ -157 458 -860 -1919 -682 -156 498 1064 -345 -1845 -348 872 73 1080 187 -1519 350 1198
3205A198r20J41L20j097J068J193k053m84J182p00N1J866k402k076J962Q76l41
$$ 1198 278 419 739 -358 710 1903 -150 -634 548 -152 -101 1765 -637 -2713 -751 125 -216
3222b16K188k265l169K672J692j283J403l95m058K275K776j956J30J857k657N82
$$ -216 1972 -293 -3462 -790 902 -381 1022 627 -3431 -1156 1620 -336 -206 1651 -1006 -424
3238d24L386k833j507L377j334j485K976k045l011L977L16k368K834q94m671L095
$$ -424 2962 129 -1378 1999 665 -820 2156 111 -2900 1077 1393 -975 1859 965 -3706 -611
3254f11L181l301J259Q21m987J428M498k677j252L507l426j417N311j315k929
$$ -611 2570 -731 528 1349 -3638 -2210 2288 -389 -1641 1866 -1560 -2977 2334 1019 -1910
3269a910L937j693l592N397R3n122L204J973m035L528R97n935K483M515l764p27
$$ -1910 2027 334 -3258 2139 2232 -2890 314 2287 -1748 1780 2777 -3158 -675 3840 76 -651
3285f51K642m559L60N377l913k346N152k466k561M920j555l331M545m38m725M537
$$ -651 1991 -2568 -2208 3169 -744 -3090 2062 -404 -2965 1955 400 -2931 1614 1176 -3549 988
3301I88Q04n029K942K653m155K177K691m982J014M336l902j55M122m315j865M744
$$ 988 1792 -3237 -295 2358 -1797 380 3071 -1911 -897 3439 -463 -618 3504 -811 -2676 2068
3317B068j765j743L905k744l068M955l30l170K655k42k990L034K85m141K244K982
$$ 2068 303 -1440 2465 -279 -3347 1608 1278 -1892 763 521 -2469 565 850 -3291 -1047 1935
3333A935k413K9P42k593K020L344k969n02J641k043M54K028j671j81J916j832
$$ 1935 -478 -449 293 -2300 -280 3064 95 -407 1234 -809 -355 1673 2 -179 1737 -95
3349i5q63K203j134l18K338k107j311J358p28l59K384j668j873K316j80j709K452
$$ -95 -958 1245 111 -207 2131 24 -1287 71 -657 -1016 1368 -300 -2173 143 -37 -1746 706
3366G06r02j314K991n19l932K479J682j866K345j269m135L933L457m400O78J614
$$ 706 -196 -1510 1481 962 -2970 -491 1191 -675 1670 401 -3734 199 3656 -744 -66 1548
3382A548l177K500K977o233pN645l364j405M029m450j278P085l169m312N859j917
$$ 1548 -1629 871 3848 -2385 -2392 3253 -111 -1516 2513 -1937 -3215 3870 701 -3611 2248 331
3398C31m239O062j065o011O260J541p613N036K993p757M925N362q818J268O354
$$ 331 -3908 2154 1089 -4922 1338 2879 -4734 302 3295 -4462 463 5825 -2993 -1725 4629
3413D629p341R12Q138q100k597J0034n105n254Q355l083m928J0319l256j0893
$$ 4629 -2712 -1800 6338 -1762 -4359 5675 570 -4684 3671 588 -4340 5979 2723 -8170
3427h170R101L423q573N470J849j0714P205P478j2020J682R163q479n7Q156r274
$$ -8170 931 4354 -4219 1251 3100 -7614 -409 7069 -4951 -3269 5894 -2585 -2642 5514 -3760
3442c760j144J2769p188p606J0832l036o093J1159k927r950J0418J457j1520Q251
$$ -3760 -4904 7865 677 -6929 3903 867 -5226 5933 3006 -6944 3474 4931 -6589 1662
3456A662M283j1986N701O583j1753L156Q518j0544J555J0849j0647l764J1445
$$ 1662 5945 -6041 -340 6243 -5510 -2354 6164 -4380 -2825 8024 -2623 -6387 5058
3469E058n066m452R894o486p043J3388j456j1024Q587K478q427P491R12j1255
$$ 5058 -8 -4460 5434 -1052 -8095 5293 3837 -7187 1400 3878 -4549 2942 3854 -7401
3483g401P957P406j1833Q60Q065p546J615P254j0087j035J2040o498o131Q768
$$ -7401 556 7962 -3871 -3011 5054 -2492 -877 6377 -3710 -4745 7295 797 -5334 3434
3497C434l560m199R157l475q068R035L17q292O706K790q404M681L304p271L465
$$ 3434 -126 -4325 4832 1357 -6711 2324 2641 -5651 1055 3845 -4559 122 3426 -3845 -380
3512c80M696q174K056P351p043j833O197l830j76O339n932m072Q165j150m659
$$ -380 4316 -3858 -1802 5549 -1494 -3327 2870 -960 -1136 5203 -729 -4801 3364 2214 -2445
3527b445M058q72l875N267j300n560O004K299n691J547J637l865L861J693n660
$$ -2445 1613 741 -3134 2133 833 -4727 1277 3576 -2115 -568 1069 -2796 1065 2758 -2902
3542b902J104M229m057O21K664k972J073L363m188n63L700k160n70L536k997k046
$$ -2902 -1798 2431 -1626 -1005 1659 -1313 -240 3123 -1065 -1628 2072 -88 -658 2878 -119 -2165
3558b165L016j406j08L843k948l001M070k19k113K653j613k655M361q99m402L616
$$ -2165 851 -555 -663 3180 232 -2769 1301 1082 -1031 1622 9 -2646 1715 816 -3586 30
3574C0J474l364K259Q69m021L325J774m786K053L642m220n23L369l717J517M384
$$ 30 1504 -1860 399 1268 -2753 572 2346 -2440 -387 3255 -965 -1488 1881 -1836 -319 4065
3590D065n021j613N299k414k058M725k628l298N119j073m853N654q40n134M782
$$ 4065 -956 -2569 2730 316 -1742 2983 355 -2943 2176 1103 -3750 1904 1064 -4070 712
3605G12K065n307K903J316n556M163L996p064K95M696m201R39M735n155j335O310
$$ 712 2777 -2530 373 1689 -3867 296 4292 -2772 -2477 2219 -1982 -1043 3692 -1463 -2798 3512
3621C512l616l101O468j580m266N010j480m618O207k20o146M857K288n832K318
$$ 3512 -104 -3205 3263 1683 -2583 2427 947 -3671 2536 2316 -3830 1027 3315 -2517 -199
3636a99K591n263L285M141p411j15N440l792p84N340m066k370N745k874k149N481
$$ -199 2392 -2871 414 4555 -2856 -2971 2469 -1323 -2107 3233 -833 -3203 2542 -332 -2481 3000
3652C000j526m881L824J031m140M381L29m788L204K504n076J694L627m535J308
$$ 3000 1474 -3407 417 1448 -2692 1689 2018 -2770 434 2938 -2138 -444 3183 -1352 -44
3667d4L032m652o58M764k887j356L824k429k692M314n10k616L561o19m260L534
$$ -44 2988 -1664 -2322 2442 -445 -1801 2023 -406 -3098 1216 706 -1910 1651 1032 -3228 306
3683C06J300l642K393O70l421K168K599l559K56K626k243L59K681k979q66K820
$$ 306 1606 -2036 357 1027 -2394 -226 2373 -1186 -930 1696 -547 -188 2493 -486 -1352 1468
3699A468j574r15K589j453j550K222l67j182J893o03j968J484J178k333R01N30
$$ 1468 -106 -1021 1568 115 -1435 787 420 -762 1131 528 -1440 44 1222 -1111 -210 320
3715C20j689J252J101j722R1J428j455J040J121j911p82J393k23L82J320j701
$$ 320 -1369 -117 984 -738 -647 781 -674 366 1487 -424 -1206 187 -36 346 1666 -35
3731c5j384J592J42J47O93o80j519P51R28n31L02n19q35Q29L41q51K07N17l91
$$ -35 -1419 173 315 462 1155 475 -1044 -293 635 104 406 -113 -948 -119 222 -629 -422 95 -296
3750b96O99L22j166l14M78K44L83K06j129n77Q87M42O16N47j292o25P96M97j59
$$ -296 403 725 -441 -755 -277 -33 350 556 -573 -1150 -263 179 795 1342 50 -575 221 718 559
3769E59K8p92o91R12N99l35Mk98m75O28N18p52l12j34L1O56J37q27k25M86R6O5
$$ 559 587 -205 -896 16 615 280 284 -14 -489 139 657 -95 -407 -541 -510 146 283 -544 -769 -283 -187 -122
3791a22N95n92m48Q26K22j56K81o55m31O55M5P0r6j53j82O02M04q53J28j40n50
$$ -122 473 -119 -567 259 481 325 606 -49 -480 175 220 290 194 41 -141 461 865 12 140 0 -550
3812e50O54P58j504m96R01l07O58M00l84p20M59pl8N80n88j42L80k77j85M40L67
$$ -550 104 862 -642 -1138 -237 -544 114 514 130 -590 -131 -138 -176 404 -184 -326 54 -223 -408 32 399
3833C99q3J6J48q80N24K66k84K79L35j459P6O76k3L23L79j320L5J186o40m9P21
$$ 399 316 332 480 -400 124 390 106 385 720 -739 -663 13 -10 313 692 -628 -593 593 -47 -96 625
3854F25q86n65Q53l67m37J043n0r13J139j50o99M58O28p29K63L78j538N02R76
$$ 625 -261 -826 27 -340 -777 266 216 -697 442 292 -407 51 679 -50 213 591 -947 -445 531
3873E31m17j36O79j120k46J613k07r18N65q78o41J588q4r56N05j83q63J150R11
$$ 531 114 -22 657 -463 -709 904 697 -221 344 -534 -1175 413 329 -627 -122 -305 -1168 -18 893
3892H93j455K36Q14j474R64J269j889j46J422j065K52J289j081p85J810m14r38
$$ 893 -562 -326 488 -986 -22 1247 -642 -788 634 -431 -179 1110 29 -756 1054 640 -298
3909b98J215q12j087J713q9j688J081M15j165O99P32j457O30R89j296J36J007
$$ -298 917 105 -982 731 642 -1046 35 450 -715 -16 716 -741 -111 878 -418 -282 725
3926G25j585k21J809j200J32J415j246n33J471l31n32J364p03j560J446m36l53
$$ 725 -860 -1081 728 -472 -340 1075 -171 -704 767 436 -96 1268 565 -995 451 15 -338
3943c38J129n71j332J517M76j086K87K17q09J026K59j938M14R51L1k03M15j615
$$ -338 791 220 -1112 405 881 -205 82 299 -510 516 775 -1163 -749 202 233 30 445 -1170
3961a170O20J604o94l63P02j531M82J204j184k13J499j039n69J351r06m26K036
$$ -1170 -550 1054 360 -3 699 -832 -350 854 -330 -543 956 -83 -652 699 -207 -633 1403
3978A403j048j434J786n50j005J579j60j971J419O04j681J592N24k240J415J439
$$ 1403 355 -1079 707 157 -848 731 571 -1400 19 623 -1058 534 1058 -1182 233 1672
3994A672k870O64J762k283P40J917k987j27L516j951j415K897j974m81L847k313
$$ 1672 -1198 -534 1228 -1055 -315 1602 -1385 -1512 2004 53 -1362 1535 -439 -920 2927 614
4010F14l491M113P4k872K828p35l529M400J250n430K184L359m197J165K531n003
$$ 614 -2877 1236 1310 -1562 1266 531 -2998 1402 2652 -2778 -594 2765 -1432 -267 2264 -2739
4026b739J286M839m526j480M562k510j741M978k593k902N553j538m946N124L16
$$ -2739 -1453 3386 -1140 -2620 1942 -568 -2309 2669 76 -2826 2727 1189 -3757 1367 1683
4041A683m623L866J188n297L622K804o147L017L955o276K41M858m016l3M609n280
$$ 1683 -2940 926 2114 -3183 439 3243 -2904 113 4068 -2208 -1967 2891 -1125 -1158 3451 -1829
4057a829k015P732k759m931N593q87l371N276j636n811O132K236o849K278L145
$$ -1829 -3844 3888 1129 -3802 1791 904 -2467 2809 1173 -4638 1494 3730 -3119 -841 2304
4072B304m935L044L537p319J862O064n082j951N456m086j035N962m115l766O429
$$ 2304 -2631 413 3950 -3369 -1507 4557 -525 -2476 2980 -1106 -2141 3821 -294 -4060 2369
4087B369r90m462M767m88m601M879Q66n922M134K064n445K214L587n548J152M407
$$ 2369 1379 -3083 1684 1196 -3405 1474 2340 -3582 552 2616 -2829 -615 2972 -2576 -1424 2983
4103B983m395q8M663l832j580N063k455k989M544j245k991M232r00m053M015J186
$$ 2983 -1412 -1500 3163 -669 -2249 2814 359 -2630 1914 669 -2322 1910 1010 -3043 972 2158
4119B158l917K349J141m238K719K572m181N89K793l601P44K989l100p32L938j975
$$ 2158 -1759 590 1731 -2507 212 2784 -1397 -808 1985 -1616 -872 2117 -983 -1715 2223 248
4135B48k157L193j737j004L688j657l224K587J155j742J406r99j208L265k57l257
$$ 248 -1909 1284 -453 -1457 2231 574 -2650 -63 1092 -650 756 -243 -1451 1814 1557 -1700
4151a700J187J769j120M59n81j967K146J796k378n04J166l58M82P2j581R85J643
$$ -1700 -513 1256 136 595 14 -1953 193 1989 -389 -893 273 -85 397 469 -1112 -127 1516
4168A516k362o30J448k09L78L76j850N78K872k169j040J387M0l98J060k214m35
$$ 1516 -846 -1476 -28 -237 141 517 -1333 -755 2117 -52 -1092 295 335 -63 997 -1217 -1652
4185a652L870j030l500J976J421j114J343j260k691L934J152m552J175K143j844
$$ -1652 2218 1188 -2312 -336 1085 -29 1314 54 -2637 1297 2449 -2103 -928 1215 -629
4200f29P14R65l360J847L802m073j573L500p01j306K413k893q88M938j789m331
$$ -629 85 1050 -2310 -463 3339 -734 -2307 1193 492 -814 1599 -1294 -2182 2756 967 -3364
4216c364M078J123l080K004k75l178M189J610n903J373L567l288K01L108l972
$$ -3364 714 1837 -1243 761 486 -2692 1497 3107 -2796 -1423 2144 -1144 -943 2165 -1807
4231a807Q84M123m442j741N510j522k728K988j716k040M633n91n069L620K513
$$ -1807 -923 3200 -1242 -2983 2527 1005 -1723 1265 -451 -2491 2142 1551 -3518 102 2615
4246B615m713K334J766m209K352K629m947P30M117l559p44L874k886j105M080
$$ 2615 -2098 236 2002 -2207 145 2774 -2173 -1443 2674 -885 -1629 2245 -641 -1746 2334
4261B334k382k258M622j337l335L106q1k927L208M88m434L047K011l746J217K808
$$ 2334 -48 -2306 2316 979 -2356 750 669 -2258 950 1438 -2996 51 2062 -1684 -467 2341
4277B341l570O52K478l164R4L570k758j917L442j167j098K814j115l019L772l03
$$ 2341 -1229 -577 1901 -1263 -1169 2401 -357 -2274 1168 1 -1097 1717 602 -2417 1355 1052
4293A052k788K387K05k648K306J056l245J201J976k204J80K034k322J41K662k145
$$ 1052 -1736 651 856 -1792 514 1570 -1675 -474 1502 -702 -522 1512 -810 -669 1993 -152
4309a52j070K041p52j033J957q12j595K351k42j735J569L45j538J181J92k039
$$ -152 -1222 819 67 -966 991 179 -1416 935 693 -1042 527 872 -666 515 707 -1332
4325a332P82J525j354J9R19r52N1J262j090K05P03r49k65Q09l43n66J208o72n42
$$ -1332 -550 975 -379 -360 559 -393 -342 920 -170 35 738 -211 -476 333 -10 -576 632 -40 -582
4344e82R72P0p45M94P3p49L72K26l83M43K33r47K08M78l73J25K38k88L31K45q78
$$ -582 390 460 -285 209 282 -467 -95 131 -252 191 424 -523 -315 163 -210 -85 153 -135 196 441 -437
4365d37J33M20J63k70J64n27J75O16l83O1o9j69o7M95m04NJ47k37n17Q74j11J50
$$ -437 -304 116 279 9 173 -354 -179 437 54 115 46 -123 -190 305 -99 -94 53 -184 -701 173 62 212
4387B12J17n81j0O10j0l25M38j44p81K96K67m84N25K63r70O72J61l30L1L26n67
$$ 212 329 -252 -262 348 338 13 451 307 -474 -178 89 -395 130 393 -577 95 256 -74 -43 283 -284
4408b84J99M21m66k9J78J07o65O11J50o40Q89l92l57M90r0l76J84J3j86Q7L43
$$ -284 -85 336 -130 -159 19 126 -539 72 222 -418 471 79 -278 212 122 -254 -70 -57 -243 -156 187
4429A87m52P1P20l60l20J83l66R6R11o72j32J85j30o01O42N31n69J84j79l6M80
$$ 187 -265 -194 526 166 -154 29 -337 -241 670 -2 -134 51 -79 -680 -38 493 -76 108 -71 -107 373
4450C73k36Oj25k04l72K75O21k98n10M41k70oN33O4l29K12k62k84L36M11o01K80
$$ 373 137 143 18 -186 -558 -283 338 40 -470 -29 -299 -305 228 292 -37 175 -87 -371 -35 376 -225 55
4472E5r6l15P09L0m75L99j85k78K33K40n23L09K49k60l23J1j36L78N07k85j51
$$ 55 -41 -356 353 383 -92 307 122 -156 77 317 -206 103 352 92 -231 -220 -356 22 529 244 93
4493I3l59k7J20N02n35K8K21j69l1L61l3p9l85M68m10N70O4l51l34K65j03O7M0
$$ 93 -266 -293 -173 329 -206 -178 43 -126 -157 204 171 92 -293 175 -235 335 399 48 -286 -21 -124 -57 -17
4516a7j52j30M15P0k95J35J71j10k52q6j33K78M99n52Q5L18m33J93J61k90K31
$$ -17 -169 -299 116 186 -109 26 197 87 -165 -251 -384 -106 393 -159 -74 244 -189 4 165 -125 106
4537A06m63L84l18K97l0P9j5M2J71p7Q8j64J05p4k58k72O06j00j17o6l1L64J95
$$ 106 -357 27 -291 6 -24 55 40 82 253 176 264 100 205 131 -127 -399 207 107 -10 -76 -107 257 452
4560D52m49J96O5m89M3J63k44K50J86l68k84O36j95L66k03q6L24l77K13j9k79
$$ 452 3 199 264 -225 -182 -19 -263 -13 173 -195 -479 157 -38 328 125 39 363 -14 199 180 -99
4581i9j22K68l51n9K11M26J2k13J82j95l10M67n8k89M45p9n92K15q9l2M99K4o49
$$ -99 -221 47 -304 -363 -152 274 286 73 255 60 -250 217 159 -130 315 236 -356 -141 -230 -262 237 261 -388
4604c88L54Q2k74K70J81j033M52O13m66p0N51N5o33M10q9K0N21j56p65M25j39
$$ -388 -34 48 -226 44 225 -808 -356 257 -209 -279 272 327 -306 104 15 35 556 400 -365 60 -79
4625g9m34O78K12q92O44L82j076N56P32j031L40M48r25M87L17p03m03J362q41
$$ -79 -513 165 377 -515 129 511 -565 -9 723 -308 32 480 -445 42 359 -344 -747 615 -226
4644b26k84J139n47m12J031n34j124J127N38j393L59Q80j319R46J055k052M18
$$ -226 -510 629 82 -330 701 167 -957 170 708 -685 -326 554 -765 181 1236 -816 -398
4661c98J354j060m91J451j043q62J994j096j121J910k19j130J019j07j511J733
$$ -398 956 -104 -595 856 -187 -1049 945 -151 -1272 638 419 -711 308 201 -1310 423
4677D23L71j576Q55O32j640N96J296j517j39K072j783m11J882q90p60J417m78
$$ 423 794 -782 73 705 -935 -339 957 -560 -699 1373 -410 -821 1061 171 -589 828 350
4694C50j429K049o29j320J487L62j786R39P48j894J471Q58k312L79J731j461m77
$$ 350 -1079 970 341 -979 508 870 -916 23 771 -1123 348 1206 -1106 -727 1004 -457 -934
4711i34J890j404l48K100j588j222K528Kk033J162j08j007J817j39k356J638J085
$$ -934 956 -448 -796 1304 -284 -1506 1022 1024 -1009 153 45 -962 855 716 -1640 -2 1083
4728A083j431l35J499j407O16J216j785n96K324r84j011J165m74l93J579q08j422
$$ 1083 -348 -683 816 -591 25 1241 -544 -1140 1184 200 -811 354 -120 -513 1066 258 -1164
4745a164J558M59j338K28P48r51O50L76j701O34J716j439o10Q69j94K9O86j041
$$ -1164 394 853 -485 -257 491 -460 190 566 -1135 -501 1215 -224 -834 35 -159 -130 556 -485
4763d85O2R59q7r56J54O91l38N87o15n52P09Q39j084o16P67q2L04m88m66J78J201
$$ -485 -423 536 449 -507 -353 338 0 587 -28 -580 129 968 -116 -732 35 -47 257 -231 -697 -519 682
4784F82l62j095M71N68K55n33m80r3O38K8l33Q8L14J08o94m25J239M86m73L4r92
$$ 682 320 -775 -304 264 519 -14 -494 -587 51 79 -254 -166 148 256 -438 -863 376 862 389 423 -569
4805e69J48J370o00j084M97N82n19L07J5o27O25R08j406j63J220n71n39P62l89
$$ -569 -421 949 349 -735 -238 344 -175 132 147 -480 145 1053 -353 -516 704 133 -406 356 -33
4824c3o86J134n89r91J416L63j231Q80l7r74Q81R14j341k20J161j410M30J627
$$ -33 -719 415 -174 -1165 251 614 -617 263 226 -748 133 1047 -294 -514 647 -763 -333 1294
4842A294j790l82J607j136j53J535j023j355K293l80j577J566o3j704J367Q16
$$ 1294 -496 -878 729 -407 -560 975 -48 -1403 890 510 -1067 499 436 -1268 99 915
4858I15k257J209J172k009O97J456j788J59J686j440q15J820n41j244K468j132
$$ 915 -1342 -133 1039 -970 -273 1183 -605 -446 1240 -200 -1015 805 264 -980 1488 356
4874C56j314K049l08j776J507M14k172J617M41k511J079J700j079k41J308k180
$$ 356 -958 1091 783 -993 514 928 -1244 373 814 -1697 -618 1082 3 -238 1070 -1110
4890a110L11K415j610q63J323k55r95J792q59j726K528L77k174J105L85j409J097
$$ -1110 -799 1616 6 -857 466 211 -784 1008 149 -1577 951 1328 -846 259 644 -765 332
4907C32N55j575L00J302j215K8J173j240n27J933j182n70J439n95q35Q31k8j363
$$ 332 887 -688 -388 914 -301 -273 900 -340 -867 1066 -116 -686 753 158 -677 154 126 -1237
4925a237J991kj299N53K48r62R72P04j125m43J068o91J2R02j096j02J418m62r47
$$ -1237 754 752 -547 6 254 -708 264 968 -157 -600 468 -223 -211 691 -405 -507 911 449 -498
4944d98P15k49P9O20m61q87M89P57p90J65K00p50P59O40r20k43N84o8l70O05o86
$$ -498 217 -32 47 667 206 -681 -192 565 -225 -60 140 -610 149 789 -131 -374 210 142 -228 377 -309
4965c09qN38l06o40O98N23o65J12J08j25k0O80l31o57K60j44J24L49k36k52J47
$$ -309 -317 221 -85 -725 -27 496 -169 -57 51 -74 -94 586 255 -402 -142 -286 -162 187 -49 -301 -154
4986a54M96m70K28l15N87k16J91l23o33M14M82j3j43o08k59M66P07j14l39l4j44
$$ -154 342 -128 100 -215 372 156 347 24 -609 -195 287 274 131 -477 -736 -270 437 323 -16 -50 -194
5007a94k19Q09m79j76K38j7k60L19L83n96J76L5M2o5J44l90l06O52k45j82L39
$$ -194 -413 396 -83 -259 -21 -38 -298 21 404 -192 -16 19 61 -4 140 -250 -556 96 -149 -331 8
5028Hj83m67P48M49o63L16l03P0j21N69n32j2K64p30R08K4k35n54N28J61K9o9
$$ 8 -175 -642 106 555 -108 208 -95 -25 -146 423 -109 -121 143 -587 321 345 110 -444 84 245 274 205
5050B05j47l39N82m0n02M74J4m68O09o2o06M72k31l29j3O54n67k9P31p23J03Q23
$$ 205 58 -281 301 261 -241 233 247 -221 388 326 -280 192 -39 -368 -381 273 -294 -323 408 -315 -212 611
5072F11l87k35J05R0k88%Np4K27M4j84RK83k01K65M9n29n1K25n08K79N70k38j49
$$ 611 224 -11 94 184 -104 -104 -99 -173 54 98 -86 -77 206 5 270 319 -210 -261 -36 -544 -265 305 67 -82
5096h2o6P8k71L14K26l33J42J42k24j37J64O5%L33k52k21J10K11l45L17k42k73
$$ -82 -148 -70 -341 -27 199 -134 8 150 -74 -211 -47 18 18 351 99 -122 -12 199 -146 171 -71 -344
5118c44J84L0R4L85l19j36n3J25J40J0j56j80J5K17l3J30K10l70j04k06K49p1
$$ -344 -160 -130 -36 349 30 -106 -159 -34 106 116 -40 -220 -205 12 -21 109 319 -51 -155 -361 -112 -183
5140a83J34j97M28Q3m1n56K28M45k98R6j02j53K0J47O5j63k38J99k34N38j57J6
$$ -183 -49 -246 182 265 224 -332 -104 341 43 139 37 -116 -96 51 116 -47 -285 -86 -320 218 61 77
5162G7m64L55j42L57k21l57L48J37m49J78L82j17k02P2N7K94k14R7p51P85l7j02
$$ 77 -387 -32 -174 183 -38 -395 -47 90 -359 -181 201 84 -118 -46 11 305 91 188 -563 222 185 83
5184H3P3k5Q2q8k8J86k07j78K81M75o74k59L18k70J35P4q5J07R2k96K70j99K69
$$ 83 156 131 213 125 97 283 76 -102 179 654 -20 -279 39 -231 -96 -22 -107 0 92 -204 66 -133 136
5207A36nn84J30M41l40J27R1o1j22L11l13M70j16j05k55L20r8L42m04M19o91L47
$$ 136 131 -453 -323 118 -222 -95 -4 -65 -187 124 -189 281 165 60 -195 125 27 369 -35 384 -307 40
5229D0Q3j34J03k28J94l1L39m47J8l34K35N1J78o2r2r2J27N3k32P1O8n0K65l47
$$ 40 123 -11 92 -136 58 27 366 -81 -63 -397 -162 -111 67 5 -87 -179 -52 1 -231 -160 -92 -142 123 -224
5253b24L73L7j5n5j0K72k52l3Q4k46N0J60l88q2M04l68N01l24M7j69M12k87K20
$$ -224 149 186 171 116 106 378 126 93 177 -69 -19 141 -247 -329 75 -293 208 -116 -69 -238 174 -113 107
5276A07P6k09j39o3R6j32L44p0l25K79M15o13N57kk99K04J51k67j08L23j26r6
$$ 107 183 -26 -165 -228 -132 -264 80 10 -315 -36 379 -234 323 321 22 226 377 110 2 325 199 103
5298A03m21J93l80P17L02m99j24J16l19J17J02l15M05J97k47m13J000o87OM92
$$ 103 -318 -125 -505 212 514 15 -109 7 -312 -195 -93 -408 -3 194 -53 -466 534 -153 -147 345
5318C45j44n94M70L4m69O81j94k02P2L7m41O05J38o20L00Q5l33l9O63m13m07J81
$$ 345 201 -393 77 111 -358 323 129 -73 -1 36 -405 200 338 -282 18 103 -230 -269 394 -19 -426 -245
5340b45N7J65N18m22n59O54L2m27K55K67o11K84M37n33K75L22q70M8O94l25P3
$$ -245 -188 -23 495 73 -486 168 200 -227 28 295 -316 -32 405 -128 147 469 -401 -353 341 16 89
5361H9M20o87j50P85q1q38L35L17n00N94N8m95M03p6m01k72P91o25N8N89n48J68
$$ 89 509 -178 -328 457 376 -462 -127 190 -310 284 342 -153 250 174 -227 -499 292 -333 -275 314 -234 -66
5383f6Nj98j84Q30l56l16K62K79o37N05K71m40l9K82o26L01O38p77J25N28m87
$$ -66 -61 -259 -443 387 31 -285 -23 256 -381 124 395 -45 -84 198 -428 -127 511 -266 -141 387 -100
5404a00j92P42k12r25M71L52o39M64K07o10O36K43m85o89P21K1p6K68m33p9M44
$$ -100 -292 450 238 -687 -216 136 -503 -39 168 -442 194 437 -48 -737 -16 5 -71 197 -236 -315 129
5425A29J68k70L38j8l91O5M15l75J03J99l77r7j3j05q7M62k84k01O38k02k99K20
$$ 129 297 27 365 347 -44 21 436 61 164 363 -14 -111 -124 -229 -316 146 -138 -339 299 97 -202 18
5447A8N3m46L59K45p69L64K08P5k45K74k61k67R52n07k11J06j2j39O63J17j066
$$ 18 71 -375 -16 229 -540 -176 32 107 -138 136 -125 -392 560 53 -158 -52 -64 -203 460 577 -489
5468d89J82Q71o13M37r0p50J85O72k68n87P16m95m9O20N9q81M89O1q57P17N05
$$ -489 -307 564 -49 388 298 -452 -267 405 137 -450 266 -229 -278 342 401 -480 9 70 -787 -70 435
5489D35r01N15L86o67l3O96n96l62P80l42j16R75q04n28Q80L54l81J02m79q00
$$ 435 -466 49 435 -232 -265 431 -165 -527 253 -89 -205 770 -34 -562 318 672 291 393 -86 -886
5509h86Q57Q26j237J57O22j080P02Q86j035l34J123q82j01N96k74m81R23k49q79
$$ -886 -29 797 -440 -283 339 -741 -39 847 -188 -522 601 -281 -382 214 -60 -541 382 133 -746
5528g46J141p3q95J150M30j267L43P18j482M34J090j057J8M80k15o57J370m14
$$ -746 395 322 -573 577 1007 -260 83 801 -681 -247 843 -214 -196 284 69 -588 782 368
5546C68q46R75n26k75J023k79j333O77P98q68O16j05j073J010P38r51k70P54n86
$$ 368 -478 497 -29 -304 719 440 -893 -216 582 -286 330 225 -848 162 900 -51 -321 433 -153
5565a53r4Q44n41q55J157m85m85P67J55p10M18L42q49L48R2k02O4Q94j031MP60
$$ -153 -247 597 56 -799 358 -127 -612 155 310 -400 18 360 -489 -141 -49 -251 -187 707 -324 -320 440
5586D40o17O2N02k53k76J75j86l67P27m6p11L73L15l62L06N59p53k75P25k65k06
$$ 440 -177 -115 387 134 -142 33 -153 -520 207 161 -550 -177 138 -224 82 641 -112 -387 338 73 -133
5607a33J76j43q1N38l45l82N51k62n9M32o7j91j80M39n7l21K26m84k34P06J16
$$ -133 43 -100 -181 357 12 -370 181 -81 -140 292 225 34 -146 293 236 -85 141 -343 -577 129 245
5628B45n44K98K25j21J34j38l03K71K95n57l7O9M1K22J22m98K00K91l32j28L77
$$ 245 -299 -1 224 103 237 99 -204 67 362 -195 -232 -163 -122 100 222 -276 -76 215 -117 -245 132
5649A32j43k0J50j09m37L10K38n0r6j19K0M5j94N67m74K30l78M02J28J18o97K48
$$ 132 -11 -31 119 10 -427 -117 121 71 -25 -144 -124 -79 -273 294 -180 50 -328 74 202 320 -377 -129
5671a29K66m3n0R2j14M0j03K5k40M41k92j27O52m7l35m5J49l29Q9L25m58K58o8
$$ -129 137 94 44 136 22 62 -41 -16 -256 185 -107 -234 418 371 36 -9 140 -189 -100 225 -233 25 -43
5694d3k89M26N5m00%M10l02J05J34r3j14K69l33L01l96M53n74O05N75n88k42k8
$$ -43 -332 94 149 -251 -251 159 -143 -38 96 3 -111 158 -175 126 -270 183 -391 214 789 201 -41 -69
5716f9J18J21J47k52m16M31L0p4r6J93j63j33L35l01O5J63l97M12K74m02J49n73
$$ -69 49 170 317 65 -351 80 110 36 -60 133 -30 -163 172 -129 -64 99 -298 114 388 -14 135 -438
5738d38j72N02J88L59o23J28J48qK55l06m18K63L13k68L99J39n17Q2L2q3J8J9
$$ -438 -610 -108 80 439 -184 -56 92 84 339 33 -385 -122 191 -77 322 461 -56 26 58 -25 -7 12
5760A2k82K39J59m27K36K17k42P7K12k74R2K35m59J56Q8o6j27L87m92K73R1J55
$$ 12 -270 -31 128 -299 -63 154 -88 -11 201 -73 19 254 -205 -49 39 -27 -154 233 -259 14 105 260
5782B60o01K12J05N3j72M8P2M4J5j2j34j94J60M7L59J02l86j23K75O6k65K66l51
$$ 260 -341 -129 -24 29 -143 -95 -23 21 36 24 -110 -304 -144 -97 262 364 -22 -145 130 196 -69 197 -154
5805a54L47k01M8k89J54j78L07K80n85M18o5o6K30l34j0J60O9J56q5j85k43J92
$$ -154 193 -8 40 -249 -95 -273 34 314 -271 147 82 16 246 -88 -98 62 131 287 202 17 -226 -34
5827c4P9K72j19J6j27j85J32r1K53m6l91N5J97q6K83j56j53K91p4J16l74J13j39
$$ -34 45 317 198 214 87 -98 34 -57 196 150 -241 -186 11 -75 208 52 -101 190 116 232 -142 -29 -168
5850a68J02K33j97O7J07k1j68L20m27L10R9m93M0L31j52O7j32J52K44j77m9J67
$$ -168 -66 167 -30 37 144 123 -45 275 -152 158 257 -236 -196 135 -17 50 -82 70 314 137 88 255
5872B55l92K22o0Q0k87K83l96K18R6j39K54m8K0k5m3K35k60j19R7j48R0K47J5
$$ 255 -137 85 25 105 -182 101 -295 -77 19 -120 134 86 106 81 38 273 13 -106 -9 -157 -67 180 195
5895A95j67l13K80nj0J56m24L10K5l84J19o4J57P6J19o3k24K57j61Q2nr5K60q2
$$ 195 28 -285 -5 -10 -20 136 -288 22 47 -337 -218 -282 -125 -49 70 7 -217 40 -121 -39 -44 -139 121 39
5919C9l1K98j39J3j45K38k07J31J1J0nk61k20J54J38K7Q6l45K50j02p2j44M31
$$ 39 8 306 167 180 35 273 66 197 208 218 213 -48 -268 -114 24 51 137 -208 42 -60 -132 -276 155
5942A55km33N24k88J6Q4J49k86j57M72k16J05J23o2j55J55j37j95J07R5j61j87
$$ 155 153 -280 244 -44 -28 56 205 -81 -238 234 18 123 246 184 29 184 47 -148 -41 54 -107 -294
5964b94L49r1j90K83j10j38K87p5o2J43k01j46K25O5n2P4r0j55N5K04k60L33n9
$$ -294 55 -36 -226 57 -53 -191 96 21 -41 102 -99 -245 -20 45 -7 67 -23 -178 -123 81 -179 154 95
5987I5k77KK90R0k62RJ24m53L89r2j49L27K33k81j62O8l52J38K96M2k52J69q3
$$ 95 -182 -180 110 200 -62 -53 71 -382 7 -85 -234 93 326 45 -117 -49 -401 -263 33 75 -177 -8 -91
6010i1oO0M00o82P5L47m72L50K69k39j75k3j00L56L52n63p2K99j68p3R3j23P9
$$ -91 -97 -37 363 -319 -244 103 -369 -19 250 11 -164 -187 -287 69 421 -142 -214 85 -83 -156 -63 -186 -107
6033a07J87K04m09j14M47l66L19O5o21J91M20n8j34M01o73j28N68l07j53M16j32
$$ -107 80 284 -125 -239 208 -158 161 226 -395 -204 216 158 24 425 -248 -376 192 -115 -268 148 16
6054A6k33K90L15n15Q6L18n15L33K59n34J52K30l68j46N43k79K13J33k2p03O70
$$ 16 -217 73 388 -127 -41 277 -238 95 354 -180 -28 202 -166 -312 231 -48 165 298 276 -427 243
6075B43k22m21M42j52k64N54om74R3L81k81r0K97m86O43m1k48p17P26J13l70O76
$$ 243 21 -400 42 -110 -374 180 174 -300 -207 174 -107 -197 100 -386 257 216 -32 -749 -23 90 -280 396
6097C96l66j54J36M3L6K6M83q99q7P10p42M37L26l64j64K88J79l43L61mn52M54
$$ 396 30 -124 12 55 91 117 600 -299 -386 324 -418 19 345 -19 -183 105 284 -59 302 298 -254 200
6119B00q8n04L41L39m30L18j18k06k13M18q3K20K9p03jQ06j1n58K37j94J17M92
$$ 200 112 -392 -51 288 -142 176 58 -148 -361 57 -26 194 223 -480 -481 325 314 -244 -7 -201 -84 408
6141D08m47j12j6J41K47m24n3l3K18K78l10l61O34n1j92K49j11j47K31k66j30
$$ 408 -39 -151 -167 -26 221 -203 -256 -289 -71 207 -103 -464 170 119 -73 176 65 -82 149 -117 -247
6162b47j99R32m78j34oJ61P7K56k37n56O15Ql02J81K4o2o2K44j50j2m0j14N9K46
$$ -247 -446 486 8 -126 -132 29 106 362 125 -431 184 192 -110 71 95 33 -29 215 65 53 13 -101 -42 204
6186B04P8l87J25k1l04N21j47p17P01m5j72j21M84j55J43K42n33m63Q61k54l58
$$ 204 282 -105 20 -1 -305 216 69 -648 53 8 -164 -285 199 44 187 429 -104 -567 294 40 -318
6207c18M34Q9l75O19j79q21Q55j18k31n1k32J79J74N51j023k26N90j34o6Q16n63
$$ -318 116 205 -170 449 270 -551 304 186 -45 -96 -328 -149 25 576 -447 -673 -83 -217 -283 533 -30
6228c0o38J286k04r88R58l88j37M95j93o57Q69j07p52N70M26m68l39N44o11K40
$$ -30 -668 618 414 -574 384 -4 -141 354 161 -496 373 266 -486 84 510 42 -297 247 -364 -124
6248a24N87q14P5M10k11nO09j56q22R22N1r73P67J7p17N06j49m77M88M23q32J95
$$ -124 463 -351 -276 134 -77 -82 527 371 -451 471 522 -451 316 333 -384 122 -27 -504 -16 407 -425 -230
6270b30R47o54l82L47p5K90J2l12l91N51K11o74O40o82M18K87m3l80J58L2m29
$$ -230 717 63 -319 28 -47 243 255 -57 -448 103 314 -360 280 -402 16 303 260 -120 38 70 -359
6291c59o2M96l61m9O27n59J75L31l59j9J07J39k10O08l96m74M85L10q10L74L36
$$ -359 -421 75 -286 -335 292 -267 -92 239 -120 -139 -32 107 -103 505 109 -365 120 430 -380 -6 330
6312C30m10Q7K18l90L32N0j15j14Q5j0m3nK2J68j03j24l93N65q4J51j50P9m22
$$ 330 -80 7 225 -165 167 217 102 -12 73 63 20 15 37 205 102 -22 -415 150 66 217 67 146 -276
6335b76J82O0J31K7k2j46M18k23k80M04l93K42k84K91j90J52r0K4M3j51K17Rj81
$$ -276 -94 -34 97 124 102 -44 374 151 -129 275 -118 124 -160 131 -59 93 3 27 70 -81 136 145 -36
6358c6JK5J56l20j86M32k9r7K74l40M67J9n86K33j66j28L08J13k56M8K73o2j82
$$ -36 -35 -10 146 -174 -360 72 43 -54 220 -120 347 366 -220 13 -153 -281 27 140 -116 -68 205 143 -39
6381c9J01j92J98k78J33j74M77k8l69j5J24k94L64Q2j68K21Jk09L07K1l16mj44
$$ -39 62 -130 68 -210 -77 -251 226 198 -171 -186 -62 -356 8 90 -78 143 144 -65 242 263 -53 -57 -201
6404b01o2RN77n63n9N68l90O0m1J7L02J95k99m67L56K31o5j27q1o3p5Q2m3J94
$$ -201 -263 -254 323 -240 -299 269 -121 -61 -102 -85 217 412 113 -354 2 233 168 41 -40 -103 -178 -96 -139 55
6428E5K27o10n7N06j39l15O00l56k04L96J29k52l6J31j77J33K80l13M5J37l81
$$ 55 282 -328 -385 121 -18 -333 267 -89 -293 103 232 -20 -56 75 -102 31 311 -2 43 180 -201
6449b01K45J20m07K41K12oJ3l74L16J8k11J72P9o5j81Ql5O7j12K8p3k9K1L3j48
$$ -201 44 164 -243 -2 210 204 217 -157 159 177 -34 138 217 152 -29 -21 -56 11 -101 -73 -146 -175 -154 -121 -269
6474b69J99J64m44L37j85J48P7j58K12J77k02j45R7K47j32n14L97K12l83K48j67
$$ -269 -70 94 -350 -13 -198 -50 27 -131 81 258 56 -89 8 255 123 -391 6 218 -165 83 -84
6495h4k68N61l82K17k5K5j56J44j01l3K0J47l41M16k1m0O6J20j83j8k06J33J70
$$ -84 -352 209 -173 44 19 44 -112 32 -69 -102 -82 65 -276 140 119 79 145 265 82 64 -142 -9 161
6518A61k21J24j22M58m28k6l1L4J22l43L63j9l51M65k53L1j6m6R6L52m10P4j50
$$ 161 -60 64 -58 400 -28 -54 -85 -51 71 -272 91 72 -279 186 -67 -36 -52 -98 -2 350 -60 14 -136
6541a36o4L22K97l62j30J06k9j2Nj91m1J01l4L16j43N0j99M23k99k7J4m1k26L43
$$ -136 -200 122 419 57 -73 33 4 -8 -3 -194 -235 -134 -168 148 5 55 -144 279 -20 -47 -33 -74 -300 43
6565D3Kj98j2M63k18j26K38j47r1J8k08K09J50j39j83J68r7KJ55k9l30N37j97
$$ 43 45 -153 -165 298 80 -46 192 45 -46 -28 -236 -27 123 -16 -199 -31 -128 -126 29 0 -330 207 10
6588A0j12J26j73K68L4J84m65J24K57j73j81K77L0o2k36p5k34M50m53L58J20k50
$$ 10 -102 24 -149 119 153 337 -128 -4 253 80 -101 176 206 144 -92 -167 -401 49 -404 -46 74 -176
6610a76M43q3k11l8j98N51k64j79K99j83j98L24j73Q0J16j42J51K75n19L24N6
$$ -176 267 184 -27 -65 -263 288 24 -155 144 -39 -237 87 -86 -6 110 -32 119 394 -125 199 255
6631B55k75N3j32RR2L21l26p8J35j23J49j11J59k47K85J24q6j81O4j56M22m38
$$ 255 -20 33 -99 -90 2 323 -3 -81 54 -69 80 -31 128 -119 166 290 204 23 87 -69 353 -85
6653h5NJ78l8k05l4L09l11L36Ln07M02M94n37J8j0J47o3R8K27o47j9L60k21J2
$$ -85 -80 98 60 -145 -179 130 -181 155 158 -349 53 547 10 28 18 165 102 200 427 -220 -239 121 -100 -88
6677h8J44k86k0J48K52l84K16p7j45M10J21m38N17m13k60M55P3o7J77j23m18L29
$$ -88 56 -230 -250 -102 150 -234 -18 -95 -240 170 291 -147 370 -43 -303 152 225 158 335 212 -206 123
6699A23K48o47L78j28O2nj20J99k01M6J54j4l04J41n35P50J01k50j15m48N49R6
$$ 123 371 -276 102 -26 36 31 -89 110 -91 -45 109 95 -209 -68 -603 147 248 -2 -117 -565 -16 80
6721H0j95M5N5j82K06j54L06j43K74k95K26m91L03K16l33J32K16j29j40L0J1l45
$$ 80 -115 -70 -15 -197 9 -145 161 18 292 -3 223 -268 35 251 -82 50 266 137 -3 27 38 -307
6743c07M47k3m41O96Mj61k63J99j69k23L70q2k04J27J9m44M01N77q15M18p1l24
$$ -307 140 117 -324 372 376 215 -48 151 -18 -241 129 47 -157 -30 -11 -455 -54 523 -292 126 55 -269
6765b69L27L66l04j95K0q2K6K65M2n68L42J18l62J48J78j56K03K06n39O8O66n23
$$ -269 58 424 120 -75 -55 -137 -111 154 196 -372 -30 88 -274 -126 52 -104 99 305 -234 -166 500 -23
6787b3m76O36k63j08N91m99K2L19j36m78N73J88n54K30K31p90O72K91m66k05M13
$$ -23 -499 137 -126 -234 357 -142 -120 199 63 -415 158 346 -208 22 253 -537 135 426 -40 -245 168
6808A68o43M81N8l25J3Q90o67m27Q93o72j48M11k6m72O70O5m71p9P90o43K2K30
$$ 168 -475 6 64 -261 -248 642 -25 -452 441 -231 -379 32 6 -466 204 269 -202 -281 509 -134 -112 118
6830A18m67K39L44l53k28N34l12j72P33l90k62N95j50q73R77J06r27N08n8m88
$$ 118 -349 -110 234 -119 -347 187 -125 -297 436 46 -216 379 229 -644 333 439 -488 20 -38 -526
6850e26M71P04o40r9L82k32k83Q76r73O5M09m50k05P03O8p49P38k38m33P14p5
$$ -526 -55 649 9 -90 292 60 -223 653 -320 -255 154 -296 -501 202 270 -479 259 21 -412 302 227
6871B27n51l2N54l59K52J64m77K35O43p36j38N32j56q5N3j6m01O63k11m38K21
$$ 227 -324 -356 198 -161 91 255 -222 13 656 -80 -218 314 158 73 126 110 -291 372 161 -277 -56
6892e6K18m13J48L93l37L70j46n39J52J88n0k2K60l68O4M51k23l91N45L3m48L53
$$ -56 162 -251 -103 290 -47 323 177 -362 -210 -22 -72 -94 166 -202 -138 313 90 -301 244 277 -171 182
6914A82n53J14N09o7n76L56Q1p0M9O1k09J60O1l78M13J21J56m94R6r6Q3K55n36
$$ 182 -371 -257 252 185 -391 -35 46 -24 25 86 -123 37 98 -280 133 254 410 -84 12 -84 -1 254 -282
6937b82M78l77K17j05k24L09j0J25l09M07m69K38K26l38k6M6L18j01l1L3j11O1
$$ -282 196 -181 36 -69 -293 16 6 131 -178 229 -240 -2 224 -114 -140 -94 224 123 92 125 14 75
6959G5J5o6P5J84l29M6MK83j20p6Nl50P15j13l63R8r3l32M97O8m24L48q0k00n
$$ 75 90 24 99 283 -46 0 4 287 167 91 96 -254 461 348 -15 83 -10 -342 155 223 -201 147 67 -133 -138
6984a38L20l15o8K80l31J12L29l41o0M69j40l06K81Jk61R2J14l69J43K24l34K84
$$ -138 182 -133 -201 79 -252 -140 189 -152 -212 257 117 -189 92 93 -168 -76 38 -331 -188 36 -298 -14
7006a4O0m37L35M11p00O50J00n37j40P04o79M1M68m05k23M06K63p70O29L8j87
$$ -14 46 -391 -56 355 -345 305 405 -132 -272 432 -247 -206 262 -143 -366 40 303 -467 162 200 13
7027A3N4K0l81M23K08n04k5M88l33k57J058p63k73O15m17k25N19k15k68O8K17
$$ 13 67 87 -294 129 337 -167 -192 296 -37 -294 764 1 -272 343 -74 -299 220 5 -263 -195 22
7048B2l58M70k39k31K22O14q70N33J59l44P8J14j22l68O19l14k04L33n6l16M23
$$ 22 -336 134 -105 -336 -114 500 -370 163 322 -22 56 170 48 -320 299 -15 -219 114 58 -258 165
7069A65k05j21M0O18m97M81k48o33N26k07kr8K10j67K0O78o16K2K91l02j6K17
$$ 165 -40 -161 -121 497 0 481 233 -400 126 -81 -83 -181 29 -138 -118 560 -56 -34 257 -45 -61 156
7091A56m2L6o9j03j62L08q0n0M6K14k83q9M73l67o3j18j00J29K91R2n2j14K2k68
$$ 156 114 150 81 -22 -184 124 44 -6 40 254 -29 -118 355 -12 -75 -193 -293 -164 127 219 167 53 75 -193
7115a93M80k11j61J82l56n8J48N1J9P6K18k54L29j83m8K57k23l63M49k61N8o9
$$ -193 287 76 -85 97 -259 -317 -169 -118 -99 -23 195 -59 270 87 39 296 73 -290 159 -102 -44 -113
7137a13M05J47l51m32M95k36j34L57n83L92J00J94k86M83l24l18K41N6J19rj0
$$ -113 292 439 88 -344 151 -85 -219 138 -445 -53 47 241 -45 438 114 -204 37 93 212 203 193
7158A93J03l26j18J25k2o3J29Kk25J64j26K25l5J15k4k17l2j34j13L19P7P6lr9
$$ 193 296 -30 -148 -23 -45 -108 21 23 -202 -38 -164 61 26 141 117 -100 -132 -266 -379 -60 17 93 90 -9
7182iL82m26k14N24l83k5K15k63J0Q2L1L6O7n4q1L17K06l20J85J06l16M7l03L39
$$ -9 373 -53 -267 257 -126 -151 64 -199 -189 -107 -76 -40 27 -27 -108 209 415 95 280 386 70 117 -186 153
7206A53j56j67ML04rR4k07k95L34n9J43j94j37L31k35O2r1L45p3l16M20n38J68
$$ 153 -3 -170 -166 138 129 223 16 -279 55 -4 139 -55 -192 139 -96 -34 -125 220 147 -169 251 -287 -119
7229a19J36K8l82K01J0j53K40q7p6L95k98J23L3K07k53j46J09n8j56K40J48n84
$$ -119 17 45 -337 -136 -126 -279 -39 -126 -202 193 -105 18 51 258 5 -141 -32 -90 -246 -6 142 -442
7251d42M94L43q06J91M77k07M4k31O2j8J88l4J3j27J48k16L11j69j03J02k67J03
$$ -442 52 395 -411 -220 257 50 94 -137 -75 -93 95 61 74 -53 95 -121 190 21 -82 20 -247 -144
7273a44J19K35j95j89Q7rO3L75k16K02l67J16j15J82k78J83K2J16k34l19M03n3
$$ -144 -25 210 15 -174 -87 -96 -33 342 126 328 -39 77 -38 144 -134 49 71 187 -47 -366 37 -16
7295a6K13l1o29Q03jn76J39M60n29J42k7M20n34R7P4k36N09m51J6J91K18n45N78
$$ -16 197 166 -463 340 339 -237 -98 362 -167 -25 -52 368 -166 -69 5 -231 278 -173 -157 34 252 -293 285
7318B85k11pK0J04l19J64J18p45M16M0k33K40N09m52J36n2k16K09RoK98r0l8j02
$$ 285 74 67 87 191 -128 36 154 -591 -175 -135 -368 -128 381 -71 65 13 -203 6 15 9 307 217 179 77
7342G7L9j77J87k91K41m07L19k9o6L7J63P4o0J9k26K29o4r6J63o6q6m3J54j36
$$ 77 116 -61 126 -165 76 -331 -12 -41 -107 -70 93 167 107 126 -100 129 65 -31 132 66 -20 -63 91 -45
7366d5L64m93L22k61K39o2J95j50m4j62Op4K80K4l3j94j95L35j74L96l97K36n3
$$ -45 319 -174 148 -113 126 64 259 109 65 -97 -91 -165 115 139 106 -88 -283 52 -122 274 -123 113 60
7389F0rr8r0k2J21p9L13J8j72k61J17L10J59o13N22k18j45P9L07l72J31r3r3J51
$$ 60 51 -47 -137 -159 -38 -117 196 214 42 -219 -102 208 367 -246 276 58 -87 -8 299 -73 58 -35 -128 23
7413B3r4J27l68O16m47pL22l29j01O17j2p15M99K21k74j01M5q9L12k35j84J23
$$ 23 -71 56 -312 304 -143 -150 172 -157 -258 359 347 -368 131 352 78 -23 22 -67 245 10 -174 -51
7435e1K49l12J25M11o39K60J37l45k92P40j35n78K71L93m94K54L88o65L33M01
$$ -51 198 -114 11 422 -217 43 180 -165 -457 283 148 -430 -159 234 -260 -6 382 -283 50 451
7455D51p56M83J00q13M14M19o49K81M21l99j75O86o51PP08l61l15M44k11l51M68
$$ 451 -305 178 278 -535 -121 298 -351 -70 351 -48 -223 463 -188 -181 527 166 -149 295 84 -267 201
7476B01L0k80L57j14l98R0K91l74J22J86k65j70N44k40k50O18k61q5J80j31k23
$$ 201 231 -49 308 194 -204 -114 177 -197 -75 111 -154 -324 220 -20 -270 348 87 2 182 51 -172
7497a72L84j99k54L90ll23R7K71l60O5L40m92K66N00l89k46M87l63j85P21m98
$$ -172 212 13 -241 149 146 -177 -80 191 -169 -104 236 -256 10 510 121 -125 362 -1 -186 535 37
7518C7m8NL80k85K71J04p42M71N1k12K78k80m00L48L78p70N20n8k95L10R3k58
$$ 37 -11 -6 374 89 360 464 -278 193 244 32 310 30 -370 -22 356 -414 106 48 -247 63 156 -102
7540a02j31L19r0O8o4k21J90o3j81K03N0N9N5M1n1m4L2K08j63j94K06J26j92R
$$ -102 -233 86 -4 64 0 -221 -31 -94 -275 -72 -22 37 92 133 82 38 70 278 115 -79 127 253 61 70
7564G0n1L05k66n3K4J97r7j35qj71m3N06k33JJ02m13J08K13j23N80k40k21J22
$$ 70 19 324 58 5 29 226 129 -6 -14 -185 -228 278 45 46 148 -265 -157 56 -67 513 273 52 174
7587A74J6l16J34K64k98J13j89J86j65L03m53Q2K95k21QN0j46j42O80q0o04O44
$$ 174 190 -126 8 272 -26 87 -102 84 -81 222 -231 -149 146 -75 -67 -17 -163 -305 375 295 -309 335
7609C35k60q8j18K59n59M96L0j65m3K40J19p58N41l30J82L13j92j46O40k11n74
$$ 335 75 -13 -131 128 -431 65 95 -70 -113 127 246 -512 29 -301 -119 194 2 -144 496 285 -289
7630b89L79O3m64N82j12m13N46J2o25N54Kn90n9Q50n22J44N95q13j90L69J59l36
$$ -289 90 153 -311 271 159 -254 292 304 -321 233 235 -355 -414 436 -86 58 653 -160 -350 19 178 -158
7652a58L28k08l49Q31k45k12J70m07oJ74L98p68J16P23p66L46J74k99OK85k75
$$ -158 170 -38 -387 444 199 -13 157 -250 -256 -82 316 -452 -336 387 -379 -33 141 -158 -152 133 -142
7673a42k49M10J3m49N06k64J5o4M43l82M03L1m95L37O5p83P06K91m07j98M04l62
$$ -142 -391 19 32 -417 89 -175 -160 -224 219 -163 240 271 -224 113 178 -605 101 392 -15 -213 191 -171
7695a71K99J29j31l80M40k07l63P49k90k05J8K2j47M11j10j83J22J02j23R2j18
$$ -171 128 257 126 -254 186 -21 -384 365 75 -130 -112 -90 -237 174 64 -119 3 105 -18 74 -44
7716d4J38m3N5j99K2M8k63M39k9k21N5K03qk18J46k09K11J96Ql77K25Lr9m54L71
$$ -44 94 51 106 -93 -71 -23 -286 153 124 -97 -42 161 153 -65 81 -128 83 279 287 -90 135 138 39 -415 -44
7741d4J39k52M6k70L40q7n9P7lk12M77j38n9k14K01J38k98L53m76K90K10j39l32
$$ -44 95 -157 -111 -381 -41 -128 -187 -110 -113 -325 152 14 -45 -259 -58 80 -218 135 -341 -51 159 20 -312
7764c12J91J52K14p2l16J78r1j3n0L88m14L47j34k0j22mj62k25N22J89m07M5p1
$$ -312 -121 31 245 173 -143 35 -56 -69 -119 269 -145 202 68 48 -74 -78 -240 -465 57 246 -161 -116 -187
7787a87K74K3R4m04QL33J56k18K3R9k03q6qJ0J77j20j59M21j1k1N9j34k77M42
$$ -187 87 110 204 -200 -192 141 297 79 102 201 -2 -88 -96 -86 91 -29 -188 233 222 201 260 126 -151 291
7811B91l74j22L41l2J20j81l5n6J16mk70K87Q3k51O8O0nJ1j82J54j96J33k45K33
$$ 291 -83 -205 136 104 224 43 8 -48 68 64 -206 81 164 -87 -19 41 36 47 -135 19 -177 -44 -289 -56
7835e6J81k26J21k4j4L13q5l11k7J20P9k34J03J71j69J37j11J76j84Km5J03j11
$$ -56 125 -101 20 -4 -18 295 210 -101 -128 -8 71 -163 -60 111 -58 79 -32 144 -40 -38 -83 20 -91
7858i1J05J70k17R7n0k91K08p0J17M3L7k05J37j38K73j27K9Q0l03K75j39M7L2
$$ -91 14 184 -33 64 14 -277 -69 -139 -22 21 58 -147 -10 -148 125 -2 27 107 -196 79 -60 -13 19
7881A9j01J42k93J88QO1j73r5K71K60j52J27l67R7k37L48L8j97K0J62k75K21J7
$$ 19 -82 60 -233 -45 -37 24 -149 -244 27 287 135 262 -105 -8 -245 103 141 -56 -36 126 -149 72 89
7904H9j11J74N6l18L70j89o3J94r1k58M8Q2L2l8L26J82m46p9L90j83j41j08ok21
$$ 89 -22 152 208 -110 260 71 8 202 111 -147 -99 -17 15 -23 303 485 39 -40 350 167 26 -82 -88 -309
7928c09J71K09j83Pk6J53J5o2J33R3j62k14K80l09M6L81j81J06j27j23Q2k04J66
$$ -309 -138 71 -112 -105 -131 22 37 -25 108 201 39 -175 105 -204 -158 223 42 148 21 -102 -20 -224 -58
7951e8O5r6P1j17K04L36j64n66M9M46k1k35o2K66k67n6L22N4J56m36J03lj64J41
$$ -58 7 -89 -18 -135 69 405 241 -325 -276 170 149 -86 -148 118 -149 -205 117 171 327 -109 -6 -9 -173 -32
7975c2O7O3q8j29J02JK17l91Q9KQ8J03p6o1L9N91k87k6r2J8O1k55j30j70K06L7
$$ -32 35 98 10 -119 -17 -16 201 -190 -101 -99 -11 92 16 -45 -6 585 298 272 180 198 259 4 -126 -296 -90 -53
8001e3J76j07o1j95J97R2j08K81j58N7l06K37J28o3L8J05m92M94k78K31k38j1
$$ -53 123 16 -45 -240 -43 49 -59 222 64 121 -185 52 180 117 155 260 -232 262 -16 215 -23 -34
8023c4no4J81j23j7K79l03R5J24j26m3J22k10N3L37k53j82J34K13k85j27K43m
$$ -34 -39 -103 78 -45 -62 217 -86 9 133 7 -36 86 -124 -71 266 13 -169 -35 178 -107 -234 9 5
8046EK52k32j62J82ml62L57J2M5j22r5M43n11K89j73j65J05J72j27j14M46m57
$$ 5 257 25 -137 45 41 -321 36 48 93 -29 -124 319 -192 97 -76 -241 -136 36 -91 -205 241 -216
8068b16K31R9p5j20N4P6l3O4k64J74J97j13o6K09k57k3J32k18n2R2Q1p1J69PJ1
$$ -216 15 114 39 -81 -27 49 16 80 -184 -10 187 74 8 217 -40 -63 69 -149 -201 -109 -28 -99 70 77 88
8093H8j82K32j93k44N19k20j75J93L90m31j51K8K72j61k96J25J89L9l91M14J73
$$ 88 -94 138 -55 -299 220 0 -175 18 408 -23 -174 -146 126 -35 -331 -206 -17 22 -369 45 218
8114B18j79N8k57K25K60k21r6J74Q0m61j56M51o3J07K8k2p18N86J01r2q3J56j61
$$ 218 39 97 -160 65 325 104 8 182 262 -199 -355 96 33 140 168 146 -572 14 115 23 -60 96 -65
8137f5O6N6r0l9K80k46n5j9k05P87l66M0m84L30Q6k67P4J63l87L32MK3j94j12
$$ -65 1 57 -33 -72 208 -38 -93 -112 -317 470 104 144 -340 -10 76 -191 -117 46 -341 -9 -5 18 -176 -288
8161b88J16q7L93M1l46K60k30j12Q0m8K56j21J96j43J97qP1l48K36k29K1N9K3
$$ -288 -172 -259 134 175 -171 89 -141 -253 -173 -221 35 -86 110 -33 164 156 227 -121 115 -114 -93 -34 -11
8184a1j61K59l34J8K72q7r0
$$ -11 -172 87 -247 -229 43 -44 -134
8191a34
$$ Imaginary data points
##PAGE= N=2
##DATA TABLE= (X++(I..I)), XYDATA
0@%%%qK4l2L2m0N6q0J12j44J68k00K56l20L84m52N31o23P33q63J001j146J312
$$ 0 0 0 0 -8 16 -16 16 -24 32 -48 64 -80 88 -112 144 -176 208 -244 287 -336 397 -466 535 -611 701
25G01j507J728j970K232k516K829l184L581m007M467m974N534o153O831p570Q380
$$ 701 -806 922 -1048 1184 -1332 1497 -1687 1894 -2113 2354 -2620 2914 -3239 3592 -3978 4402
41D402r274J0269j1377J2604j3970J5512j7266J9278k1612K4352k7617L1597l6591
$$ 4402 -4872 5397 -5980 6624 -7346 8166 -9100 10178 -11434 12918 -14699 16898 -19693
54a9693M3044n1728O4119q3316J17157j93428O29699K9406j412727R60109R3216
$$ -19693 23351 -28377 35742 -47574 69583 -123845 505854 535260 -877467 82642 175858
65A75858l47469P50492n13115j040307J326066L70027j337095L98467O61784p52798
$$ 175858 -171611 578881 65766 -974541 351525 721552 -615543 -217076 444708 -308090
75c08090M35524L32103j095213M34165R59590j095077k08606J018758n28817l08177
$$ -308090 127434 459537 -635676 -201511 758079 -336998 -545604 473154 -55663 -363840
85c63840P27529n95337k10291J105579m72513q16623R06030L1787p25807O14787
$$ -363840 363689 -231648 -441939 663640 191127 -625496 280534 312321 -413486 201301
95B01301N5927o73479O35831R8248r17480O02698O45390q52368j5114M87128m58666
$$ 201301 257228 -416251 219580 317828 -599652 3046 648436 -203932 -219046 268082 -190584
106a90584K51836M38886r05404o9414R68333l56109m89635M01328k38468m1877
$$ -190584 61252 500138 -405266 -474680 493653 137544 -352091 49237 -189231 -231108
116b31108P34024m01934o41375O44104J50429m66359L34334j5372m55180M64603
$$ -231108 502916 100982 -540393 103711 254140 -212219 122115 106743 -348437 116166
126A16166J57212n97828K63612L49256m24753J41196K79662m44689Q5341L80389
$$ 116166 273378 -324450 -60838 288418 -136335 4861 284523 -160166 -74825 305564
136C05564l80851m9772L60277l08520j03273L61067k53036j57205M08004j05898
$$ 305564 -75287 -125059 235218 -73302 -176575 184492 -68544 -225749 182255 76357
146G6357k19896K41751j47216j69135M00711l2373l62672J64670M8512j56405
$$ 76357 -143539 98212 -49004 -218139 182572 150199 -212473 -47803 709 -155696
156a55696K51356q83l01292K21143J57348k54682R6373J08626k16759J36807J46474
$$ -155696 95660 94777 -206515 14628 171976 -82706 13667 122293 -94466 42341 188815
167A88815k75281K9319J58406k12391P8924K47520k25498r1702J71893j28820
$$ 188815 -86466 -57147 101259 -111132 -32208 215312 -10186 -101888 70005 -58815
177e8815M2437K37157k52347j64667K69005o5749j40233J87844r1446j10877K67136
$$ -58815 -16378 220779 -31568 -196235 72770 7021 -133212 54632 -36814 -147691 119445
188A19445q7537k45405K69003Q4907k36041J24005L2464j95648K05652O2139l32488
$$ 119445 31908 -213497 55506 140413 -95628 28377 60841 -134807 70845 132984 -199504
199a99504J47011K63316k29197k0987J25079j96997J22007K65038l03564j31487
$$ -199504 -52493 210823 -18374 -39361 85718 -111279 10728 275766 -27798 -159285
209a59285K76640j16847j02420K23454j49158j40802K81271q1300k16558K62311
$$ -159285 117355 508 -101912 121542 -27616 -168418 112853 31553 -185005 77306
219G7306J5051k47359J89635O3046k33894J50917O7909k69323J58594K06673k61741
$$ 77306 92357 -155002 34633 97679 -136215 14702 82611 -186712 -28118 178555 -83186
230h3186O44J84940j73295M6360K23083k16009p7603K39199j40939j22900K35047
$$ -83186 -82542 102398 -70897 -24537 198546 -17463 -95066 144133 3194 -119706 115341
241A15341o9293j51664J87195n8486j68050K24964K8594k24802J32751P9640j92575
$$ 115341 46048 -105616 81579 23093 -144957 80007 108601 -116201 16550 96190 -96385
252i6385Q7069P4270j99162R5112J64882k00279k8683J55411j11055J2430J80411
$$ -96385 -9316 64954 -134208 -39096 125786 -74493 -103176 52235 -58820 -46390 134021
263A34021j35639q9237J65361o9088q7758J71209l4202j35100J18620m881j17668
$$ 134021 -1618 -90855 74506 5418 -82340 88869 54667 -80433 38187 33306 -84362
274h4362J36989M3839j46672P2275O0071j34331M3951P9518j17675K3052Q9793
$$ -84362 52627 96466 -50206 22069 82140 -52191 -8240 71278 -46397 -23345 66448
285F6448j20034k2999J08656o0827j7079J04501o3911o2261R0526k5494n2022
$$ 66448 -53586 -76585 32071 -28756 -45835 58666 -5245 -67506 23020 -2474 -54496
296e4496R2718j2189q5720N5725J4489n5279O6594K9452p1906L2978M0518o0651
$$ -54496 38222 26033 -59687 -3962 10527 -44752 21842 51294 -20612 12366 52884 -7767
308g767J5471M2120n1505M426L9999n5207j8140M6441k2942q992M5507k4788l2368
$$ -7767 7704 49824 -1681 2745 42744 -12463 -30603 15838 -7104 -16096 29411 4623 -27745
321b7745L0816r116k0061L6788m936l8255J4058J420j9441K8296J7287j9532J2159
$$ -27745 3071 -6045 -26106 10682 5746 -32509 -18451 -17031 -36472 -8176 9111 -10421 1738
334A738J1226k1548R526K0281r477M641P870k5107q610J5060j532P195J6060j3187
$$ 1738 12964 -8584 942 21223 11746 16387 24257 -850 -9460 5600 4068 11263 27323 14136
348A4136j5074L881k987L268J6930o206k0800r041r595j643J7588R807o188n105
$$ 14136 -938 2943 -44 3224 20154 13948 -6852 -15893 -25488 -27131 -9543 264 -5924 -11029
362a1029q517m664J5370J6723K508l416j0567j2695L705J2928P902N397j334r040
$$ -11029 -19546 -24210 -8840 7883 10391 6975 -3592 -16287 -12582 346 8248 13645 12311 3271
376C271k469O841O778P356L511o002j0410q891n075J932P985K563o422j1165q669
$$ 3271 802 7643 14421 21777 25288 19286 8876 -15 -5090 -3158 4827 7390 968 -10197 -18866
391a8866J357J1150J0576J261j0447j2410n651O407J0923M435m064o910j682O797
$$ -18866 -17509 -6359 4217 5478 -4969 -17379 -23030 -16623 -5700 -1265 -5329 -12239 -13921 -7124
405g124Q997N906K360L74J611K195j490m739k542K136N103J970n050j1491n789
$$ -7124 1873 7779 10139 10513 12124 14319 12829 8090 5548 7684 12787 14757 9707 -1784 -7573
420g573P490J0102M353n110j3873j1517L660P981J310j600p721j0696M847R504
$$ -7573 -83 10019 14372 9262 -4611 -16128 -12468 -4487 -3177 -4777 -12498 -23194 -18347 -8843
434h843q49M002O608l288L385N705j0386l002J4883L327o40L807j6800j1729K0862
$$ -8843 -9692 -5690 918 -2370 1015 6720 -3666 -6668 8215 11542 10902 14709 -2091 -13820 7042
449G042J3447k153M969j4408k3113J3076J6366q690L898n196k9812L264K0456
$$ 7042 20489 18336 23305 8897 -14216 -1140 15226 6536 10434 5238 -24574 -21310 -854
462h54j0128L293J4727k0848n450K1897j3515p976K9076n434j6635J5936j3310
$$ -854 -10982 -7689 7038 -13810 -19260 2637 -10878 -18854 10222 4788 -11847 4089 -9221
475i221k0041L7069J7293k2889J0339k518k9730K8900L0694k8893j278R423l6348
$$ -9221 -29262 7807 25100 2211 12550 10032 -19698 9202 39896 11003 9725 19148 -17200
488a7200P500L7321k6309j2794K5622k2978j0034L7069k0842k6676L9564k008
$$ -17200 -9700 27621 1312 -11482 14140 -8838 -18872 18197 -2645 -29321 10243 8235
500H235l1333K2743r035l2780M1565J9371m0112J4036J4863l4033K5487L5415
$$ 8235 -23098 -355 -9390 -42170 -605 18766 -21346 -7310 7553 -26480 -993 34422
512C4422l5062J393K5386l7614M13M5920k5242k0479K9182j8931q815M4055k2495
$$ 34422 -640 753 26139 -11475 -11062 34858 9616 -10863 18319 -612 -9427 34628 12133
525A2133m0204L6641J1614k1069J6255k2533m2427M2323L2055l4040k170r13k8128
$$ 12133 -28071 8570 20184 -885 15370 -7163 -49590 -7267 24788 -9252 -11422 -12335 -40463
538d0463L3167L5784l2350n192J5873k5461R731L2353k3941r367K1354j5939J235
$$ -40463 -7296 28488 -3862 -9054 6819 -18642 -8911 23442 -499 -9866 11488 -4451 -3216
551c216K8993k2478j4988L1914k50q073J0635l0520j7881L9971N097k1762O767
$$ -3216 25777 3299 -11689 20225 19975 11902 22537 -7983 -25864 14107 19204 -2558 4209
564D209k1134j8701L7917Q339j6271K1900j8693m2532L3135K8491j6077J1066
$$ 4209 -16925 -35626 2291 10630 -5641 16259 -2434 -44966 -11831 16660 583 11649
576A1649k2973m4106N4377M4944n1489q853K1617j4144M0770J8801q5212J864
$$ 11649 -11324 -55430 -1053 43891 -7598 -16451 5166 -8978 31792 50593 -34619 -32755
588c2755P9793k3791k4562J9711n1536M975Q3222m3484n0143O8450j7732n4253
$$ -32755 47038 23247 -1315 18396 -33140 -28165 55057 11573 -38570 29880 12148 -42105
600d2105O2089n744n2025O5773j3537r3107P2855N0981q6447K6676M1811p4368
$$ -42105 19984 14240 -37785 27988 14451 -78656 -5801 45180 -41267 -14591 27220 -47148
612d7148M7268O7001j07239K389R9738p2984k1662R4672p2208m7314J07464l9690
$$ -47148 120 67121 -40118 -37729 62009 -10975 -32637 62035 -10173 -57487 49977 10287
624A0287n2412J15579m4686j14950J13568L8609j00590N8661J38j14062J06212
$$ 10287 -42125 73454 28768 -86182 27386 65995 -34595 24066 24204 -89858 16354
635A6354P3186j62439J5554J14410q2532J4110P5662j36052L181J71950r1447
$$ 16354 89540 -72899 -57345 57065 -25467 -11357 64305 -71747 -68566 103384 11937
646A1937r1240J19436m7203o3823J38303m5588j13921J45895J1177j49583J00908
$$ 11937 -79303 40133 -7070 -70893 67410 21822 -92099 53796 64973 -84610 16298
657A6298N6868j26585Q0863N4529j66857N6427J26208j38152j092J20655j21790
$$ 16298 73166 -53419 27444 81973 -84884 -28457 97751 -40401 -41493 79162 -42628
668d2628j5113J53009j06507p5396J53472n0127q7938J32927n5038j31053J57177
$$ -42628 -57741 95268 -11239 -86635 66837 16710 -71228 61699 6661 -124392 32785
679C2785M0848j42712P3648K7110j26939J17045R3570j71841J4363J13843j06104
$$ 32785 73633 -69079 4569 31679 -95260 21785 115355 -56486 -42123 71720 -34384
690c4384J4201J10358j29951k8958J54058p5709p3090J23953n0645p8329J36131
$$ -34384 -20183 90175 -39776 -68734 85324 9615 -63475 60478 9833 -68496 67635
701F7635k1786j23339J00281J6935j13805Q8253L9483j29437O0947P7472j19372
$$ 67635 45849 -77490 22791 39726 -74079 14174 53657 -75780 -14833 62639 -56733
712e6733K3132R5629q7696M926Q4753j06069k2001J36047n0196p7893P3595k4640
$$ -56733 -33601 62028 -25668 -20742 64011 -42058 -64059 71988 21792 -56101 17494 -7146
724g146k9262J07927m2176j13401R5486N8872p4750J8138n980p1660Q0684O1276
$$ -7146 -36408 71519 29343 -84058 11428 70300 -4450 13688 7708 -63952 16732 78008
736G8008j08360j2536O3314l8918J1121N0626o2080j2226O7462m0608l3865N8067
$$ 78008 -30352 -42888 20426 -18492 -7371 43255 -18825 -31051 36411 -4197 -38062 20005
748B0005j7390l5455M3848j0015l4216M1242Q61l1777M0043J1678m2546J3077
$$ 20005 2615 -32840 11008 993 -33223 8019 8880 -22897 17146 28824 -13722 -645
760f45J6307k0593J3139N990k4516J4451J0687l1930K647L0665N469k885k4140
$$ -645 15662 -4931 8208 14198 -10318 4133 14820 -17110 -14463 16202 21671 18786 -5354
773e354k8356L0272L6599k1130k6945j2725L413L7164M018m4728N278L3674m249
$$ -5354 -33710 -3438 33161 12031 -14914 -27639 -24226 12938 16956 -27772 -22494 11180 6931
786F931K102o819l1777K8560L8195l9234j6131K4979k0412O061L9280l2460j5080
$$ 6931 9033 2214 -29563 -1003 37192 -2042 -18173 6806 -13606 -7545 31735 -725 -15805
799a5805M5988k4418k6504M9213j2459l9092M2368q633m9138M6540J0160n5872
$$ -15805 30183 5765 -20739 28474 16015 -23077 19291 10658 -38480 8060 18220 -37652
811c7652M0427K6432o3628K6720M2573n9784J0230M8737n9364J664O5301o0052
$$ -37652 2775 29207 -34421 -7701 34872 -24912 -14682 34055 -25309 -23645 41656 -18396
823a8396k9412P6957k1557l2023O2329l5591n1556Q6714N169p7399M5933J5410
$$ -18396 -47808 29149 7592 -24431 37898 2307 -49249 37465 42634 -34765 11168 26578
835B6578o5238N1674K6085q6240L5638O4661p2948J554N8312o4187o46P7911o0123
$$ 26578 -38660 13014 39099 -47141 -11503 53158 -19790 -18236 40076 -24111 -24757 53154 -6969
848f969l6662P6621l9777m7991Q1680j1708n9158O5306m664p0096O9045K9736
$$ -6969 -43631 32990 -6787 -54778 26902 15194 -43964 21342 16678 -53418 15627 45363
860D5363p9642L6138L6259p6727K6206N6791o8953P922O6283o5196j6402P7358
$$ 45363 -34279 1859 38118 -38609 -12403 44388 -24565 -16643 49640 -15556 -31958 45400
872D5400m1328l2258P0329l2665m9025O6474j5966o1443O6868J3085o9326L8811
$$ 45400 4072 -28186 42143 9478 -39547 26927 10961 -50482 16386 29471 -39855 -1044
884a044K0672o0326M3507M1567p1668R582M9919n5585k14N8131m5667j5856N7585
$$ -1044 19628 -40698 2809 44376 -27292 -17710 32209 -23376 -23590 34541 -11126 -26982 30603
897C0603l5681k7420O4766j4952m3141M9016k688m5729M0059N158n0761L6221
$$ 30603 -5078 -32498 32268 17316 -25825 23191 20503 -25226 14833 19991 -30770 5451
909E451K3956n3774J3875L2510l8624R773L5197m0460m867M0435l0532j8334L9538
$$ 5451 29407 -24367 -10492 22018 -16606 -6833 28364 -12096 -16963 23472 -7060 -25394 14144
922A4144j5522k1447L3774j0022k6261L4306L792k9276K5322R959l0961J2823
$$ 14144 -1378 -22825 10949 927 -25334 8972 12764 -16512 8810 18769 -12192 631
934F31J3445k6077J1754J9517k6526r51K0916j6905k412K5225j2033j1733J4994
$$ 631 14076 -12001 -247 19270 -7256 -8207 12709 -4196 -6608 18617 6584 -5149 9845
947I845j1736j0855K0845j938j8526J0458J496j3026J0995N753j0363J0141O106
$$ 9845 -1891 -12746 8099 6161 -12365 -1907 -411 -13437 -2442 3311 -7052 3089 9195
960I195j6838j038J0623l210K925M245j1502l639R995l76O19R110k855o610J021
$$ 9195 -7643 -8681 1942 -1268 1657 5902 -5600 -9239 756 380 999 10109 7254 644 1665
975A665q07N07O493j549q041k114k3J32M489K045j415j325k579r91K418J256k29
$$ 1665 858 1365 7858 6309 -1732 -3846 -3869 -3737 752 2797 1382 57 -2522 -3513 -1095 161 -68
992f8j494l243q55J774o82J198M967Q84j389K30j613O13N684K05m649k36j514
$$ -68 -1562 -4805 -5660 -3886 -4568 -3370 1597 2481 1092 1322 -291 322 6006 6211 1562 1326 -188
1009a88k453M084J973j976J574j36m470J747M151l265j467K09l616l78L326l580
$$ -188 -2641 1443 3416 1440 3014 2878 -1592 155 4306 1041 -426 -217 -3833 -4211 -885 -4465
1025d465j929L806R97K69L704l019l804L669K818l30J687k450o342J663N200J780
$$ -4465 -6394 -2588 -1591 -1322 2382 -637 -4441 -772 2046 1716 3403 953 -5389 -3726 1474 3254
1041C254K005p22n584m22N031J121j56k92m736k328J905r6o49R88Q6q44J320q70
$$ 3254 5259 4537 -1047 -1469 3562 4683 4527 4235 -501 -2829 -924 -1020 -1669 -681 -595 -1439 -119 -989
1059i89k619J367K698J044j84l619m878K88N587M329J159l275n267k32N714N767
$$ -989 -3608 -2241 457 1501 1317 -2302 -7180 -6892 -1305 3024 4183 908 -4359 -4591 1123 6890
1075F890O57l420n698k883L532M800J253k534l757j193J737K932L22j217j348
$$ 6890 7547 4127 -1571 -4454 -922 3878 5131 2597 -1160 -2353 -616 2316 2638 1421 73
1090G3o92M7n13j778p49J294J897L62j484k219k64L603L213M23k157l528j286
$$ 73 -619 -572 -1085 -2863 -3612 -2318 -421 -59 -1543 -3762 -4026 -423 2790 3213 1056 -2472 -3758
1107c758L858L544r56j445j938j520L660L299j545j652j5j773J587K272l726k478
$$ -3758 100 3644 2688 1243 -695 -2215 1445 4744 3199 1547 1532 -241 1346 3618 -108 -2586
1123b586J496K7M40K367l304l400L370J275q22K597j578m522K116K917k045K668
$$ -2586 -1090 -1063 -623 1744 -1560 -4960 -1590 -315 -1137 1460 -118 -4640 -2524 393 -1652 1016
1139A016J250m662J147L969k365r5M620k817j405K815m251j771N807R37l718J104
$$ 1016 2266 -2396 -1249 2720 355 260 4880 2063 658 3473 -778 -2549 3258 4195 477 1581
1155A581k822l777O096L253m303k17p34m401L167M308l636K07K336m120n91M208
$$ 1581 -1241 -5018 1078 4331 28 -189 -923 -5324 -2157 2151 -1485 -1278 1058 -3062 -3653 555
1171E55k004K85M404j651m469J859K17P2N219nm968r48R73j8L440J950l018k603
$$ 555 -1449 -1164 3240 1589 -2880 -1021 -804 -732 4487 4482 -486 -1434 -461 -479 2961 4911 1893 -710
1189g10j433k95K962L668q56n022l283J785N051J053k690l111j646M047L848m635
$$ -710 -2143 -2438 524 4192 3336 -1686 -4969 -3184 1867 2920 230 -2881 -4527 -480 3368 -1267
1205a267l048L121N35J330L146n439l661Q014Q90m229M473k756o790P586L823
$$ -1267 -4315 -1194 -659 671 3817 -1622 -5283 2731 3621 -608 3865 1109 -5681 1905 5728
1220E728p929L745K674r955N241R264j1223p88Q770r413j249J3173r594p238J3290
$$ 5728 -2201 1544 4218 -5737 -496 8768 -2455 -3243 5527 -3886 -5135 8038 -1556 -8794 4496
1235D496o076p928J7759k816j6723J1713K672j1650J6597L459k5748P907J6287
$$ 4496 -1580 -9508 8251 5435 -11288 425 3097 -8553 8044 11503 -14245 -6338 9949
1248I949j4235N802J1390k3554K219K5988j7418r584K1946j2810j0407K4874j2537
$$ 9949 -4286 1516 12906 -10648 -8429 17559 141 -9443 12503 -307 -10714 14160 1623
1261A623k0964K7930J136k4648K0393L426k7591K1319J3641l1168J2024K0383
$$ 1623 -19341 8589 9725 -14923 5470 8896 -18695 2624 16265 -14903 -2879 17504
1273A7504l1816L571K7422k5427p86L0957k7657j4270L7392j1762j8839L1264
$$ 17504 -14312 -10741 16681 -8746 -9532 21425 -6232 -20502 16890 5128 -13711 17553
1285A7553j2901k8687L5216L594l3995K4519R093l5228K2203K0246l8857J0777
$$ 17553 4652 -24035 11181 14775 -19220 5299 14392 -20836 1367 21613 -17244 -6467
1297f467K9249l3578J373L0964l2736o681M0629k2522k1086L4905j3048k1862
$$ -6467 22782 -10796 -9423 21541 -11195 -17876 22753 231 -20855 14050 1002 -20860
1309b0860L8851o730l5972L1888Q866l4705K2418J2267l7093J9437K4462l9236
$$ -20860 17991 11261 -24711 7177 16043 -18662 3756 16023 -21070 -1633 22829 -16407
1321a6407N217L3371k8828l947L0625k6146r816L9615k0170k6209L3899m432k4594
$$ -16407 -11190 22181 -6647 -10594 20031 -6115 -15931 23684 3514 -22695 11204 6772 -17822
1334a7822K9149l007l1850K8827J2669l4039J4338J7571k9000R837K1263l1340
$$ -17822 11327 8320 -23530 5297 17966 -16073 -1735 15836 -13164 -3327 17936 -13404
1346a3404R37K9454k0487q470K5719j6962j2332L0683o631k0643K0269l147k0400
$$ -13404 -12467 16987 -3500 -11970 13749 -3213 -15545 15138 8507 -12136 8133 4986 -15414
1359a5414K2297O171k5736R985J2077j8464P716J3032j8947K592J8708j5698r187
$$ -15414 6883 13054 -12682 -2697 9380 -9084 -1368 11664 -7283 -4691 14017 -1681 -10868
1372a0868J6626m740o014J1416q625j0605J6279M362j4090M252O923n747K613
$$ -10868 5758 1018 -4996 6420 -2205 -12810 3469 7831 -6259 -2007 4916 -831 1782
1385A782K395j0222L109J2197o332j1311N202M358p83M149j730q194L942Q383
$$ 1782 4177 -6045 -2936 9261 2929 -8382 -3180 1178 395 4544 2814 -5380 -1438 6945
1399F945o306l854P272l304p395P075J822p392O227K704j0662O590J0285j3531
$$ 6945 639 -3215 4057 753 -6642 433 2255 -5137 1090 3794 -6868 -278 10007 -3524
$$ [...]
8191i2
##END NTUPLES=NMR FID
##END=
