##TITLE=1H_LR-723-R2-C
 CDCl3, 8 sc, 
 20.10.2020
##JCAMPDX= 6.0         $$ Bruker NMR JCAMP-DX V2.0
##DATA TYPE= NMR FID
##DATA CLASS= NTUPLES
##ORIGIN= UXNMR, Bruker Analytische Messtechnik GmbH
##OWNER= root
$$ XWIN-NMR		Version 3.5
$$ Tue Oct 20 12:26:03 2020 Russian Standard Time (UT+4h)  she@DPX200
##.OBSERVE FREQUENCY= 200.1315066352
##.OBSERVE NUCLEUS= ^1H
##.DELAY= (6, 6)
##.ACQUISITION MODE= SIMULTANEOUS
##.ACQUISITION SCHEME= undefined
##.AVERAGES= 8
##.DIGITISER RES= 18
##SPECTROMETER/DATA SYSTEM= spect
##.PULSE SEQUENCE= zg30
##.SOLVENT NAME= CDCl3
##.SHIFT REFERENCE= (INTERNAL, CDCl3, 0, 15.7039)
##AUDIT TRAIL= $$ (NUMBER, WHEN, WHO, WHERE, WHAT)
$$ ##TITLE= Audit trail, XWIN-NMR		Version 3.5
$$ ##JCAMPDX= 5.01
$$ ##ORIGIN= Bruker BioSpin GmbH
$$ ##OWNER= she
$$ F:/spectra/data/she/nmr/H-F/1/audita.txt
$$ ##AUDIT TRAIL=  $$ (NUMBER, WHEN, WHO, WHERE, WHAT)
(   1,<2020-10-20 12:24:55.87 +0400>,<she>,<DPX200>,
      <created by zg, POWCHK disabled, PULCHK disabled
       configuration hash MD5:
       00 E9 B6 7A A2 85 ED C7 34 08 36 98 17 FE 4E 26
       data hash MD5: 16K
       CD F8 D4 17 32 9F B8 55 6A 2E 41 49 48 51 CE 2A>)
$$ ##END=
$$ 
$$ hash MD5
$$ EB 31 7A 72 89 82 D5 89 5F 09 11 A1 32 C8 2A 20
##$RELAX= 
##$RELAX= 
##$RELAX= 
##$RELAX= 
##$RELAX= 
##$RELAX= 
$$ Bruker specific parameters
$$ --------------------------
##$DU= <F:/spectra>
##$EXPNO= 1
##$NAME= <H-F>
##$PROCNO= 1
##$TYPE= <nmr>
##$USER= <she>
##$AMP= (0..31)
100 100 100 100 100 100 100 100 100 100 100 100 100 100 100 100 100 100 
100 100 100 100 100 100 100 100 100 100 100 100 100 100 
##$AQSEQ= 0
##$AQ_mod= 1
##$AUNM= <au_zg>
##$AUTOPOS= <>
##$BF1= 200.13
##$BF2= 200.13
##$BF3= 200.13
##$BF4= 200.13
##$BF5= 200.13
##$BF6= 200.13
##$BF7= 200.13
##$BF8= 200.13
##$BYTORDA= 1
##$CFDGTYP= 0
##$CFRGTYP= 5
##$CHEMSTR= <none>
##$CNST= (0..31)
1 1 145 1 1 1 1 1 1 1 1 1 1 1 1 1 1 1 1 1 1 1 1 1 1 1 1 1 1 1 1 1 
##$CPDPRG= <>
##$CPDPRG1= <>
##$CPDPRG2= <>
##$CPDPRG3= <>
##$CPDPRG4= <mlev>
##$CPDPRG5= <mlev>
##$CPDPRG6= <mlev>
##$CPDPRG7= <mlev>
##$CPDPRG8= <mlev>
##$CPDPRGB= <>
##$CPDPRGT= <>
##$D= (0..31)
0 1.2 0 0 0 0 0 0 0 0.06 0 0.03 0 0 0 0 0.0002 0 0 0 0 0 0 0 0 0 0 0 0 
0 0 0 
##$DATE= 1603182295
##$DBL= (0..7)
120 120 120 120 120 120 120 120 
##$DBP= (0..7)
150 150 150 150 150 150 150 150 
##$DBP07= 0
##$DBPNAM0= <>
##$DBPNAM1= <>
##$DBPNAM2= <>
##$DBPNAM3= <>
##$DBPNAM4= <>
##$DBPNAM5= <>
##$DBPNAM6= <>
##$DBPNAM7= <>
##$DBPOAL= (0..7)
0.5 0.5 0.5 0.5 0.5 0.5 0.5 0.5 
##$DBPOFFS= (0..7)
0 0 0 0 0 0 0 0 
##$DE= 6
##$DECBNUC= <off>
##$DECIM= 32
##$DECNUC= <off>
##$DECSTAT= 4
##$DIGMOD= 1
##$DIGTYP= 9
##$DL= (0..7)
0 120 120 120 120 120 120 120 
##$DP= (0..7)
150 150 150 150 150 150 150 150 
##$DP07= 0
##$DPNAME0= <>
##$DPNAME1= <>
##$DPNAME2= <>
##$DPNAME3= <>
##$DPNAME4= <>
##$DPNAME5= <>
##$DPNAME6= <>
##$DPNAME7= <>
##$DPOAL= (0..7)
0.5 0.5 0.5 0.5 0.5 0.5 0.5 0.5 
##$DPOFFS= (0..7)
0 0 0 0 0 0 0 0 
##$DQDMODE= 0
##$DR= 18
##$DS= 0
##$DSLIST= <SSSSSSSSSSSSSSS>
$$ [...]
##$SUBNAM2= <"">
##$SUBNAM3= <"">
##$SUBNAM4= <"">
##$SUBNAM5= <"">
##$SUBNAM6= <"">
##$SUBNAM7= <"">
##$SUBNAM8= <"">
##$SUBNAM9= <"">
##$SW= 16.880792210976
##$SWIBOX= (0..15)
0 0 2 0 0 0 0 0 0 0 0 0 0 0 0 0 
##$SW_h= 3378.37837837838
##$TD= 16384
##$TD0= 1
##$TE= 0
##$TE2= 300
##$TE3= 300
##$TEG= 300
##$TL= (0..7)
0 120 120 120 120 120 120 120 
##$TP= (0..7)
150 150 150 150 150 150 150 150 
##$TP07= 0
##$TPNAME0= <>
##$TPNAME1= <>
##$TPNAME2= <>
##$TPNAME3= <>
##$TPNAME4= <>
##$TPNAME5= <>
##$TPNAME6= <>
##$TPNAME7= <>
##$TPOAL= (0..7)
0.5 0.5 0.5 0.5 0.5 0.5 0.5 0.5 
##$TPOFFS= (0..7)
0 0 0 0 0 0 0 0 
##$TUNHIN= 0
##$TUNHOUT= 0
##$TUNXOUT= 0
##$USERA1= <user>
##$USERA2= <user>
##$USERA3= <user>
##$USERA4= <user>
##$USERA5= <user>
##$V9= 5
##$VALIST= <valist>
##$VCLIST= <CCCCCCCCCCCCCCC>
##$VD= 0
##$VDLIST= <DDDDDDDDDDDDDDD>
##$VPLIST= <PPPPPPPPPPPPPPP>
##$VTLIST= <TTTTTTTTTTTTTTT>
##$WBST= 1024
##$WBSW= 4
##$XGAIN= (0..3)
0 0 0 0 
##$XL= 0
##$YL= 0
##$YMAX_a= 232958
##$YMIN_a= -208169
##$ZGOPTNS= <>
##$ZL1= 120
##$ZL2= 120
##$ZL3= 120
##$ZL4= 120
##$ABSF1= 10
##$ABSF2= 0
##$ABSG= 5
##$ABSL= 3
##$ALPHA= 0
##$AQORDER= 0
##$ASSFAC= 0
##$ASSFACI= 0
##$ASSFACX= 0
##$ASSWID= 0
##$AUNMP= <proc_1d>
##$AZFE= 0.1
##$AZFW= 0.1
##$BCFW= 1
##$BC_mod= 2
##$BYTORDP= 1
##$COROFFS= 0
##$CY= 11.3945322036743
##$DATMOD= 1
##$DC= 2
##$DFILT= <>
##$DTYPP= 0
##$F1P= 16.9975609425685
##$F2P= -3.02152046262296
##$FCOR= 0.5
##$FTSIZE= 0
##$FT_mod= 4
##$GAMMA= 1
##$GB= 0.15
##$INTBC= 1
##$INTSCL= 1
##$ISEN= 128
##$LB= 0.24
##$LEV0= 0
##$LPBIN= 0
##$MAXI= 10000
##$MC2= 0
##$MEAN= 0
##$ME_mod= 0
##$MI= 1.114404
##$NCOEF= 0
##$NC_proc= 0
##$NLEV= 6
##$NOISF1= 3.799351
##$NOISF2= 2.8
##$NSP= 1
##$NTH_PI= 0
##$NZP= 0
##$OFFSET= 15.70392
##$PC= 1
##$PHC0= -10843.3
##$PHC1= 7.200892
##$PH_mod= 1
##$PKNL= yes
##$PPARMOD= 0
##$PSCAL= 0
##$PSIGN= 0
##$REVERSE= no
##$SF= 200.130013532006
##$SI= 16384
##$SIGF1= 3
##$SIGF2= 2
##$SINO= 400
##$SIOLD= 16384
##$SREGLST= <1H.CDCl3>
##$SSB= 0
##$STSI= 0
##$STSR= 0
##$SW_p= 3612.71676300578
##$SYMM= 0
##$S_DEV= 0
##$TDeff= 0
##$TDoff= 0
##$TI= <>
##$TILT= no
##$TM1= 0
##$TM2= 0
##$TOPLEV= 0
##$USERP1= <user>
##$USERP2= <user>
##$USERP3= <user>
##$USERP4= <user>
##$USERP5= <user>
##$WDW= 1
##$XDIM= 8192
##$YMAX_p= 0
##$YMIN_p= 0
$$ End of Bruker specific parameters
$$ ---------------------------------
##NTUPLES= NMR FID
##VAR_NAME=  TIME,          FID/REAL,        FID/IMAG
##SYMBOL=    X,             R,               I
##VAR_TYPE=  INDEPENDENT,   DEPENDENT,       DEPENDENT
##VAR_FORM=  AFFN,          ASDF,            ASDF
##VAR_DIM=   8192,          8192,            8192
##UNITS=     SECONDS,       ARBITRARY UNITS, ARBITRARY UNITS
##FACTOR=    0.000296,      1,               1
##FIRST=     0,             0,               0
##LAST=      2.424536,      0,               0
##MIN=       0,             -208169,         0
##MAX=       2.424536,      232958,          0
$$ Real data points
##PAGE= N=1
##DATA TABLE= (X++(R..R)), XYDATA
$$ plain form
0 0 0 0 0 0 0 0 0 0 0 0 -3 8 -8 8 -8 16 -16 20 -24 32 -33 40 -49 57 -72 81 -97 112 -129 146 -169 193 -221
33 -221 248 -281 319 -359 401 -450 502 -558 622 -689 767 -849 936 -1033 1141 -1258 1385
50 1385 -1526 1680 -1853 2040 -2254 2489 -2759 3064 -3416 3826 -4311 4897 -5618 6533 -7735
65 -7735 9393 -11856 15932 -24396 80937 -150205 -58633 46025 -53819 232958 -122155
76 -122155 -118804 170980 -71017 42707 9981 -178549 163374 -26768 -110950 115751 -95145
87 -95145 43427 65218 -173460 105214 9384 -83464 123156 -72041 19920 70740 -164054
98 -164054 76346 55950 -68789 58259 -120046 494 142946 -101946 -21451 -34545 -56754
109 -56754 142523 -39701 -69091 51185 -57784 58210 20657 -84144 73761 -1957 -10469
$$ packed form
0@%%%%%%%%%%lJ1j6J6j6K4l2L6m4N6o5P3q9J06j29J53j78K09k41K75l15L62m14
33b21M69n29O00o78P60q51R52j060J180j311J456j616J785j969K174k399K643
50A385k911L206l533L893m294M743n248N823o480P242q137R208j0515J2151j4268
65g735J7128k1249K7788m0328J05333k31142R1572J04658r9844K86777l55113
76a22155L351K89784k41997J13724l2726j88530L41923j90142q4182K26701k10896
87i5145J38572K1791k38678K78674r5830r2848K06620j95197R1961N0820k34794
98a64054K40400k0396j24739J27048j78305J20540J42452k44892Q0495j3094k2209
109e6754J99277j82224k9390J20276j08969J15994l7553j04801J57905p5718q512
$$ plain form
120 -10469 56430 -64950 24998 33173 -51099 37661 -28542 -16289 62370 -30502 -1577 -14862
132 -14862 -46636 57683 16110 -4983 15910 -31652 34916 28194 -17365 22028 -12902 13453
144 13453 34665 -12722 19780 -15992 -33306 14892 -10401 22066 7648 -41519 14596 -7057
156 -7057 -7554 17168 -30514 27301 24468 -28881 20543 -10845 6209 30073 -53601 1612 24332
169 24332 -10185 29390 -47531 -38376 32199 -28810 10188 2665 -41855 34993 -17063 -23911 35838
182 35838 -31772 9387 16329 -32027 47666 384 -29501 24551 -33714 11585 28332 -38829
194 -38829 25209 -3496 -30616 25929 -30998 1185 30218 -35347 19095 10120 -12785 40144
206 40144 -21371 -11065 32928 -11306 32330 16120 -25708 24535 -13096 -10100 26147 -20849
$$ packed form
120a0469O6899j21380Q9948Q175q4272Q8760o6203J2253P8659r2872K8925j3285
132a4862l1774J04319m1573k1093K0893m7562O6568o722m5559L9393l4930K6355
144A3453K1212m7387L2502l5772j7314M8198k5293L2467j4418m9167N6115k1653
156g057m97K4722m7682N7815k833n3349M9424l1388J7054K3864q3674N5213K2720
169B4332l4517L9575p6921R155P0575o1009L8998p523m4520P6848n2056o848N9749
182C5838o7610M1159O942m8356P9693m7282k9885N4052n8265M5299J6747o7161
194c8829O4038k8705k7120N6545n6927L2183K9033o5565N4442q975k2905N2929
206D0144o1515J0306M3993m4234M3636j6210m1828N0243l7631K996L6247m6996
$$ plain form
218 -20849 10612 9581 -26350 18306 -7847 -14387 18336 -16495 11368 22293 -11337 17068
230 17068 -3254 -12347 18895 -7064 6617 14689 -15746 3673 -7052 -16949 5931 -14181 -7660
243 -7660 5172 -11401 3522 -3874 -15806 1621 -6107 1242 12195 -2040 4216 -673 -9483
256 -9483 2217 -2907 -1169 4487 -5162 -1205 -2924 -9411 -4286 -7939 -5222 1914 -806 2796 1615
271 1615 -2612 595 -474 2620 7993 7313 8947 6904 2587 1412 -1211 179 3264 3363 3812 1122
287 1122 -2348 -3464 -4338 -2203 1227 3323 5624 6140 4975 3269 1309 1852 4474 7099 8103 6242
303 6242 2196 -2128 -4644 -4496 -3112 -2345 -2501 -2678 -2963 -3656 -4770 -5831 -5369 -2536 2074 5168 4995
320 4995 1397 -3672 -4813 -2715 494 3455 1323 -2498 -4465 -7018 -5825 -5052 -6832 -4287 -3711 -1849
$$ packed form
218b0849L1461j031l5931M4656k6153o540L2723l4831K7863J0925l3630K8405
230A7068k0322r093L1242k5959J3681Q072l0435J9419j0725r897K2880k0112O521
243g660J2832j6573J4923p396j1932J7427p728P349J0953j4235O256m889q810
256i483J1700n124J738N656r649L957j719o487N125l653K717P136k720L602j181
271A615m227L207j069L094N373o80J634k043m317j175k623J390L085R9M49k690
287A122l470j116q74K135L430K096K301N16j165j706j960N43K622K625J004j861
303F242m046m324k516J48J384P67j56j77k85o93j114j061M62K833M610L094j73
320D995l598n069j141K098L209K961k132l821j967k553J193P73j780K545N76J862
$$ plain form
336 -1849 2063 -2307 -4055 -3844 -5018 3948 6970 4831 6860 -640 -918 3423 -1337 4186 3076 -2321
352 -2321 5139 -105 -1369 1976 -9628 -3290 2260 132 12352 3416 -3784 3963 -3811 7024
366 7024 13168 1105 10505 3471 -1770 11046 -2941 -1279 2666 -10763 6015 4693 -5922 3589
380 3589 -13594 -8883 6356 -5451 8281 4946 -8079 7795 -4404 -2786 10454 -6955 3107
393 3107 3000 -8485 9513 -4118 -12397 -3178 -16036 1981 8854 -8508 -949 -12522 -10697 8542
407 8542 -3814 1836 2758 -7562 8427 1915 -1946 6018 -8233 -776 3825 -789 11077 -2458
421 -2458 -9363 -2885 -8102 5354 3424 -3861 6774 -3651 -1561 2533 -2905 14111 3722 -5854
435 -5854 8415 4593 17788 6622 -20940 1772 6793 11376 13732 -21650 -3224 9763 -8579
$$ packed form
336a849L912m370j748K11j174Q966L022k139K029p500k78M341m760N523j110n397
352b321P460n244j264L345j1604O338N550k128J2220q936p200P747p774J0835
366G024O144j2063R400p034n241J2816j3987J662L945j3429J6778j322j0615R511
380C589j7183M711J5239j1807J3732l335j3025J5874j2199J618J3240j7409J0062
393C107j07j1485J7998j3631q279R219j2858J8017O873j7362P559j1573J825J9239
407H542j2356N650R22j0320J5989o512l861P964j4251P457M601m614J1866j3535
421b458o905O478n217J3456j930p285J0635j0425K090M094n438J7016j0389r576
435e854J4269l822J3195j1166k7562K2712N021M583K356l5382J8426J2987j8342
$$ plain form
448 -8579 7917 -11156 -5610 21731 -12731 1325 10385 -11085 17568 -8739 -12916 27401 -6877
461 -6877 4497 8383 -26788 13463 -6561 -19030 27638 -14634 -8948 3632 -31352 25819 7226
474 7226 -34759 11978 -12893 13259 32391 -42981 -68 11736 -13966 32803 -22644 -16374
486 -16374 35942 -26178 3594 4134 -33790 34772 -8163 -24338 29359 -26225 10112 20938
498 20938 -39728 22831 -71 -13510 47215 -20853 -7662 18775 -29742 37002 12587 -33192
510 -33192 25811 -16035 3804 32514 -40835 7304 11380 -21764 34978 -13668 -13409 30446 -27273
523 -27273 10620 16977 -24139 31226 -2763 -13585 27327 -26299 3827 20833 -24215 14875
535 14875 -11087 -17601 32978 -16633 -13957 821 -22398 29400 8052 -25567 8943 -12324
$$ packed form
448h579J6496j9073N546K7341l4462J4056R060k1470K8653k6307m177M0317l4278
461f877J1374L886l5171M0251k0024j2469M6668m2272N686J2580l4984N7171j8593
474G226m1985M6737k4871K6152J9132p5372M2913J1804k5702M6769n5447O270
486a6374N2316o2120K9772N40l7924O8562m2935j6175N3697n5584L6337J0826
498B0938o0666O2559k2902j3439O0725o8068J3191K6437m8517O6744k4415m5779
510c3192N9003m1846J9839K8710p3349M8139M076l3144N6742m8646K59M3855n7719
523b7273L7893O357m1116N5365l3989j0822M0912n3626L0126J7006m5048L9090
535A4875k5962o514N0579m9611K676J4778k3219N1798k1348l3619L4510k1267
$$ plain form
547 -12324 6067 16940 -23624 8100 5691 -11014 12700 -12962 -2901 9111 -20513 2252
559 2252 2488 -5842 9586 -14350 -4699 7285 -10872 4906 1197 1732 12291 -12487 -2128 9153
573 9153 1834 9618 -11407 -4383 17709 946 3436 -9627 -12723 16944 25 -211 5485 -12482
587 -12482 11251 1345 -9935 16187 -5393 2757 13020 -11891 16178 4457 -13690 15747
599 15747 -9014 1163 15939 -18185 11166 2724 -21334 12460 -11414 -765 20532 -23440
611 -23440 2971 7195 -14057 20892 -12221 -13067 23165 -12439 7576 6464 -25629 16198 -5059
624 -5059 -15408 18545 -17447 597 9516 -26970 12150 -241 -16798 17698 -14788 -155
636 -155 18665 -20794 9398 3407 -16185 19786 -8514 -2968 20378 -18449 3097 4326 -15673
$$ packed form
547a2324J8391J0873m0564L1724k409j6705K3714k5662J0061J2012k9624K2765
559B252K36q330J5428k3936R651J1984j8157J5778l709N35J0559k4778J0359J1281
573I153p319P784k1025P024K2092j6763K490j3063l096K9667j6919k36N696j7967
587a2482K3733r906j1280K6122k1580Q150J0263k4911K8069j1721j8147K9437
599A5747k4761J0177J4776l4124K9351q442k4058L3794k3874J0649K1297m3972
611b3440K6411M224k1252L4949l3113q46L6232l5604K0015j112l2093M1827k1257
624e059j0349L3953l5992J8044Q919l6486L9120j2391j6557L4496l2486J4633
636a55J8820l9459L0192n991j9592L5971k8300N546K3346l8827K1546J229j9999
$$ plain form
649 -15673 19214 -5213 -10459 16637 -12171 4240 7737 -16748 14827 2069 -7293 17129 -6483
662 -6483 3790 10768 -14050 10537 6477 -5406 12634 -7119 -1014 10638 -11522 2138 1873
675 1873 -6740 10487 -3904 -4396 7344 -7171 1693 3143 -4825 9110 648 -3322 4672 -5349
689 -5349 -3 1704 -5671 2967 -1523 -5245 261 -5514 -2722 -1438 -5913 672 398 -1646 76
704 76 -3521 -695 788 -1755 525 391 1218 1137 -2593 -2091 -2076 -1082 501 -937 342 -582 -2019 -380
722 -380 -1687 33 1572 176 3123 2368 798 2275 -218 1623 3513 1349 3812 2586 575 2069
738 2069 -1031 145 2202 -345 1544 947 -207 2307 -394 -935 861 -213 3007 3609 1396 1965
754 1965 -632 -966 1410 594 1613 890 -1909 -1282 -1825 -2134 -1311 -2798 -2469 -1201 -1280 -314 -959 -2343
$$ packed form
649a5673L4887k4427n246K7096k8808J6411L497k4485L1575j2758r362K4422k3612
662f483J0273O978k4818K4587m060j1883J8040j9753O105J1652k2160J3660k65
675A873q613J7227j4391m92J1740j4515Q864J450p968J3935q462l970P994j0021
689e349N346J707p375Q638m490l722N506n775K792J284m475O585k74k044J722
704G6l597K826J483k543K280j34Q27q1l730N02J5R94J583j438J279r24j437J639
722c80j307J720J539j396K947p55j570J477k493J841J890k164K463j226k011J494
738B069l100J176K057k547J889n97j154K514k701n41J796j074L220O02k213N69
754A965k597l34K376q16J019p23k799O27n43l09Q23j487L29J268p9R66o45j384
$$ plain form
772 -2343 -2094 -1724 -128 1349 534 -479 -1555 -2086 -1338 -1028 -1189 -1451 -1801 -1369 -914 -1321 -1970 -2498 -1814
791 -1814 -45 1276 1632 705 -718 -666 160 1633 2776 1797 1078 900 564 1654 1223 207 621 120
809 120 1466 2608 974 663 -420 -890 1853 2007 2340 2832 209 1169 1698 574 2569 1015 555
826 555 2471 219 753 412 -2717 -620 -935 -957 1742 -1461 -2038 -1197 -2868 508 631 -1494 384
843 384 -1352 -525 1511 -1643 -1362 -1609 -2822 409 -327 -1722 -1465 -3903 -2780 -1195 -1586 -326 -581
860 -581 -1304 -656 -926 -700 390 667 -259 -19 937 844 1870 -487 -2681 621 849 2244 2785 -2997
878 -2997 -177 1655 -363 3895 -795 -1525 4816 -394 2779 3393 -3717 4362 1479 -1473 6879 -1677
894 -1677 1499 5672 -5970 2866 1418 -3660 8772 -3447 -4080 5314 -6659 4834 3282 -10222
$$ packed form
772b343K49L70J596J477q15j013j076n31P48L10j61k62l50M32M55m07o49n28O84
791a814J769J321L56r27j423N2Q26J473J143r79p19j78l36J090m31j016M14n01
809A20J346J142j634l11j083m70K743J54L33M92k623R60N29j124J995j554m60
826E55J916k252N34l41l129K097l15k2K699l203n77Q41j671L376J23k125J878
843C84j736Q27K036l154K81k47j213L231p36j395K57k438J123J585l91J260k55
860e81p23O48k70K26J090K77r26K40R56r3J026k357k194L302K28J395N41n782
878b997K820J832k018M258m690p30O341n210L173O14p110Q079k883k952Q352q556
894a677L176M173j1642Q836j448n078J2432j2219o33R394j1973J1493j552j3504
$$ plain form
908 -10222 6249 -1523 -2067 9996 -10224 -729 5918 -8517 8703 -2730 -9892 10429 -7690
921 -7690 -1841 5422 -14795 6676 2032 -11593 9470 -8493 -3487 11461 -14059 3114 4344
934 4344 -10677 13503 -5377 -9364 11528 -10787 4405 7770 -15545 9336 -831 -7533 14301
947 14301 -11285 -1653 10903 -11279 10525 1729 -11647 14256 -5166 -1507 11871 -12422 7935
960 7935 7237 -10412 11691 -4471 -3697 14370 -9749 2721 6741 -9368 11545 -1732 -8309
973 -8309 10648 -6154 2656 7480 -10886 6065 1206 -5708 9416 -5233 -1616 6254 -7396
986 -7396 4121 1595 -7031 4153 -3932 -2136 4455 -6249 -278 600 -4223 1990 -3350 -2559 2927
1001 2927 -1767 -841 -1940 -2091 1800 -923 -1793 -2200 -358 1632 -2469 -851 -1675 -1384 3116 -3071
$$ packed form
908a0222J6471p772n44J2063k0220R495O647j4435J7220j1433p162K0321j8119
921g690N849P263k0217K1471m644j3625K1063j7963N006J4948k5520J7173J230
934D344j5021K4180j8880l987K0892k2315J5192L365k3315K4881j0167o702K1834
947A4301k5586R632J2556k2182K1804q796j3376K5903j9422L659J3378k4293K0357
960G935o98j7649K2103j6162P74J8067k4119J2470M020j6109K0913j3277o577
973h309J8957j6802Q810M824j8366J6951m859o914J5124j4649L617P870j3650
986g396J1517k526q626J1184q085J796O591j0704N971Q78m823O213n340P91N486
1001B927m694R26j099j51L891k723q70m07J842J990m101J618q24K91M500o187
$$ plain form
1017 -3071 -8 2433 -3862 3461 -288 -2520 6289 -4049 209 5617 -5191 5480 779 -5199
1031 -5199 9029 -3804 -1058 8374 -6542 5845 2733 -8310 10703 -1761 -3021 9551 -8618
1044 -8618 4880 6346 -10644 9513 -876 -5321 11490 -8939 1789 8696 -11865 8096 869
1057 869 -8440 11455 -8621 -1588 10565 -13236 4179 2406 -9558 11495 -8574 -6923 12674
1070 12674 -9107 2016 811 -13042 13441 -1483 -10745 7265 -8609 4208 5959 -16769
1082 -16769 6139 3130 -6490 7247 -10950 -379 11816 -10495 1931 1529 -6060 10234 -6143
1095 -6143 -4438 10526 -6270 1000 2291 -5780 10089 -2022 -7063 8620 -829 2189 1923 -7785
1109 -7785 8868 5119 -5898 2086 -1794 4715 6802 -8321 -139 5231 686 3492 -4624 -1393
$$ packed form
1017c071L063K441o295P323l749k232Q809j0338M258N408j0808J0671m701n978
1031e199J4228j2833K746R432j4916J2387l112j1043J9013j2464j260J2572j8169
1044h618J3498J466j6990K0157j0389m445J6811k0429J0728O907k0561J9961p227
1057H69r309J9895k0076P033J2153k3801J7415j773j1964K1053k0069J651J9597
1070A2674k1781J1123j205j3853K6483j4924r262J8010j5874J2817J751k2728
1082a6769K2908l009r620J3737j8197J0571J2195k2311J2426m02p589J6294j6377
1095f143J705J4964j6796P270J291q071J5869j2111n041J5683r449L018k66r708
1109g785J6653l749j1017P984l880O509K087j5123Q182N370m545K806q116L231
$$ plain form
1123 -1393 7939 -623 -1563 137 -996 4735 -155 -3611 2201 338 -517 -212 -2311 1085 699 -2754
1139 -2754 -435 489 -925 -1206 -1843 -374 1467 -1575 -3324 -255 281 -370 -1317 -3400 -82 1238
1155 1238 -2223 -844 -1026 -1194 1201 -2309 -1652 1503 -1533 356 -21 -2620 1283 -684 -876 2571
1171 2571 -1368 -2 1649 -1163 2637 553 -1651 2954 295 751 2191 -1815 1945 1782 -1623
1186 -1623 2108 210 586 3095 -1354 942 2405 -505 2316 579 -82 3308 -165 139 1603 -1234
1202 -1234 1073 404 -1034 1800 -668 -1295 330 -1373 554 425 -1816 351 -357 -801 372 -1492
1218 -1492 -742 1 -1515 -206 -494 -1189 -457 -1830 -1483 -315 -1150 -603 -876 -1493 -545 -982 -1175 -571
1236 -571 -966 -405 162 -224 82 -438 -751 -35 398 905 866 140 -127 -94 293 715 539 144 145 415 830
$$ packed form
1123a393R332q562r40J700j133N731m890l456N812j863q55L05k099L396l86l453
1139b754K319R24j414k81o37J469J841l042j749L069N36o51r47k083L318J320
1155A238l461J379j82j68K395l510O57L155l036J889l77k599L903j967j92L447
1171B571l939J366J651k812L800k084k204M605k659M56J440m006L760j63l405
1186a623L731j898L76K509m449K296J463k910K821j737o61L390l473L04J464k837
1202a234K307o69j438K834k468o27J625j703J927j29k241K167p08m44J173j864
1218a492P50P43j516J309k88o95P32j373L47J168q35N47k73o17R48m37j93O04
1236e71l95N61N67l86L06n20l13P16M33N07l9p26k67L3L87M22j76l95JK70M15
$$ plain form
1257 830 1151 744 314 332 853 1726 2077 1670 904 370 562 1187 1460 1221 523 -72 109 415 403 109 -491
1278 -491 -291 382 697 701 15 -678 -643 -148 649 932 -36 -738 -1117 -996 -174 -378 -1015 -1213 -1544 -961 -177
1299 -177 -874 -1448 -1999 -1950 -221 169 -68 -421 -1885 -1374 -191 -94 746 -62 -1127 -76 -443 -46 470
1318 470 -1167 -530 50 -413 1316 314 -822 -91 -1128 743 2437 609 1198 378 -187 2516 1283
1335 1283 754 1616 -469 1554 2395 -12 1145 -819 -1331 1837 394 1113 1647 -1712 264 563 -360
1352 -360 2728 430 -488 1582 -896 1039 1528 -1981 228 -834 -1650 2046 -811 -1489 -677 -3900
1368 -3900 -294 1161 -1627 470 -2047 -2419 1870 -1295 -1065 232 -2707 1277 983 -2242 1144 -1588
1384 -1588 -2421 863 -2173 800 2154 -3478 -778 -888 -1663 3104 -1391 -1821 2636 -1316 1249 1898
$$ packed form
1257H30L21m07m30J8N21Q73L51m07p66n34J92O25K73k39o98n95J81L06j2k94o00
1278d91K00O73L15Mo86o93L5M95P97K83r68p02l79J21Q22k04o37j98l31N83P84
1299a77o97n74n51M9J729L90k37l53j464N11J183R7Q40q08j065J051l67L97N16
1318D70j637O37N80m63J729j002j136P31j037J871J694j828N89q20n65K703j233
1335A283n29Q62k085K023Q41k407J157j964n12L168j443P19N34l359J976K99r23
1352c60L088k298r18K070k478J935M89l509K209j062q16L696k857o78Q12l223
1368c900L606J455k788K097k517l72M289l165K30J297k939L984k94l225L386k732
1384a588q33L284l036K973J354n632K700j10p75M767m495m30M457l952K565O49
$$ plain form
1400 1898 -2157 2946 331 -2162 4423 1321 1125 1743 -4880 1704 4283 -1698 1746 -1588 -824 5592
1416 5592 -2693 -1568 3347 -1176 3822 579 -3194 6479 794 -2634 1809 -2903 4608 4484 -6434
1431 -6434 778 134 -1771 3938 -5572 -1818 4968 -4395 721 231 -4024 5047 -3511 -4595 5672
1446 5672 -1709 1367 487 -7915 4094 1233 -4990 2993 -3961 -236 4017 -7992 210 2319 -4403
1461 -4403 3043 -4009 -2474 8137 -3555 -2640 803 -3652 7620 1536 -6683 4224 85 1106
1475 1106 3197 -7628 2513 5920 -3904 1632 -2246 -512 7724 -5273 -3711 4845 637 5856
1489 5856 -768 -6574 6924 2777 -1292 2689 -3342 4612 5380 -6648 920 1869 -1378 3366 -5190
1504 -5190 -1346 7374 -3361 -2207 -80 -2926 5985 -967 -5721 5548 453 -1036 616 -6300
$$ packed form
1400A898m055N103k615k493O585l102j96O18o623O584K579n981L444l334P64O416
1416E592q285J125M915m523M998l243l773R673n685l428M443m712P511j24j0918
1431f434P212o44j905N709r510L754O786r363N116m90m255R071q558j084J0267
1446E672p381L076q80q402J2009k861o223P983o954L725M253j2009Q202K109o722
1461d403P446p052J535J0611j1692R15L443m455J1272o084q219J0907m139J021
1475A106K091j0825J0141L407r824N536l878J734Q236j2997J562Q556m208N219
1489E856o624n806J3498m147m069L981o031P954P68j2028P568R49l247M744q556
1504e190L844Q720j0735J154K127k846Q911o952m754J1269n095j489J652o916
$$ plain form
1518 -6300 3901 4022 -7074 666 -238 -876 3586 -8777 -3509 6107 -2876 451 -2435 -5425 7269
1533 7269 -1559 -5830 3192 -2709 3815 3445 -8150 3340 1968 -3436 4404 -5062 -671 7338 -5359
1548 -5359 844 688 -5755 6618 -1313 -3746 6530 -3633 2208 4700 -6737 4957 2212 -2922
1562 -2922 7781 -2683 -260 6519 -6063 2382 2783 -4779 6384 -2181 -3554 6713 -4760 -223
1576 -223 2717 -5348 6681 1221 -5422 5410 -2005 480 3974 -7372 3343 4346 -4377 2591
1590 2591 -4301 -2282 5616 -6522 -2068 2358 -3224 3903 -3364 -6360 4631 -1710 -770 1873 -4589
1605 -4589 3709 1432 -5132 2429 -1395 -975 2745 -4291 1246 2612 -4252 65 -1862 -1574 3837
1620 3837 -2350 -926 2521 -1793 1198 89 -1469 4001 688 -571 2737 281 1909 952 -2793
$$ packed form
1518f300J0201J21j1096P740r04o38M462j2363N268R616q983L327k886k990J2694
1533G269q828m271R022n901O524l70j1595J1490j372n404P840r466M391Q009j2697
1548e359O203j56o443J2373p931k433J0276j0163N841K492j1437J1694k745n134
1562b922J0703j0464K423O779j2582Q445M01p562J1163q565j373J0267j1473M537
1576b23K940q065J2029n460o643J0832p415K485L494j1346J0715J003q723O968
1590B591o892K019P898j2138M454M426n582P127p267k996J0991o341R40K643o462
1605d589Q298k277o564P561l824M20L720p036N537J366o864M317j927K88N411
1620C837o187J424L447m314K991j109j558N470l313j259L308k456J628r57l745
$$ plain form
1635 -2793 1516 2238 610 1644 -1606 -1035 1263 -962 552 1358 -227 1360 485 -11 2127 354
1651 354 -276 1072 408 1878 1847 -1039 -559 -967 -1469 654 -168 -668 -78 -2197 -1367 10 -1219 -122
1669 -122 -693 -1235 1426 464 -497 -315 -2208 -574 924 -219 781 -887 -2432 -802 -1551 -674 260
1686 260 -1817 -742 -245 -724 789 -774 -1439 166 -32 1747 2264 201 240 -666 -452 1806 1267 899
1704 899 490 -996 234 680 -147 170 -723 -121 1535 1279 1280 352 -897 325 1404 2163 2572 898
1722 898 -36 24 201 1049 554 -521 -545 -465 298 460 -800 -1643 -1779 -785 996 1394 497 -758 -1579 -737
1742 -737 545 978 639 -619 -1126 -587 -338 -360 -1255 -2176 -1718 -681 207 119 -1295 -2257 -1991 -755 989
1761 989 1182 183 -475 -795 122 950 572 72 -378 -202 1003 1056 181 -981 -1886 -825 872 1542 1285
$$ packed form
1635b793M309P22j628J034l250N71K298k225J514Q06j585J587q75m96K138j773
1651C54o30J348o64J470l1k886M80m08n02K123q22n00N90k119Q30J377j229J097
1669a22n71n42K661r62r61J82j893J634J498j143J000j668j545J630p49Q77R34
1686B60k077J075M97m79J513j563o65J605j98J779N17k063L9r06K14K258n39l68
1704H99m09j486J230M46q27L17q93O02J656k56Jr28j249J222J079P59M09j674
1722H98r34O0J77Q48m95j075k4Q0P63J62j260q43j36R94J781L98q97j255q21Q42
1742g37J282M33l39j258n07N39K49k2q95r21M58J037Q88q8j414r62K66J236J744
1761I89J93r99o58l20R17Q28l78n00m50J76J205N3q75j162r05J061J697O70k57
$$ plain form
1780 1285 -308 -1216 -304 809 1837 1711 730 607 1133 1605 1702 771 -224 -295 518 1529 1702 319 -1368
1799 -1368 -1862 -791 677 1255 197 -638 -325 -127 581 757 -85 147 -142 275 1798 562 -820 -1843
1817 -1843 -2671 215 1175 -540 -795 -2781 -2041 18 -1578 -201 2 -1710 483 -523 -189 1991
1833 1991 -1829 -1511 332 -384 3196 485 -3021 23 -1954 -151 1804 -2296 881 233 -2783 1803
1849 1803 -564 -357 2300 -2639 1557 3711 -375 2947 -1185 -1957 4196 -346 1771 2904 -3048
1864 -3048 1922 -29 -2343 3781 -1823 -927 2629 -2743 2934 1641 -3614 2575 -1311 87 5500
1879 5500 -1871 1178 1228 -3899 3282 -349 -2301 3394 -3130 -525 1242 -4861 1685 -609 -4196
1894 -4196 2079 -2019 816 3355 -5216 -751 819 -978 4165 -2222 -2466 3174 -2014 -179 -717
$$ packed form
1780A285j593r08R12J113J028j26r81j23N26M72R7r31r95p1Q13J011J73j383j687
1799a368m94J071J468N78j058q35L13J98P08J76q42K32k89M17J523j236j382j023
1817a843q28K886R60j715k55j986P40K059j596J377K03j712K193j006L34K180
1833A991l820L18J843p16L580k711l506L044j977J803J955m100L177o48l016M586
1849A803k367K07K657m939M196K154m086L322m132p72O153m542K117J133n952
1864c048M970j951k314O124n604Q96L556n372N677j293n255O189l886J398N413
1879E500p371L049N0n127P181l631j952N695o524K605J767o103O546k294l587
1894d196O275m098K835K539q571M465J570j797N143o387k44N640n188J835n38
$$ plain form
1909 -717 -3647 2893 -699 -3117 1420 -1499 316 -503 -4613 1726 2539 250 1122 -2006 723 2566
1925 2566 -1094 693 1417 1192 1502 -1273 59 1852 -92 -1319 -1253 1647 2642 -28 -1492 -1325 1870
1942 1870 1754 -923 1080 1474 2213 1790 -2621 937 2684 -558 1166 -1661 268 4101 -3177 -2175
1958 -2175 -358 -2243 3573 -1487 -3539 3365 -2036 -160 778 -4773 4148 1537 -3361 3433 -3034
1973 -3034 47 3307 -6560 1327 1154 -3896 4370 -4245 -3243 4085 -6060 989 1775 -5218 5654
1988 5654 -1548 -3428 5748 -5037 978 4098 -5040 6116 190 -4889 5884 -3986 -42 4508
2002 4508 -6952 4182 2398 -4835 5189 -4293 -1541 6995 -4907 2851 3145 -4156 7137 -1592
2016 -1592 -3287 6502 -3274 3010 3939 -5994 4769 -59 -3833 4713 -5071 39 4827 -4809 2884
$$ packed form
1909g17k930O540l592k418M537k919J815q19m110O339Q13k289Q72l128K729J843
1925B566l660J787P24k25L10k775J332J793j944j227O6K900R95k670j464J67L195
1942A870j16k677K003L94P39m23m411L558J747l242J724k827J929L833p278J002
1958b175J817j885N816n060k052O904n401J876R38n551Q921k611m898O794o467
1973c034L081L260r867P887j73n050Q266q615J002P328j0145P049P86o993J0872
1988E654p202j880R176j0785O015L120r138J1156n926n079J0773r870L944M550
2002D508j1460J1134j784p233J0024r482K752Q536j1902P758K94p301J1293q729
2016a592j695R789r776O284R29r933J0763m828l774Q546r784N110M788r636P693
$$ plain form
2031 2884 -742 -4947 5072 -2179 -348 4245 -4403 2656 1693 -4052 3287 -2494 -1798 3963 -3472
2046 -3472 380 317 -4718 1721 -2057 -2995 2490 -2182 477 837 -4020 1254 213 -919 2139 -1765
2062 -1765 480 2314 -1279 445 -1290 -1748 1734 -70 344 245 -1997 -220 -444 -160 1102 -289
2078 -289 579 713 635 1453 -67 528 880 605 2201 829 993 1127 -1520 -8 17 231 2505 -925
2096 -925 -927 448 -1223 1566 21 -1579 1908 -115 1012 2273 -1695 568 -103 -1481 2857 74
2112 74 -507 682 -3322 -180 333 -2488 841 -1710 -1816 1575 -2067 -47 182 -3071 1134 191 -156
2129 -156 2777 -1825 -1182 314 -2131 1870 431 -1905 884 -2109 -802 1204 -2358 -62 -415 -1594
2145 -1594 2476 378 -306 850 -2040 986 2205 384 2419 39 -798 1429 -410 1023 1103 -1343
$$ packed form
2031B884l626m205J0019p251J831M593q648P059r63n745P339n781O96N761p435
2046c472L852o3n035O439l778r38N485m672K659L60m857N274j041j132L058l904
2062a765K245J834l593J724j735m58L482j804M14r9k242J777k24K84J262j391
2078b89Q68J34p8Q18j520N95L52k75J596j372J64J34k647J512K5K14K274l430
2096i25kJ375j671K789j545j600L487k023J127J261l968K263o71j378M338k783
2112G4n81J189m004L142N13k821L329k551j06L391l642K020K29l253M205r43l47
2129a56K933m602O43J496k445M001j439k336K789k993J307K006l562K296l53j179
2145a594M070k098o84J156k890L026J219j821K035k380q37K227j839J433Q0k446
$$ plain form
2161 -1343 714 433 173 1477 -1185 -1042 337 -63 2128 1586 -123 432 -729 375 1906 785
2177 785 906 80 -652 882 225 -415 -641 -1697 -442 394 85 -16 -1449 -1938 -831 -179 953 642
2195 642 -525 -575 -546 72 506 -375 -772 -712 -327 401 -222 -1196 -1814 -1852 -580 418 460 -203 -1198 -1220 -276
2216 -276 545 927 475 -60 302 757 1102 674 -324 -519 -140 840 1391 637 -450 -1101 -870 384 1013
2235 1013 929 463 -226 199 961 1044 868 144 279 1147 1441 1497 483 -887 -652 -254 610 1209 -131 -786
2255 -786 -1073 -1064 316 100 -439 -130 -790 413 1015 -91 50 -1088 -1076 1010 522 697 -126 -2390 -1087
2274 -1087 -780 -760 690 -1473 -1397 -182 -1494 350 -249 -1831 487 -601 356 2173 -837 131 -241
2291 -241 -1751 1880 581 -146 1365 -2166 -295 829 -1550 1569 -453 -1624 2044 -495 1126
$$ packed form
2161a343K057k81k60J304k662J43J379m00K191n42j709N55j161J104J531j121
2177G85J21q26p32J534o57o40k26j056J255Q36l09j01j433m89J107O52J132l11
2195F42j167n0K9O18M34q81l97O0L85P28o23r74o18l8J272R98M2o63r95k2R44
2216b76Q21L82m52n35L62M55L45m28r98j95L79R80N51p54j087o51K31J254O29
2235A013q4m66o89M25P62Q3j76p24J35Q68K94N6j014j370K35L98Q64N99j340o55
2255g86k87RJ380k16n39L09o60J203O02j106J41j138J2K086m88J75q23k264J303
2274a087L07K0J450k163P6J215j312J844n99j582K318j088R57J817l010R68l72
2291b41j510L631j299p27J511l531J871J124k379L119k022j171L668k539J621
$$ plain form
2306 1126 1727 -2580 1033 1194 353 3827 -645 -421 2029 -1589 1747 1147 -1547 2551 -860 -1030
2322 -1030 2128 -2070 513 513 -2568 2427 421 -666 2090 -2428 -21 1651 -1548 2586 314 -1972
2338 -1972 1491 -1858 -23 1276 -3200 23 -173 -1209 1627 -2468 -2033 463 -1796 900 342 -1384
2354 -1384 1350 -1023 -871 841 -955 841 252 -995 859 -695 -487 -166 -1400 9 -468 -153
2370 -153 885 -420 11 -983 -549 1782 551 1255 385 -676 2365 384 10 1056 -1360 2062 1611
2387 1611 -1303 1839 -1496 -809 2280 -2242 1588 1258 -2290 3257 -902 -1308 3026 -2798 2259 2797
2403 2797 -3369 3196 -859 -1493 4411 -4517 -331 2884 -3633 3865 -1965 -5237 4391 -3240 -134
2418 -134 2856 -6357 3851 1339 -4739 4391 -4147 -933 5812 -5502 2405 1144 -5929 5583
$$ packed form
2306A126O01m307L613J61q41L474m472K24K450l618L336o00k694M098l411j70
2322a030L158m198K583%l081M995k006j087K756m518K407J672l199M134k272k286
2338a972L463l349J835J299m476L223j96j036K836m095M35K496k259K696n58j726
2354a384K734k373J52J712j796J796n89j247J854j554K08L21j234J409m77L15
2370a53J038j305M31r94M34K331j231P04q70j061L041j981l74J046k416L422m51
2387A611k914L142l335O87L089m522L830l30l548N547m159m06M334n824N057N38
2403B797o166O565m055o34N904q928M186L215o517P498n830l272R628p631L106
2418a34K990r213J0208k512o078R130q538L214O745j1314P907j261p073J1512
$$ plain form
2432 5583 -2953 -3273 4934 -6271 2080 3255 -6786 4090 -2494 -3336 7494 -4891 181 3940
2446 3940 -5237 6222 -442 -5648 6584 -2576 1236 4639 -7379 4133 2188 -4767 5117 -4152
2460 -4152 -557 6822 -5194 2160 1256 -4865 6392 -1301 -1561 5641 -4487 2334 3371 -4412 4216
2475 4216 -1797 -2403 5930 -3180 87 1402 -4831 3856 -549 -3799 3376 -2368 913 1988 -5136
2490 -5136 1899 856 -1661 2743 -2989 -94 2912 -2719 688 -1260 -2516 2586 -1444 -476 421
2505 421 -3298 656 -319 -1191 1334 -2029 216 1330 -1064 1166 -1222 -496 1962 -904 1157 316
2521 316 -1016 1774 -1623 -411 1286 -1245 1986 -195 -1626 1980 -1335 825 1880 -2192 2181
2536 2181 607 -243 3555 -1903 -225 2057 -1548 3332 364 -2324 2783 -1789 56 2085 -3293
$$ packed form
2432E583q536l20Q207j1205Q351J175j0041J0876o584q42J0830j2385N072L759
2446C940r177J1459o664n206J2232r160L812L403j2018J1512j945o955R884r269
2460d152L595P379j2016P354r04o121J1257p693k60P202j0128O821J037p783Q628
2475D216o013o06Q333r110L267J315o233Q687m405l250P175n744L281J075p124
2490e136P035j043k517M404n732K895L006n631L407j948j256N102m030R68Q97
2505D21l719L954r75q72K525l363K245J114k394K230k388P26K458k866K061q41
2521C16j332K790l397J212J697k531L231k181j431L606l315K160J055m072M373
2536B181j574q50L798n458J678K282l605M880k968k688N107m572J845K029n378
$$ plain form
2551 -3293 2113 565 -2587 3026 -1818 -459 2389 -3624 1681 1524 -2091 3227 -2074 -1669 2643
2566 2643 -3050 1263 1148 -3473 2152 -1778 -2010 2710 -3449 -393 846 -3077 2890 -511 -2687
2581 -2687 2056 -2483 464 2307 -2647 1964 -17 -2370 2348 -1733 -259 1890 -2956 1021 668
2596 668 -1676 2207 -1771 -1212 2099 -1128 1807 1291 -1802 1849 -250 -141 2573 -836 859 1107
2612 1107 -1170 1872 225 -712 1116 -1252 551 1515 -572 818 -528 -1003 1249 -105 737 967
2628 967 -857 535 160 -108 1033 -615 -378 271 -344 734 -346 -1316 -531 -989 -94 324 -606 -286
2646 -286 -855 -935 -9 -295 84 -69 -709 60 13 36 -74 -1015 -519 -94 -105 363 -485 -905 -608 -712 194
2667 194 328 -155 74 -251 124 685 78 370 134 98 945 686 476 242 -433 29 495 485 806 -2 -279
$$ packed form
2551c293N406j548l152N613m844J359K848o013N305j57l615N318n301M05M312
2566B643n693M313j15m621N625l930k32M720o159L056J239l923N967l401k176
2581b687M743m539K947J843m954M611j981k353M718m081J474K149m846L977l53
2596F68k344L883l978N59L311l227K935n16l093L651k099J09K714l409J695K48
2612A107k277L042j647r37J828k368J803R64k087J390j346m75K252j354Q42K30
2628I67j824J392l75k68J141j648K37O49o15J078j080r70P85m58Q95M18r30L20
2646b86n69q0R26k86L79j53o40P69m7K3j10r41M96M25j1M68q48m20K97j04R06
2667A94J34m83K29l25L75N61o07K92k36l6Q47k59k10k34o75M62M66j0L21q08k77
$$ plain form
2688 -279 182 99 578 481 4 408 393 651 930 143 34 14 105 852 631 162 -58 -706 -277 135 -119 23
2710 23 -478 -624 -39 -232 -128 -272 -859 -157 29 112 384 -551 -679 -385 -536 290 9 -601 -285 -871 -496
2731 -496 3 -728 -321 -506 -712 390 -71 -172 50 -911 67 582 251 956 -235 -430 514 -232 570
2750 570 502 -543 470 30 -32 831 -477 8 468 -255 1158 594 54 862 -349 308 1087 63 1060
2769 1060 406 -317 814 -273 177 697 -763 332 103 -170 833 -624 -659 82 -477 743 299 -680
2787 -680 181 -532 16 293 -767 88 -227 -413 223 -833 -416 -309 -995 51 -628 -422 117 -926 -89
2806 -89 -399 -921 549 -264 154 448 -1232 478 276 -478 753 -1271 -41 1511 -803 487 -697
2823 -697 -1192 2073 -382 -334 930 -1248 1851 578 -1669 1889 -305 531 2090 -2005 1437 1293
$$ packed form
2688b79M61q3M79r7m77M04j5K58K79p87j09k0R1P47k21m69k20o48M29M12k54J42
2710B3n01j46N85j93J04j44n87P02J86Q3K72r35j28K94j51Q26k81o10L16n86L75
2731d96M99p31M07j85k06J102m61j01K22r61R78N15l31P05j191j95R44p46Q02
2750E70o8j045J013m40o2Q63j308M85M60p23J413n64n40Q08j211O57P79j024R97
2769A060o54p23J131j087M50N20j460J095k29k73J003j457l5P41n59J220m44r79
2787f80Q61p13N48K77j060Q55l15j86O36j056M17J07o86J046o79K06N39j043Q37
2806h9l10n22J470q13M18K94j680J710k02p54J231k024J230J552k314J290j184
2823f97m95L265k455M8J264k178L099j273k247L558k194Q36J559m095L442j44
$$ plain form
2839 1293 -1637 2196 -912 -491 2641 -2194 1271 1416 -2666 2031 -764 -603 3494 -2845 -109 2105
2855 2105 -1881 2666 -1436 -2768 4080 -1169 -317 897 -3919 3139 708 -3861 2008 -1981 336
2870 336 2692 -4977 867 1223 -2823 2773 -2467 -1326 3659 -3541 597 1306 -3308 2874 -1527 -1870
2886 -1870 3933 -3016 -328 1348 -3026 3299 -728 -3187 3402 -1331 397 1570 -3859 2741 1512
2901 1512 -2035 2478 -1861 455 3355 -2741 1043 741 -1459 3370 -967 -996 2064 -1857 1531 1201
2917 1201 -2084 1891 -311 22 2098 -2047 539 1316 -816 1485 -906 -393 1932 -1172 5 -17
2933 -17 -622 1351 -1107 -661 842 -826 77 -1081 -509 1581 -1184 -867 -313 -172 1625 -1901 -1722
2950 -1722 1274 -97 821 -1671 -2233 2521 -431 -1334 -221 -1734 2576 113 -3329 1443 -242 570
$$ packed form
2839A293k930L833l108M21L132m835L465J45m082M697k795J61M097o339K736K214
2855B105l986M547m102j332O848n249Q52J214m816P058k431m569N869l989K317
2870C36K356p669N844L56m046N596n240J141M985p200M138P09m614O182m401l43
2886a870N803o949K688J676m374O325m027k459O589m733J728J173n429O600j229
2901A512l547M513m339K316K900o096L784l02k200M829m337k9L060l921L388l30
2917A201l285L975k202L33K076m145K586P77k132K301k391N13K325l104J177k2
2933a7o05J973k458M46J503j668R03j158N72K090k765L17N54J41J797l526J79
2950a722K996j371R18k492n62M754k952r03J113j513M310k463l442M772j685Q12
$$ plain form
2966 570 1005 -3679 1998 2009 -2233 1383 -1567 554 3357 -3513 601 2077 -1460 2584 -2241 -1163
2982 -1163 4591 -2097 34 1122 -2114 4228 -735 -2873 3646 -1319 1031 1791 -3751 3492 891
2997 891 -2821 2894 -2018 710 3027 -4216 1721 1263 -2460 2974 -2533 -855 3752 -3273 675
3012 675 908 -2784 3352 -1629 -2350 3111 -2383 657 1027 -3836 2444 -286 -2256 2375 -2753 -6
3028 -6 2044 -3265 1372 -240 -2302 2670 -1773 -641 1851 -2618 1275 577 -2130 2025 -1072 -662
3044 -662 2106 -1847 689 804 -1628 1902 -362 -817 1729 -1135 735 1136 -1386 1265 265 -266
3060 -266 1632 -829 172 1193 -353 966 -66 -537 1378 105 139 326 -622 870 376 -375 363
3077 363 -294 313 445 -528 129 -75 -53 260 -483 -84 -107 -281 119 -511 -241 -65 -509 105 -390 -457 -4
$$ packed form
2966E70M35m684N677J1m242L616k950K121K803o870M114J476l537M044m825J078
2982a163N754o688K131J088l236O342m963k138O519m965K350P60n542P243k601
2997H91l712N715m912K728K317p243N937m58l723N434n507J678M607p025L948
3012F75K33l692O136m981p21N461n494L040L70m863O280k730j970M631n128K747
3028fK050n309M637j612k062M972m443J132K492m469L893o98k707M155l097M10
3044f62K768l953K536J15k432L530k264m55K546k864J870M01k522K651j000n31
3060b66J898k461J001J021j546J319j032m71J915j273L4J87r48J492m94p51P38
3077C63o57O07J32r73O57k04K2L13p43L99k3j74M00o30K70J76m44O14m95o7M53
$$ plain form
3098 -4 -657 -4 -114 -755 43 -458 -313 155 -742 -84 -29 -577 272 -478 -379 453 -506 50 75 -564 500
3119 500 -29 -310 537 -355 220 509 -411 538 207 -115 746 -89 246 585 -187 622 384 -94 718 133
3139 133 203 628 -127 421 415 -92 588 55 18 538 -133 151 208 -312 251 18 -147 257 -222 -69 -3 -393
3161 -393 93 -138 -281 43 -291 -220 -76 -440 -163 -175 -492 -131 -387 -347 -207 -541 -255 -202 -415 -53 -277
3182 -277 -264 -26 -364 -142 -115 -160 84 -101 -114 98 -182 3 69 -142 228 68 60 226 2 199 261 40 407
3205 407 292 198 393 128 245 434 198 454 359 201 402 239 197 305 96 206 135 129 295 37 52 75 -13
3228 -13 210 14 -38 185 -14 88 -146 -242 50 -160 -129 -176 -475 -33 -244 -391 -214 -519 -92 -92 -593 -21
3250 -21 -391 -284 80 -624 -16 50 -557 243 -331 -311 383 -807 -14 366 -543 476 -428 -606 855 -663
$$ packed form
3098do53O53j10o41P98n01J45M68q97O58N5n48Q49p50R9Q32r59N56K5o39J064
3119E00n29k81Q47q92N75K89r20R49l31l22Q61q35L35L39p72Q09k38m78Q12n85
3139A33P0M25p55N48on07O80n33l7N20o71K84N7n20N63k33j65M04m79J53O6l90
3161c93M86k31j43L24l34P1J44l64K77j2l17L61k56M0J40l34K86N3k13L62k24
3182b77J3K38l38K22K7m5K44j85j3K12k80J85O6k11L70j60qJ66k24J97O2k21L67
3205D07j15r4J95k65J17J89k36K56r5j58K01j63m2J08k09J10p1oJ66k58J5K3q8
3228a3K23j96n2K23j99J02k34r6K92k10L1m7k99M42k11j47J77l05M27%n01N72
3250b1l70J07L64p04O08O6o07Q00n74K0O94j190P93L80r09J019r04j78J461j518
$$ plain form
3270 -663 38 466 -735 1043 24 -790 1158 -255 390 976 -1090 1050 702 -608 1268 -752 -65
3287 -65 1640 -994 721 578 -1122 1624 -449 -499 1735 -1117 754 1045 -1432 1613 -216 -944 1772
3304 1772 -1288 359 1233 -1891 1078 -126 -1466 1691 -1532 -407 1480 -2034 660 -86 -1810
3319 -1810 2019 -1048 -1115 1351 -1616 989 344 -2659 1311 -197 -751 1192 -2341 316 1397 -2102
3335 -2102 575 -560 -745 2016 -1689 -447 1468 -1101 869 -482 -1102 2377 -478 -671 811 -849
3351 -849 1442 114 -1597 1560 438 -39 296 -1253 1337 1111 -1182 125 200 1188 1151 -1344 -64
3368 -64 1060 599 444 -788 354 1234 -116 -305 -454 592 728 -893 -244 191 418 327 -1542 -161
3386 -161 776 -289 362 -960 -208 1281 -1223 -257 196 -811 1236 -1100 -1215 1241 -1236 29 -69
$$ packed form
3270f63P01M28j201J778j019q14J948j413O45N86k066K140l48j310J876k020O87
3287f5J705k634J715j43j700K746k073n0K234k852J871K91k477L045j829p28K716
3304A772l060J647Q74l124K969j204j340L157l223J125J887l514K694p46j724
3319a810L829l067o7K466k967K605o45l003L970j508n54J943l533K657J081l499
3335b102K677j135j85K761l705J242J915k569J970j351o20L479k855j93J482j660
3351h49K291j328j711L157j122m77L35j549K590k26k293J307P5R88l7k495J280
3368f4J124m61j55j232J142Q80j350j89j49J046J36j621O49M35K27r1j869J381
3386a61R37j065O51j322P52J489k504R66M53j007K047k336j15K456k477J265r8
$$ plain form
3403 -69 -1993 1492 -354 -1222 1384 -1802 18 920 -1980 1748 -80 -1631 1927 -1386 301 1662
3419 1662 -2600 1257 538 -1432 2483 -1615 -768 2196 -2071 1478 798 -2196 2668 -580 -775 2420
3435 2420 -2252 1247 1945 -2105 2169 -510 -924 3256 -2037 -292 1568 -1774 2705 -97 -2586
3450 -2586 2236 -1092 306 1816 -2989 1337 983 -1559 2176 -1590 -991 2182 -1857 900 608 -2376
3466 -2376 1745 -798 -1261 1448 -2114 355 1159 -2148 727 -827 -1109 2010 -1420 -755 570 -1145
3482 -1145 1718 8 -2044 624 -434 606 1140 -1927 -51 415 -487 923 -960 -634 1067 -292
3498 -292 483 103 -693 908 112 -92 575 -94 726 710 -284 145 -165 468 1015 36 -168 -292 193 890
3518 890 42 -311 -340 233 1082 252 -202 -272 -136 895 228 -190 385 -175 336 37 -810 346 -132 -345
$$ packed form
3403f9j924L485j846q68K606l186J820R02k900L728j828j551L558l313J687J361
3419A662m262L857p19j970L915m098Q47K964m267L549o80k994M864l248j95L195
3435B420m672L499O98m050M274k679m14M180n293J745J860l342M479k802k489
3450b586M822l328J398J510m805M326l54k542L735l766N99L173m039K757k92k984
3466b376M121k543m63K709l562K469Q04l307K875j554k82L119l430O65J325j715
3482a145K863j710k052K668j058J040N34l067J876M66r02J410j883L26J701j359
3498b92P75l80p96J601p96k04O67o69Q20j6r94M29l10O33N47r79k04j24M85O97
3518H90q48l53k9N73Q49q30m54p0J36J031o67m18N75n60N11k99q47J156m78k13
$$ plain form
3538 -345 219 -835 44 193 -913 63 -528 -589 739 -357 -6 -10 -1236 332 207 -301 383 -1007 -295
3557 -295 609 -728 -12 -499 -917 703 -206 -371 365 -791 180 162 -629 838 224 -121 571 -472 386
3576 386 708 -397 531 45 -65 889 -114 42 269 -577 476 494 71 716 -237 -180 673 43 527 368
3596 368 -137 594 247 114 402 -272 -33 150 -148 394 45 -365 -160 -542 -174 236 -179 -32 -213 -296
3616 -296 100 -139 -207 -109 -306 35 143 -164 -153 -493 -560 -243 -205 -113 -207 -423 -317 -327 -274 -120 -125 -73 34 55
3640 55 176 39 -34 -130 -24 172 297 196 17 -116 -37 -10 136 218 121 125 110 188 256 149 153 262 378 529 479
3665 479 206 181 40 140 293 233 254 107 -35 -1 -140 -126 51 -106 -19 101 -13 102 -141 -150 58 -34 185
3688 185 102 -108 -16 -305 -370 -124 -352 -176 -92 -419 -223 -397 -537 -137 -479 -228 81 -293 41 -185 -328
$$ packed form
3538c45N64j054Q79J49j106R76n91o1J328j096L51mj226J568j25n08O84j390P12
3557b95R04j337P16m87m18J620r09j65P36j156R71j8p91J467o14l45O92j043Q58
3576C86L22j105R28m86j10R54j003J56K27q46J053J8m23O45r53N7Q53o30M84j59
3596C68n05P31l47j33K88o74K39J83k98N42l49m10K05l82L68M10m15J47j81q3
3616b96L96k39o8R8j97L41J08l07J1l40o7L17L8R2r4k16J06j0N3J54nN2J07K1
3640E5J21j37p3r6J06J96J25j01j79j33P9K7J46Q2r7Mj5P8O8j07MJ09J16J51n0
3665D79k73k5j41J00J53o0K1j47j42L4j39J4J77j57Q7J20j14J15k43rK08r2K19
3688A85q3k10R2k89o5K46k28J76Q4l27J96j74j40M00l42K51L09l74L34k26j43
$$ plain form
3709 -328 140 -170 -102 313 -189 150 143 -485 57 -215 -255 384 -231 62 237 -460 225 38 -135 682 39
3730 39 235 724 -60 452 300 -224 788 217 115 687 -354 156 334 -478 512 116 -235 614 -302 54
3750 54 533 -474 306 230 -196 828 -58 -249 378 -629 90 261 -507 412 -254 -741 155 -656 -241 154
3770 154 -848 76 109 -454 264 -537 -565 354 -377 253 271 -655 162 -292 -550 358 -422 -355 218 -543 37
3791 37 109 -740 214 -70 -211 673 -16 125 441 -441 339 564 10 729 89 -235 623 -115 58 483 -496
3812 -496 265 466 -161 652 -130 -589 671 77 447 776 -561 300 482 -254 680 -273 -433 879 -405
3831 -405 23 365 -998 257 -128 -943 755 -315 -293 480 -1283 -43 457 -713 809 -354 -936
3848 -936 850 -629 -70 546 -1513 166 287 -721 947 -1034 -1196 682 -818 486 376 -1458
$$ packed form
3709c28M68l10O8M15n02L39po28N42k72m0O39o15K93J75o97O85j87j73Q17o43
3730C9J96M89p84N12j52n24J012n71j02N72j041N10J78q12R90l96l51Q49r16L56
3750E4M79j007P80p6m26J024q86j91O27j007P19J71p68R19o66m87Q96q11M15L95
3770A54j002R24L3n63P18q01k8R19p31O30J8r26Q17m54k58R08p80O7N73p61N80
3791C7P2q49R54k84j41Q84o89J41L16q82P80K25n54P19o40l24Q58p38J73M25r79
3812d96P61K01o27Q13p82m59J260n94L70L29j337Q61J82p36R34r53j60J312j284
3831d05M28L42j363J255l85q15J698j070K2P73j763J240N00j170J522j163n82
3848i36J786j479N59O16k059J679J21j008J668j981j62J878j500J304j10j834
$$ plain form
3864 -1458 855 94 -698 965 -866 150 1279 -985 610 405 -706 1279 -739 -762 1246 -421
3880 -421 754 417 -1653 826 378 -191 1338 -960 -17 1374 -429 1074 128 -1274 1249 234
3896 234 239 1102 -1338 198 760 -891 653 -323 -575 1303 -808 -578 551 -719 838 94 -1302
3913 -1302 859 166 -55 565 -1488 -248 732 -450 673 -590 -1442 480 -402 -84 171 -1468 -7
3930 -7 546 -400 276 -832 -672 969 -252 -146 434 -408 652 -84 -1140 504 288 142 306 -994
3948 -994 -44 703 -258 230 -275 -476 893 371 226 530 -694 68 869 403 777 -114 -512 925 307
3967 307 -124 101 -516 512 577 -612 132 133 -196 319 -616 -6 1082 -23 -42 -212 -553 747 236 -367
3987 -367 299 -505 -175 317 -550 34 -370 -1091 333 92 -201 -17 -1189 -255 519 -443 158 -125 -340
$$ packed form
3864a458K313p61p92J663j831J016J129k264J595k05j111J985k018k3K008j667
3880d21J175l37k070K479m48n69J529k298R43J391j803J503r46j402K523j015
3896B34NQ63k440J536N62j651J544r76k52J878k111K30J129j270J557p44j396
3913a302K161o93k21O20k053J240R80j182J123j263q52J922q82L18K55j639J461
3930gN53r46O76j108J60J641j221J06N80q42J060p36j056J644k16j46J64j300
3948i94R50P47r61M88n05k01J369n22j45L04j224P62Q01m66L74q91l98J437o18
3967C07m31K25o17J028O5j189P44Jl29N15r35O10J088j105j9j70l41J300n11o03
3987c67O66q04L30M92q67N84m04p21J424k41k93J84j172R34P74r62O01k83k15
$$ plain form
4006 -340 533 -569 -386 439 -375 8 -169 -543 660 -94 -667 -72 -524 252 611 -325 273 -29 -406
4025 -406 587 110 280 585 -379 334 699 -35 409 -276 -186 779 66 147 324 -410 209 9 -215 692 152
4046 152 73 299 -209 447 418 -258 272 54 110 543 -124 -186 -132 -562 73 81 -205 37 -481 -464 80 -268 -134
4069 -134 -153 -322 143 -14 -198 30 -412 -282 -52 -158 111 -68 -418 -287 -377 -254 -22 -216 -159 -79 -184
4090 -184 32 19 -95 44 28 171 365 238 108 73 -43 129 187 192 178 -8 32 10 -1 52 108 23 239 286 215
4115 215 239 87 103 267 255 346 344 188 115 -4 -8 106 11 -1 12 -71 -139 -97 -251 -103 -180 -46 57 -4 -49 -69
4141 -69 -137 -159 -83 -86 26 -135 -199 -210 -342 -320 -245 -218 -149 -179 -211 -176 -263 -191 -183 -94 27 83 37 121 -61 -51 -44 -66 181
4170 181 180 73 69 -103 -118 43 -53 81 163 -28 221 147 45 198 -37 184 390 272 451 267 -23 143 66
$$ packed form
4006c40Q73j102J83Q25q14L83j77l74J203p54n73N95m52P76L59r36N98l02l77
4025d06R93m77J70L05r64P13L65p34M44o85R0R65p13Q1J77p34O19k00k24R07n40
4046A52p9K26n08O56k9o76N30k18N6M33o67o2N4m30O35Qk86K42n18J7N44l48J34
4069a34j9j69M65j57j84K28m42J30K30j06K69j79l50J31r0J23K32j94N7Q0j05
4090a84K16j3j14J39j6J43J94j27j30l5j16J72N8Nj4j86M0k2j1N3N6q5K16M7p1
4115B15K4j52J6J64j2R1kj56p3j19mJ14r5j2J3q3o8M2j54J48p7J34J03o1m5k0
4141f9o8k2P6lJ12j61o4j1j32K2P5K7O9l0l2L5q7P2QQ9J21N6m6Q4j82J0Pk2K47
4170A81jj07mj72j5J61r6J34Q2j91K49p4j02J53k35K21K06j18J79j84k90J66p7
$$ plain form
4193 66 66 400 34 132 99 -154 107 -10 -145 114 -74 74 288 -62 14 -89 -247 220 136 76 179 -317 -206
4216 -206 -43 -357 -43 -166 -436 -20 -227 -215 -40 -549 -312 -68 -213 279 -66 -386 -8 -221 -18 237
4236 237 -260 19 40 -370 40 -134 -209 181 -374 -49 369 -86 233 -111 -409 387 211 251 499 -244 175
4257 175 422 8 483 91 -162 529 78 273 368 -485 -5 195 -13 631 -105 -243 511 -187 112 277
4277 277 -172 605 187 -475 370 -51 92 205 -812 -77 393 -113 185 -665 -797 372 -149 -49 1 -721
4297 -721 77 83 -415 240 -337 -369 312 -286 49 62 -737 -63 -91 -470 222 -310 -38 328 -757 -248 217
4318 217 47 609 -276 -649 624 446 246 28 -832 401 1006 71 170 -458 -251 868 -58 -95 320 -259
4338 -259 568 326 -599 499 264 50 632 -491 264 849 -312 326 -143 -543 906 115 -138 373 -932
$$ packed form
4193F6%L34l66R8l3k53K61j17j35K59j88J48K14l50P6j03j58M67q4o0J03m96J11
4216b06J63l14L14j23k70M16k07J2J75n09K37K44j45M92l45l20L78k13K03K55
4236B37m97K79K1m10M10j74p5L90n55L25M18m55L19l44k98P96j76M0K48p43M19
4257A75K47m14M75l92k53O91m51J95R5q53M80K00k08O44p36j38P54o98K99J65
4277B77m49P77m18o62Q45m21J43J13j017P35M70n06K98q50j32J169n21J00N0p22
4297g21P98Om98O55n77l2O81n98L35J3p99O74k8l79O92n32K72L66j085N09M65
4318B17j70N62q85l73J273j78k00k18q60J233O05r35R9o28K07J119r26l7M15n79
4338b59Q27k42r25J098k35k14N82j123P55N85j161O38m69m00J449p91k53N11j305
$$ plain form
4357 -932 -5 449 -509 411 -482 -766 883 -105 -83 -36 -1173 556 672 -614 201 -640 -170 874 -1059
4376 -1059 -439 343 -414 564 -792 -1161 944 -145 -360 -152 -1044 978 702 -962 201 -429 56 983
4394 983 -770 187 602 -757 475 -90 -255 907 -845 -175 920 -204 501 -284 -643 1155 91
4411 91 -307 671 -160 695 337 -986 705 641 -1 381 -810 240 1040 -538 -144 -229 -249 881 -135
4430 -135 -469 295 -392 94 270 -372 431 61 -437 319 -211 -128 226 -551 7 70 -453 27 -255 -512 -38
4451 -38 -478 -130 403 -274 -168 -206 -388 317 61 -293 81 -228 7 406 -298 -187 -103 -339 321 126 -282
4472 -282 151 -248 -55 327 -259 249 474 -155 271 76 38 693 -156 -69 430 12 580 198 -422 375 7
4493 7 -3 499 -249 156 289 -421 361 60 -113 447 -273 63 525 -307 186 -35 -345 421 -197 -171 284
$$ packed form
4357i32R27M54r58R20q93k84J649r88K2M7j137J729J16j286Q15q41M70J044j933
4376a059O20P82p57R78j356l69K105j089k15K08q92K022k76j664J163o30M85R27
4394I83j753R57M15j359J232n65j65J162j752O70J095j124P05p85l59J798j064
4411I1l98R78q31Q55l58j323J691o4o42L82j191J050Q00j578L94q5k0J130j016
4430a35l34P64o87M86J76o42Q03l70m98P56n30Q3L54p77N58O3n23M80k82k57M74
4451c8m40L48N33o77J06l8j82P05k56l54L74l09K35L99p04J11Q4k36O60j95m08
4472b82M33l99J93L82n86N08K25o29M26j95l8O55q49Q7M99m18N68l82o20P97l68
4493Gj0N02p48M05J33p10P82l01j73N60p20L36M62q32M93k21l10P66o18K6M55
$$ plain form
4514 284 -527 -189 -69 -500 227 -189 -417 173 -346 -38 65 -555 86 -15 -216 256 -284 -184 124 -504
4534 -504 -95 35 -201 176 -231 -298 125 -253 -35 58 -254 179 120 -60 227 -90 63 240 48 283 224
4555 224 -48 239 4 56 274 -31 185 160 -37 200 51 4 188 44 168 211 178 208 83 23 171 39
4577 39 146 104 1 41 -44 -170 -77 -97 -62 -39 -102 -71 -135 -92 -136 -105 -117 -35 -52 -14 -112 -100 -149 -175 -10 -107 -93 -78
4605 -78 -232 -188 -244 -162 -81 -77 -129 47 -99 -16 -24 -120 32 -46 78 142 87 109 18 27 157 38 115 156 5 68 111 39
4633 39 140 39 62 230 129 224 195 -5 200 116 146 323 86 97 117 -74 78 71 -17 105 -134 34 167 -129
4657 -129 68 -97 -197 168 -67 -18 83 -284 -29 4 -176 176 -172 -224 -17 -270 -48 -137 -478 -67 -180
4678 -180 -222 79 -334 -121 -20 -363 117 -19 -78 287 -277 -121 119 -123 232 -7 -334 209 7 57 119
$$ packed form
4514B84q11L38J20m31P27m16k28N90n19L08J03o20O41j01k01M72n40J00L08o28
4534e04M09J30k36L77m07o7M23l78K18R3l12M33n9j80K87l17J53J77j92K35n9
4555B24k72K87k35N2K18l05K16k5j97K37j49m7J84j44J24M3l3L0j25o0J48j32
4577C9J07m2j03M0q5j26R3k0L5K3o3L1o4M3m4L1j2Q2j7L8r8J2m9k6J65r7J4J5
4605g8j54M4n6Q2Q1Mn2J76j46Q3qr6J52p8J24O4n5K2r1RJ30j19P7M1j51O3M3p2
4633C9J01j01K3J68j01R5k9k00K05q4L0J77k37J1K0j91J52pq8J22k39J68J33k96
4657a29J97j65j00L65k35M9J01l67K55L3j80L52l48n2K07k53K22q9l41M11j13
4678a80m2L01m13K13J01l43M80j36n9L65n64J56K40k42L55k39l27N43k02N0O2
$$ plain form
4699 119 -400 126 194 -31 312 15 3 277 -139 205 295 13 349 116 65 419 -16 34 184 -6 263 83
4721 83 -61 203 -7 -133 -43 -68 288 181 -140 -109 -23 248 126 -236 -225 65 261 76 -284 -325 -122 88
4743 88 -162 -291 -85 -124 -76 -207 -365 27 -40 -257 30 -249 -21 193 -405 49 -46 -341 242 -166 -106 260
4765 260 -583 -56 221 -186 443 -350 -441 608 -126 170 91 -652 768 386 -272 452 -378 247 732 -633
4785 -633 307 342 -197 753 -480 -262 897 -334 336 224 -652 1000 12 -422 664 -584 310 651
4803 651 -774 653 -12 -668 737 -530 80 625 -1028 312 188 -631 666 -682 -461 794 -735
4820 -735 157 96 -849 802 -387 -732 610 -576 200 254 -1156 417 144 -531 430 -802 -82 722
4838 722 -666 171 -112 -580 754 -253 -279 584 -421 350 220 -593 628 57 -193 499 -355 248 486
$$ packed form
4699A19n19N26O8k25L43k97j2K74m16L44R0k82L36k33n1L54m35N0J50j90K69j80
4721H3j44K64k10j26R0k5L56j07l21L1Q6K71j22l62J1K90J96j85l60m1K03K10
4743H8k50j29K06l9M8j31j58L92o7k17K87k79K28K14n98M54r5k95N83m08O0L66
4765B60q43N27K77m07O29p93r1J049p34K96p9p43J420l82o58P24q30O25M85j365
4785f33R40L5n39R50j233K18J159j231O70j12q76J652r88m34J086j248Q94L41
4803F51j425J427o65o56J405j267O10N45j653J340j24q19J297j348K21J255j529
4820g35Q92o1r45J651j189l45J342j186P76N4j410J573k73o75R61j232P20Q04
4838G22j388Q37k83m68J334j007k6Q63j005P71j30q13J221n71k50O92q54O03K38
$$ plain form
4857 486 -435 248 157 -150 460 -142 104 421 -263 127 195 71 399 -101 -92 324 75 66 -19 -130 208 213 -118
4880 -118 -91 17 13 52 -99 -247 138 121 -195 -120 -164 -15 210 -396 -138 103 -267 120 -239 -433 121 -303
4902 -303 -167 104 -449 88 -45 -490 333 -248 -237 295 -452 109 207 -439 300 -117 -259 525 -388 50 425
4923 425 -542 335 102 -297 657 -267 -121 499 -385 383 270 -432 672 -51 -86 653 -370 273 407 -489
4943 -489 541 95 -153 534 -416 52 526 -476 367 46 -368 581 -233 -188 403 -389 287 142 -462 413
4963 413 -180 -206 311 -488 -12 119 -491 216 -218 -378 257 -421 -126 75 -494 117 -35 -259 164 -409
4983 -409 -162 286 -302 65 -41 -326 238 -108 -173 90 -170 146 42 -262 172 44 -5 144 -94 132 199
5004 199 51 193 9 66 220 74 173 195 44 185 160 79 178 50 43 165 145 127 0 59 145 70 113 -24 11
$$ packed form
4857D86r21O83r1l07O10o02K46L17o84L90O8j24L28n00RM16k49rq5j11L38Nl31
4880a18K7J08mL9j51j48L85j7l16P5m4J49K25o06K58K41l70L87l59j94N54m24
4902c03J36K71n53N37j33m45Q23n81J1N32p47N61R8o46P39m17j42P84r13M38L75
4923D25r67Q77k33l99R54r24J46O20q84P68j13p02J104p23l5P39j023O43J34q96
4943d89J030m46k48O87r50M68M74j002Q43l21m14R49q14M5N91p92O76j45o04Q75
4963D13n93k6N17p99M76J31o10P07m34j60O35o78K95K01n69O11j52k24M23n73
4983d09K47M48n88L67j06k85N64l46o5K63k60L16j04l04M34j28m9J49k38K26O7
5004A99j48J42j84N7J54j46R9K2j51J41k5q1R9j28pJ22k0j8j27N9Q6p5M3j37L5
$$ plain form
5029 11 75 11 5 -31 -22 57 -101 -68 -28 -121 -52 -76 -134 -22 -145 -67 -22 -135 -97 -94 -156 -26 -118 -107 -62 -168 -57 -65 -213
5058 -213 -9 -140 -72 10 -130 -17 -44 -129 61 -26 -76 62 -61 0 108 -25 132 61 36 124 -18 44 168 2
5082 2 104 145 16 194 95 50 185 48 151 182 78 191 96 34 141 16 57 127 20 58 50 2 88 -20 6
5107 6 -2 -79 40 -70 -69 11 -84 -62 39 -119 -46 -59 -154 -65 -142 -125 -57 -190 -26 -48 -153 -26 -142 -133 -50 -84 -126 -57
5135 -57 -97 -33 9 -136 1 -41 -29 79 -64 4 55 -8 58 6 37 47 0 90 65 79 129 105 64 42 68 110 79 92
5163 92 90 111 179 115 88 35 91 143 104 122 90 35 128 113 20 63 22 69 128 -75 53 33 -95 81 -93 -152 7 -199
5191 -199 18 42 -266 -1 -90 -156 107 -263 -164 64 -331 49 -96 -348 117 -132 -164 37 -310 13 53 -352
5213 -352 166 -147 -207 267 -246 -6 188 -321 269 26 -216 351 -246 30 401 -339 199 168 -190 547 -29
$$ packed form
5029A1O4o4ol6RP9j58L3M0r3O9k4n8J12j23P8M5j13L8Lo2J30r2J1M5j06J11qj48
5058b13K04j31O8Q2j40J13k7q5J90q7n0J38j23O1J08j33J57p1k5Q8j42O2J24j66
5082BJ02M1j29J78r9m5J35j37J03L1j04J13r5o2J07j25M1P0j07L8qm8Q6j08K6
5107Fqp7J19j10JQ0r5K2J01j58P3j3r5Q9p7J7O8j33J64k2j05J27j16RQ3l4m2O9
5135e7m0O4M2j45J37m2J2J08j43O8N1o3O6n2L1J0m7R0k5J4N0k4m1k2K6M2l1J3
5163I2kK1O8o4k7n3N6N2l9J8l2n5R3j5r3M3m1M7N9k03J28k0j28J76j74n9J59k06
5191a99K17K4l08K65q9o6K63l70R9K28l95L80j45k52M65k49l2K01l47L23M0m05
5213c52N18l13o0M74n13K40J94n09N90k43k42N67n97K76L71p40N38l1l58P37n76
$$ plain form
5234 -29 -127 409 -237 284 314 -380 476 90 -106 513 -334 168 469 -367 339 64 -291 567 -290 -48 405
5255 405 -434 305 146 -479 448 -208 -196 387 -420 57 108 -549 343 -80 -362 307 -464 -15 214 -546 137
5276 137 -78 -430 361 -380 -190 291 -448 71 59 -399 294 -193 -169 309 -297 30 175 -257 182 -7 -202
5297 -202 284 -53 -9 173 -231 132 164 -95 158 -49 37 285 40 91 169 4 182 196 50 133 72 29 209
5320 209 91 9 188 36 -4 195 -52 -31 178 -77 119 -16 -183 203 -5 -177 67 -318 60 197 -344
5341 -344 24 -100 -239 273 -343 -278 174 -369 92 -45 -443 212 -168 -294 252 -408 115 169 -489 204 -48
5362 -48 -310 393 -370 -77 323 -440 245 31 -374 510 -225 -52 464 -424 191 238 -378 477 -63 -137 588
5383 588 -255 178 333 -333 473 197 -206 494 -268 158 429 -432 251 132 -225 556 -235 -107 493 -247
$$ packed form
5234b9r8N36o46N21L0o94Q56l86j96O19q47N02L01q36P06k75l55Q58q57K42M53
5255D05q39P39j59o25R27o56J2N83q07M77N1o57Q92m23k82O69p71M49K29p60O83
5276A37k15l52P91p41J90M81p39N19j2m58O93m87K4M78o06L27J45m32M39j89j95
5297b02M86l37M4J82m04L63L2k59K53k07Q6K48k45N1P8j65J78J4j46Q3o1m3J80
5320B09j18q2J79j52m0J99k47K1K09k55J96j35j67L86k08j72K44l85L78J37n41
5341c44L68j24j39N12o16O5M52n43M61j37l98O55l80j26N46o60N23N4o58O93k52
5362d8k62P03p63K93M00p63O85k14m05Q84p35J73N16q88O15M7o16Q55n40p4P25
5383E88q43M33J55o66Q06k76m03P00p62M26K71q61O83j19l57P81p91J28O00p40
$$ plain form
5403 -247 182 88 -358 436 -33 -191 216 -340 77 179 -397 151 -106 -208 305 -311 -132 58 -377 143
5423 143 0 -360 76 -222 -54 127 -314 29 39 -191 97 -224 -167 139 -167 15 -62 -193 90 -9 -97 17
5445 17 -31 99 148 18 122 -9 63 104 38 19 49 46 109 103 77 49 69 196 45 105 71 50 184 98 -13 122 89
5472 89 157 94 -59 122 12 -8 81 -93 50 94 -161 90 -65 -114 27 -96 21 48 -154 -28 -32 -148 63
5495 63 -189 -113 73 -199 -64 -68 -216 -11 -177 -173 7 -201 -27 -7 -267 34 -90 -84 64 -142 1 52 -67
5518 -67 65 -18 -126 58 -10 79 147 -110 23 64 -30 166 3 21 137 -45 68 149 47 91 72 73 169 102 148
5543 148 99 -32 184 80 47 142 -28 -24 80 1 87 82 -40 15 -44 -7 45 -64 -24 -11 -48 16 -35 -48 -13 -197 -98
5570 -98 -34 -73 -47 -153 -117 -124 -103 -32 -136 -124 -76 -72 -24 -13 -147 -86 -26 -52 29 12 -7 -63 -53 -8 -35 -34 -43 14 20 3 54
$$ packed form
5403b47M29r4m46P94m69j58M07n56M17J02n76N48k57j02N13o16J79J90m35N20
5423A43j43l60M36k98J68J81m41L43J0k30K88l21N7L06l06J82p7j31K83r9q8J14
5445A7m8J30M9j30J04j31P2M1o6j9L0lO3ok6k8K0J27j51O0l4k1J34q6j11J35l3
5472H9O8o3j53J81j10k0Q9j74J43M4k55K51j55m9J41j23J17K7k02J26mj16K11
5495F3k52P6J86k72J35mj48K05j66MJ80k08J74K0k60L01j24OJ48k06J43N1j19
5518f7J32q3j08J84o8Q9O8k57J33M1r4J96j63J8J16j82J13Q1j02M4j9JR6o7M6
5543A48m9j31K16j04l3R5j70MJ04p9Q6nj22N5n9L7N2j09M0J3l7O4n1j3L5j84R9
5570i8O4l9K6j06L6pK1P1j04J2M8MM8J1j34O1O0k6Q1j7j9n6J0M5k7JrN7Oj7N1
$$ plain form
5601 54 0 -28 23 111 115 164 95 88 43 -8 134 115 81 115 20 70 180 49 39 68 -54 116 75 67 84 -149 15 107
5629 107 38 126 -22 -59 94 -47 -1 102 -147 10 -34 -141 108 -124 -144 11 -281 61 16 -219 -10 -183
5651 -183 -199 53 -175 22 12 -235 71 -71 -135 98 -159 -142 72 -213 136 -69 -272 121 -117 40 212
5672 212 -218 161 90 -100 312 -44 20 312 -174 196 252 -108 334 -73 -112 325 -52 129 145 -244 281 135
5694 135 -56 290 -100 58 262 -188 209 124 -201 241 -126 -76 310 -196 63 25 -383 169 -82 -136 152
5715 152 -288 -7 95 -235 72 -122 -274 188 -85 -45 -32 -387 18 -28 -109 51 -250 -109 79 -205 -156 -151
5737 -151 -108 126 -102 -182 31 17 61 -86 -131 105 150 105 -40 -62 -16 96 107 34 62 54 -12 93 87 16 54 -38 154
5764 154 280 32 49 -4 12 308 32 -50 236 14 191 47 -244 231 151 -84 95 -219 49 277 -260 -11
$$ packed form
5601E4n4k8N1Q8MM9o9pm5n1J42j9l4L4r5N0J10j31j0K9j22J70m1qJ7k33J64R2
5629A07o9Q8j48l7J53j41M6J03k49J57m4j07K49k32k0J55k92L42m5k35K09j73
5651a83j6K52k28J97j0k47L06j42o4K33k57J7K14k85L49k05k03L93k38J57J72
5672B12m30L79p1j90M12l56O4K92m86L70N6l60M42m07l9M37l77J81J6l89N25j46
5694A35j91L46l90J58K04m50L97q5l25M42l67N0L86n06K59l8m08N52k51n4K88
5715A52m40K81J02l30L07j94j52M62k73M0J3l55M05m6q1J60l01J41J88k84M9N
5737a51M3K34k28q0K13j4M4j47m5K36M5m5j45k2M6J12J1p3K8qo6J05op1L8r2J92
5764A54J26k48J7n3J6K96k76q2K86k22J77j44k91M75q0k35J79l14K68K28n37K49
$$ plain form
5786 -11 -70 -131 300 -149 -138 184 -289 77 38 -289 201 -200 -258 272 -303 -49 -112 -411 260 -18 -306 150
5808 150 -358 14 193 -493 146 91 -109 330 -330 -133 373 -230 178 -2 -304 422 -11 -102 178 -284 157
5829 157 297 -190 217 15 -25 430 -155 32 296 -91 306 117 -173 265 -120 39 283 -106 119 81 -133
5850 -133 335 -114 -125 170 -32 173 114 -254 77 31 27 80 -220 -17 177 -31 -66 -209 -138 130 -99 -139 -97
5873 -97 -89 50 -77 -238 -116 -27 -20 -59 -51 -22 -87 -75 -79 -31 -2 -97 -19 35 13 37 -171 -44 125 -20 22 -1 -42 207
5901 207 20 -69 119 36 225 139 -118 144 39 47 211 -152 55 204 -68 211 -7 -58 180 -18 129 228
5923 228 -111 221 93 -54 254 -89 -4 224 -98 99 40 -258 137 -71 -77 94 -155 52 77 -322 19 -48
5945 -48 -141 140 -206 -108 70 -167 26 -80 -263 117 -66 -69 30 -293 -62 -30 -154 82 -103 -179 77 -108 13
$$ packed form
5786a1n9o1M31m49J1L22m73L66l9l27M90m01n8N30n75K54o3k99O71k78k88M56
5808A50n08L72J79o86O39n5k00M39o60J97N06o03M08j80l02P26m33r1K80m62M41
5829A57J40m87M07k02m0M55n85J87K64l87L97j89k90M38l85J59K44l89K25l8k14
5850a33M68m49j1K95k02K05n9l68L31m6mN3l00K03J94k08l5j43P1K68k29m0M2
5873i7QJ39j27j61J22Q9Pl9QK9o5J2mM8K9r5P8N4k2K4k08J27J69j45M2k3m1K49
5901B07j87q9J88q3J89q6k57K62j05QJ64l63K07J49k72K79k18n1K38j98J47R9
5923B28l39L32j28j47L08l43Q5K28l22J97n9k98L95k08oJ71k49K07K5l99L41o7
5945d8r3K81l46R8J78k37J93j06j83L80j83lR9l23K31L2j24K36j85p6K56j85J21
$$ plain form
5968 13 30 -177 78 34 -17 189 -45 29 24 -84 33 99 17 94 -35 -40 181 63 117 139 61 109 94 33 134 -28
5994 -28 19 117 25 176 123 -18 15 -44 14 43 19 41 -15 -57 3 25 -27 -44 -53 -21 -12 20 -101 -107 -88 -68 -23 -13 -29 -65
6024 -65 -123 -63 -105 -52 -73 -96 -134 -51 -78 -85 -66 -94 -125 -64 -15 35 -46 -105 -9 -9 58 57 6 -10 15 8 64 25 13 -14 -41 88
6056 88 55 26 72 -17 24 96 144 100 95 15 95 76 108 47 44 54 63 77 134 32 -23 1 -21 77 63 -38 -19 -73 -124 60
6086 60 -62 11 -25 -155 -27 -45 -131 -71 -173 -103 3 -67 -48 -148 -214 -77 -115 -18 34 -160 -81 -34 -136 10 -70
6111 -70 -92 13 -120 25 6 -125 -104 -104 -68 93 6 50 28 -59 17 52 9 144 22 16 149 94 121 80 -77 127
6137 127 79 94 91 -27 63 107 -61 141 140 81 95 -73 -29 147 79 0 10 -14 121 96 -46 7 -79 41 52 -35 22
6164 22 -52 -134 -75 -100 -72 -57 -156 -83 -3 -17 -92 -103 -161 -22 -95 -116 -30 -33 -20 -44 -169 -126 45 12 -105 -133 -46 33 59
$$ packed form
5968A3J7k07K55m4n1K06k34P4nj08J17O6q2P7j29nK21j18N4K2p8M8j5o1J01j62
5994b8M7R8r2J51n3j41L3n9N8K9k4K2n6m2O0K2n2j7rL2RL2j21oJ9K0M5J0j6l6
6024f5n8O0m2N3k1k3l8Q3k7pJ9k8l1O1M9N0q1n9R6%O7jn1j6K5pN6l9j2k7k7J29
6056H8l3k9M6q9M1P2M8m4nq0Q0j9L2o1lJ0RJ4N7j02n5K4k2R8j4j01J9n4n1J84
6086F0j22P3l6j30J28j8q6O0j02P0J06p0J9j00o6J37l8R7N2j94P9M7j02J46q0
6111g0k2J05j33J45j9j31K1%L6J61q7M4k2q7P6L5m3J35j22oJ33n5K7m1j57K04
6137A27m8J5lj18R0M4j68K02jn9J4j68M4J76o8p9J0k4J35k5j42N3q6J20J1q7N7
6164B2p4q2N9k5K8J5r9P3Q0j4p5j1n8J39p3k1Q6lJ3k4j25M3J71l3j17k8Q7P9K6
$$ plain form
6193 59 -112 -67 37 137 136 -38 -3 22 39 143 -6 8 138 60 114 52 -129 82 50 4 155 19 20 140 -8
6218 -8 116 129 -63 193 106 73 74 -169 25 171 -5 36 -91 -87 245 -11 -122 -58 -89 143 65 -319 -83 -22 22
6243 22 78 -268 -106 81 -90 20 -134 -235 100 -75 -153 -37 -245 -4 64 -209 29 -118 -164 121 -49 -24
6265 -24 -15 -217 86 132 -108 8 -86 87 342 -91 -78 73 33 283 -12 -253 126 183 116 42 -168 119 307
6288 307 -13 97 -24 19 310 6 -26 82 -83 154 118 -66 130 -50 -4 207 -77 46 59 -124 145 2
6310 2 -186 84 -48 60 168 -260 -63 23 -76 113 -129 -220 144 -61 -15 -61 -308 0 80 -166 26 -157 -138
6333 -138 154 -120 -35 1 -110 144 38 -232 25 -73 -26 159 -206 -23 92 -21 131 -59 -127 180 67 117
6355 117 119 -123 117 109 -43 176 7 -41 298 19 64 80 -114 170 73 -52 170 -30 50 140 -160 119 89 -7
$$ packed form
6193E9j71M5J04J00jj74L5K5J7J04j49J4J30p8N4o2j81K11l2m6J51j36JJ20j48
6218hJ24J3j92K56q7l3Jk43J94J46j76M1j27ML32k56j11O4l1K32p8l84K36O1M4
6243B2N6l46J62J87j71J10j54j01L35j75p8J16k08K41O8k73K38j47m6K85j70K5
6265b4Rk02L03M6k40J16r4J73K55m33J3J51m0K50k95k41L79N7o7p4k10K87J88
6288C07l20J10j21M3K91l04l2J08j65K37l6j84J96j80M6K11k84J23J3j83K69j43
6310Bj88K70j32J08J08m28J97Q6r9J89k42r1L64k05M6m6k47L08Q0k46J92j83J9
6333a38K92k74Q5L6j11K54j06k70K57r8M7J85l65J83J15j13J52j90o8L07j13N0
6355A17Kk42K40qj52K19j69m8L39k79M5J6j94K84r7j25K22k00Q0R0l00K79l0r6
$$ plain form
6379 -7 166 -59 -40 205 -64 45 13 -168 102 95 -77 84 -146 -140 87 -125 -24 -51 -204 75 -55 -131 20
6402 20 -180 -74 48 -205 12 -20 -185 57 -149 -100 48 -66 -43 -60 -165 24 -22 -90 40 -73 52 126 -90
6425 -90 85 -31 -68 174 37 68 121 -49 27 126 86 146 68 11 76 -37 55 117 46 78 73 32 165 8 56 54 31
6452 31 64 80 69 56 -27 0 32 -33 -22 50 -84 -34 38 -10 4 -80 -72 -35 -41 -11 -29 -122 -75 -77 -59 -30 -61 -77 -44 -130 -114
6483 -114 -70 -127 -84 -73 -60 -21 -26 -3 -50 -70 20 27 -1 -9 12 -43 21 -15 47 28 -2 27 76 65 115 44 19 74 60 68 98 41
6515 41 70 109 109 144 105 51 71 -10 80 72 55 23 93 7 39 61 26 0 -15 33 8 55 -7 36 -50 3 -42 -60 -66 -77 12 -34
6547 -34 -108 -22 -76 -81 -85 -122 -9 3 -95 -139 -107 -38 -30 -116 -50 -68 -39 -2 20 -60 -38 -97 34 12 35 -7 -59 -55 -36 -22 64
6578 64 21 7 -6 50 62 101 32 62 49 90 105 79 68 30 23 52 106 79 82 69 74 70 80 16 11 18 67 21 47 -23 -29 44 5 -4
$$ packed form
6379gJ73k25J9K45k69J09l2j81K70pj72J61k30OK27k12J01k7j53K79j30p6J51
6402B0k00J06J22k53K17l2j65K42k06M9J48j14K3j7j05J89m6o8J30j13J25P4k16
6425i0J75j16l7K42j37L1N3j70P6R9m0O0p8n7O5j13R2O2p1L2nm1J33j57M8kk3
6452C1L3J6j1j3q3K7L2o5J1P2j34N0P2m8J4q4QL7oL0j8r3M7kJ8K9l1j6L3q6J6
6483a14M4n7M3J1J3L9nK3m7k0R0Pk8qK1n5O4l6O2j9l0K9M9j1N0p1k5N5j4QL0n7
6515D1K9L9%L5l9n4K0q1R0qj7l2P0q6L2K2l5k6j5M8k5M7o2M3q6N3m5j8oj1Q9m6
6547c4p4Q6n4nml7J13J2r8m4L2O9Qq6O6j8K9L7K2q0K2n9J31k2K3m2n2MJ9J4Q6
6578F4m3j4j3N6J2L9o9L0j3M1J5k6j1l8pK9N4k7Lj3NmJ0o4nPM9m6K6p0oP3l9r
$$ plain form
6612 -4 -43 -42 21 -9 -73 -58 -52 -17 -64 -86 -63 -105 -46 -36 -99 -26 20 -58 -19 -102 -96 -19 -117 18 5 -129 -68 -66 -8 96 -68
6643 -68 -105 -11 -36 12 -12 -127 49 61 16 68 -73 67 138 -41 71 -19 -8 109 17 11 100 17 125 100 -124 105
6669 105 41 46 189 -28 57 78 1 169 21 -114 165 21 42 110 -155 52 110 -90 42 -79 -75 173 -115 -51
6693 -51 -40 -155 118 -36 -180 38 -110 -35 25 -199 -4 -15 -106 29 -207 -101 3 -149 -23 35 -217 -26
6715 -26 -49 -144 87 -170 -54 157 -97 76 56 -125 138 42 -74 132 -126 120 174 -93 104 26 5 251 -54
6738 -54 18 160 -34 154 137 -67 73 61 -11 236 -51 -11 111 -25 155 65 -113 178 -43 34 117 -200 43
6761 43 137 -81 61 -47 -84 143 -104 -117 17 -236 65 48 -202 30 -107 -91 104 -139 -27 76 -165 21
6783 21 -47 -180 109 -47 -80 45 -167 -22 32 -158 120 -65 -103 150 -30 15 66 -110 147 110 -96 53 -19
$$ packed form
6612dl9JO3l0o4J5OL5m7k2K3m2N9J0o3P3M6p8L9q3OP7r8J35j3j34O1KN8J04j64
6643f8l7R4k5M8k4j15J76J2m5N2j41J40P1j79J12r0J1J17r2oQ9q3J08k5k24K29
6669A05o4NJ43k17Q5K1p7J68j48j35K79j44K1O8k65K07N8k00J32j21MK48k88O4
6693e1J1j15K73j54j44K18j48P5O0k24J95j1r1J35k36J06J04j52J26N8k52J91
6715b6k3r5K31k57J16K11k54J73k0j81K63r6j16K06k58K46N4k67J97p8k1K46l05
6738e4P2J42j94J88j7k04J40j2p2K47k87M0J22j36J80r0j78K91k21P7Q3l17K43
6761D3R4k18J42j08l7K27k47j3J34k53L01j7k50K32j37J6J95k43J12J03k41J86
6783B1o8j33K89j56l3J25k12J45N4j90K78j85l8K53j80M5N1j76K57l7k06J49p2
$$ plain form
6806 -19 20 182 -86 68 109 -9 173 8 -69 244 52 90 122 -109 47 175 -3 102 -11 -64 172 -46
6828 -46 24 122 -32 132 -9 -78 116 -13 3 80 -117 13 39 -143 19 -87 -37 48 -146 -19 12 -138 3
6851 3 -25 -146 -50 -158 -72 -38 -131 -16 -20 -87 34 -64 -95 18 -26 -8 -5 -107 18 55 -27 14 -34 6 93 7 -3 27
6879 27 17 94 -15 -23 67 52 37 116 31 67 109 5 57 30 -42 155 23 32 104 -16 3 25 28 43 29 -15 30 -36 -51
6908 -51 67 13 29 24 -17 38 -8 -54 -7 -86 -52 41 -75 -35 -91 -104 -32 -79 7 -16 -62 -73 -71 -98 -20 -75 -59 -51 -134 13
6938 13 -11 -65 44 -83 -57 47 7 4 -22 19 27 23 -20 40 -4 -6 36 53 9 61 76 22 1 35 39 54 18 23 44 -33 71
6969 71 88 111 41 19 42 73 57 70 42 7 10 29 21 39 23 29 -2 -28 -64 -28 -14 -71 -18 -27 6 -94 -3 -81 -49 -36 -71 -57
7001 -57 -76 -38 -37 13 -85 -49 -37 -61 -76 -49 -64 -41 -27 -38 -3 -30 -54 -26 -70 -25 18 16 51 -5 17 3 -17 67 40 28 19 32
$$ packed form
6806a9L9J62k68J54M1j18J82j65p7L13j92L8L2k31J56J28j78J05j13n3K36k18
6828d6P0R8j54J64j41o9J94j29J6P7j97J30K6j82J62j06N0Q5j94J27L1j50J41
6851Ck8j21R6j08Q6L4r3J15mo7J21r8l1J13m4J8Lj02J25L7q2M1m8M0Q7q6j0L0
6879B7j0P7j09qR0j5j5P9q5L6M2j04N2k7p2J97j32RP2j20J9K2LJ5j4m4M5o6j5
6908e1J18n4J6nm1N5m6m6M7p9L4R3j16M0n6j3P2m7Q6k3m6j1Kk7P8n5J6Qq3J47
6938A3k4n4J09j27K6J04m0lk6M1Qmm3O0m4kM2J7m4N2J5n4k1L4MJ5l6NK1p7J04
6969G1J7K3p0k2K3L1j6J3k8l5LJ9qJ8j6Ol1k6l6L6J4n7N3rL3j00R1p8L2J3l5J4
7001e7j9L8JN0r8L6J2k4j5K7j5K3J4j1L5k7k4K8m4M5M3kL5n6K2j4k0Q4k7j2rJ3
$$ plain form
7033 32 108 81 108 45 13 0 116 9 74 86 78 79 95 63 46 13 39 45 5 34 25 59 7 -14 -31 73 20 -40 16 -63 25
7064 25 -29 -75 -21 -72 38 52 -55 -70 -26 -36 3 -46 -90 -54 -94 -44 -75 -102 -5 -28 -55 -11 -115 -78 18 -76 -7 -35 -94
7093 -94 72 -9 -14 20 -27 -2 23 -26 13 49 -7 103 27 68 27 45 152 50 -4 69 22 79 87 15 102 79 66 90 16
7122 16 -19 97 29 53 68 -22 65 85 -37 76 14 44 68 -35 9 10 -81 38 -26 -76 32 -92 -54 3 -118 -69 -37
7149 -37 -101 -5 -98 -131 -6 -119 -9 29 -121 13 -9 -137 -13 -145 -64 29 -43 24 11 -67 89 -10 -75 28 -49
7174 -49 49 101 6 -8 40 18 91 -18 35 82 4 94 23 42 111 30 34 134 -7 68 161 50 98 67 -20 114 49 16
7202 16 76 15 35 81 6 62 -18 -15 50 -38 -58 34 -7 32 -32 -80 2 33 -12 39 -111 -37 6 -133 -31 1 -126 38
7230 38 -45 -111 -11 -49 -17 -68 -128 33 -9 -37 19 -79 -19 29 -38 8 6 -90 20 4 3 74 -61 8 46 -26 82 54 1
$$ packed form
7033C2P6k7K7o3l2j3J16j07O5J2qJJ6l2j7l3K6Om0K9rL4n2k1j7J04n3o0N6p9Q8
7064B5n4m6N4n1J10J4j07j5M4j0L9m9m4L6m0N0l1k7R7k3k7M4j04L7R6r4O9k8n9
7093i4J66q1nL4m7K5K5m9L9L6n6J10p6M1m1J8J07j02n4P3m7N7Qp2Q7k3j3K4p4
7122A6l5J16o8K4J5r0Q7K0j22J13o2L0K4j03M4Jr1J19o4n0J08j24L8N7j21M9L2
7149c7o4R6r3l3J25j13J10L8j50J34k2j28J24j32Q1R3p2O7j3p8J56r9o5J03p7
7174d9R8N2r5j4M8k2P3j09N3M7p8R0p1J9O9q1MJ00j41P5R3j11M8l1q7J34o5l3
7202A6O0o1K0M6p5N6q0LO5q8k0R2m1L9o4m8Q2L1m5N1j50P4M3j39J02L2j27J64
7230C8q3o6J00l8L2n1o0J61m2k8N6r8O0M8o7M6kr6J10j6jP1j35O9L8p2J08k8n3
$$ plain form
7259 1 107 -5 27 104 23 86 45 -38 94 126 37 76 -12 6 130 41 58 51 -33 125 -20 -11 96 34 20 38 -84 57
7287 57 23 -33 -2 -72 27 3 -29 -7 -37 -38 16 -48 -94 -41 -74 4 -23 -138 11 17 -102 -32 -61 -86 -23 -65 -37 -27 -77 33
7317 33 -39 -1 22 -60 -27 37 23 -16 18 -38 70 36 -34 7 32 27 45 39 41 48 87 132 62 18 121 105 32 59 40 61 109
7348 109 76 29 -44 36 73 20 36 62 -5 5 91 24 -17 10 30 7 -37 -26 -55 -20 -8 -19 -92 -46 11 -4 23 -10 -28 -12
7378 -12 -78 -19 -67 -95 -46 -48 -75 -41 -60 -39 -67 -61 10 32 0 -20 -63 -43 -8 -28 29 30 -60 30 14 31 49 -28 41 37 45 48 15
7411 15 16 52 31 86 71 37 71 63 55 72 77 38 65 40 40 70 5 76 -17 19 19 6 -23 78 22 22 29 6 -5 -9 -11 -46 -39 -48 -1 -37
7447 -37 -68 -4 -59 -13 -59 -53 -28 -56 10 -56 -46 -95 -52 -25 -89 -64 -26 -42 41 -1 11 -26 -57 4 -59 -4 -33 15 14 20 27 -51
7479 -51 14 61 20 48 65 18 -15 -16 6 43 44 70 79 60 96 115 60 84 122 46 98 52 26 19 24 -31 57 44 16 55 18 30 33
$$ packed form
7259AJ06j12L2P7q1O3m1q3J32L2q9L9q8J8J24q9J7pq4J58j45RJ07o2j4J8j22J41
7287E7l4n6L1p0R9k4l2K2l0jN4o4m6N3l3P8k7j15J49Oj19P0k9k5O3m2K8J0n0J10
7317C3p2L8K3q2L3O4j4l9L4n6J08l4p0M1K5nJ8oKPL9M5p0m4J03j6p3K7j9K1M8
7348A09l3m7p3Q0L7n3J6K6o7J0Q6o7m1K7K0k3m4J1k9L5J2j1p3M6N7j5K7l3j8J6
7378a2o6N9m8k8M9kk7L4j9K1k8OP1K2l2k0m3K0L5k0N7Jr0R0j6J7J8p7O9mQLl3
7411A5JL6k1N5j5l4L4qqJ7Nl9K7k5%L0o5P1r3L6%j3k9J01n6%Pk3j1mkl5PrM7l6
7447c7l1O4n5M6m6OK5k8O6o6J0m9M3K7o4K5L8j6Q3m2J2l7l1O1o3N5k9M8jOPp8
7479e1O5M7m1K8J7m7l3jK2L7JK6Rj9L6J9n5K4L8p6N2m6k6pNn5Q8j3k8L9l7J2L
$$ plain form
7512 33 -11 58 -48 -11 -1 -64 -15 -20 -66 -13 -78 -25 -20 -85 -65 -41 -72 -21 -73 -79 -29 -67 -57 -22 -23 16 -34 -48 -53 -21 -34 31
7544 31 -58 33 -37 -3 23 -14 -1 3 -21 -26 34 -9 79 -8 80 14 21 7 89 52 93 42 46 65 29 80 35 -9 48 49 -27 79
7576 79 -24 26 64 24 38 -4 13 60 40 -40 36 1 24 -22 -18 32 9 -52 -79 0 -60 -14 -74 -2 -70 -34 -31 -35 7 -27 -45
7607 -45 -99 -47 -34 -2 -89 -74 -50 1 -56 -11 -23 -6 22 2 -33 -4 25 34 -3 -45 44 -12 33 3 -45 59 97 -8 36 63
7637 63 30 48 40 12 158 9 71 54 23 74 64 -34 78 13 93 32 -69 57 86 18 25 -15 -32 113 -33 3 2 -27
7665 -27 80 -30 -54 25 -19 -35 -18 -86 32 -47 -107 30 -68 -59 -53 -131 21 14 -59 50 -60 -65 35 -100 -36 54 -60
7692 -60 15 -69 -25 59 -13 -23 18 -62 71 65 -63 26 -35 34 85 -52 -32 62 18 137 29 26 110 15 118 65 26 91
7720 91 63 49 143 31 65 94 0 91 80 -46 66 42 29 51 -42 10 64 -22 5 -5 3 19 19 24 13 3 9 11 -40 7 -54
$$ packed form
7512C3m4O9j06L7J0o3M9nm6N3o5N3No5K0K4l1N1n2oN0l8J0L5jL9n0j4nL2j3O5
7544C1q9R1p0L4K6l7J3Mk4nO0m3Q8q7Q8o6Pj4Q2l7M1n1MJ9l6N1m5m4N7Jp6J06
7576G9j03N0L8m0J4m2J7M7k0q0P6l5K3m6MN0k3o1k7P9o0M6o0P2o8L6LmM2l4j8
7607d5n4N2J3L2q7J5K4N1n7M5j2J7K8k0l5K9K9Rl7m2Q9n6M5l0m8J04L8j05M4K7
7637F3l3J8qk8J46j49O2j7l1N1j0r8J12o5Q0o1j01J26K9o8Pm0j7J45j46L6jk9
7665b7J07j10k4P9m4j6J7o8J18p9o0J37r8ROp8J52pp3J09j10nJ00j35O4R0j14
7692f0P5q4M4Q4p2j0M1q0J33oj28Q9o1O9N1j37K0R4m4J19j08lQ4r5J03n3l9O5
7720I1k8j4R4j12L4K9r4R1j1j26J12k4j3K2r3N2N4q6K7j0QJ6%Nj1j0OKn1M7o1
$$ plain form
7751 -54 -13 -18 -107 -36 3 -57 -64 -88 -29 -19 -41 -63 -100 -27 13 8 -17 -21 22 -29 -9 4 -36 -46 22 41 11 16 31 61 15 18 62
7784 62 -26 28 56 38 50 43 35 120 31 15 26 16 84 54 2 87 35 48 86 -69 102 51 -16 85 -14 16 17 -24 60 39
7814 39 -56 34 23 -47 10 -48 12 27 -45 27 -41 -45 48 -34 -35 -15 -84 17 -20 -93 -42 -71 -64 -25 -123 -52 -11 -29 45 -51 -56 38
7846 38 21 14 15 11 38 15 14 36 1 -12 27 20 11 20 29 91 38 35 90 8 133 57 13 30 90 85 157 -44 70 24 26 78 22 50
7880 50 32 64 -23 -68 23 10 -49 12 26 -3 14 -1 -33 -20 -37 -11 -22 -33 -57 -25 -19 -42 -38 -86 -32 -48 -33 -20 9 -52 -74
7911 -74 -20 -17 -40 -3 -16 -81 14 -77 14 -8 -35 51 -53 14 18 -16 17 -31 5 31 58 15 43 29 61 26 -17 81 37 43 77
7942 77 -1 39 49 -14 56 37 27 101 42 72 21 25 59 4 -10 29 -23 33 3 6 27 57 19 34 -35 -35 -37 -26 -10 -37 31 -46
7974 -46 -56 -60 -78 -105 19 -69 -33 -45 -58 -42 -8 -17 -10 -93 -56 -53 -67 -5 -55 9 -14 -8 2 -31 -47 -20 8 -38 -6 1 -8 67 43
$$ packed form
7751e4M1nq9P1L9o0pk4N9J0k2k2l7P3M0nk5mM3n1K0J3m0j0O8J9l0NJ5L0m6LM4
7784F2q8N4K8j8J2pqQ5q9j6J1j0O8l0n2Q5n2J3L8j55J71n1o7J01r9L0Jm1Q4k1
7814C9r5R0j1p0N7n8O0J5p2P2o8mR3q2jK0o9J01l7p3N1k9PL9r8P1M1j8P4r6nR4
7846C8j7pJmK7k3jK2l5j3L9prRRO2n3lN5q2J25p6m4J7O0nP2k01J14m6KN2n6K8
7880E0j8L2q7m5R1j3n9O1J4k9J7j5l2J3j7K6j1j1k4L2Ok3Mm8N4j6J5J3K9o1k2
7911g4N4Lk3L7j3o5R5r1R1k2k7Q6j04O7Ml4L3m8L6K6K7m3K8j4L2l5m3R8m4OL4
7942G7p8M0J0o3P0j9j0P4n9L0n1ML4n5j4L9n2N6l0LK1L0l8J5o9%kJ1J6k7O8p7
7974d6j0mj8k7J24q8L6j2j3J6L4rPq3L7Lj4O2n0O4k3OJ0l3j6K7K8m6L2PrP5k4
$$ plain form
8007 43 55 32 -5 41 59 64 67 59 39 61 39 49 25 133 73 94 58 63 7 6 9 41 17 36 27 24 25 46 8 -1 18 44 -1 -18 17
8042 17 17 -4 -9 -37 -18 -86 -60 -8 -35 -76 -41 -16 -4 -65 -62 -80 27 7 -32 -50 -53 44 -14 -67 -56 -29 21 -6 -67 -4 -57 -25
8074 -25 23 -14 -23 2 -34 -7 28 0 20 7 -4 83 43 38 71 15 43 18 -74 97 8 14 63 13 67 26 52 72 -17 25 76
8105 76 39 0 -3 -1 110 20 -9 37 -7 3 23 -10 23 37 -6 21 -23 -13 -25 -55 -11 -1 -73 -7 -10 -16 6 -20 -36 -5 -75 25
8137 25 -40 -46 -31 -41 13 18 -102 -1 3 -16 30 -44 43 17 -2 46 17 -61 62 -14 19 25 -17 92 67 9 72 45 48 44 89
8168 89 5 43 72 109 47 32 49 78 75 31 48 50 97 97 5 46 79 0 63 56 -52 45 30
$$ packed form
8007D3J2k3l7M6J8NLqk0K2k2J0k4J08o0K1l6Nn6jLL2k4J9rlJK1l8rJ9K6m5j7L5
8042A7%k1nk8J9o8K6N2k7m1L5K5J2o1Lj8J07k0l9j8lR7n8n3J1K7N0k7o1O3n3L2
8074b5M8l7rK5l6K7L5k8K0j3j1Q7m0nL3n6K8k5r2J71q9OM9n0N4m1K6K0q9M2N1
8105G6l7l9lKJ11r0k9M6m4J0K0l3L3J4m3K7m4J0j2l0M4J0p2O6loK2k6j6L1p0J00
8137B5o5oJ5j0N4Nj20J01Mj9M6p4Q7k6j9M8k9p8J23p6L3Om2J09k5n8O3k7LmM5
8168H9q4L8K9L7o2j5J7K9lm4J7KM7%r2M1L3p9O3pj08R7j5
8191C0
$$ Imaginary data points
##PAGE= N=2
##DATA TABLE= (X++(I..I)), XYDATA
$$ plain form
0 0 0 0 0 0 0 0 0 0 0 0 0 -1 8 -8 8 -11 16 -16 24 -24 32 -37 41 -49 58 -69 80 -90 104 -120 137 -155 177 -197
34 -197 222 -251 280 -312 351 -391 433 -481 530 -587 646 -715 788 -867 955 -1053 1159 -1275
52 -1275 1408 -1555 1721 -1908 2122 -2372 2662 -3011 3432 -3959 4630 -5524 6766 -8614 11626
67 11626 -17316 31578 -134303 -187092 149183 -50815 128324 -20862 -208169 188958 16871
78 16871 -79947 85538 -152334 91399 92430 -179213 97921 -10755 -72319 105248 -156370
89 -156370 14374 104839 -135844 80645 -422 -79905 104927 -114116 10743 142610 -96487
100 -96487 28862 -15301 -43678 168312 -67222 -87340 55602 -41795 106239 12589 -133291
111 -133291 62157 -11950 -4373 58268 -91658 39376 51979 -53544 54719 -27931 -12172
$$ packed form
0@%%%%%%%%%%%jRj6J6j9K7l2M0m8N6o9P8r0J07j27J49j70J94k24K57k92L32l74
34a97M19m73N31n92O63p42Q24r14J011j117J233j361J503j655J822k008K212k434
52a275K683k963L276l629M030m494N034n673O443p391Q589j0154J2290j5380K0240
67A1626k8942M8894j65881n2789L36275j99998J79139j49186j87307L97127j72087
78A6871r6818J65485k37872K43733J031k71643K77134j08676o1564J77567k61618
89a56370J70744R0465k40683K16489q1067p9483J84832k19043J24859J31867k39097
100i6487J25349m4163k8377K11990k35534k0118J42942r7397J48034r3650j45880
111a33291J95448p4107P577O2641j49926J31034J2603j05523J08263q2650J5759
$$ plain form
122 -12172 75466 -42615 20740 27476 -30588 65925 -11320 -38428 15552 -36933 39929 30945
134 30945 -47617 926 -27493 1326 33621 -37342 2190 5236 -5239 38297 -13682 -3738
146 -3738 5419 -31484 25899 13477 87 12605 -46910 -4078 9973 -29117 10196 -23941
158 -23941 -6563 27635 -43583 -3446 8816 -16950 30205 -31222 -12114 54791 -9705 9879
170 9879 -14393 -42957 51349 2544 -14527 23723 -40321 14703 11710 -44776 31959 -10496
182 -10496 -19858 35131 -27967 21373 25212 -45302 26554 3897 -2757 51936 -24206 6832 29581
195 29581 -34095 25331 1769 -17906 40339 -26285 -8518 26356 -29281 16187 -7164 -34557
207 -34557 36678 -1788 2001 24204 -33893 11687 13278 -18209 32844 -3632 -7590 21775 -27270
$$ packed form
122a2172Q7638j18081O3355O736n8064R6513p7245k7108N3980n2485P6862q984
134C0945p8562M8543k8419K8819L2295p0963L9532L046j0475M3536n1979R944
146c738R157l6903N7383j2422j3390J2518n9515M2832J4051l9090L9313l4137
158b3941J7378L4198p1218M0137J2262k5766M7155o1427J9108O6905o4496J9584
170I879k4272k8564R4306m8805j7071L8250o4044N5024k993n6486P6735m2455
182a0496r362N4989o3098M9340L839p0514P1856k2657o654N4693p6142L1038K2749
195B9581o3676N9426k3562j9675N8245o6624J7767L4874n5637M5468k3351k7393
207c4557P1235l8466L789K2203n8097M5580J591l1487N1053l6476l958K9365m9045
$$ plain form
220 -27270 2240 5983 -29406 11407 -9984 -13464 17714 -23785 -8824 904 -23318 14387 3583
233 3583 -6163 18154 -12180 -3430 8544 -12601 10419 1940 -9618 10988 -7610 -6401 -774
246 -774 -19126 -1480 839 -4699 9546 -4353 -5411 1996 -7069 6059 9128 3782 12104 3845
260 3845 2595 6883 -1294 3228 4035 1382 7597 2418 -532 -350 -6208 -2767 -499 235 5716 3962
276 3962 2713 2672 -636 1201 3092 5282 9151 7751 5232 2079 -2235 -2725 -2721 -1890 -86 -1209 -2756
293 -2756 -4540 -7115 -8216 -7656 -4779 -352 2417 2763 830 -1819 -3042 -1815 847 3004 2845 859
309 859 -1423 -3311 -5221 -6933 -7607 -6523 -3794 -926 -444 -2741 -5803 -7400 -4504 1568 5727 7311
325 7311 5042 951 750 983 2410 4338 2061 2630 3419 1338 2359 -1973 -5967 -2538 -2054 3746
$$ packed form
220b7270K9510L743l5389M0813k1391l480L1178m1499J4961R728k4222L7705j0804
233C583r746K4317l0334Q750J1974k1145K3020q479j1558K0606j8598J209N627
246g74j8352J7646K319n538J4245j3899j058P407r065J3128L069n346Q322q259
260C845j250M288q177M522Q07k653O215n179k950J82n858L441K268P34N481j754
276C962j249m1l308J837J891K190L869j400k519l153m314m90MQ31J804j123j547
293b756j784k575j101N60K877M427K769L46j933k649j223J227K662K157j59j986
309H59k282j888j910j712o74J084K729K868M82k297l062j597K896O072M159J584
325G311k269m091k01K33J427J928k277N69P89k081J021m332l994L429M84N800
$$ plain form
341 3746 7399 848 1355 -1240 -2538 6320 4266 5777 9324 1916 6974 6200 -1008 4260 -3193 -2470
357 -2470 7714 176 3380 -1191 -14612 -3512 -4276 -2295 8737 -5202 -1891 2474 -7404 6570
371 6570 1461 -5381 7533 -3494 3494 10422 -9442 -2512 -7839 -13051 7762 -4077 -4891 1527
385 1527 -16933 -3244 -1806 -10586 8477 -3045 -3621 9365 -5787 6449 5266 -11776 4569
398 4569 -140 3828 16382 -7830 -6483 -3707 -9813 10818 1568 -5821 4321 -7421 3271 6585
412 6585 -5839 5937 -597 16 13528 4146 9468 3934 -8767 4602 3160 7006 10025 -5331
426 -5331 2304 -1409 -7833 3192 -3830 4234 3339 -13144 4205 5580 3805 4123 -20610 794
440 794 19571 5845 9002 -16255 -10315 18854 -6700 -1658 -1795 -14396 15870 -9294 -18127 10817
$$ packed form
341C746L653o551N07k595j298Q858k054J511L547p408N058p74p208N268p453P23
357b470J0184p538L204m571j3421J1100p64J981J1032j3939L311M365r878J3974
371F570n109o842J2914j1027O988O928j9864O930n327n212K0813j1839q14O418
385A527j8460J3689J438q780J9063j1522n76J2986j5152J2236j183j7042J6345
398D569m709L968J2554k4212J347K776o106K0631r250p389J0142j1742J0692L314
412F585j2424J1776o534O13J3512r382N322n534j2701J3369j442L846L019j5356
426e331P635l713o424J1025p022Q064q95j6483J7349J375j775L18k4733K1404
440G94J8777j3726L157k5257N940K9169k5554N042j37j2601L0266k5164q833K8944
$$ plain form
454 10817 -15485 -123 1021 -22234 22020 2673 -14964 13545 -19961 3928 16689 -20277
466 -20277 23409 2422 -24853 14105 -17795 8043 22287 -41144 3968 10603 -7363 28667
478 28667 -34422 -19598 35674 -12267 17873 2153 -29309 41087 -4595 -16587 27237 -23510
490 -23510 21193 20128 -37137 27526 -2717 -15637 32032 -33745 1482 26530 -27014 31195
502 31195 -4337 -34713 30460 -14846 12130 31922 -41996 14900 12762 -16216 35151 -26903
514 -26903 -14989 33913 -23864 14501 3978 -36484 25738 -14401 -16899 27493 -27236 7863
526 7863 13006 -31807 21226 -7976 -14979 32620 -19074 -1105 11481 -23493 26760 -2507 -31190
539 -31190 12569 -11413 12362 16532 -37938 404 3630 -7190 19793 -18519 -4049 19820
$$ packed form
454A0817k6302J5362J144k3255M4254j9347j7637K8509l3506K3889J2761l6966
466b0277M3686k0987k7275L8958l1900K5838J4244o3431M5112O635j7966L6030
478B8667o3089J4824N5272m7941L0140j5720l1462P0396m5682j1992M3824n0747
490b3510M4703j065n7265O4663l0243j2920M7669o5777L5227K5048n3544N8209
502C1195l5532l0376O5173m5306K6976J9792p3918N6896k138k8978N1367o2054
514b6903J1914M8902n7777L8365j0523m0462O2222m0139k498M4392n4729L5099
526G863N143m4813N3033k9202p003M7599n1694J7969J2586l4974N0253k9267k8683
539c1190M3759k3982K3775M170n4470L8342L226j0820K6983l8312J4470K3869
$$ plain form
551 19820 -12499 9151 1778 -8799 17891 -8919 -795 16936 -6106 6870 -4491 -10153 13735
564 13735 -5501 -538 8322 -4583 7691 -7795 -7852 15153 1598 3716 -2845 -6317 20886 4398
578 4398 -5711 -1014 -9160 17592 9072 -10241 5720 -9733 721 7950 -16364 7846 565
591 565 -11872 11828 -11552 -179 10745 -20031 8695 4021 -9852 18774 -11839 -3466 14035
604 14035 -22597 6462 5034 -13262 18514 -17607 -14704 16614 -17468 5891 518 -24256 22124
617 22124 -1564 -10449 15272 -21132 7355 15443 -19358 18629 -394 -11854 19483 -18479
629 -18479 1160 16909 -20762 12445 783 -13660 22073 -14146 -5387 17363 -16662 13565
641 13565 8002 -13126 22225 -7780 -7932 18812 -11200 12287 9588 -17909 16251 -1878 -8575
$$ packed form
551A9820l2319K1650p373j0577K6690k6810Q124J7731k3042J2976j1361n662K3888
564A3735j9236M963Q860j2905J2274j5486n7K3005j3555K118o561l472K7203j6488
578D398j0109M697q146K6752q520j9313J5961j5453J0454P229k4314K4210p281
591E65j2437K3700k3380J1373J0924l0776K8726m674j3873K8626l0613Q373J7501
604A4035l6632K9059j428j8296L1776l6121K903L1318l4082K3359n373k4774M6380
617B2124k3688q885K5721l6404K8487Q088l4801L7987j9023j1460L1337l7962
629a8479J9639J5749l7671L3207j1662j4443L5733l6219Q759K2750l4025L0227
641A3565n563k1128L5351l0005j52K6744l0012K3487k699k7497L4160j8129o697
$$ plain form
654 -8575 14126 -14842 3933 11411 -15797 10170 -963 -10154 11961 -11694 603 13953 -10293
667 -10293 6399 203 -8749 12298 -7022 -4899 8589 -8039 4185 -230 -12716 4507 -5860
680 -5860 -6739 4325 -7499 1703 1660 -9466 2398 -2022 -2918 5644 -3089 1940 3437 -4956 1806
695 1806 -857 -2742 2146 -3335 246 2403 -3307 -1162 -2416 -1454 2548 -404 1218 2824 1783
710 1783 2632 -105 564 2921 2970 4273 2459 1748 1774 -544 975 849 469 2510 221 974 1463 -1670
728 -1670 184 -216 93 3294 934 1596 2197 -992 911 186 -280 2921 99 -227 616 -2301 -643
745 -643 -1911 -4096 -1219 -1907 -1017 244 -3231 -2916 -2768 -3023 653 626 101 488 -2048 -1211 -64 -1017
763 -1017 -127 -1203 -1740 -370 -1110 -1381 -1835 -3301 -2356 -938 246 1402 377 -678 -579 97 1525
$$ packed form
654h575K2701k8968J8775P478k7208K5967j1133r191K2115k3655J2297J3350k4246
667a0293J6692o196q952K1047j9320K123J3488j6628J2224m415j2486J7223j0367
680e860q79J1064j1824R202m3j1126J1864m420q96Q562q733N029J497q393O762
695A806k663j885M888n481L581K157n710K145j254R62M002k952J622J606j041
710A783Q49k737O69K357M9J303j814p11K6k318J519j26l80K041k289P53M89l133
728a670J854m00L09L201k360O62O01l189J903p25m66L201k822l26Q43k917J658
745f43j268k185K877o88Q90J261l475L15J48k55L676k7n25L87k536Q37J147r53
763a017Q90j076n37J370p40k71m54j466R45J418J184J156j025j055R9O76J428
$$ plain form
780 1525 2323 2000 1814 1538 1568 1721 1009 149 -24 691 1912 2241 1273 -46 -1067 -378 1304 2379 2796
799 2796 1603 561 1077 1196 1891 1873 656 1152 1261 1348 2051 -177 -1309 -1096 -1596 651 804 -913
817 -913 -617 -2657 -2520 -349 -1584 -330 -118 -1775 691 -515 -1505 -39 -2515 -1004 722 -1199
833 -1199 530 -1732 -4103 -1598 -2677 -1087 341 -3073 -1545 -1086 -1686 1143 -992 -1567 757 -143
849 -143 2250 2572 -438 260 -684 -337 2151 996 751 648 -636 -52 199 345 1274 1508 802 854 2241
868 2241 1911 1906 1054 -1005 2441 3745 2171 2704 -1809 -1069 3593 56 1792 523 -3344 3546 440
885 440 -1830 2543 -4499 55 3267 -4305 3502 -146 -4160 4761 -5045 -1993 5013 -5112 4061
900 4061 -110 -9293 5011 -3298 -2580 5372 -11331 353 3959 -8072 6281 -6179 -8216 9980
$$ packed form
780A525P98l23j86k76L0J53p12q60j73P15J221L29r68j319j021O89J682J075M17
799B796j193j042N16J19O95j8j217M96J09Q7P03k228j132K13n00K247J53j717
817i13K96k040J37K171j235J254K12j657K466j206r90J466k476J511J726j921
833a199J729k262k371K505j079J590J428l414J528M59o00K829k135n75K324r00
849a43K393L22l010O98r44L47K488j155k45j03j284N84K51J46R29K34p06N2J387
868B241l30nq52k059L446J304j574N33m513P40M662l537J736j269l867O890l106
885D40k270M373p042M554L212p572P807l648m014Q921r806L052P006j0125R173
900D061m171r183J4304q309P18P952j6703J1684L606j2031J4353j2460k037J8196
$$ plain form
914 9980 -6427 1365 4695 -12421 8728 1337 -8424 9806 -8427 146 11022 -12640 5096
927 5096 1892 -9878 13065 -7003 -5279 13000 -9456 6644 5096 -14025 12944 -35 -3837
940 -3837 14472 -11779 2606 10992 -10984 11389 -1183 -9816 15797 -6487 331 9917 -14380
953 -14380 8991 4396 -10385 12645 -6880 -2517 13417 -12375 3866 4398 -10830 12738 -4135
966 -4135 -7471 11299 -9208 2672 4775 -13801 7863 -198 -6727 8343 -10425 -2082 6489
979 6489 -9696 4724 -830 -8351 7050 -4985 -1917 5461 -8085 1838 1399 -4893 5238 -3486
993 -3486 -3311 3772 -3939 573 106 -3594 3718 -289 -2074 528 -888 2837 1202 -1084 702 1338
1009 1338 3320 -283 -570 1818 -75 3795 97 -1561 4469 -1930 1200 3606 -3448 5139 278
$$ packed form
914I980j6407P792L330j7116K1149p391r761J8230j8233Q573J0876k3662J7736
927E096l204j1770K2943k0068J724J8279k2456J6100j548j9121K6969j2979l802
940c837J8309k6251J4385Q386k1976K2373j2572q633K5613k2284O818R586k4297
953a4380K3371m595j4781K3030j9525M363J5934k5792J6241N32j5228K3568j6873
966d135l336J8770k0507J1880K103j8576K1664q061o529J5070j8768Q343Q571
979F489j6185J4420n554p521J5401j2035L068P378j3546R923m39o292J0131q724
993c486J75P083p711M512m67l700P312m007j785K602j416L725j635k286J786O36
1009A338J982l603k87K388j893L870l698j658O030o399L130K406p054Q587m861
$$ plain form
1024 278 -3320 7475 -2844 514 5297 -6673 5824 1749 -6439 8683 -3629 -1817 6864 -9497
1038 -9497 5066 4347 -9523 7855 -4080 -4056 9738 -10926 1549 5789 -11261 7786 -3160
1051 -3160 -7931 11011 -10143 -1183 7867 -12348 6640 -555 -9916 12053 -8606 -4624 9861
1064 9861 -11022 5259 611 -12969 13153 -3013 -7297 7713 -10658 7258 7483 -15254 7289
1077 7289 839 -2954 10850 -12544 833 12613 -8789 4649 -1640 -5371 15008 -6013 -4609
1090 -4609 9095 -5669 6807 1774 -8447 11779 -897 -4798 7352 -4633 5299 3564 -10041
1103 -10041 7657 3150 -3894 3610 -5993 4173 8063 -8793 -74 2406 457 5805 -7609 -4075
1117 -4075 7504 -1251 -997 -3186 -4222 6431 -791 -5995 245 -1271 1801 159 -5594 891 1181
$$ packed form
1024B78l598J0795j0319L358M783j1970J2497m075q188J5122j2312J812Q681j6361
1038i497J4563p19j3870J7378j1935K4J3794k0664J2475M240j7050J9047j0946
1051c160m771J8942k1154Q960R050k0215J8988p195r361K1969k0659L982J4485
1064I861k0883J6281m648j3580K6122j6166m284J5010j8371J7916K25k2737K2543
1077G289o450l793J3804k3394J3377J1780k1402J3438o289l731K0379k1021J404
1090d609J3704j4764J2476n033j0221K0226j2676l901J2150j1985R932j735j3605
1103a0041J7698m507p044P504r603J0166L890j6856Q719K480j949N348j3414L534
1117d075J1579q755K54k189j036J0653p222n204O240j516L072j642n753O485K90
$$ plain form
1132 1181 -2529 -574 -2049 -275 951 -3061 -1353 789 -1351 -1528 -1058 -203 1271 -1032 -2895 546
1148 546 1754 -322 -580 -1538 593 2917 -946 -762 1284 -51 1908 237 -965 3213 815 124
1164 124 2064 -1136 1592 2171 -734 2865 298 -1072 2699 -360 1277 1988 -1936 2480 1965 -750
1180 -750 2323 -929 332 2853 -1917 629 1184 -1365 1644 -1577 -1907 1787 -1786 -578 359 -2175
1196 -2175 1231 -588 -2323 817 -1457 -684 738 -1993 301 -596 -2858 -208 -1191 -995 162 -2537
1212 -2537 -926 -113 -1797 -202 -1126 -1269 597 -894 -305 513 -875 44 -288 -521 1135 422 121
1229 121 530 -289 574 666 11 746 544 525 1247 574 427 367 143 1014 1537 1422 1286 606 427 1010 1266
1250 1266 1467 1179 584 515 705 740 633 -37 -538 -447 112 556 472 -318 -856 -827 -258 551 660 180 -482
$$ packed form
1132A181l710J955j475J774J226m012J708K142k140j77M70Q55J474k303j863L441
1148E46J208k076k58r58K131K324l863J84K046j335J959j671j202M178k398o91
1164A24J940l200K728N79k905L599k567j370L771l059J637P11l924M416n15k715
1180g50L073l252J261K521m770K546N55k549L009l221l30L694l573J208R37k534
1196b175L406j819j735L140k274P73J422k731K294q97k262K650r83J96J157k699
1212b537J611Q13j684J595r24j43J866j491N89Q18j388R19l32k33J656p13l01
1229A21M09q19Q63R2o55P35k02j9P22o73j47o0k24Q71N23j15j36o80j79N83K56
1250A266K01k88n95o9J90L5j07o70n01R1N59M44q4p90n38K9N69Q09J09m80o62
$$ plain form
1271 -482 -782 -463 -118 -349 -834 -1240 -1147 -606 -548 -1026 -1637 -2088 -1569 -656 -119 -106 -1044 -1509 -995 -470 275
1292 275 254 -569 -569 -429 38 659 -259 -972 -815 -531 929 1182 18 -422 -1020 -554 1275 1127 1158 771
1312 771 -369 899 1346 952 1688 558 575 1954 1076 1664 1178 -852 338 255 705 2279 -41 -638
1330 -638 27 -945 1419 1186 -749 922 -214 418 2265 -595 -345 -139 -1579 1549 710 -1158 128
1347 128 -2759 -1997 322 -1797 243 -509 -3088 -35 -1078 -1187 1149 -2227 -930 712 -1458 1615
1363 1615 198 -2709 -91 -2020 -529 2562 -1654 -998 -749 -2687 1709 93 -2161 1153 -1029
1378 -1029 676 2691 -1758 804 1109 -1464 2735 1239 720 3685 -1818 -931 2427 -352 2928 860
1394 860 -2728 2905 372 -743 2538 -1969 903 2289 -2479 3468 2789 -1521 1645 -2577 594
$$ packed form
1271d82l00L19L45k31m85m06R3N41N8m78o11m51N19R13N37J3r38m65N14N25P45
1292B75k1q23%J40M67O21r18p13J57K84J460K53j164m40n98M66J829j48L1l87
1312G71j140J268M47l94P36j130J7J379q78N88m86k030J190q3M50J574k320n97
1330f38O65r72K364k33j935J671j136O32J847k860K50K06j440L128q39j868J286
1347A28k887P62K319k119K040p52k579L053j043j09K336l376J297J642k170L073
1363A615j417k907K618j929J491L091m216O56K49j938M396j616k254L314k182
1378a029J705K015m449K562L05k573M199j496n19K965n503Q87L358k779L280k068
1394H60l588N633k533j115L281m507K872J386m768N947o79m310L166m222L171
$$ plain form
1409 594 6298 -1718 -680 607 -2291 3916 -1521 -5002 3157 -1241 -884 858 -5367 2544 1576 -6266
1425 -6266 1026 -473 925 4732 -6718 -2076 3796 -2748 2329 -2386 -4615 5655 -2892 -3535 2249
1440 2249 -4832 1758 -139 -6732 5424 858 -3299 2146 -5710 2235 6054 -5263 2542 1293
1454 1293 -2173 5821 -4266 -1942 6835 -3261 1160 1134 -3918 7405 -810 -6259 3746 -944
1468 -944 4180 4347 -7835 2955 4570 -1662 3970 -3818 401 9295 -3391 -1043 2056 -2035 6063
1483 6063 -2644 -6839 6163 1057 -220 -413 -8285 3838 4862 -5312 983 -1276 417 5657
1497 5657 -6420 -2219 5112 -2385 1303 -1981 -3954 6507 -2537 -6659 1377 -2562 1996 662
1511 662 -8103 3027 2415 -4960 755 -3373 1298 6529 -6269 -1069 4447 -1786 2911 -3966 -4418
$$ packed form
1409E94N704q016J038J287k898O207n437l481Q159m398L57J742o225P911r68p842
1425f266P292j499J398L807j1450M642N872o544N077m715k229J0270q547o43N784
1440B249p081O590j897o593J2156m566m157N445p856P945L819j1317P805j249
1454A293l466P994j0087K324Q777j0096M421k6n052J1323q215n449J0005m690
1468i44N124J67j2182J0790J615o232N632p788M219Q894j2686K348L099m091Q098
1483F063q707m195J3002n106j277j93p872J2123J024j0174O295k259J693N240
1497E657j2077M201P331p497L688l284j973J0461r044m122Q036l939M558j334
1511F62q765J1130o12p375N715m128M671N231j2798N200N516o233M697o877m52
$$ plain form
1526 -4418 8929 -264 -3243 1012 -4628 5071 2212 -8045 3706 1591 -95 5028 -6578 686
1540 686 7073 -3912 3380 706 -2457 9026 -2027 -2985 5041 -4233 4045 3414 -6579 5334 -403
1555 -403 -3521 5429 -6013 35 5780 -5413 4211 629 -5095 6619 -3312 -2120 6511 -4699
1569 -4699 2645 1986 -6955 5229 -1810 -5494 4261 -4954 975 3157 -8945 1961 708 -4588
1583 -4588 3920 -5094 -725 7226 -5204 -232 507 -3829 6270 -2598 -4597 5611 -2191 327
1597 327 -101 -7333 4256 1784 -3937 2739 -2898 670 4087 -5226 1563 2947 -1605 4202 -828
1612 -828 -12 5322 -2758 -324 2431 -829 4197 7 -2732 3145 -1034 -788 1433 -1873 2563 1589
1628 1589 -2413 2045 706 -84 1452 -1928 1346 3852 63 458 -944 -1698 1582 -358 -885 807
$$ packed form
1526d418J3347r193k979M255n640R699k859j0257J1751k115j686N123j1606P264
1540F86O387j0985P292k674l163J1483j1053r58Q026r274Q278o31r993J1913n737
1555d03l118Q950j1442O048N745j1193R624l582n724J1714r931J192Q631j1210
1569d699P344o59q941J2184p039l684R755r215N929K182j2102J0906j253n296
1583d588Q508r014M369P951j2430M972P39m336J0099q868j999J0208p802K518
1597C27m28p232J1589k472n721O676n637L568L417r313O789J384m552N807n030
1612h28Q16N334q080K434K755l260N026m190k739N877m179K46K221l306M436r74
1628A589m002M458j339p90J536l380L274K506l789L95j402p54L280j940n27J692
$$ plain form
1644 807 -1518 -1043 -646 -2142 -194 -752 -2192 46 11 202 791 -1779 -1381 140 -477 1089 784 -1125
1662 -1125 -403 -1647 -1749 323 -1110 -1064 -574 -1626 354 236 -1744 -602 -970 74 2488 822 789
1679 789 503 -1172 967 1292 744 1797 -222 -194 1191 -111 501 -62 -1423 654 877 1059 1788 -627
1697 -627 -644 224 401 2564 2133 638 799 -148 633 1579 175 149 -131 -305 985 239 -968 -1410 -2165
1716 -2165 -727 741 555 367 -1032 -1691 -438 225 852 495 -662 -387 14 139 -24 -1407 -2098 -1536
1734 -1536 -629 457 7 -1644 -2479 -2364 -942 706 660 86 -635 -670 384 904 640 94 -504 261 1258
1753 1258 1245 554 -1057 -1679 -718 576 1509 1091 -483 -934 -402 593 1556 1015 528 671 1092 2008 1821
1772 1821 579 -112 -262 955 2295 1735 419 -1144 -1755 -428 673 814 212 -906 -858 54 525
$$ packed form
1644H07k325M75L97j496J948n58j440K238l5J91N89k570L98J521o17J566l05j909
1662a125P22j244j02K072j433M6M90j052J980j18j980J142l68J044K414j666l3
1679G89k86j675K139L25n48J053k019K8J385j302O12n63j361K077K23J82P29k415
1697f27j7Q68J77K163m31j495J61r47P81R46j404k6k80j74J290p46j207m42p55
1716b165J438J468j86j88j399o59J253O63O27l57j157K75M01J25j63j383o91N62
1734a536R07J086m50j651q35J15J422J648m6n74p21l5J054N20k64n46n98P65R97
1753A258j3o91j611o22R61J294R33m18j574m51N32R95R63n41m87J43M21R16j87
1772A821j242o91j50J217J340n60j316j563o11J327J101J41o02j118M8R12M71
$$ plain form
1789 525 423 -299 -741 -42 995 1585 945 -573 -1878 -1479 -55 845 434 -1153 -2277 -1696 -1146 -825
1807 -825 -603 -1445 -1108 -519 -307 911 83 -1523 -1070 -732 1531 2621 -288 -921 -1370 -1227 1220 -220
1825 -220 -682 547 -1553 -186 437 -963 1398 -900 -1738 2190 1350 2488 1671 -2700 957 1686 665
1842 665 3588 -346 69 2127 -2190 1139 1285 -1851 1856 -1421 -693 3930 -1634 -353 77 -2943
1858 -2943 3926 1584 -906 3086 -2530 -195 2527 -2712 2657 358 -3446 2629 -2065 -1064 1880
1873 1880 -5554 -282 558 -2897 3660 -2005 -3295 1979 -3681 1315 2588 -3433 2962 -430 -2644
1888 -2644 3069 -3204 -199 2231 -4608 1298 451 -2238 2552 -4574 -3002 3386 -981 2343 -77
1903 -77 -3746 4060 560 -1168 2315 -1459 3069 2790 -2884 2255 963 -793 1145 -3000 1310 4114
$$ packed form
1789E25j02p22m42O99J037N90o40j518j305L99J424R00m11j587j124N81N50L21
1807h25K22q42L37N89K12J218q28j606M53L38K263J090k909o33m49J43K447j440
1825b20m62J229k100J367O23j400K361k298q38L928q40J138q17m371L657P29j021
1842F65K923l934M15K058m317L329J46l136L707l277P28M623n564J281M30l020
1858b943O869k342k490L992n616K335K722n239N369k299l804O075m694J001K944
1873A880p434N272Q40l455O557n665j290N274n660M996J273o021O395l392k214
1888b644N713o273L005K430o839N906q47k689M790p126J572O388m367L324k420
1903g7l669P806l500j728L483l774M528k79n674N139j292j756J938m145M310K804
$$ plain form
1919 4114 -1194 -432 -1341 -565 3029 -765 -209 2371 788 1123 -429 -119 2496 469 -845 -9 1755
1936 1755 2180 -1287 -2569 -1420 824 1116 -2298 -1030 643 -511 -213 -3096 -960 3051 -1071 -381
1952 -381 -14 -849 3526 -2006 -3801 1918 -957 1652 208 -5342 2033 -509 -3653 1337 -3901 1071
1968 1071 3549 -5188 1543 273 -2471 4814 -3422 -564 5862 -3205 2817 603 -4993 5647 -1934
1983 -1934 -2073 5372 -4610 2196 2268 -6440 4851 -1067 -3024 6880 -3489 2001 4523 -6353 5020
1998 5020 1526 -3121 7012 -3613 343 6541 -5992 2317 444 -5150 7110 -2770 -3055 5100
2012 5100 -5647 2097 1600 -7034 5590 -193 -2258 5517 -5714 909 4084 -5772 3596 -766
2026 -766 -3497 6065 -4199 -1979 1880 -6569 2700 578 -4713 3696 -3591 -1780 3639 -4829 1366
$$ packed form
1919D114n308P62r09P76L594l794N56K580j583L35j552L10K615k027j314Q36J764
1936A755M25l467j282J149K244K92l414J268J673j154K98k883K136M011m122O90
1952c81L67q35M375n532j795N719k875K609j444n550P375k542l144M990n238M972
1968A071K478q737O731j270k744P285q236K858O426r067O022k214n596J0640p581
1983a934j39P445r982O806P2q708J1291n918j957R904j0369N490K522j0876J1373
1998E020l494m647J0133j0625L956O198j2533Q309j873n594J2260r880k85Q155
2012E100j0747P744m97q634J2624n783k065P775j1231O623L175r856R368m362
2026g66k731R562j0264K220L859q449R269k122n291Q409p287J811N419q468O195
$$ plain form
2041 1366 1307 -3186 4878 -800 -1894 3102 -3396 1153 1732 -3314 3002 -146 -1872 1650 -3518 -33
2057 -33 2270 -1725 1712 -129 -686 3182 -573 -89 1230 -410 3121 1971 70 1191 -999 157
2073 157 1220 18 1165 -153 -539 483 -453 243 -608 -655 892 191 1180 640 -430 724 -1064
2090 -1064 -159 1537 194 1550 -703 -2433 469 -1129 -356 88 -2880 253 -106 -1718 741 -2448
2106 -2448 -1676 855 -1591 1864 1143 -2020 856 -1634 -548 2465 -1620 379 407 -2279 1597 -1049
2122 -1049 -1927 958 -2630 163 1768 -1247 1728 -913 -2199 2093 -12 1817 2715 -1455 1403
2137 1403 732 -555 2729 -561 -355 1614 -992 1842 1014 -2045 433 -1112 46 2821 -195 712
2153 712 410 -1524 1639 811 449 1845 -867 368 1449 -357 620 -1111 -1883 583 -148 416 284
$$ packed form
2041A366n9m493Q064n678j094M996o498M549N79n046O316l148j726L522n168L485
2057c3K303l995L437j841n57L868l755M84J319j640L531j150j901J121k190J156
2073A57J063j202J147j318l86J022r36O96q51m7J547p01R89n40j070J154j788
2090a064R05J696j343J356k253j730K902j598P73M44k968L133l59j612K459l189
2106b448P72K531k446L455p21l163K876k490J086L013m085J999K8k686L876k646
2122a049q78K885l588K793J605l015K975k641j286M292k105J829Q98m170K858
2137A403o71j287L284l290K06J969k606K834q28l059K478j545J158K775l016R07
2153G12l02j934L163q28l62J396k712J235J081j806R77j731p72K466p31N64j32
$$ plain form
2170 284 -2254 -1418 -1184 -794 1216 -104 -691 -350 -976 480 522 -722 -287 -743 95 1006 -158 -810
2188 -810 -1585 -2036 -393 186 237 -266 -1489 -1231 -406 133 665 35 -174 478 929 1334 686 -358 -407 45
2208 45 1142 1538 711 -333 -1081 -792 386 847 707 94 -366 277 855 967 663 -26 163 1078 1722
2227 1722 1752 564 -566 -606 23 946 1107 233 -618 -1081 -683 58 -115 -483 -760 -597 485 614 96
2246 96 -555 -1324 -469 619 873 931 -519 -1462 -945 -871 102 -73 -1301 -933 -1162 -747 240 -1152 -1175 -855
2266 -855 -900 1298 1069 -42 81 -1519 -202 1460 478 1294 -105 -1320 780 -366 2 585 -1699
2283 -1699 355 704 -302 1862 -606 -1029 1007 -622 2130 2354 -468 1617 -354 -421 2671 -419
2299 -419 871 1185 -1844 1769 485 -1060 1340 -2591 -593 2309 -863 1686 -440 -2617 2025
$$ packed form
2170B84k538Q36K34L90K010j320n87L41o26J456M2j244M35m56Q38R11j164o52
2188h10p75m51J643N79N1n03j223K58Q25N39N32o30k09O52M51M05o48j044m9M52
2208D5J097L96q27j044p48K89J178M61j40o13m60O43N78J12l04o89J89R15O44
2227A722L0j188j130m0O29R23J61q74q51m63L98P41j73l68k77J63J082J29n18
2246I6o51p69Q55J088K54N8j450r43N17P4R73j75j228L68k29M15R87j392k3L20
2266h55m5K198k29j111J23j600J317J662r82Q16j399j215K100j146L68N83k284
2283a699K054L49j006K164k468m23K036j629K752K24k822K085j971o7L092l090
2299d19J290L14l029L613j284j545K400l931J998K902l172K549k126k177M642
$$ plain form
2314 2025 -657 8 2341 -1862 1175 637 -2376 1919 -1050 -1490 1415 -2692 484 1083 -3103 337
2330 337 -2032 -2298 2109 -1659 217 1042 -3055 901 0 -1044 2343 -1871 -485 2125 -1163 1125
2346 1125 -938 -2734 1568 -522 -128 1152 -1952 495 -39 -1462 1455 45 523 1533 -580 1298
2362 1298 873 -142 1244 4 872 1187 187 1178 -228 -568 -278 -658 1699 607 -478 303 -1198
2379 -1198 1323 1014 -1227 1266 -280 842 2490 -1787 577 238 -1874 2517 -1003 -870 2069 -3197
2395 -3197 579 254 -3896 2201 -1629 -1381 3259 -4109 58 1577 -3670 3523 -1631 -3000 5078
2410 5078 -2550 452 1496 -6273 3712 606 -3770 3962 -4612 -246 4461 -6362 2005 354 -4097
2425 -4097 6749 -2889 -1876 5166 -5301 3471 2708 -5416 6112 -1513 -1719 6759 -5848 878
$$ packed form
2314B025k682O65K333m203L037n38l013M295k969m40K905m107L176N99m186L440
2330C37k369k66M407l768J876Q25m097L956r01j044L387m214J386K610l288K288
2346A125k063j796M302k090L94J280l104K447n34j423K917j410M78J010k113J878
2362A298m25j015J386j240Q68L15j000R91j406l40K90l80K357j092j085P81j501
2379a198K521l09k241K493j546J122J648m277K364l39k112M391l520J33K939n266
2395c197L776l25m150O097l830K48M640p368M167J519n247P193n154j369Q078
2410E078p628L002J044p769R985l106m376P732q574M366M707j0823Q367j651m451
2425d097J0846r638J013P042j0467Q772p63q124J1528p625k06Q478j2607O726
$$ plain form
2439 878 3107 -5406 6619 -1032 -4750 6301 -3964 1411 3841 -7367 5386 2316 -3278 5937
2453 5937 -4935 98 6671 -5699 2829 818 -4060 7216 -3416 -3191 4171 -5522 2976 1980
2467 1980 -5761 4524 -2444 -2597 5065 -4876 792 1983 -4578 5145 -661 -3797 3320 -3733 1156
$$ packed form
2439H78K229q513J2025p651l718J1051j0265N375K430j1208J2753l070n594R215
2453E937j0872N033O573j2370Q528k011m878J1276j0632K25P362r693Q498r96
2467A980p741J0285o968j53P662r941N668J191o561R723n806l136P117p053M889
$$ [...]
8191a18
##END NTUPLES=NMR FID
##END=
