##TITLE=1H_LR-723-C1
 CDCl3, 8 sc, 
 22.9.2020
##JCAMPDX= 6.0         $$ Bruker NMR JCAMP-DX V2.0
##DATA TYPE= NMR FID
##DATA CLASS= NTUPLES
##ORIGIN= UXNMR, Bruker Analytische Messtechnik GmbH
##OWNER= root
$$ XWIN-NMR		Version 3.5
$$ Tue Sep 22 12:13:02 2020 Russian Standard Time (UT+4h)  she@DPX200
##.OBSERVE FREQUENCY= 200.1315066352
##.OBSERVE NUCLEUS= ^1H
##.DELAY= (6, 6)
##.ACQUISITION MODE= SIMULTANEOUS
##.ACQUISITION SCHEME= undefined
##.AVERAGES= 8
##.DIGITISER RES= 18
##SPECTROMETER/DATA SYSTEM= spect
##.PULSE SEQUENCE= zg30
##.SOLVENT NAME= CDCl3
##.SHIFT REFERENCE= (INTERNAL, CDCl3, 0, 15.7039)
##AUDIT TRAIL= $$ (NUMBER, WHEN, WHO, WHERE, WHAT)
$$ ##TITLE= Audit trail, XWIN-NMR		Version 3.5
$$ ##JCAMPDX= 5.01
$$ ##ORIGIN= Bruker BioSpin GmbH
$$ ##OWNER= she
$$ F:/spectra/data/she/nmr/H-F/1/audita.txt
$$ ##AUDIT TRAIL=  $$ (NUMBER, WHEN, WHO, WHERE, WHAT)
(   1,<2020-09-22 12:12:17.07 +0400>,<she>,<DPX200>,
      <created by zg, POWCHK disabled, PULCHK disabled
       configuration hash MD5:
       00 E9 B6 7A A2 85 ED C7 34 08 36 98 17 FE 4E 26
       data hash MD5: 16K
       AE 71 F2 DD 45 7E E1 8B 83 39 76 6C 3A 1B 57 1A>)
$$ ##END=
$$ 
$$ hash MD5
$$ B5 F9 79 6F 9A AB 4E 13 1E A4 87 92 83 DA 73 FF
##$RELAX= 
##$RELAX= 
##$RELAX= 
##$RELAX= 
##$RELAX= 
##$RELAX= 
$$ Bruker specific parameters
$$ --------------------------
##$DU= <F:/spectra>
##$EXPNO= 1
##$NAME= <H-F>
##$PROCNO= 1
##$TYPE= <nmr>
##$USER= <she>
##$AMP= (0..31)
100 100 100 100 100 100 100 100 100 100 100 100 100 100 100 100 100 100 
100 100 100 100 100 100 100 100 100 100 100 100 100 100 
##$AQSEQ= 0
##$AQ_mod= 1
##$AUNM= <au_zg>
##$AUTOPOS= <>
##$BF1= 200.13
##$BF2= 200.13
##$BF3= 200.13
##$BF4= 200.13
##$BF5= 200.13
##$BF6= 200.13
##$BF7= 200.13
##$BF8= 200.13
##$BYTORDA= 1
##$CFDGTYP= 0
##$CFRGTYP= 5
##$CHEMSTR= <none>
##$CNST= (0..31)
1 1 145 1 1 1 1 1 1 1 1 1 1 1 1 1 1 1 1 1 1 1 1 1 1 1 1 1 1 1 1 1 
##$CPDPRG= <>
##$CPDPRG1= <>
##$CPDPRG2= <>
##$CPDPRG3= <>
##$CPDPRG4= <mlev>
##$CPDPRG5= <mlev>
##$CPDPRG6= <mlev>
##$CPDPRG7= <mlev>
##$CPDPRG8= <mlev>
##$CPDPRGB= <>
##$CPDPRGT= <>
##$D= (0..31)
0 1.2 0 0 0 0 0 0 0 0.06 0 0.03 0 0 0 0 0.0002 0 0 0 0 0 0 0 0 0 0 0 0 
0 0 0 
##$DATE= 1600762336
##$DBL= (0..7)
120 120 120 120 120 120 120 120 
##$DBP= (0..7)
150 150 150 150 150 150 150 150 
##$DBP07= 0
##$DBPNAM0= <>
##$DBPNAM1= <>
##$DBPNAM2= <>
##$DBPNAM3= <>
##$DBPNAM4= <>
##$DBPNAM5= <>
##$DBPNAM6= <>
##$DBPNAM7= <>
##$DBPOAL= (0..7)
0.5 0.5 0.5 0.5 0.5 0.5 0.5 0.5 
##$DBPOFFS= (0..7)
0 0 0 0 0 0 0 0 
##$DE= 6
##$DECBNUC= <off>
##$DECIM= 32
##$DECNUC= <off>
##$DECSTAT= 4
##$DIGMOD= 1
##$DIGTYP= 9
##$DL= (0..7)
0 120 120 120 120 120 120 120 
##$DP= (0..7)
150 150 150 150 150 150 150 150 
##$DP07= 0
##$DPNAME0= <>
##$DPNAME1= <>
##$DPNAME2= <>
##$DPNAME3= <>
##$DPNAME4= <>
##$DPNAME5= <>
##$DPNAME6= <>
##$DPNAME7= <>
##$DPOAL= (0..7)
0.5 0.5 0.5 0.5 0.5 0.5 0.5 0.5 
##$DPOFFS= (0..7)
0 0 0 0 0 0 0 0 
##$DQDMODE= 0
##$DR= 18
##$DS= 0
##$DSLIST= <SSSSSSSSSSSSSSS>
$$ [...]
##$SUBNAM2= <"">
##$SUBNAM3= <"">
##$SUBNAM4= <"">
##$SUBNAM5= <"">
##$SUBNAM6= <"">
##$SUBNAM7= <"">
##$SUBNAM8= <"">
##$SUBNAM9= <"">
##$SW= 16.880792210976
##$SWIBOX= (0..15)
0 0 2 0 0 0 0 0 0 0 0 0 0 0 0 0 
##$SW_h= 3378.37837837838
##$TD= 16384
##$TD0= 1
##$TE= 0
##$TE2= 300
##$TE3= 300
##$TEG= 300
##$TL= (0..7)
0 120 120 120 120 120 120 120 
##$TP= (0..7)
150 150 150 150 150 150 150 150 
##$TP07= 0
##$TPNAME0= <>
##$TPNAME1= <>
##$TPNAME2= <>
##$TPNAME3= <>
##$TPNAME4= <>
##$TPNAME5= <>
##$TPNAME6= <>
##$TPNAME7= <>
##$TPOAL= (0..7)
0.5 0.5 0.5 0.5 0.5 0.5 0.5 0.5 
##$TPOFFS= (0..7)
0 0 0 0 0 0 0 0 
##$TUNHIN= 0
##$TUNHOUT= 0
##$TUNXOUT= 0
##$USERA1= <user>
##$USERA2= <user>
##$USERA3= <user>
##$USERA4= <user>
##$USERA5= <user>
##$V9= 5
##$VALIST= <valist>
##$VCLIST= <CCCCCCCCCCCCCCC>
##$VD= 0
##$VDLIST= <DDDDDDDDDDDDDDD>
##$VPLIST= <PPPPPPPPPPPPPPP>
##$VTLIST= <TTTTTTTTTTTTTTT>
##$WBST= 1024
##$WBSW= 4
##$XGAIN= (0..3)
0 0 0 0 
##$XL= 0
##$YL= 0
##$YMAX_a= 410328
##$YMIN_a= -417981
##$ZGOPTNS= <>
##$ZL1= 120
##$ZL2= 120
##$ZL3= 120
##$ZL4= 120
##$ABSF1= 10
##$ABSF2= 0
##$ABSG= 5
##$ABSL= 3
##$ALPHA= 0
##$AQORDER= 0
##$ASSFAC= 0
##$ASSFACI= 0
##$ASSFACX= 0
##$ASSWID= 0
##$AUNMP= <proc_1d>
##$AZFE= 0.1
##$AZFW= 0.1
##$BCFW= 1
##$BC_mod= 2
##$BYTORDP= 1
##$COROFFS= 0
##$CY= 11.3945322036743
##$DATMOD= 1
##$DC= 2
##$DFILT= <>
##$DTYPP= 0
##$F1P= 16.9975609425685
##$F2P= -3.02152046262296
##$FCOR= 0.5
##$FTSIZE= 0
##$FT_mod= 4
##$GAMMA= 1
##$GB= 0.15
##$INTBC= 1
##$INTSCL= 1
##$ISEN= 128
##$LB= 0.24
##$LEV0= 0
##$LPBIN= 0
##$MAXI= 10000
##$MC2= 0
##$MEAN= 0
##$ME_mod= 0
##$MI= 1.114404
##$NCOEF= 0
##$NC_proc= 0
##$NLEV= 6
##$NOISF1= 3.799351
##$NOISF2= 2.8
##$NSP= 1
##$NTH_PI= 0
##$NZP= 0
##$OFFSET= 15.70392
##$PC= 1
##$PHC0= -9969.909
##$PHC1= 12.6009
##$PH_mod= 1
##$PKNL= yes
##$PPARMOD= 0
##$PSCAL= 0
##$PSIGN= 0
##$REVERSE= no
##$SF= 200.130013532006
##$SI= 16384
##$SIGF1= 3
##$SIGF2= 2
##$SINO= 400
##$SIOLD= 16384
##$SREGLST= <1H.CDCl3>
##$SSB= 0
##$STSI= 0
##$STSR= 0
##$SW_p= 3612.71676300578
##$SYMM= 0
##$S_DEV= 0
##$TDeff= 0
##$TDoff= 0
##$TI= <>
##$TILT= no
##$TM1= 0
##$TM2= 0
##$TOPLEV= 0
##$USERP1= <user>
##$USERP2= <user>
##$USERP3= <user>
##$USERP4= <user>
##$USERP5= <user>
##$WDW= 1
##$XDIM= 8192
##$YMAX_p= 0
##$YMIN_p= 0
$$ End of Bruker specific parameters
$$ ---------------------------------
##NTUPLES= NMR FID
##VAR_NAME=  TIME,          FID/REAL,        FID/IMAG
##SYMBOL=    X,             R,               I
##VAR_TYPE=  INDEPENDENT,   DEPENDENT,       DEPENDENT
##VAR_FORM=  AFFN,          ASDF,            ASDF
##VAR_DIM=   8192,          8192,            8192
##UNITS=     SECONDS,       ARBITRARY UNITS, ARBITRARY UNITS
##FACTOR=    0.000296,      1,               1
##FIRST=     0,             0,               0
##LAST=      2.424536,      0,               0
##MIN=       0,             -417981,         0
##MAX=       2.424536,      410328,          0
$$ Real data points
##PAGE= N=1
##DATA TABLE= (X++(R..R)), XYDATA
0 0 0 0 0 0 0 0 0 0 0 0 8 -8 8 -8 8 -16 16 -24 29 -32 40 -48 57 -70 83 -97 114 -132 153 -176 205 -233 267
33 267 -304 344 -388 436 -491 552 -616 689 -765 853 -946 1045 -1158 1280 -1412 1557 -1716
50 -1716 1889 -2080 2291 -2527 2786 -3073 3399 -3765 4183 -4668 5234 -5905 6712 -7711 8976
65 8976 -10636 12908 -16185 21270 -51100 410328 6426 -60511 26431 -417981 330772 146842
77 146842 -326390 169408 -115732 22720 332452 -330120 77962 217928 -222943 186977
87 186977 -76912 -136224 337365 -184303 -36494 194075 -239934 111734 8325 -184859
97 -184859 316285 -61124 -156058 147025 -116787 188476 117089 -316318 111354 87819 12790
108 12790 191964 -231707 -79103 172148 -101321 80529 -31788 -152607 173574 -49702
118 -49702 -81525 82150 -127318 56422 70570 -113327 81872 -18046 -27139 115917 -99700
129 -99700 -42410 25388 -58905 97835 -6101 -107038 708 -61235 22959 32832 -95991
140 -95991 11291 3113 -5779 65139 -35998 -3931 7056 -46609 61447 24790 2312 27691
152 27691 -77489 2108 31342 -44206 21635 -33095 -2171 70249 -59487 3637 40617 -22909
164 -22909 66053 -29760 -31001 113794 11943 23961 1248 -95734 75186 36080 -43760 56172
176 56172 -52168 -1809 60862 -80921 30887 22105 -60344 70739 -19861 -3605 96989
187 96989 -67203 -7079 33163 -53430 76160 -1454 -55067 64607 -57361 -25700 33296
198 33296 -82660 30250 10366 -77001 47138 -20530 -18833 49353 -80573 -2044 45589
209 45589 -35532 60267 -4019 -54717 41584 -44422 -17186 33559 -56075 18725 3254 -57037
221 -57037 35597 -22729 -33176 33061 -33760 20483 45463 -20298 36706 1143 -25330 40218
233 40218 -12327 4124 37524 -23344 10808 5203 -27852 18262 -13709 -13541 28759 -3168 21968
246 21968 27333 -14161 13099 5938 465 33194 10867 14001 17988 -14105 1225 -1826 -16029
259 -16029 5180 -4129 -4685 7038 -7800 -3617 -6697 -15525 1947 2222 3638 14728 4183 545
273 545 -2134 -11155 -6808 -6863 -5224 601 -6161 -9671 -13416 -22790 -20479 -14163 -8403 -1745 421 2050
289 2050 -139 -4526 -2504 -734 8 4835 8620 8006 2563 -5023 -10810 -13689 -10703 -3859 -277 1218
305 1218 1063 193 -446 2046 5081 6684 9276 15375 19961 18453 13273 4692 -3215 -4577 1376 9422
321 9422 10408 4320 -1037 -6060 -7696 54 3901 5614 8799 8469 11739 12441 5601 4160 -2187 -4177
337 -4177 8395 7439 5946 3430 -13152 -13568 -11163 -13120 -777 -6306 -8714 3230 -7719 -3671
351 -3671 1454 -14663 -3625 -916 -1871 18999 3281 -7169 -4131 -26448 -8683 4001 -12318
364 -12318 3031 -11254 -21378 3153 -14400 -6996 5321 -19269 7897 14267 498 26933
376 26933 -1073 -13504 10372 -9369 14692 21345 -14455 8522 -5433 -18511 15551 -11741
388 -11741 -5287 17556 -11428 17853 19926 -4396 23861 -4815 -9896 27897 6628 24754 21857
401 21857 -24285 188 -2884 -5866 23147 -13314 -11421 9422 -11958 14270 6134 -19355 6018
414 6018 -8164 1082 25703 953 9448 -2971 -26338 3960 -660 -1322 6318 -20440 -4070
427 -4070 -2926 -21209 -3087 -14751 -6450 3858 -22797 3828 15384 1726 2716 -35899 -12023
440 -12023 34016 9414 8187 -21561 -29833 28445 -2185 -17469 -3233 -29558 19750 13087 -29116
453 -29116 22776 -3432 -10673 22094 -27745 24061 43786 -21196 24679 -3493 -19978 40575
465 40575 -27093 663 44525 -37649 9354 2956 -25646 61362 -23002 -45141 41737 -7252
477 -7252 48940 30949 -77797 30228 23540 -12680 51417 -52563 -10414 63128 -48485 14536
489 14536 3078 -59632 55801 -22160 -38597 58802 -43670 10766 35402 -74207 33454
500 33454 3465 -38892 77188 -32479 -35074 35662 -60011 38139 29779 -84146 27292 -13575
512 -13575 -20132 67945 -65802 -26298 37892 -51067 45783 12800 -52791 58247 -23671 -21003
524 -21003 56037 -49419 14842 30996 -51368 47651 -7230 -44969 50871 -30450 -5875 30347
536 30347 -54115 44518 40907 -38202 24162 -28049 796 76093 -25650 -4158 16968 -25802
548 -25802 47906 -1724 -39661 29904 -17970 767 26500 -28608 22906 6947 -33282 21706
560 21706 -2687 4681 26466 -24190 10343 15876 -19468 7074 -12123 -2603 19507 -24293 -7929
573 -7929 5135 -6170 7810 -28698 -21715 16636 3344 10614 -12573 -24794 15198 -2018 -1299
586 -1299 4852 -20631 12053 2184 -15990 15407 -16777 -10627 5645 -27391 15780 10177 -21856
599 -21856 16535 -15354 -6121 26395 -24434 13142 23617 -17463 26354 -8498 -15470 38643
611 38643 -19378 -4570 17996 -26182 32156 8915 -35474 23990 -13394 -768 39379 -27567
623 -27567 15148 24475 -26195 32304 -1666 -17782 38241 -23748 -1294 31585 -29424 17281
635 17281 -342 -37906 31258 -11219 -13583 31775 -28254 7847 16745 -37990 22933 3015
647 3015 -20229 29802 -23188 -6049 27144 -33680 3216 1950 -30060 25486 -10863 -21308
659 -21308 22125 -24655 -3893 10797 -28628 18061 4953 -20900 20986 -8898 -4023 17556
671 17556 -24856 3942 13671 -13877 15456 -5759 -15009 14916 -13988 -3563 12982 -10715
683 -10715 11836 6020 -10021 15596 -17 -1594 15184 -3061 9145 11940 -6371 8242 1893
696 1893 -5901 6272 -4955 1569 9983 -3856 2485 2051 -2243 6968 -29 293 8973 4086 4922
711 4922 1656 -4492 76 -1209 -2005 527 -2134 -1539 -2948 -5550 -4063 -4936 -3465 -1962 -1707 1302
727 1302 -877 -2473 -2603 -4174 -1216 -1649 -3122 66 -2305 -2831 -2659 -6363 -3902 -3733 -5610 -1135
743 -1135 -1274 -898 1471 -4082 -3427 -1047 -823 4858 4576 2299 3151 -543 114 2652 392 1932 1682
760 1682 -98 2372 1966 658 1434 -929 464 4127 4868 6689 5573 3329 3493 2615 3066 4490 3491
777 3491 2663 1995 1077 677 -687 -2461 -1905 -1059 894 2675 2415 115 -1376 -2013 2 1227 1424
794 1424 895 -971 -1968 -2335 -3179 -2855 -4058 -4937 -3034 -3227 -1797 -1696 -4547 -4440 -3916 -3750 -54 -741
812 -741 -957 8 -2890 -1785 -707 -3596 -591 -1104 -1870 2311 -975 -2201 -1161 -5029 -587 2174
828 2174 -442 3825 549 -1279 4130 310 2700 6247 236 4209 3978 912 6991 1754 -1707
843 -1707 2118 -2251 3010 6467 62 2949 273 -2379 5350 2518 2480 5658 -334 3150 4662 -479
859 -479 1640 -1367 -3023 2262 -328 -1057 236 -3543 -2565 -2190 -4372 -25 1918 -591 -1684 -3414
875 -3414 -3028 1107 1064 -4582 -4480 -3674 -2133 3428 -2874 -7548 -3320 -5835 -308 2923 -6373 -88
891 -88 -598 -6105 4100 -3247 -4845 6914 -4103 1936 5512 -9324 5920 3466 -6943 8449
905 8449 -5822 -2411 14987 -7159 1412 4135 -12262 14729 4968 -9033 12991 -7116 3433
918 3433 20260 -12864 4537 6805 -10663 21865 -660 -12360 16819 -11453 2404 14241
930 14241 -21088 11412 7696 -14481 18954 -10318 -8930 23251 -15026 3704 9975 -23242 17690
943 17690 2771 -18040 16669 -18299 -6479 21141 -21311 4448 3476 -24728 20636 -3544
955 -3544 -17196 16856 -19959 1258 19103 -25149 7541 1388 -19751 21675 -11297 -12668 20048
968 20048 -17188 4424 9166 -25385 15465 3338 -13772 18193 -14670 -3835 20500 -15139
980 -15139 7515 6176 -17027 17884 511 -7095 17532 -11667 582 14162 -11055 10374
992 10374 3544 -11147 15242 -926 -3792 10347 -8769 5725 11040 -7677 6167 1549 -2554
1005 -2554 10200 -4586 -3909 6855 -1394 2695 -344 -7136 3285 1813 -2143 -552 -2534 -724
1019 -724 1549 43 -2505 -809 -342 -4296 -73 -1134 -4567 1845 -4617 -4671 3158 -7686 -1515 2816
1035 2816 -8451 3759 -1737 -8786 8180 -5577 -4693 7189 -10340 3090 5291 -12322 8389
1048 8389 -1422 -8350 12903 -7511 -657 10624 -13482 8176 7395 -11953 11808 -4248 -4308 18643
1062 18643 -11596 -641 12497 -9229 13662 -217 -14876 20168 760 -3507 10515 -15460
1074 -15460 10795 15160 -16942 7249 254 -4032 19376 -14086 -6057 16957 -8290 6643 386
1087 386 -15570 17251 -1093 -11775 10610 -9198 2093 7151 -18480 7729 5943 -12761 5754
1100 5754 -8301 -2114 13591 -15617 -4896 7724 -6525 6100 -8280 -13330 14214 -1106
1112 -1106 -8303 -623 -9808 9218 6571 -15369 611 1937 263 6743 -11127 -3741 9940 -3326
1126 -3326 250 -662 -4879 8554 -59 -5416 5401 406 1967 4062 -3450 4289 4493 -2868 3609
1141 3609 2570 847 3631 -2013 710 6869 536 -339 709 -309 5211 2985 -2381 1959 1942 457
1157 457 2092 -1620 131 3508 -1129 -953 432 -2467 1134 618 -2527 826 -1923 -2377 1561 -2451
1173 -2451 -2433 -974 -4259 514 630 -4535 -617 -1770 -1915 1175 -3914 -2439 1237 -2854 -572 -1216
1189 -1216 -3908 604 -2105 -3672 651 -1397 82 1207 -3231 738 1187 -1078 2098 399 -94
1204 -94 2647 -770 505 2366 -794 1080 512 -237 3767 1708 462 1956 402 2384 3034 1007
1220 1007 2613 2333 1181 2546 816 985 1748 -377 861 1646 655 1395 -330 -1577 66 242 937
1237 937 1513 -254 -661 -863 -1107 395 -12 -1021 -1305 -1818 -1104 -273 -944 -1950 -2799 -3030 -1942 -786
1255 -786 -639 -1224 -2424 -2704 -2164 -875 -57 -599 -1086 -1265 -686 -43 -238 -925 -1672 -1438 -729 125 229
1274 229 -297 -1107 -1541 -555 1265 1818 1580 1101 545 1214 2099 1953 1792 903 504 1563 2305 2139 1820
1293 1820 -195 -449 587 1241 3197 2757 1079 955 719 1074 2693 1325 1116 864 -268 1198 1160
1310 1160 -767 -343 -1840 -1388 1415 -46 -269 -923 -2980 -1037 -415 -1373 573 -1598 -1596 307 -1675
1327 -1675 -510 -138 -3645 -1345 -1352 -1972 1547 -1711 -3293 -1972 -4201 -749 1187 -2361 216 -1163
1343 -1163 -2748 2107 -579 -623 1466 -2193 1517 2866 -546 1796 -941 -2841 1599 -326 672 2936
1359 2936 -1490 970 2033 -766 2962 2011 468 4334 1132 1398 4547 479 973 606 -2198 3251
1375 3251 3663 -489 516 -2295 -1194 3586 -179 25 2172 -1080 1798 1519 -1814 2141 -16 -2976
1391 -2976 875 -677 329 2447 -4984 -3365 569 -3002 184 -1566 -4384 3120 -1502 -5147 1178
1406 1178 -2309 -65 1850 -7383 1415 5035 -2939 -211 -5984 -4442 8219 -2448 -4444 821
1420 821 -5253 4185 1278 -9269 4712 1884 -2344 5585 -4953 3060 9943 -7266 292 2275
1434 2275 -2151 11264 -2554 -6410 8603 -3790 261 4179 -8200 8756 4789 -8353 7481
1447 7481 -129 716 9398 -10389 1677 11320 -4269 6098 -3083 -8182 12450 -3451 -5586 5803
1461 5803 -7429 5973 4248 -13842 5392 2210 -4369 6723 -9919 -922 13052 -6704 -1192
1474 -1192 -2059 -9023 11237 -1395 -10585 4933 -5005 569 3038 -14257 2071 5227 -6567 3252
1488 3252 -5181 -1940 11058 -7167 -5317 4043 -2639 7520 -231 -9859 6300 1408 -3339 1565
1502 1565 -6659 2991 7388 -7019 -130 3804 12 4466 -4468 -3138 10681 3993 -941 694
1516 694 -2531 5959 4918 -6660 475 5131 1032 2548 -4866 -3275 8516 -112 -4085 1552 -413
1531 -413 7440 4453 -8928 1150 3603 -351 4967 -5305 -3151 8078 -4141 -2513 146 -7946
1545 -7946 5067 652 -8482 4911 -2461 -2591 5513 -9527 -494 5885 -6167 5599 -743 -8290
1559 -8290 7399 -5076 -4914 6232 -8596 2259 3878 -10869 5660 -722 -7739 7438 -6698
1572 -6698 -484 10861 -8038 2784 4282 -7282 9547 -2407 -7284 11342 -2620 1024 4747
1585 4747 -11692 6147 5361 -8378 6523 -2222 -326 12283 -8040 -412 7618 -4344 7917
1598 7917 134 -6272 11914 -1083 -3434 4508 -8192 4055 4941 -8438 4974 -56 -4402 5930
1612 5930 -6139 -781 6983 -5772 2501 2512 -4352 6066 -3675 -6336 4621 -3471 394 1686
1626 1686 -7348 1615 -498 -6656 1741 -2456 -1150 3684 -4893 -528 2712 -2895 1431 -1903 -3083
1641 -3083 4294 -165 -620 1270 -4042 -448 167 -2613 1637 -45 -1315 1429 -852 291 1831
1656 1831 -1174 1023 2100 1884 3520 1516 -186 616 -132 845 1918 1012 635 -38 -839 -5 631
1673 631 502 421 374 772 2492 2955 913 418 -673 -258 1767 1635 1000 127 -2147 -1808 -1037 -1390 -231
1692 -231 -1240 -1711 36 -456 -37 100 -2206 -1390 -542 70 1983 329 -1321 -1727 -2633 -1349 348
1709 348 -870 -1187 -1735 -2208 -652 -485 -983 -1253 -2232 -263 1675 1762 1771 -1 -1700 -444 421 1788
1727 1788 2023 252 -696 -571 -522 823 269 -518 22 151 1622 2619 1365 587 54 126 2189 3322
1745 3322 2799 1321 -474 -607 345 678 852 -271 -1030 -113 374 1106 492 -1321 -1172 -222 1061 2750
1763 2750 2109 -89 -1147 -1885 -276 720 -111 -536 -1849 -2177 -897 -1055 -1303 -1992 -2881 -1104 288
1780 288 1041 1164 -893 -2489 -1258 -857 1191 1919 -686 -789 -1291 -1055 372 -1118 -1705 -1195 -1355 582
1798 582 1655 307 -325 -1717 -1217 1767 2573 2975 1410 -579 393 918 1079 1314 147 96 451 170
1816 170 1368 784 -418 -967 -1393 1551 3031 2546 1085 -1161 226 1846 1130 1659 519 -12 1127
1833 1127 -950 -145 371 -2588 -1243 -1718 -832 3193 -265 -1764 -1198 -3004 1939 1729 -1337 1711
1849 1711 -896 -1590 1522 -2986 -347 219 -4746 224 -613 -1878 2896 -3834 -3528 1167 -3507 2620
1865 2620 2443 -3061 3279 -1595 -2608 4982 -2642 557 2667 -5123 3614 1874 -3724 3280 -4503
1880 -4503 -2479 5536 -2464 3677 3282 -5742 4530 840 -1226 7421 -2798 649 6122 -3739 3387
1895 3387 1198 -4863 5887 -2362 -3270 6265 -2798 2072 1630 -8420 4292 2995 -2188 5683 -3934
1910 -3934 -542 6811 -5281 1216 1429 -5112 4647 -2349 -3847 5560 -5174 -2465 353 -5976 4596
1925 4596 917 -5178 3403 -2154 -767 2952 -5813 1468 3248 -3888 1787 -1803 -1592 3605 -5371
1940 -5371 -3334 1556 -1035 3218 -1380 -4486 2520 -231 84 1276 -1893 3176 2482 -1114 1437
1955 1437 74 1004 862 -2462 1341 1768 1230 979 -2812 -199 1456 -491 1933 -325 1105 3530
1971 3530 -855 1861 969 -1328 3600 -425 49 3759 -2358 675 160 -4735 2732 -1358 -2044 4681
1987 4681 -3502 -25 2348 -5157 3709 1048 -4018 4996 -2437 -700 5158 -6866 18 1217 -5874
2002 -5874 5077 -2345 -5341 4967 -5248 -630 3062 -7907 3842 2516 -4812 6105 -3848
2015 -3848 -2930 6936 -5693 1153 2744 -6783 6525 -246 -5821 5203 -5545 -239 6109 -6600
2029 -6600 3759 2564 -4877 7399 -2315 -3104 7504 -3204 3376 5064 -6282 4865 963 -4051
2043 -4051 5864 -4461 -1249 6653 -4267 2838 1589 -6667 5091 -41 -1342 6466 -3726 1019
2057 1019 4416 -4909 2910 400 -3619 5203 -2546 -2398 3147 -4670 684 330 -5550 2409 -464
2072 -464 -1188 3654 -3556 -1121 1723 -2815 2300 128 -3005 1983 -1203 -732 1323 -4268 -1259 -273
2088 -273 -1774 2028 -934 -1297 898 -1759 -19 780 38 2378 652 -311 1059 -331 1077 628
2104 628 -1140 751 -138 945 1546 -971 -427 -763 -654 2203 1320 1217 1384 -913 1485 1603 319
2121 319 1830 -419 399 2178 -437 941 -129 -2459 468 -1039 29 2401 -835 -281 -133 -1681
2137 -1681 1622 620 -613 1338 -1210 88 1638 -1508 -57 -1270 -3289 504 -444 -345 597 -3414
2153 -3414 -1896 -141 -1235 1463 181 -1380 653 -943 262 1482 -1325 -531 -430 -749 1782 402
2169 402 -1264 -967 -2512 -736 1299 89 1378 -119 -950 1149 598 1287 1548 -290 633 1533 1379
2186 1379 1844 201 -1111 -497 -133 1164 1902 262 -224 -785 -391 1219 1225 840 536 -96 705 1542 965
2205 965 295 -840 -724 240 567 958 59 -1772 -1657 -1331 -243 602 -17 -501 -721 -531 385 457 -484
2224 -484 -871 -899 -176 776 344 -675 -1903 -2326 -1375 -275 157 -88 -1253 -1216 -870 15 625 335 -72
2243 -72 -393 511 1403 1095 -20 -695 -1160 -408 838 1048 484 -495 -1100 -419 288 684 841 -123 242 986
2263 986 1201 1649 389 -131 487 330 1516 1710 24 57 -1099 -1119 659 305 539 409 -1218 263
2281 263 391 -42 803 -937 -609 1050 204 1608 559 -2101 -372 -917 -918 1570 -1323 -1073 -185 -2644
2299 -2644 268 -633 -2199 966 -1117 -482 2116 -1536 750 258 -3249 1339 20 -784 2587 -2502
2315 -2502 -1748 742 -2910 1639 401 -3138 2158 -792 -133 3420 -2191 342 1735 -2369 3898
2330 3898 1474 -1744 3112 -2287 -336 3132 -3164 1871 1716 -2603 2945 -1267 -1135 4318 -2416
2345 -2416 536 2621 -2280 4275 1252 -2825 2839 -2225 95 3869 -2995 1159 914 -3697 2599
2360 2599 -760 -2682 2432 -3310 630 3348 -2945 1269 -617 -2757 3550 -1357 -1431 2401 -2393
2375 -2393 984 -91 -4075 1183 -636 -1615 1442 -2986 -263 1316 -2384 799 -806 -1301 2648
2390 2648 -222 591 897 -2122 405 -13 -246 1529 -1468 -251 859 -395 1089 -1394 -1252 1655
2406 1655 571 2010 126 -1036 2820 255 337 1029 -1700 2928 2103 -1200 1937 -2069 -62 3062
2422 3062 -2794 1021 965 -2590 3967 -849 -1703 2890 -3681 1622 3584 -3187 2820 -778 -3352 5181
2438 5181 -2697 -1970 2373 -4801 3546 1459 -6842 2585 -1927 -1588 5094 -6207 -36 4461 -4378
2453 -4378 3901 -1683 -5707 6561 -2595 -1317 3981 -6524 2444 1827 -6405 4680 -1911 -3611
2467 -3611 6363 -4593 748 3991 -6853 3983 1583 -4183 6092 -3403 -886 7025 -5093 924
2481 924 1526 -5069 6768 -238 -4585 5053 -3340 1308 4871 -6296 3012 2354 -2776 6125 -2147
2496 -2147 -1694 5237 -4012 1549 2839 -4273 4356 -493 -3140 4129 -3686 -627 3228 -3947 2461
2511 2461 248 -3234 3892 -1341 -1422 2344 -3474 1460 2163 -2806 1551 -1951 -2498 2522 -2193 -605
2527 -605 689 -2996 1459 -165 -1872 1135 -1932 -284 1713 -1609 1165 438 -903 1099 -1665
2542 -1665 -584 1467 -799 1013 -608 -1630 1233 -509 90 551 -1324 1566 761 -49 1822 -863
2558 -863 295 913 -575 2057 892 -773 1351 -964 394 1933 -1583 984 328 -803 2432 -679
2574 -679 -196 1954 -1772 828 884 -912 2751 -246 -1869 1083 -1513 829 1679 -2675 582 -365
2590 -365 -1938 1502 -1791 -1206 1264 -2288 881 976 -1717 1316 -1183 -1724 1625 -1195 272 659
2606 659 -2794 736 -206 -1541 1208 -1714 -818 1147 -1278 1049 783 -1640 1093 -494 -544 2403
2622 2403 -247 288 580 -1466 969 548 -606 1049 -542 -164 1408 -527 865 709 -768 970
2638 970 377 730 1834 -65 242 643 -199 1119 626 -485 578 -238 449 582 -412 -116 -173 -655 750
2657 750 550 203 339 -900 -421 102 -71 553 -429 -689 -198 -800 -276 -207 -882 -594 -731 -284 174 -377
2677 -377 -607 -735 -727 86 135 -95 -98 -602 -516 -133 -187 52 -30 -441 -448 138 66 209 -272 -370 -32 -35 660 767 514
2702 514 175 -17 419 751 674 785 158 328 527 84 279 278 -371 224 737 563 678 -146 133 339 133
2723 133 634 840 152 380 -60 222 348 -168 -157 -150 -337 318 62 -104 -125 -795 -317 -79 -354 310 -101
2744 -101 -385 329 -415 -373 50 -984 -325 -298 -806 258 -349 -743 -403 -1060 136 171 -632 422 -322 -852
2764 -852 609 -370 -14 908 -870 518 658 -639 833 -524 -709 858 -559 512 828 -767 872
2781 872 33 -836 1395 -244 486 1512 -400 672 944 -489 1155 -59 -547 1330 -275 377 630
2798 630 -1266 483 197 -289 1425 -525 -229 673 -576 99 449 -1013 508 -117 -170 790 -1337 -349
2816 -349 228 -954 -118 -745 -946 770 -640 -910 -379 -881 679 -252 -780 142 -374 -21 -46 -1192 -243
2835 -243 -110 -167 316 -708 370 29 -662 460 -67 22 599 -1054 682 1259 -517 557 -575 317
2853 317 2184 -596 -53 704 -158 1966 -607 -1571 1527 192 686 929 -1785 1626 1576 -972 1118
2870 1118 -1016 -21 2668 -1858 169 1265 -1799 2029 -434 -1457 2576 -1547 -508 1701 -2217
2885 -2217 1583 256 -2884 2365 -552 -971 1547 -2849 706 2099 -3187 893 -388 -1632 3021
2900 3021 -2559 -1643 1787 -2439 1282 560 -3174 1890 -377 -1853 2345 -2593 36 2174 -2433
2915 -2433 1532 -136 -2548 2986 -1085 -1073 1920 -2395 1306 1541 -2629 1877 -138 -1190 2696 -2000
2931 -2000 181 2556 -1958 1267 653 -1323 2839 -958 -1103 2578 -716 778 291 -2372 2102 652
2947 652 -1608 906 -834 849 2157 -2185 -32 1019 288 1270 -1517 -812 2002 125 -430 -897
2963 -897 -867 1550 -338 -1550 265 142 424 -475 -1603 382 962 -335 -829 -815 849 592 -1314 -828
2981 -828 -308 875 303 -1631 -307 394 241 231 -1538 143 1266 -363 -53 -387 -39 1485 -859
2998 -859 -476 1143 -303 1116 -221 -1205 1666 26 -473 784 -1030 1260 1268 -1506 985 299 -495
3015 -495 1860 -1300 52 1981 -1137 1160 467 -1407 1638 -412 -745 1636 -1369 458 1117 -1914
3031 -1914 1168 -128 -1075 1629 -746 -313 1067 -1624 752 694 -1784 1179 -789 -1226 1220 -1598
3047 -1598 -303 780 -1907 1078 127 -1440 1161 -1023 -554 1311 -1485 176 559 -1199 1251 -392
3063 -392 -1179 1083 -478 -149 665 -1292 669 628 -672 656 -652 -384 1181 -598 169 626 -721
3080 -721 1022 327 -561 700 -34 339 930 -393 372 542 -267 546 206 -162 818 -311 290 484 -360
3099 -360 377 119 51 598 16 -317 121 -11 341 39 -393 382 -81 -263 -75 -221 -107 -183 -163 -35 -252
3120 -252 -157 -368 -364 -241 -226 -347 49 -421 -393 -267 -613 -84 -125 -286 -106 -132 -308 -158 -476 -295 -219 -22 -160
3143 -160 -157 56 325 -321 -164 120 126 307 128 192 344 123 -44 247 106 228 219 338 350 146 312 379 -122
3166 -122 346 554 219 398 -218 -134 236 -3 157 346 51 190 -65 -71 76 -77 -6 51 -243 -85 -49 -285
3188 -285 -23 -373 -231 -104 -463 -133 36 -350 4 -403 -432 -149 -338 -173 -20 -341 -223 -253 -205 -268 -82
3209 -82 -262 36 98 -140 112 -332 203 37 -71 395 -31 -107 197 31 247 66 -18 418 -29 244 528
3230 528 5 328 538 183 477 232 98 428 133 153 499 -102 389 152 -267 341 301 -80 414 6 -53
3251 -53 384 24 169 386 -406 150 -68 39 212 -355 -242 83 -227 109 -279 -362 -52 -263 32 -363 -433
3272 -433 -320 -32 -123 -547 -312 -40 -336 -92 -359 -278 219 -259 -199 -210 -376 30 140 -161 348 -70 -212
3293 -212 436 -468 417 220 -241 568 427 -399 759 -44 122 845 -454 297 556 -624 629 620 -342
3312 -342 764 -248 142 1130 -558 227 335 -498 1173 -53 -346 977 -773 745 758 -1320 636
3329 636 303 -995 635 -821 -370 1288 -1273 -209 137 -1145 1399 -132 -1355 1255 -721 -268
3345 -268 730 -1576 735 476 -1793 754 -493 -684 1213 -1874 -208 1309 -885 844 -379 -1013
3361 -1013 1804 -601 -976 930 -1149 963 525 -1725 1337 320 -463 1156 -893 552 1331 -1142
3377 -1142 485 359 -543 1348 -141 -288 1511 -476 84 604 -476 1151 514 -962 493 149 -77
3394 -77 744 -1140 216 624 -566 520 -65 -247 747 -108 37 351 -143 -10 -187 -118 372 176 -463
3413 -463 -70 -453 -329 -99 -249 -87 100 -322 -472 -36 207 -130 288 -586 -17 92 -687 114 -343 -862
3433 -862 -129 -545 -148 816 -558 -449 156 -562 768 267 -794 646 -123 -4 917 -921 288 688
3451 688 -638 839 249 -346 1081 -514 -103 982 -683 660 748 -748 891 -12 -161 1271 -608
3468 -608 -93 594 -585 1086 393 -1058 510 -519 -16 1262 -1023 -303 449 -659 1060 85 -1104
3485 -1104 1015 -211 -261 682 -1078 397 623 -1254 351 -490 -720 1072 -886 -772 11 -914 373
3502 373 299 -1014 366 -395 -656 842 -645 -573 204 -787 625 198 -708 407 -393 -297 544 -436 -345
3521 -345 587 -209 405 -83 -109 735 218 -187 411 -231 614 753 81 -51 -230 314 729 217 -92 59
3541 59 -254 96 472 -92 103 98 139 519 280 -271 -66 -190 11 371 65 -83 197 -420 -323 -445 -356 10
3563 10 -231 -310 -99 -120 236 -191 -706 -366 -348 -80 -7 -74 -428 -311 -499 -276 144 -115 -682 -336 -313 -158
3585 -158 -51 -466 -52 -118 -29 309 -30 4 -51 -289 -33 105 136 150 210 -53 191 -99 224 525 -56 -61 283
3608 283 205 611 180 -100 216 144 403 477 221 449 -119 -216 187 43 -189 138 156 -63 -135 19 -108 -70
3630 -70 -122 48 27 204 -105 -131 -160 -116 -297 -112 -190 -140 -161 -140 16 -64 -302 -318 -346 -176 128 -18 -149 -124 -203
3655 -203 -358 -128 268 -42 -332 -119 -172 -34 -147 64 -116 -44 -30 -29 237 315 -288 -85 -22 343 303 347 136
3678 136 -118 -56 -24 228 89 28 69 226 56 73 83 95 170 -54 279 182 363 246 156 54 119 -35 274 -34
3702 -34 90 91 -152 -239 -96 -145 2 -133 -217 -17 -174 -153 -260 -197 60 23 -174 -72 -371 -508 53 -483 -439
3725 -439 -139 -617 -76 -241 -354 -14 -318 -357 177 -246 -152 230 -133 204 49 -283 -33 -133 98 469 -230
3746 -230 -94 -82 -446 -14 -39 -2 368 107 -95 581 40 10 473 -274 366 373 281 724 -81 -252 155 -321
3768 -321 414 94 -307 348 121 -366 359 -91 -116 193 -271 21 326 -430 397 4 -525 66 -347 -254 83
3789 83 -735 -342 -243 -546 422 -175 -519 258 24 -91 466 -560 -150 128 -366 319 -58 -443 474 -460
3809 -460 -614 322 -523 -28 473 -543 455 350 -380 458 -260 -74 578 -100 232 769 -368 326 -267
3828 -267 -394 642 -34 -162 515 -715 584 598 -618 336 182 -293 1127 -22 -123 676 -415 130
3846 130 530 -333 592 -192 -796 776 -175 -392 352 -1025 317 477 -827 353 -60 -432 556 -680
3864 -680 -136 799 -350 -287 -186 -1027 453 17 -779 215 -829 -147 562 -711 -62 -196 -962 544 247
3883 247 -184 602 -448 -24 751 -510 194 -142 -555 687 -61 -425 114 -237 -141 399 -553 148 537
3902 537 56 311 -679 -330 1063 423 188 139 -480 393 474 -260 21 -52 -167 718 228 -217 313 89 284
3923 284 514 -87 450 169 7 609 -196 -444 387 88 -186 -147 -804 96 183 -559 -241 -492 -407 936 -66
3944 -66 -302 -58 -616 -31 450 -373 102 -489 -741 620 -64 -391 -27 -668 171 430 -598 437 153
3963 153 -414 531 -390 -70 822 10 309 75 -627 761 319 -630 424 -221 173 702 -52 97 184 -511
3983 -511 974 210 109 1000 -289 -55 677 -41 566 110 -345 1040 230 -621 473 -240 -80 224 -771
4002 -771 316 732 69 95 -527 -365 636 125 -143 -280 -545 395 25 -506 -127 -448 -458 193 -541 77
4022 77 75 -659 7 -271 -165 185 -239 -289 220 -271 -263 -107 -236 88 -174 -178 167 41 90 280 -360 -1 571
4045 571 266 64 86 -6 261 142 159 331 176 157 426 272 149 177 -131 111 276 233 713 34 22 195
4067 195 78 129 117 426 13 153 160 34 106 139 -243 -155 163 80 1 -119 -165 -282 -130 -193 47 -230 210 -192
4091 -192 -47 -235 -248 -28 -308 95 -50 -91 -221 -206 -164 -220 -159 -14 -68 70 -128 -56 -257 121 -12 -177 -11
4114 -11 40 -81 -38 203 -103 -244 -144 91 103 340 155 -8 -15 -17 -245 565 242 90 333 115 332 151 -74
4137 -74 -30 336 215 200 95 -40 164 -209 -152 223 -80 148 -88 -262 187 148 -221 188 -14 -28 84 -132
4159 -132 3 -341 -250 -114 -244 -111 -104 -303 27 -65 -210 -214 -71 -181 80 -108 -12 25 -344 -137 -247 -109 -3
4182 -3 -9 -43 480 -33 -30 -223 -275 51 34 -46 269 213 -131 247 -199 337 110 86 -43 7 -9 258 -119 48 185
4207 185 28 322 189 45 -47 86 -210 24 131 308 224 17 42 279 128 -49 -39 -129 216 -48 -98 -22
4229 -22 -68 2 6 -194 -133 153 64 -167 -110 -343 -77 273 -118 179 -203 -353 38 -115 -35 -353 -419 -110 -97 -178
4253 -178 346 -232 -327 108 -124 87 344 -253 77 -22 -263 501 -294 -90 390 -394 235 170 -185 492 -202
4274 -202 -484 481 177 259 568 -416 395 479 -26 600 -66 -67 709 -133 129 106 -550 237 -76 -404 665
4295 665 158 -96 461 -246 208 416 -673 460 180 -44 563 -546 -197 887 -895 -82 90 -557
4313 -557 511 -293 -735 101 -453 85 505 -874 92 92 -197 239 -410 -588 487 -225 101 20 -516 314
4333 314 10 -680 505 31 190 454 -394 61 132 -248 499 24 -149 199 -124 193 355 -29 -5 -346
4353 -346 -219 427 348 -151 -48 -37 541 459 -22 -148 166 618 385 -120 -40 23 315 123 -86 224 179 223
4375 223 -221 -625 106 206 -88 110 -350 122 616 -260 -216 -32 -586 348 -186 -516 222 -433 -524 -227 -572
4396 -572 130 -15 -951 209 -56 3 477 -987 156 719 -568 252 -125 -504 658 -308 -481 461 -397
4415 -397 689 213 -992 528 -71 -166 713 -678 89 775 -338 732 321 -185 594 -191 -34 810
4433 810 -108 527 336 -657 563 51 -342 732 -448 -140 625 -662 483 453 -618 564 -105 -323
4451 -323 761 -617 -266 122 -734 526 262 -619 567 -377 -162 626 -754 -154 200 -576 429 -66
4469 -66 -728 365 -264 -423 -128 -473 441 -194 -608 -8 -421 -111 386 -514 -140 -29 -37 43 61 -461 277
4490 277 144 -73 248 162 -133 142 -119 -21 121 142 176 25 214 140 234 298 -57 -30 366 78 315 395 388 -31
4514 -31 -207 296 286 273 141 -36 -301 -4 -300 -72 -53 -100 230 -201 193 32 -233 272 -104 -216 114 123
4536 123 5 -162 -382 -281 -241 -512 -191 52 -335 -138 -415 -96 54 -509 -164 -19 -123 265 -8 -153
4556 -153 -49 -113 -244 -33 -12 34 89 -260 361 35 -140 298 -320 407 300 -2 -5 197 202 333 -45 160 97
4579 97 25 349 140 13 12 -7 -54 244 -107 385 371 -44 -5 155 21 -23 62 136 330 -19 -56 -109 -132 86 57
4604 57 100 -18 -139 -10 -110 -249 -63 -292 102 -89 -96 -181 -186 -118 -352 -113 -524 -104 -99 -6 -342 -235 -205 -68
4628 -68 -62 -99 -109 -135 1 -71 -81 150 118 -77 12 150 102 -1 41 -57 -58 35 27 73 -217 -25 34 152 183 186 242 162
4656 162 413 134 414 265 9 24 150 105 139 198 1 102 -220 -25 45 28 137 92 204 125 26 119 35 -153
4680 -153 -67 -92 85 -17 -84 -296 -182 -278 120 -211 -291 73 -432 92 -168 -238 355 -184 -115 112 -95 -214
4702 -214 -116 -398 -53 29 -290 341 72 -123 -24 -293 48 204 -465 64 171 -17 241 -18 -174 209 -310
4723 -310 246 179 -273 349 -192 -78 547 48 -168 310 -261 267 492 -249 354 11 44 407 -224 460 22
4744 22 -294 218 -14 -199 397 -265 2 226 -247 193 -429 -254 234 -198 -473 102 -128 -53 50 -777 5
4765 5 11 -239 -192 -557 -286 265 -229 -102 -20 -492 -58 -150 -348 54 95 19 -165 -362 58 160 12 254 -72
4788 -72 -12 142 233 2 104 31 80 203 70 88 40 97 -51 374 263 209 267 -355 169 171 -57 252 -90 -145
4812 -145 432 -67 -97 509 -229 411 311 -198 502 133 -213 450 -98 -203 431 -258 47 -63 -522 502
4832 502 -62 -433 346 -519 -154 463 -535 74 70 -671 565 -294 -44 604 -619 -170 486 -554 404 -293
4852 -293 -625 555 -505 -343 560 -663 205 193 -565 643 -146 -312 716 -611 -171 620 -531 527
4870 527 285 -322 816 -92 -450 509 -480 205 686 -727 475 295 -86 536 -348 1 804 -355 520
4889 520 241 -691 547 -157 -415 542 -607 183 445 -181 184 158 -466 745 -271 -369 452 -422 415
4908 415 250 -526 273 -21 -386 143 -409 -364 33 -466 182 -116 -284 189 -233 -178 18 -317 -318 175 -151
4929 -151 -222 -77 -66 18 -291 -40 14 -331 -56 -40 -16 -53 131 228 221 109 75 -54 84 144 219 178 172 146 158 -202
4955 -202 68 259 122 387 266 174 322 -76 -54 107 22 415 130 -149 89 -15 50 75 6 160 99 -138
4977 -138 182 -483 -446 176 -434 -118 147 -163 2 -224 -136 -52 -67 176 44 -491 143 149 -241 120 -299 -134
4999 -134 -44 -165 -118 -59 -247 -150 26 -253 219 -219 -186 149 -94 242 276 -103 136 128 -171 322 -40 -99 308
5022 308 -241 151 58 84 84 394 137 322 -69 134 168 -11 255 196 -41 388 224 -139 370 3 279 221
5044 221 -162 6 28 142 151 -29 144 75 -244 -68 -47 -230 54 -24 25 -8 -120 -208 -62 -127 115 -102 20
5067 20 -69 -234 -172 -136 -196 -336 13 -97 86 -1 -191 -66 -258 -425 -188 14 22 -311 -259 -160 -71 207 93 119
5091 119 84 47 -46 39 -25 -52 -61 157 25 -74 -82 71 98 -5 163 129 102 -5 463 176 112 -1 141 205 271 123
5117 123 58 -2 -4 159 200 209 5 21 66 177 -14 -164 51 100 39 -75 -229 38 -250 170 33 -209 -33 -87
5141 -87 -283 78 -244 -58 -122 -508 -60 83 -282 82 -261 -192 -160 -176 110 38 -247 173 123 -57 237 -39
5163 -39 52 -28 85 -38 298 -10 7 -345 -68 149 -165 152 280 87 277 -76 -51 41 331 115 309 142
5185 142 173 325 -115 178 25 -70 207 125 -83 343 116 551 165 -28 44 -26 8 153 20 120 -89 -215
5207 -215 -38 -5 -37 -159 -50 -142 31 110 -262 -3 -165 -434 92 -188 -195 -73 -89 30 -90 -142 117 -304 -101
5230 -101 -91 -58 -226 -104 -89 -272 173 19 -212 -85 -103 226 43 235 222 -1 -59 -28 99 54 -70 -23 89
5253 89 284 128 2 102 111 494 3 -129 184 -33 200 -33 -19 231 -9 -145 340 -206 11 435 -142
5274 -142 119 52 -226 480 -215 -216 301 -389 118 16 -387 196 -182 -263 54 -387 -66 14 -596 389 -92 -478
5296 -478 139 -300 -287 215 -277 -63 187 -506 380 -64 -245 380 -123 152 191 -505 108 318 -298 267 -234
5317 -234 -203 395 -330 -286 364 -386 525 216 -503 466 -190 44 443 -198 53 389 -215 184 121 -131 287
5338 287 23 -51 443 -255 -158 357 -145 270 -232 -229 142 -135 39 290 -343 176 166 119 107 106 -198 234 -142
5361 -142 -321 168 -305 -21 73 -321 77 -76 -251 32 -259 -40 15 -170 47 -243 -95 -170 -304 34 -94
5382 -94 -122 76 65 174 30 -122 4 135 141 104 61 288 168 261 -43 -160 67 120 129 278 -48 21 25 35 18
5407 18 144 94 144 154 10 12 177 61 503 10 118 270 -3 125 -215 -188 220 -220 50 217 -66 41
5429 41 24 -282 346 362 -151 -90 -139 17 278 -204 98 62 -392 -12 -214 -143 5 -97 -120 111 -249 -108 15
5452 15 -228 15 -223 -51 -104 -440 16 42 -353 -105 -153 -217 -34 3 221 -76 -150 22 168 -117 175 126 25
5475 25 62 -9 37 156 -92 42 -133 41 174 50 32 263 58 158 160 115 348 172 -125 165 117 -3 59
5498 59 74 212 198 85 188 108 -265 -143 30 -119 82 -262 -230 24 -46 -159 -97 -137 -229 -21 -193 -89 -50
5521 -50 65 -210 -65 -42 -203 -246 -183 9 -305 -70 -244 -121 -91 -255 -41 -23 -1 -116 152 -102 18 0 -246
5544 -246 32 272 -141 -16 113 197 7 50 56 108 -4 -38 219 99 -64 149 293 188 -1 14 -74 -60 -36
5567 -36 -41 -124 -80 -46 98 -87 223 -156 152 -268 36 167 -60 85 -232 67 -51 143 93 -155 -69 44 33
5590 33 97 -160 -261 -115 -231 44 -53 -60 -84 124 55 -197 12 -161 -210 -86 55 -77 -77 63 -21 -25 -188 -87
5614 -87 -223 139 76 -137 -10 -30 22 153 -294 -88 358 67 113 170 -173 55 -268 13 276 5 221 220 171
5637 171 170 149 59 578 -58 104 194 -251 14 143 31 358 279 62 -69 128 -119 141 -92 -89 51 93 -57
5660 -57 22 -183 0 57 -170 -4 -204 -20 6 -285 225 35 -124 -58 117 53 45 -293 -71 -141 -173 -142 50 -146
5684 -146 -167 -207 -80 220 -8 -191 166 20 -150 321 69 58 17 -49 132 123 196 189 99 122 204 48 251 94
5708 94 -182 314 146 -7 300 -7 278 32 124 190 100 -229 63 -47 -113 424 -108 168 -65 -266 193 -84
5730 -84 -299 -153 -111 -135 0 -483 34 103 -330 -96 -291 -268 202 -441 138 5 -241 63 10 -299 161 -119
5752 -119 -285 -124 -276 122 18 -470 -73 -145 -5 162 -467 -352 224 -222 72 -51 -113 210 13 180 145
5773 145 -3 117 39 -334 -129 226 12 72 -55 18 205 47 275 377 1 331 -28 48 174 230 72 163
5795 163 -154 111 215 -142 258 147 79 -46 -70 -208 -223 19 86 75 -85 -130 36 -83 -23 -401 -34 167
5817 167 -151 -206 -65 -145 -74 71 -175 -315 3 169 -194 -79 -156 -153 112 -46 20 -240 -35 24 -87 446 120
5840 120 -258 -198 -99 -100 47 -304 60 97 -183 97 302 -143 335 -127 129 101 20 134 374 -52 -126 181 144
5863 144 614 74 -199 191 355 131 -227 -101 47 28 -25 25 -125 -159 274 -307 308 60 -188 179 -196
5884 -196 -85 110 -396 -175 169 15 -43 124 -261 -44 163 -65 -215 -214 -193 25 -222 -38 -236 -104 12
5905 12 -220 -200 -31 -267 212 -230 -295 -106 -16 -18 155 346 249 478 3 -64 52 -106 -49 -35 168 258 86 39
5929 39 255 22 -31 93 -149 151 408 -32 -57 61 325 304 65 47 104 51 -89 210 -89 -106 123 310 37
5952 37 -22 -2 133 -137 -87 130 -109 69 67 75 -32 33 -178 -141 -222 -55 15 35 -27 46 3 7 -184 145 128 -63
5978 -63 44 -31 -227 -21 -91 69 -5 -76 -10 -226 -165 105 143 -194 75 -12 -115 -39 -26 2 287 121 80 241
6002 241 43 65 206 37 175 8 -24 161 184 315 295 -7 169 13 80 -11 -2 11 -47 -126 -26 225 -341 -70
6026 -70 23 -88 183 -179 -200 82 -219 -36 -110 -117 19 115 -96 -9 19 -135 48 -43 79 -69 -32 -194 -62 22
6050 22 6 -165 -85 134 9 -39 -9 -151 -118 -30 -71 -279 -81 -88 203 34 173 190 -81 -22 -92 268 83 -28
6074 -28 26 427 -137 -147 12 -27 208 325 112 248 -59 225 253 -129 -123 -56 -88 -147 193 -132 93 70 214 10
6098 10 46 -41 33 -66 -67 10 171 -74 192 73 -105 258 -151 -91 40 257 159 -102 110 -259 -16 93 -85
6121 -85 -50 15 222 -3 -20 -229 -94 -87 82 -49 -250 117 -180 9 -251 81 -19 -140 116 36 195 -184
6143 -184 -59 252 -12 74 287 -290 355 -126 37 -43 -164 -265 66 -167 126 -58 40 417 240 165 45
6164 45 -169 374 213 -122 224 225 -222 -6 221 -98 76 116 4 42 -96 160 203 -142 -62 -52 11 -123 37
6187 37 -67 -221 -184 70 176 -107 -255 130 134 22 -119 -364 -316 -26 52 215 -148 -26 -53 36 -48 -320 -139
6210 -139 195 -29 50 132 -116 117 -224 26 118 -95 -35 -7 -46 15 14 198 287 108 188 77 -15 236 280 119
6234 119 131 14 439 299 9 -220 -9 146 165 151 24 122 -73 4 65 -21 64 217 55 -78 -26 104 106 233
6258 233 -19 -61 -324 -58 112 -133 -117 -47 -18 -45 174 -180 -235 -175 -11 38 -315 -125 -128 -134 147 -34 -228 -140
6282 -140 85 143 118 -108 -124 -32 -22 33 -24 114 222 154 -163 308 -101 -46 149 254 8 70 -189 259 182 -175
6306 -175 -174 -45 155 105 139 -44 -52 285 29 255 -22 -334 86 83 166 -81 -64 216 287 296 333 -92 71 57 -119
6331 -119 132 -30 17 34 8 262 54 -113 -10 -186 -91 -15 -122 -198 -53 -47 -276 40 -269 -56 -104 -25 69 -194
6355 -194 106 22 -5 57 -224 83 177 17 -32 261 -159 77 345 -133 247 43 31 264 301 -43 -19 26 -64
6378 -64 138 -42 50 306 75 176 -223 198 130 1 115 2 122 113 -189 -102 33 21 164 341 64 155 -52
6401 -52 94 112 -141 65 4 29 -221 -51 -229 -213 -49 -148 -159 6 -117 220 113 -141 -211 21 -157 120 -318
6424 -318 -13 8 -77 128 46 -182 -47 -80 -10 171 28 -249 -99 -171 197 -187 226 212 198 342 89 59 -202
6447 -202 386 49 -17 -49 252 88 46 39 90 4 79 62 306 203 180 -91 122 409 124 41 -2 -84 132 -110
6471 -110 -73 -20 -104 149 -44 35 -32 134 -158 -268 -41 172 -16 26 -91 -133 -107 -85 -115 89 207 -136 31
6494 31 -5 6 -153 93 162 370 -206 -226 84 -51 -178 -158 -75 -217 -202 -98 -83 159 -101 -44 182 99 145 34
6518 34 9 118 5 -89 4 -60 267 20 47 137 238 230 140 -91 158 -33 136 221 209 7 108 22 -108 273
6542 273 6 129 77 134 143 150 59 -72 -30 -124 11 37 203 37 66 18 122 241 83 -179 23 -44 16 -114 -289
6567 -289 -82 -168 -281 73 -90 -41 29 -242 -140 -65 -173 -91 142 -55 -265 -22 109 -96 55 -291 -100 48
6589 48 -233 -46 -159 19 31 198 304 -35 -35 -13 75 -127 105 165 66 134 117 -23 -25 171 26 -44 -38 181 -3
6614 -3 161 124 284 -119 4 -46 -150 88 -120 -182 147 -80 -79 30 -118 -187 -119 187 33 74 -143 -281 -135
6637 -135 180 -25 -158 -2 -28 -67 97 66 94 168 -27 -159 109 -81 -82 -142 -194 -176 -121 -90 -6 166 -100 -110 -171
6662 -171 26 69 89 -5 28 -98 183 -165 100 -58 -24 210 41 40 111 122 -64 -5 -86 260 -52 32 270 16
6686 16 -186 61 258 254 48 100 -110 73 -99 -20 -94 -127 13 -125 20 -367 -26 -81 236 -111 73 -44 83
6709 83 96 38 -19 -153 -1 79 -175 -200 -197 -175 163 154 -137 -135 -98 140 -63 39 -228 -343 -10 -274 31 -31 -36 -154
6735 -154 -217 -77 -150 -119 -235 -186 259 -11 -154 -113 72 92 -50 -207 17 29 95 59 -131 153 -138 -155 18
6758 18 157 -103 130 5 33 179 -46 102 80 12 -119 -132 78 182 152 -82 30 31 97 58 -23 20 -97 -265
6782 -265 -175 -135 -242 392 -102 -174 97 -161 38 14 -287 -39 -28 -190 144 -66 -15 -23 -71 86 -88 -314 -192
6805 -192 -15 2 16 -241 76 -126 -283 149 -220 -79 66 124 -154 132 241 -22 -6 -88 80 244 -101 124
6827 124 18 -94 192 -352 167 15 -118 59 93 130 65 -46 -38 240 -133 -241 108 187 -101 76 173 79 104
6850 104 -176 120 -326 129 15 -105 66 7 125 184 -58 -34 -4 -73 27 -158 -283 136 -11 -87 91 -16
6872 -16 33 -115 -118 -384 86 60 17 53 -94 -72 15 -61 -136 -129 -26 -125 22 -191 -190 -48 -57 -33 128 157 -34 83 345
6899 345 208 -64 -124 -20 -254 -313 104 -195 139 -251 196 -281 -107 -158 -50 104 -62 71 103 -148 8
6920 8 -7 -239 208 217 -65 88 163 -119 243 -54 53 76 -1 2 43 -180 222 -162 -177 -140 68 31 -50 -45 -143 -116
6946 -116 11 94 -194 -100 9 95 -33 -157 -30 -90 -242 -93 -81 -89 28 124 -256 166 50 38 -3 110 123 -16
6970 -16 -64 59 278 8 -27 -134 -170 -232 30 77 -15 41 -55 40 -133 -63 33 -26 -11 -177 140 -156 121 147 111
6995 111 89 -91 85 100 -41 151 -44 156 203 -106 42 -134 60 267 -28 -165 -95 -165 280 128 -62 -175
7017 -175 19 -126 -76 -180 -65 27 -213 -204 -353 -163 -181 157 -218 -119 -100 118 156 117 26 150 -67 180 37
7040 37 -29 -85 -106 -84 -222 14 292 -83 -84 -21 141 47 22 5 -141 177 -264 115 -12 47 270 235 296 -121 118
7065 118 174 41 -146 62 -10 -36 -57 115 10 62 365 -83 15 65 -135 36 -126 -108 212 -85 -84 -24 -71 -163
7089 -163 -67 62 -146 -117 169 51 -164 -8 -77 -37 -19 -175 72 -122 97 5 63 -32 -217 -55 -85 -6 9 -122
7113 -122 137 -41 15 126 142 116 260 1 158 286 109 -68 106 -31 -1 -69 -91 47 32 -24 179 209 85
7136 85 67 150 118 259 -134 -162 139 -52 355 -12 172 -26 113 -181 128 191 39 209 -39 88 -14 81
7158 81 -102 125 -157 238 -121 -146 -270 174 -49 -99 -262 74 -19 130 -36 -215 -56 -65 71 -163 -30 90
7180 90 1 102 16 21 0 -173 114 130 -123 -45 8 -118 93 -309 -249 61 -132 -102 254 -202 68 7 11 118 -35
7205 -35 -79 12 21 75 54 -96 34 -83 26 -106 -107 22 26 88 -251 234 50 -150 80 91 92 -42 -148 -55 -189
7230 -189 96 74 -127 -80 -16 -125 18 96 -35 52 -241 -69 -55 51 237 -37 -68 53 -45 -305 88 -16 -114
7253 -114 131 50 108 28 -56 -121 -43 51 -212 43 29 71 108 23 -132 37 13 -25 -56 -84 -11 -347 17 56 -130 -27
7279 -27 -164 366 50 35 13 -57 -39 -91 144 -161 133 87 262 -122 -17 -19 0 138 -133 13 159 140 -57 43
7303 43 13 -169 49 45 25 59 -34 -30 -206 -101 99 29 -150 132 42 -214 8 -19 -62 -50 -48 79 -83 -244 129
7328 129 -152 -461 -103 -124 -43 -82 -199 -77 1 -267 -136 41 -99 64 -70 121 168 100 95 -53 128 -188 51
7351 51 44 160 -62 -6 19 -350 163 -16 35 121 -121 258 -120 -24 -148 263 60 257 -49 -66 130 105 257
7374 257 -101 124 -173 102 -58 -303 -113 153 37 141 134 194 -92 -60 -139 -30 -14 34 -164 -256 19 -216 15
7397 15 37 0 -143 -317 27 64 -178 -114 -45 6 47 54 -67 -268 -125 -252 -78 27 -93 128 342 44 -200
7420 -200 23 133 -49 1 47 116 81 103 20 -288 77 -236 29 27 33 113 68 -128 -65 50 42 55 -244 -139 -60 -138
7446 -138 192 -121 -96 33 -83 -69 0 -139 2 80 -73 -135 -333 153 157 -252 117 -53 -197 26 -194 -41
7468 -41 -174 -20 -91 29 176 -85 -3 -73 -56 57 -348 -197 -82 20 -78 -97 -98 -280 -152 19 17 229 -77 135
7492 135 -59 -122 -56 -237 -410 -2 -31 3 -205 52 36 142 66 -201 11 -89 95 -146 117 -110 -118 -44 282
7515 282 -35 166 -214 52 -36 -194 251 -73 168 313 117 140 68 -40 288 292 126 -39 66 66 -100 -113 60
7538 60 -13 44 -38 0 -167 60 -101 -42 254 135 -42 -180 121 -45 56 125 -221 -125 -60 -327 -64 -117 -100 46
7562 46 -21 -30 -39 175 10 31 -191 -188 179 -131 -33 43 -21 -23 23 -12 176 100 -50 123 -35 121 13 121 -29 -90
7588 -90 64 -91 25 56 58 285 19 -131 -122 -40 100 12 -129 62 288 193 -165 -49 -227 -223 46 -85 77 -83
7612 -83 -78 -61 -127 165 79 -59 -72 0 8 -162 -67 -88 17 249 -132 -99 21 -128 2 -149 98 222 -101 49
7636 49 -33 71 1 116 -78 -140 4 22 -57 -195 75 -174 6 -16 -51 99 83 48 110 122 107 113 -79 240 19
7661 19 79 38 29 20 -150 -94 109 164 -53 -74 30 -209 226 155 -98 217 117 -169 -47 -2 146 3 108 -114
7685 -114 -72 -3 39 -126 -142 -276 -85 93 -63 -162 123 -36 -129 -192 121 -85 48 -9 99 -55 -163 -111 -86
7708 -86 84 -311 185 -39 22 49 -44 17 12 -133 -2 -102 -109 -181 -100 -103 141 65 -8 106 40 267 60 -24 103 276
7734 276 84 174 -103 234 -31 -157 93 40 -23 170 -76 -51 -88 -116 -67 33 -11 5 -149 -31 44 63 26 45
7758 45 -92 -157 -111 -145 -104 -19 -126 352 80 -110 -105 -245 -13 116 -112 47 -33 159 27 83 -168 61 -87
7781 -87 99 250 -27 120 45 -100 41 104 -42 -123 -90 -65 5 -102 62 -133 158 -149 115 130 -44 -147 171
7804 171 100 211 -45 18 60 6 103 -197 86 -112 216 -76 5 -155 199 -51 60 -118 107 -235 -95 -191
7826 -191 -95 56 -148 133 -263 -148 -111 15 -108 175 -98 -157 185 162 57 -118 -204 -354 140 32 -128 -193
7848 -193 156 94 -246 -59 -38 39 -372 -25 -134 90 -45 -25 143 25 -82 106 32 -93 -36 279 -27 28
7870 28 156 -60 -7 -191 97 -2 271 -111 -106 128 8 67 -25 98 22 35 -73 27 -205 41 144 -165 30
7893 30 -129 0 -188 189 120 -103 48 -142 3 81 -56 -63 116 -5 -159 -131 -103 -93 146 -86 247 -82 151
7916 151 100 -17 238 96 -213 -7 324 16 -359 67 228 25 24 83 -134 32 76 53 49 -16 46 176 -90
7939 -90 -184 140 -6 -56 80 137 154 116 -169 -87 -26 -108 -308 88 188 -57 3 -339 102 -29 96 -114 182
7962 182 -41 64 -40 139 -19 235 -28 153 68 15 -42 -180 96 77 -195 21 -202 -62 62 -52 -86 3
7984 3 171 -82 -67 -358 92 -177 -238 186 -194 147 -49 -235 107 -183 126 229 50 -81 -156 -151 -113 -180 34
8007 34 208 -55 -38 187 68 -49 138 -3 -202 -103 355 97 47 18 -29 -25 -67 58 -125 12 201 63 221
8030 221 -61 -45 211 78 -56 28 86 -105 126 -258 297 -58 -163 48 -42 -62 138 -55 -143 -138 -166 1 -161
8053 -161 -54 47 172 -15 -70 79 33 -79 172 68 63 128 -187 -154 263 -6 -35 -92 -75 -50 6 -90 9 141
8077 141 33 -54 7 -53 212 -21 29 248 19 -182 -124 -46 -178 147 -25 12 261 134 -236 -105 -3 -101 -149
8100 -149 -97 91 -11 49 28 229 -102 -162 138 -112 145 -130 86 110 -252 -141 9 174 -179 -201 194 -193
8122 -193 18 72 -264 150 -41 144 -168 123 11 -78 -106 -73 -327 88 -175 -95 -214 -114 -160 188 -147 -20
8144 -20 -213 -252 -46 -181 -186 -62 175 128 -72 -22 66 -9 -73 108 -38 -215 94 66 -27 -18 117 -126 50 -65
8168 -65 -207 -150 190 155 -47 -46 -52 287 101 -173 -75 -277 280 -114 -30 280 -11 -85 -146 89 -147 -12 35
8191C5
$$ Imaginary data points
##PAGE= N=2
##DATA TABLE= (X++(I..I)), XYDATA
0 0 0 0 0 0 0 0 0 0 -8 8 -8 8 -16 16 -24 32 -40 48 -56 65 -80 96 -113 136 -157 185 -211 244 -282 324 -371
31 -371 420 -477 539 -606 683 -767 858 -958 1068 -1188 1319 -1461 1618 -1788 1974 -2179
47 -2179 2399 -2643 2910 -3207 3532 -3895 4298 -4751 5263 -5845 6517 -7302 8229 -9346
61 -9346 10723 -12462 14742 -17869 22426 -29681 43005 -75226 306759 239264 -320504 127146
73 127146 -261916 166272 332607 -404378 35310 123727 -153425 307479 -215171 -150502
83 -150502 348255 -199781 18809 141023 -209181 295497 -10418 -217633 261326 -145382
93 -145382 -49395 177646 -216234 179617 57567 -311942 139378 -18342 -18350 154372 -315272
104 -315272 7920 237901 -91599 92330 -132008 -171628 253858 -33892 -43215 65380
114 65380 -166419 114313 43536 -180948 78631 -62435 -43699 112334 -130599 3629
124 3629 51133 -88341 88150 -43936 -85564 102197 -7386 60202 51092 -117729 22556
135 22556 23008 3032 63321 -80065 -16825 51045 -31092 35741 -26223 -47509 37604 -21169
147 -21169 51335 65608 -21395 32500 -26061 -342 86890 -18981 12270 19651 -24137 62137
159 62137 -40569 -50319 55382 -36841 9877 2614 -62827 92245 24677 -51602 16129 -66382
171 -66382 50903 93195 -66852 28333 -3276 -48268 67695 -61883 -32127 53497 -79439
182 -79439 18761 13390 -69630 60973 -52516 -72902 63932 -38486 29201 42316 -81367
193 -81367 48342 -761 -58182 64279 -40576 -6964 56146 -78987 16137 20757 -63022
204 -63022 34922 -49187 -40580 77486 -27081 14850 30399 -66326 43467 19113 -23198 70936
216 70936 -11868 2697 49197 -46562 21740 17963 -50027 34269 -6807 -13144 49384 -29587
228 -29587 -2015 20171 -33046 39250 23537 -6113 51239 -3306 -3065 28945 -21843 11648
240 11648 8808 -24584 22520 -3697 -15879 8584 -35159 -17107 5871 -13269 17883 7734
252 7734 -9258 9431 -14795 -7317 10916 -9775 6413 5581 -11373 -74 -14265 -20415 -12638
265 -12638 -22539 -8433 -1417 -10136 -1004 -7907 -14091 -6381 -7737 590 9007 8110 13212 6378 -1679
280 -1679 -1591 -7493 -4763 2476 3394 3271 -1013 -5088 -7204 -9914 -4548 3233 6641 13041 17157 15495
296 15495 10968 6704 6081 8361 12148 16031 13808 6916 839 -4013 -6670 -5697 -3048 -1333 1207
311 1207 6152 9193 6319 1874 -668 -633 4787 13214 17147 12136 572 -7690 -10669 -11262 -5773 -3274
327 -3274 -7337 -7531 -8901 -9481 -7485 -12204 -11159 -7449 -5470 7890 9872 882 -341 -11136 -11206 -201
343 -201 -3212 2100 -82 -12188 -3199 -9923 -16206 -4390 -16080 -9556 5954 -1323 12693 6265
357 6265 -12212 2751 -3582 5556 29235 6623 8016 8204 -12998 9643 2951 -10126 10070
370 10070 -10830 -1690 19905 -6995 8543 2763 -20082 17426 13399 14083 34217 -5108 3692
383 3692 15518 -12211 17227 5768 -14671 17069 -9644 -6800 13444 -23228 -3442 -3400 -22916
396 -22916 22708 11907 -14 15335 -26098 -8729 16848 -4781 18008 -4650 -25044 9573
408 9573 -10584 -7951 1470 -33201 -9337 -2274 -12178 15930 -6587 -14783 -3137 -23676 6132
421 6132 17564 -1734 10213 -9007 -6031 10868 -13321 -801 870 -8640 8623 -13626 -4716
434 -4716 18300 -9950 -8931 -19639 -7812 46508 16883 -6281 -4124 -15956 37369 25483 -19678
447 -19678 11756 -2797 13851 30115 -30535 4736 12323 -28126 17230 -9831 -944 48227
459 48227 -25567 -5104 20090 -25262 37285 6917 -19453 52551 -21328 -19152 29405 -30968
471 -30968 28263 -1603 -72115 37093 11169 -9057 24447 -81344 -4140 59427 -33939 24593
483 24593 -17312 -41291 73346 -26697 -30444 36066 -55644 27369 20793 -68098 47376 -13555
495 -13555 -42238 46690 -62709 -5946 48998 -52317 47316 5411 -70352 51669 -15640
506 -15640 685 65104 -72287 6989 47693 -36760 54529 -26766 -61372 66127 -23038 3330
518 3330 44656 -65172 31089 20191 -49333 60077 -12331 -18315 64153 -36276 19478 37514
530 37514 -55121 43635 9370 -37229 44103 -32480 3912 55309 -58827 -7546 6345 -21889
542 -21889 66085 -13898 -43445 34834 -16285 21411 21621 -52415 23718 10630 -22037 28626
554 28626 -25828 -10260 15365 -44539 4274 11059 -19673 17013 -21863 -13498 22610 -22366
566 -22366 -2092 6456 -8405 21556 -12785 -15900 17506 -6399 -1048 -14499 -22110 24185 8027
579 8027 -7682 -9008 -26002 14319 12135 -10387 10313 -9192 7413 20750 -13304 15101 5096
592 5096 -13409 21288 -7039 7826 26996 -24277 5233 3715 -18607 27490 -10744 -7748 33803
605 33803 -19141 6489 13416 -23252 35941 4046 -21289 32822 -11597 9614 25076 -44066
617 -44066 9342 10358 -23100 31379 -21074 -20281 30114 -31708 3602 16263 -34225 27631 -1678
630 -1678 -24420 37754 -20025 -9690 19167 -39532 16532 12488 -35006 23792 -16678 -23341 24484
643 24484 -35518 272 23436 -31702 18185 -1144 -24094 33519 -17746 -12489 26307 -22060
655 -22060 16567 13536 -30302 21896 -4661 -18283 23516 -17914 3822 21390 -25607 12476
667 12476 8546 -15304 21813 -8467 -3079 30565 -6888 8418 11380 -15921 17519 3101 -9314
680 -9314 19623 -5136 -1139 10376 -15924 5275 5113 -11355 11940 640 -1320 13316 -6945
693 -6945 1299 7912 -7452 5831 1715 -3746 8038 -6821 -8549 -796 -9195 -1982 -3428 -8657
707 -8657 2076 -922 -4596 -2593 -7314 -1417 2021 -1443 1521 -718 -2559 -2394 -5622 -4125 -3088
722 -3088 -3169 -1439 -2226 -1237 -2616 -4649 -2603 -2035 706 2681 620 3373 2859 469 2845 470 1499
739 1499 4345 1369 3703 4479 1258 2371 -1590 -2256 2567 2455 4914 5482 850 2149 1746 1601 5929
756 5929 4617 4146 5415 2453 3506 3256 -348 -327 -1879 -1768 1559 444 -425 -1399 -3839 -2903 -1025
773 -1025 -81 1559 1183 272 151 -735 -1337 -2413 -3759 -3079 -1926 -1978 -2236 -4038 -6218 -6597 -5852 -2788
791 -2788 -839 -1196 -1290 -2116 -2264 -1012 -1042 -394 -337 -1215 152 469 -288 -458 -3091 -3078 -741 -302 1869
810 1869 2032 -133 1314 -61 228 3653 1275 3139 5365 2704 5428 3569 -84 2744 510 2544
826 2544 6724 1547 2191 1752 -3050 2583 1744 -312 5218 -101 605 4707 355 4139 2576 -3273
842 -3273 2368 1018 1067 5228 -3002 -3924 -2076 -6406 56 -221 -4901 -536 -4122 -3575 1824 -3741
858 -3741 -2428 -802 -3798 1769 692 -3615 -1271 -3925 -4474 -2076 -4083 -1677 368 -3278 -4392
873 -4392 -3324 -2339 1284 1610 -2992 -2189 1647 1883 4583 683 -5720 654 1955 1881 6767 -2411 -1077
890 -1077 4454 -3527 3946 3140 -4411 8307 2342 -1645 8696 -4426 2312 11013 -5992 6321
904 6321 4625 -4916 15231 -1124 -6863 9684 -8041 6203 11420 -15352 5944 1308 -7902
917 -7902 17330 -10222 -9805 13927 -10346 9321 7830 -21585 11853 -546 -11245 16467 -16652
930 -16652 -4274 16274 -20672 4667 396 -21702 18792 -6807 -14704 16208 -18987 3414
942 3414 15604 -24487 9449 -364 -17254 24522 -11181 -11691 15829 -21536 9375 12585 -25890
955 -25890 14457 -1719 -11246 26183 -16559 -5536 18943 -18255 14844 7594 -20838 22886
967 22886 -2567 -8682 20086 -17497 5963 19940 -17917 12743 1436 -13534 24449 -6517
979 -6517 -6383 16544 -14994 9143 12621 -15176 13510 -1744 -10061 18264 -7032 -1230 10849
992 10849 -13956 7870 5332 -13067 7235 -4863 -4928 11124 -10303 -3420 4742 -7809 4507
1005 4507 -2242 -9366 6402 -648 -3695 -232 -8112 57 2591 -5521 -3226 -2985 -2437 188 -1871
1020 -1871 -3362 -1802 56 -2608 -314 2208 -2949 1332 403 -4676 4580 -1846 -3389 7055 -4433
1035 -4433 456 5112 -7523 7111 3526 -7290 10105 -2118 -1575 12330 -8241 3704 8898
1048 8898 -9768 11029 2446 -7722 14535 -5990 -451 15284 -11511 5086 7015 -10285 15531
1061 15531 -3250 -11219 16727 -6654 380 7695 -18082 12521 8990 -15632 8045 -7710 -1560
1074 -1560 19067 -18105 -4317 9945 -10725 10827 -6741 -18012 17848 -4985 -7788 5867
1086 5867 -16435 8584 7765 -19688 7663 -793 -8037 10487 -14463 -1556 13436 -15140 233
1099 233 2040 -7708 13002 -8341 -10755 14672 -3083 -431 1030 -11635 13999 6900 -13226
1112 -13226 2947 -1269 5025 11480 -13174 -1244 11097 -571 5613 -4023 -4939 14663 1506
1125 1506 -3362 4193 -2575 6587 4212 -6955 4813 3651 -1537 4324 -2519 810 5883 -3397
1139 -3397 879 4187 -1479 1489 -1184 -2005 4778 -1013 -4728 -332 -1166 1263 784 -5489 -1731 1288
1155 1288 -2276 -943 -2086 -2872 1424 -2101 -4096 -372 -2910 -1375 413 -3788 -1356 -860 -3735
1170 -3735 1062 -898 -3728 227 -2341 -354 2099 -3653 -1041 1295 -1903 1922 -895 -1640 4061
1185 4061 778 192 2426 -1114 2280 2406 -1824 2933 2177 338 2658 -939 484 4094 141 2374
1201 2374 2715 374 3600 1333 555 3975 591 863 2055 -45 2206 1453 -1942 300 -367 -429 1543
1218 1543 -1051 -421 586 -1055 151 -102 -1447 246 -1150 -1421 272 -1124 -1458 -2199 -3347 -1556
1234 -1556 -820 -1084 -1149 -2429 -2882 -1818 -1892 -765 -672 -1640 -1574 -1420 -679 251 -689 -1418 -1201 -945 23 920
1254 920 455 -340 -1420 -1330 10 1066 979 654 -6 221 1255 1636 1810 1334 1049 1642 2356 2765 2329
1273 2329 1130 436 311 1227 2464 2277 896 94 6 966 2091 1389 1067 944 678 1622 2162 1088
1291 1088 158 -996 -1191 100 318 454 -171 -2359 -2357 -1559 -1214 254 -770 -1869 -675 -1340 -602 11
1309 11 -2165 -1746 -1283 -1634 428 -683 -2417 -1879 -3353 -1651 15 -2004 -694 -920 -2342 415 -611
1326 -611 -1272 881 -2045 -241 2089 259 2519 661 -2362 798 108 965 3954 -772 -313 832
1342 832 -1262 2450 1761 -1016 2534 588 1423 5093 725 1323 1856 -1143 3535 3195 394 2805
1358 2805 -1081 -1459 2015 -1456 401 1297 -2026 1599 620 -1391 2673 -525 -1778 860 -1111 1815
1374 1815 3504 -2748 -2067 -2191 -3031 1537 -1148 -3872 -602 -2481 -1966 497 -3727 -1262 262 -3858
1390 -3858 366 1357 -1013 1281 -3500 -3953 2719 -849 -851 896 -3854 1637 1175 -5845 920 765 -1606
1407 -1606 3018 -3812 312 7904 -2267 -1799 409 -1601 10022 3070 -5888 4135 153 1588
1421 1588 5155 -7235 2558 6899 -4680 3407 -549 -1951 10156 -5044 -3897 8196 -1074 7089
1435 7089 2558 -9644 7760 1966 -5021 6430 -5883 1414 7196 -11573 1296 3474 -7161
1448 -7161 5762 -7056 -5455 13162 -4887 -3097 1351 -9885 8732 2844 -11654 6080 -2978
1461 -2978 -2315 6323 -13799 -1077 7637 -9073 2459 -3858 -6902 12919 -5153 -8627 4180
1474 4180 -5714 7973 5686 -12463 5093 2846 -3325 6294 -8951 -1000 11592 -6218 -194
1487 -194 1422 -4656 9750 -2577 -9106 8339 1544 3536 4021 -8646 5791 8141 -4273 3104
1501 3104 -272 1445 9468 -4764 -3702 6149 -1309 318 -1959 -4751 8885 3949 -6465 -721
1515 -721 -313 3444 5819 -6062 -1205 7175 -127 -1253 -3450 -4770 6207 94 -9184 126 -132
1530 -132 941 1981 -10976 -3168 6332 -2265 1025 -2098 -5631 7818 -1065 -6932 2856 -4504 1616
1545 1616 4709 -9311 1580 2339 -6863 4610 -4965 -5055 9526 -4062 278 4737 -8341 5973
1559 5973 2991 -7017 9104 -1262 -1868 9646 -7545 1487 7164 -8664 5669 1143 -5581
1572 -5581 11538 -4318 -4493 8896 -6394 4381 5079 -8736 10607 3989 -5305 7235 -6613
1585 -6613 881 11181 -8968 1434 3341 -6337 8372 -5821 -8998 9247 -4101 80 3828
1598 3828 -9342 7118 3313 -9635 4865 -3406 -1206 8309 -8735 -857 3656 -8463 2568
1611 2568 -2985 -6738 6581 -4802 -3810 4562 -5544 1724 399 -7592 5607 1888 -2249 4625
1625 4625 -4732 -321 3780 -5964 1696 1758 -2668 3646 -2903 -2847 4578 -2228 -437 1682 -1910 5086
1641 5086 3211 -1377 2780 -601 795 4158 -137 2409 2544 -1314 1340 158 -1024 1473 -1065
1656 -1065 -271 2543 815 1398 427 -1582 461 1373 1215 2557 1348 -189 -222 -910 -698 -82 -813 -1526
1674 -1526 -1417 -1088 -461 -399 -2169 -2600 -1744 -897 1620 1286 -418 -656 -1994 -1502 291 -316 -461 -687
1692 -687 -2678 -681 -599 -1769 -1173 -2581 -2101 352 493 1326 446 -1809 -695 184 1148 2925 1447
1709 1447 332 332 -381 930 1032 -339 -404 -575 409 2501 1439 143 -555 -1279 1007 2916 3086 2886
1727 2886 818 -46 742 1231 1807 1208 -177 116 402 664 563 -1247 -2165 -1424 -682 1526 1863 376
1745 376 -569 -1554 -666 789 752 724 -530 -1394 -608 -175 -682 -1978 -3337 -2702 -1000 -109 547 -815 -2457
1764 -2457 -2215 -1236 579 1943 506 -39 -603 -815 618 330 -1187 -1026 -1810 -402 1167 86 -127
1781 -127 -1516 -2632 -128 1314 2089 2323 25 -19 1412 1079 2293 1415 112 1142 794 1480 2167
1798 2167 -400 -1340 -1139 -773 2224 2279 692 -121 -1373 345 2110 1421 1798 598 83 1139 774
1815 774 727 61 -1618 -1691 -1064 252 1226 -925 -2269 -2918 -1464 860 135 -79 155 -382 650 -479
1833 -479 -840 796 -1625 -1483 -165 -1050 1730 -952 -4518 -1864 -2324 426 2411 -2264 11 147
1849 147 -1958 2285 11 -586 3283 -2212 749 3421 -1706 2068 -1536 -4469 3312 -273 606 3830
1865 3830 -3766 831 1561 -3266 5026 1076 -1336 5269 -1936 2077 5778 -4141 2383 510 -3359
1880 -3359 6665 -200 -1798 3450 -6526 205 3723 -4514 4459 -708 -4129 6989 -2519 -1110
1894 -1110 4147 -5321 3380 2220 -5796 5547 -696 -4264 1949 -8140 36 5519 -5808 1173
1908 1173 -2246 -5017 6388 -3523 -3353 4733 -4155 2741 2522 -5518 4969 -1402 -5635 3332 -3161
1923 -3161 1457 3833 -7245 794 1022 -3870 3326 -2790 -719 6454 -2635 951 2434 -1668 4574
1938 4574 -1247 -3178 5557 1323 1348 343 -4831 2396 1963 -1731 1193 -681 1481 3050 -2125 440
1954 440 1441 540 2406 -770 1598 3624 141 35 -1982 -632 2119 -827 -108 -557 -1944 1670
1970 1670 -2248 -1915 772 -2366 1591 770 -2205 3316 -1252 -2096 1911 -3818 994 1802 -4113 2636
1986 2636 -2295 -4666 2419 -4742 -344 3093 -5747 2495 1025 -3949 5250 -3436 -2847 6038 -3705
2001 -3705 3032 2838 -6657 4574 -654 -4629 5461 -4916 142 6792 -5907 2528 688 -5587
2015 -5587 7928 -1152 -2412 7634 -3750 3639 5535 -7231 4518 758 -3376 8260 -4069
2028 -4069 -1483 5940 -6449 2682 1846 -7117 6949 14 -2378 6681 -5892 548 5657 -5619
2042 -5619 4106 351 -4639 7005 -2618 -2878 3182 -7232 1150 3059 -5785 3653 -2362 -4194 4699
2057 4699 -4195 -840 3442 -4273 3315 986 -4346 3811 -2366 -2085 3015 -5032 736 2475 -3751
2072 -3751 1867 -2446 -3910 3082 -1402 712 2777 -3009 1801 1681 -1152 2513 -1668 -516 3099
2087 3099 -222 1602 578 -2470 991 -835 -701 2086 -113 1472 706 -1099 1414 955 871 1585
2103 1585 -458 1353 1665 524 1653 -1069 -1134 336 -560 1708 611 -1387 -382 -1939 -741 1392
2119 1392 -1112 502 -83 -682 1970 -245 -663 154 -2221 -90 626 -750 1463 -1677 -3065 -694
2135 -694 -2376 -10 944 -2181 177 -755 -1229 1685 -698 -684 820 -1409 1656 1936 -566 183 -2387
2152 -2387 -1994 1282 -385 770 582 -1951 321 259 -312 1901 -435 155 1775 357 2495 1715 -757
2169 -757 284 -144 521 2450 446 196 -135 -1302 457 796 118 1198 -724 -204 1771 915 837 140
2187 140 -1197 389 962 1202 1526 -1079 -1681 -1012 -1123 184 50 -1119 -1051 -1306 -502 570 -552 -796
2205 -796 -937 -687 884 940 304 -542 -1803 -1616 -159 160 220 -555 -1560 -1418 -901 -116 -278 -749 -644
2224 -644 -10 550 1654 911 -169 -762 -399 1196 1565 1399 301 -705 -745 58 602 467 250 -325 -104
2243 -104 710 1226 1152 290 -487 412 1379 2283 1824 317 -637 -795 253 695 563 321 -633 -479 206 258
2263 258 35 -380 -973 152 452 937 1439 -413 -769 -578 -884 915 478 -684 -667 -1730 -958 -181 -1269
2282 -1269 -658 -1301 -1752 1148 -93 -227 -42 -2257 -616 1003 -199 1867 -185 -1797 890 -1486
2298 -1486 -348 1047 -2636 212 210 -1698 1957 -716 -923 1629 -2253 1225 2917 -204 2775 -369
2314 -369 -2279 3038 -248 886 2478 -3030 1317 1676 -2037 2674 -1487 -2073 2860 -1567 1938 2989
2330 2989 -3172 1893 417 -1685 4205 -1267 -434 3351 -3371 635 879 -3698 3116 -1314 -3129
2345 -3129 3102 -2462 299 1958 -4974 1024 450 -2214 4245 -1726 -1949 2469 -3664 802 1247 -4128
2361 -4128 1860 -1169 -2122 3275 -3324 -1907 874 -3325 2347 781 -2763 2943 -733 -586 2091
2376 2091 -2377 1308 2387 -1640 1800 -818 -1102 2299 -1865 -304 860 -1561 2309 817 -695
2391 -695 1492 -1118 538 2225 272 2018 113 -263 2136 130 555 -557 -1404 1917 831 123
2407 123 -75 -2310 1629 711 -1582 1165 -1107 1259 2881 -2499 336 -182 -1657 3387 -1696 -1521
2423 -1521 2396 -3080 1014 587 -4533 1808 -1760 -1955 4131 -3553 -777 1628 -4311 3679 273
2438 273 -4709 3956 -1747 93 4072 -6853 619 2416 -3889 4261 -2902 -3579 6264 -3528 -266
2453 -266 2123 -6227 5518 2306 -4553 5441 -2663 -822 6292 -5673 2026 3192 -5208 5808
2467 5808 -730 -3706 5920 -4773 24 5629 -5154 3695 1294 -4109 7354 -2198 -3131 5391
2481 5391 -3809 3531 3658 -7136 3651 327 -2951 5228 -5233 -1266 5240 -4728 2488 509
2495 509 -5109 4853 -1903 -2303 4642 -3800 1250 2375 -5430 2948 -606 -3546 3946 -2989 -1212
2510 -1212 2029 -4589 1793 459 -3907 2317 -1558 -696 3815 -2741 60 795 -2566 3464 310
2525 310 -1799 1960 -1982 267 1902 -2260 996 -214 -965 2640 -1024 11 1632 -1169 1367
2540 1367 393 -445 2565 458 361 613 -1713 1445 666 -781 799 -1146 474 1726 -977 782
2556 782 -344 -996 1409 -306 1411 1502 -1897 580 -253 -360 2285 -1442 -531 939 -1672 956 -559
2573 -559 -2470 1269 -1501 -1111 1667 -1604 744 300 -3299 937 -207 -316 1765 -2229 -422 1392
2589 1392 -1817 1289 -588 -2540 1570 -1413 -565 1651 -1838 207 91 -1979 2065 733 -462
2604 -462 1757 -1356 189 2215 -931 1242 207 -1359 2034 -726 102 1484 -1891 165 945 -770
2620 -770 2335 211 -951 1388 -524 917 1553 -1037 1055 245 -676 1203 -168 -571 535 -1435
2636 -1435 211 795 -740 809 -583 -1203 497 -228 439 631 -840 128 5 -294 178 -601 -1051 -179
2654 -179 -590 -3 153 -1135 -634 -927 -1086 243 -276 -119 -175 -728 -270 -181 -10 373 -358 -263 228 58
2674 58 306 -119 -802 -999 -213 243 752 164 255 -211 26 988 563 647 233 211 611 629 608 465 34 -175
2696 -175 456 614 603 481 -145 -327 -75 313 988 250 339 360 36 317 239 -3 -29 -340 -98 342 -213 -179
2718 -179 -559 -612 -300 -435 20 -207 -411 -430 -549 -458 229 -372 -420 -141 -421 -36 33 -536 -217 -870 -621 194
2740 194 -506 -28 -221 -892 66 -141 -221 400 -317 265 748 19 414 300 -745 403 144 131 907 -288
2760 -288 -236 370 -669 598 608 -40 962 -270 222 1391 -290 482 261 -408 1415 597 -135 913
2778 913 -713 43 635 -882 754 387 -744 781 -627 -145 1065 -857 138 498 -993 1056 -26
2795 -26 -731 592 -1512 -638 355 -1220 338 -251 -1595 489 -724 -468 469 -1472 45 306 -779
2812 -779 463 -778 -759 744 -615 33 98 -748 725 -217 -986 -37 -324 441 449 -763 126 190 50 504
2832 504 -382 166 772 112 1043 59 -145 674 -416 499 703 186 689 -411 434 1313 -486 178 211
2851 211 72 2044 -118 -1310 1287 -224 1075 95 -2081 1510 1143 -929 373 -1877 14 2084
2867 2084 -1943 104 -87 -1179 2114 -1195 -1675 1742 -1821 249 656 -2600 1847 -117 -2308 1957
2883 1957 -1443 -321 1305 -3003 942 924 -2848 1399 -1355 -705 2945 -2709 -259 1627 -2249 2295
2899 2295 -236 -3005 2937 -670 -334 2029 -2830 1230 1731 -2568 2536 -702 -1346 3488 -1518 53
2915 53 2138 -2596 2272 1132 -2184 2493 -567 -619 2793 -2368 294 1842 -2019 2236 -206 -1330
2931 -1330 3203 -1411 -966 1796 -1656 1590 490 -2356 2120 294 -878 1047 -2132 634 1480
2946 1480 -2637 19 -353 -145 1410 -2098 -1654 1707 -458 234 -885 -1538 1828 13 -1794 -278
2962 -278 -481 942 95 -1989 90 695 -140 -285 -1361 616 1476 -523 -839 -204 1023 851 -1075
2979 -1075 -537 515 880 429 -1012 -134 1034 506 327 -616 152 1727 -185 -408 330 -24 1538 -155
2997 -155 -1299 1654 84 342 555 -1236 1265 714 -1234 859 -315 115 1323 -1868 -103 861
3013 861 -810 1101 -680 -1315 1789 -693 -393 1173 -1884 689 544 -1784 1124 -648 -1094 1241
3029 1241 -1660 -143 1063 -1889 915 -13 -1513 1329 -1073 -480 1485 -1738 181 451 -1412 1367
3045 1367 -289 -1270 1353 -1164 189 1496 -1771 740 210 -929 1768 -457 -700 1231 -794 472
3061 472 972 -1166 1120 565 -480 1285 -818 26 1506 -617 529 473 -726 1399 171 -791 1022
3078 1022 -516 306 788 -1010 582 434 -396 775 -151 -173 614 -516 193 438 -662 -84 -194 -293
3096 -293 458 -634 -613 130 -568 -90 -451 -641 217 108 -312 -267 -496 -125 -259 -490 -77 -116 -401 100 -380
3117 -380 -78 -102 -108 95 152 24 -88 220 103 128 -181 41 3 186 298 76 106 146 189 308 268 321 313 213
3141 213 277 218 64 291 -33 187 275 233 414 359 65 -38 53 189 325 277 -70 150 -58 50 -14 -414 -48
3164 -48 -353 56 -91 -147 -61 -221 -211 -107 -254 -300 -303 -469 -28 -225 -357 51 -141 -417 -360 -63 -342 -286 -355
3187 -355 -242 -453 -194 159 -260 -325 19 -260 -15 -71 -91 239 81 36 304 -86 24 364 -458 -221 -60
3208 -60 -70 354 181 141 292 147 436 499 41 325 225 174 644 297 299 357 -53 348 333 146 145 52 1 212
3232 212 -69 111 155 -34 401 72 -336 318 -242 -93 148 -529 114 170 -636 -81 -370 -222 143 -371 -73
3253 -73 148 -596 -239 -294 -214 -94 -355 -184 -91 -520 -21 -138 -504 -28 103 51 175 -167 29 17 -223 -196
3275 -196 -217 369 291 -102 28 122 399 356 -38 495 298 165 408 39 212 358 -268 652 -94 -14 744 34
3297 34 382 744 -456 426 249 -258 595 -102 -40 717 -514 388 389 -945 643 8 -475 987 -393
3316 -393 -462 508 -1199 349 226 -1290 592 -242 -536 779 -1239 -274 699 -1226 490 -464 -947 1347
3334 1347 -764 -1165 929 -871 362 441 -1959 1016 211 -1269 1046 -820 -55 1465 -1511 357
3350 357 902 -1150 1212 -865 -847 2015 -221 -200 593 -1296 1161 506 -1393 1139 177 69 1313
3367 1313 -1333 720 1291 -992 616 -75 -584 1614 -660 -494 1144 -685 658 392 -892 1270
3383 1270 77 -788 867 -272 431 662 -971 445 607 -550 495 -778 -336 797 -619 -288
3399 -288 282 -633 9 -466 -530 344 -238 -551 143 -324 -69 285 -600 -62 9 -323 193 -43 -57 100 -516
3420 -516 -474 71 -49 -37 394 72 281 697 -61 189 491 -418 134 388 -231 693 -383 -653 719 -140
3440 -140 423 832 -646 518 656 -282 653 -132 -208 1294 -353 24 838 -545 877 -112 -787 933
3458 933 -174 -95 699 -1083 154 449 -882 449 -373 -921 701 -473 133 817 -1508 118 331
3475 331 -586 1107 -587 -1317 774 -598 -41 274 -1243 388 222 -954 484 -629 -501 859 -864
3492 -864 -293 778 -576 833 55 -1247 812 -389 -162 677 -843 -21 514 -727 891 -45 -488
3509 -488 282 -297 363 1160 -596 349 463 67 916 -186 -25 756 -315 -28 10 -488 278 452 -289
3528 -289 323 184 176 511 -465 -162 390 64 464 21 -429 -88 -211 -350 271 -40 -336 -269 -436 -166 85
3549 85 -260 -73 -79 -38 41 -96 -295 -161 -182 -308 -130 -236 -41 -26 -496 -306 9 -262 115 -82 -418 56
3571 56 193 223 94 -194 54 43 114 367 355 210 57 41 292 122 -50 67 246 9 184 222 32 227
3593 227 -122 243 544 277 463 282 -182 358 313 211 472 -44 190 119 -270 62 -150 -383 -347 -172 -52
3614 -52 86 -191 7 154 -205 12 -92 -16 -171 -109 -137 -141 -240 -203 -317 -546 -107 -269 6 -210 -195 -184 -25
3637 -25 -27 83 266 -130 113 59 -415 -190 13 -36 -137 32 -29 63 -24 -142 -127 327 244 507 432 183 110 201
3661 201 378 363 401 231 215 375 283 321 64 -80 49 406 116 167 72 -15 107 33 -3 484 138 11 -33 -33
3685 -33 27 -72 -332 -150 -125 -34 -235 -48 -391 -110 -177 71 -157 -87 -131 -290 -100 -120 -117 -272 -93 -515 36 -36
3709 -36 -65 -6 -141 -571 -73 -536 -123 -29 -429 94 168 -165 126 27 294 511 72 33 72 -136 124 164 -215
3732 -215 240 247 -24 520 -1 -117 287 4 282 298 84 608 161 -107 336 -248 92 246 -65 237 139
3753 139 -182 144 53 -197 66 -156 10 368 -164 502 93 -365 355 -179 -113 186 -356 -112 283 -699 -34
3774 -34 32 -901 -63 -153 -387 199 -337 -39 37 -374 193 128 -281 403 -152 -536 293 -384 99 174 -755 -1
3796 -1 111 -209 482 -161 -339 499 82 382 444 -428 412 254 -143 637 61 -223 805 -131 -19 641 -515
3817 -515 86 355 -296 709 222 -124 813 2 134 614 -175 721 279 -573 484 -118 -304 607 -688
3836 -688 -197 299 -600 187 167 -746 258 -284 -179 778 -544 -105 -48 -751 435 136 -874 139 -487
3855 -487 -322 673 -1006 -221 107 -934 171 -168 -518 844 -170 -482 256 -600 347 885 -468 167
3873 167 -215 -390 757 -397 -667 474 -553 407 695 -612 220 3 -432 1003 -92 230 782 -231
3891 -231 561 603 -430 272 313 -236 792 -493 -176 781 -209 -338 -99 -413 755 565 -703 -58 -108
3910 -108 281 773 -364 -313 334 -411 319 96 -781 -128 -445 -338 459 -638 -298 194 -651 -132 -167 -562
3930 -562 386 311 -307 257 -369 -313 556 -269 -627 12 -340 260 345 -845 -119 -361 -54 800 -319 122
3950 122 181 -534 365 235 -488 259 85 176 843 -648 -53 304 -458 430 -137 -430 1081 229 -108 497
3970 497 -379 785 927 -405 13 68 -148 756 -356 -244 17 -241 148 408 -278 95 -370 -677 875
3989 875 -309 -142 199 -706 196 467 -810 48 -73 -385 149 -688 -278 402 -542 -288 -640 -688 777
4008 777 82 -785 279 -489 -156 167 -303 32 173 -285 344 194 -179 386 -809 -360 193 90 521
4027 521 4 -524 212 67 193 497 89 368 309 -80 450 471 12 227 123 193 593 187 166 -256 -161 204
4049 204 281 -67 180 143 132 132 336 181 154 -2 -191 75 267 125 -7 -238 -325 -339 -79 -123 -234 -107 -196
4072 -196 -329 -151 77 -139 5 -119 -69 -7 -144 -112 -254 -260 -147 141 36 -152 -166 -343 -307 103 -71 25 150
4095 150 20 271 38 107 -137 -90 -80 78 333 391 113 -2 -63 -171 278 204 179 85 271 91 169 27 247
4118 247 226 117 261 268 1 108 53 -62 -102 -106 110 -89 173 118 9 -79 -2 -8 40 62 -98 169 -74 -114 -125
4143 -125 -143 -455 -309 -146 241 77 -312 -313 -601 -189 -123 -53 -278 132 -239 -99 -127 -121 -205 39 -132 -127 60 -138
4167 -138 43 -161 -208 -198 -200 441 10 -202 80 33 36 303 40 168 249 193 157 -6 36 209 18 214 101 40
4191 40 58 -118 -386 123 16 270 292 200 323 116 -113 184 272 -66 134 -30 142 98 107 -167 -152 -358 -174
4214 -174 -35 43 83 -233 -229 40 -133 -103 -76 -17 -1 167 -214 -256 -139 -213 -298 -246 -278 379 -62 -419 -322 -434 19
4239 19 304 -138 101 -89 -50 456 -97 2 171 -36 235 361 -22 104 -56 -488 244 124 214 386 -63
4260 -63 274 614 -148 225 139 -141 499 130 -168 319 -184 107 163 -565 227 287 -218 346 -440 -283 716
4281 716 -186 231 131 -486 776 122 -322 235 -653 -295 340 -517 100 -56 -841 305 -233 -335 579
4300 579 -764 54 491 -406 205 -314 -596 542 -435 -258 137 -317 372 317 -1109 128 -37 -77 514
4319 514 -518 -347 721 -162 179 -140 -394 688 348 -21 503 -118 180 476 -481 566 343 -46 326
4338 326 -493 -12 411 128 351 240 -190 257 257 77 544 176 78 91 76 633 235 -376 -208 131 291 194
4360 194 -285 -326 72 276 58 -429 -364 -263 314 -119 -539 -141 304 -112 -196 -622 -206 524 -299 -405 -470
4381 -470 -375 390 -253 -466 -75 -291 452 208 -625 400 -37 -599 258 -217 318 360 -982 45 464 -265
4401 -265 551 -479 -46 1117 -387 20 197 -34 866 124 -492 804 366 291 728 -987 303 714
4419 714 -373 602 -381 -626 1103 -469 -126 485 -461 537 352 -589 911 -139 -692 386 -699 285
4437 285 593 -752 461 -175 -592 457 -653 -253 295 -683 -133 419 -481 513 2 -679 234 -504 -131
4456 -131 374 -683 127 -43 -507 468 -362 -581 289 -411 46 349 -585 283 121 -119 405 -86 272 645
4476 645 -530 239 207 -36 253 39 31 528 79 -52 261 -171 285 463 34 458 498 29 209 52 391
4497 391 449 -107 -69 -110 -64 99 -139 -80 186 -186 -35 72 8 11 -158 -202 -358 7 366 13 -48 -85 -34 194
4521 194 -257 -249 -8 -359 -82 -143 -120 -89 -334 -354 63 87 -95 -7 -53 191 -385 -151 127 -352 -19 199 -195
4544 -195 211 96 -216 137 -105 30 529 166 156 363 -145 105 258 83 602 70 310 261 -197 146 90
4565 90 129 162 -54 23 196 -277 33 449 -85 129 484 254 97 11 58 160 -386 72 212 -118 94 -42
4587 -42 -179 107 -230 -246 -90 -80 53 -59 -19 24 -73 49 -152 -196 -75 -48 -47 -22 -40 -320 54 -53 -235 -50
4611 -50 -351 -312 -227 -147 -182 29 -78 -15 102 96 135 -13 -29 71 118 -8 124 57 -42 176 1 280 43 171
4635 171 169 105 463 74 176 140 149 116 -68 418 76 254 245 317 49 79 -195 115 9 190 244 96 218 34
4659 34 -168 -70 101 152 16 -20 -117 -71 -11 177 -17 -348 -177 -1 -266 -112 -100 -264 -148 -261 80 47 6
4682 6 125 -67 -352 144 -305 256 -106 -380 287 -110 -68 6 -218 -188 96 23 162 189 -16 210 -41 -54 378
4705 378 54 76 -19 -55 424 117 -82 265 -97 186 200 -353 382 82 -265 398 163 134 602 -70 115 24
4727 24 -554 362 -70 -215 522 -90 -121 298 -587 -27 -161 -471 177 -224 8 374 -558 -251 113 -474 34
4748 34 -152 -396 -22 -254 60 131 -418 -59 304 -530 89 209 -110 163 -300 -153 449 -283 237 -215 -458
4769 -458 357 10 -90 9 -342 243 222 -226 144 39 -74 185 -47 128 79 -103 163 55 16 -69 120 166
4791 166 165 -79 -46 85 190 89 32 178 39 51 191 -149 339 59 -232 395 -276 -9 281 -131 76 369
4813 369 -461 -24 -192 27 330 -595 -112 125 -411 -151 -56 -424 160 41 -467 110 -507 38 8 -645 380
4834 380 -101 -459 491 -510 -352 481 -351 47 245 -428 469 -149 -278 640 -236 43 524 -454 550
4853 550 315 -588 622 -139 41 713 -377 389 588 -342 535 131 -441 781 -450 141 707 -626
4871 -626 460 115 -532 637 -269 -298 569 -479 12 420 -561 325 35 -558 630 -312 -290 458 -723
4890 -723 335 165 -597 366 -129 -410 291 -455 -161 233 -644 33 -152 -404 209 -180 -185 403 -178 140
4910 140 0 -500 478 43 -296 134 -46 -298 193 -447 384 205 -295 -5 107 17 55 -36 -97 280 -140
4931 -140 296 112 -57 245 195 300 163 -74 356 203 71 317 197 -27 265 15 33 -26 -18 180 19 210
4953 210 98 84 49 151 -243 209 5 180 54 -57 239 -301 -234 -52 -466 60 -182 -93 168 -295 -362 9
4975 9 -239 40 -194 -12 59 -353 -219 37 -79 105 -64 -346 81 16 -246 129 89 -30 197 -178 87 -30
4997 -30 16 205 -40 -26 224 -47 156 -54 -275 335 144 37 128 243 220 267 106 38 294 117 253 58
5019 58 -77 355 58 328 277 122 237 -93 -107 36 33 -152 239 -175 82 41 -298 243 -186 -176 225 -21
5041 -21 80 92 45 161 -142 -91 -51 -33 33 140 -139 -93 67 -519 -2 73 -175 195 -325 35 -17 -283 -158
5064 -158 112 -360 40 92 -68 -25 -163 105 -67 -20 34 131 -344 57 -62 -3 67 81 185 -41 215 265 177
5087 177 76 48 138 256 286 -126 207 -76 276 235 -184 53 79 -171 119 113 189 -95 71 -129 129 79 -62
5110 -62 -76 -40 -268 -316 -74 -140 -230 -163 101 -139 -161 -143 -318 -23 -27 78 -97 -232 251 -187 -237 -100 -34 -123 17
5135 17 -118 -4 -284 76 -8 -156 -60 -22 -24 139 -129 -29 221 98 93 234 43 167 148 -70 110 -40 -31 24
5159 24 -170 232 156 -111 243 203 11 219 193 -6 123 -102 242 17 136 247 66 -53 221 184 60 504
5181 504 -226 -65 -57 72 182 38 -2 203 -74 -128 56 -210 -102 -177 -22 130 -238 -193 -15 83 -71 -199
5203 -199 -164 -167 -75 -88 292 -260 -235 295 -4 -23 -125 363 45 66 -165 204 -127 -65 -77 34 -210 -46 320
5226 320 368 55 -164 -145 -86 -18 204 -100 191 234 -35 10 271 59 242 359 -86 191 -12 -78 238 209 135
5249 135 314 -155 254 105 -189 -91 -119 -170 178 -176 -230 108 -105 2 251 -169 7 -120 -316 152 -75
5270 -75 -386 262 -284 -159 193 -343 133 145 -199 75 -71 -187 107 -449 159 -15 -371 280 -56 -425 288
5291 288 -348 -157 328 -253 126 176 -535 -56 -300 -492 383 -461 287 380 -488 488 240 -161 560 -273 -64
5312 -64 786 -289 -6 409 -148 382 325 -410 630 -311 -35 593 -185 316 285 -382 429 5 -287 561
5332 561 -164 34 -7 -295 566 113 -504 424 -273 -121 336 -406 -147 71 -230 61 206 -383 208 -245
5352 -245 -99 200 -417 -88 129 -68 146 125 -382 219 16 0 74 -303 250 187 -212 204 -283 315 430
5373 430 -56 34 31 -99 329 49 -187 -9 45 -285 50 124 221 -31 25 25 46 159 -62 -30 161 140 57 29 -88
5398 -88 172 40 143 80 -86 148 51 -70 176 -73 55 157 -135 171 -77 138 195 9 16 215 -177 -160
5420 -160 -19 -221 176 -135 -38 256 -256 -259 -232 -458 -216 220 -200 -225 -104 116 244 -120 -36 -52 -303 339
5442 339 -195 -378 227 -338 -131 92 -191 -30 349 -391 93 209 12 346 -179 -44 308 -180 220 130
5462 130 -102 189 291 -179 154 -48 -153 155 -12 267 150 -114 246 211 -101 442 -395 67 89 34 228
5483 228 26 -1 178 31 -21 101 -143 4 41 -387 123 -197 -19 47 -172 -425 -156 -361 -43 170 153 -140
5505 -140 1 -125 -142 76 -10 -102 -200 118 3 -30 120 -249 6 156 -19 35 59 -36 -76 60 -112 105 74
5528 74 7 233 -211 126 -241 112 15 55 151 42 254 119 -453 99 93 -18 226 111 33 -1 -14 43 186 217
5552 217 126 139 1 297 -218 -87 277 115 -172 -74 -53 -86 -42 213 -149 230 -75 -148 -132 128 262 93 92
5575 92 -481 -80 13 -108 -39 -148 -163 -69 -112 -141 -239 30 -96 -215 -175 -10 -172 27 -51 -412 127 7 -157
5598 -157 -106 162 -45 -81 -194 50 223 -333 284 200 -73 280 228 5 181 -4 252 245 27 -233 361 -132
5620 -132 202 -97 -192 -3 120 -36 213 28 -92 163 57 51 205 292 6 -238 142 85 14 186 -115 -199
5642 -199 -91 -157 -199 52 -56 -89 -297 -55 87 -169 -129 111 -89 -4 73 -30 -120 -324 -61 -104 -116 -32 204
5665 204 24 -129 -212 15 4 -38 -188 69 -246 88 260 -101 10 26 -64 39 420 56 170 60 198 53
5687 53 158 -186 262 8 -200 577 -89 303 314 -415 172 231 -14 -47 -139 -120 -13 0 -6 111 -123 -41 -44 -192
5711 -192 183 40 -69 -5 -345 68 390 -179 120 -265 -285 65 0 42 -564 -598 183 123 -354 31 -123 -275
5733 -275 320 -48 -107 94 -338 -24 -35 -77 91 -278 -106 45 -252 7 345 -377 48 64 -297 111 222
5754 222 -114 276 -243 -49 333 -2 224 151 -160 285 35 -33 -112 -186 225 145 -212 -51 211 97 426 82
5776 82 -245 252 14 208 37 -201 74 -65 -171 158 -81 -85 -28 -13 37 99 -252 -30 -216 -3 52 -168 -345
5799 -345 -99 -141 -89 -265 -262 165 -26 -298 -236 -216 -67 212 -253 -226 -254 -227 -68 -88 -406 109 29 -70 103 53
5823 53 153 57 -97 32 -62 72 207 142 5 36 -225 49 275 -62 -112 158 -80 128 367 23 295 -49
5845 -49 -171 339 232 151 -122 -144 54 261 -145 124 254 92 321 -150 -60 230 -113 89 -27 -351 265
5866 265 -195 -206 73 -514 -147 168 -328 139 -158 -517 134 -52 -31 -31 -360 -90 93 -239 140 20 -41 148
5888 148 -154 -231 -95 -219 -206 198 -232 -18 41 46 257 -123 -112 65 -150 162 193 -350 276 164 15 -30 188
5911 188 191 243 212 57 -29 -59 219 106 56 90 -29 -62 -42 -109 109 -156 -110 33 -31 191 139 -89 -74 96 -197
5936 -197 53 -93 -217 -268 -117 -144 -208 -7 20 -284 -195 64 58 -20 38 -42 -156 50 80 -161 -81 -192 -48 43
5960 43 -54 41 -140 -275 -91 -210 115 -34 -219 11 -116 -198 -131 -125 16 188 137 -119 98 -91 -9 94 129
5983 129 163 168 140 -100 -58 -13 240 -30 268 50 -27 -105 25 134 107 53 -10 44 166 195 240 -148 73 135 -145
6008 -145 49 -14 -83 219 -70 -222 -54 0 -201 102 193 20 -75 33 -158 -256 119 -273 -175 -213 -49 39 87
6031 87 -338 -123 -39 -66 -59 58 65 29 16 -54 -286 55 137 -1 -55 -150 31 -108 -30 34 401 -65 -46 34 147 60
6057 60 23 18 -105 237 -29 193 200 238 130 -61 15 52 245 127 144 194 43 87 338 39 -27 168 88 47 -9
6082 -9 -167 41 -77 -19 -50 -61 -30 -159 -25 -86 -213 50 5 -210 -130 -98 -215 185 -8 -148 128 -141 -47 24
6106 24 -76 180 -168 -237 276 188 87 -76 -382 -158 -152 -276 76 -142 -116 87 -70 82 173 -343 -1 -68 -185
6129 -185 246 -46 -194 14 134 29 66 141 76 150 366 -261 -9 19 103 187 106 214 35 49 43 -167 197 -57
6153 -57 187 184 96 -221 239 -116 67 76 -140 -163 70 -79 7 -35 -250 -176 -17 67 -247 -27 -44 -157 119 -11
6177 -11 -220 77 13 -362 -285 -24 42 18 101 -59 215 -169 -185 306 66 -150 -13 187 122 78 -58 270 193
6200 193 177 -122 -166 133 26 -227 23 -78 -65 299 -25 245 129 123 -67 212 10 229 189 6 297 -81
6222 -81 241 76 147 79 257 51 41 68 225 138 36 -126 223 92 75 44 -107 142 -88 -46 267 -10 -156
6245 -156 201 -378 73 -172 -158 -177 57 -56 53 -208 -79 -55 -171 -188 -233 -134 29 -106 -164 -41 -284 209
6267 209 78 -208 185 -75 108 142 -267 -1 -129 73 175 51 -166 -12 215 121 231 -166 63 96 -18
6288 -18 147 -179 -37 6 -22 65 33 -36 -14 161 83 -168 -183 82 266 209 -34 -13 -147 -162 226 1 -180 162
6312 162 -66 -37 101 -228 -58 123 69 187 35 -317 225 177 65 -53 57 53 161 -58 -82 -218 -359 -100
6334 -100 265 -183 -74 -162 43 43 -277 134 81 -2 74 42 -74 162 27 94 298 -310 -10 -64 96 -59 53
6357 53 -142 292 275 122 56 -202 -11 4 -51 309 87 393 29 21 -92 401 -114 -73 -162 -144 132 139 32 359
6381 359 42 -27 -14 1 114 -45 -216 56 96 -92 4 -199 -5 -63 16 168 -17 -41 -155 -401 37 4 -136
6404 -136 204 94 -151 -96 40 -149 -205 21 -152 -102 -200 2 95 -224 93 -217 -55 171 -48 -251 -111 80
6426 80 216 177 -59 -53 193 -53 179 -40 -184 194 -104 -101 163 32 137 -86 108 76 -120 64 41 120 21
6449 21 -42 -129 -164 104 125 71 60 15 -110 242 -113 30 -105 115 -44 -100 93 -8 -26 23 -32 -85 4 -323 -3
6474 -3 -9 139 -17 141 29 69 -127 -123 -105 -120 -137 -23 121 39 -76 -95 -30 -333 -189 -71 161 212 -104 -13 49
6499 49 -30 181 -172 181 -16 -174 -75 57 -38 15 -104 72 85 63 -83 120 171 -13 121 -7 173 -10 108
6522 108 209 240 124 5 51 30 53 276 -16 -164 -133 51 113 -89 -188 71 -13 62 159 -79 66 -122 4
6545 4 -3 -288 67 -77 8 -438 53 31 17 11 -83 3 -116 82 126 -41 -206 136 -241 -5 -103 -66 -167 81 48
6570 48 19 -114 -122 119 -10 109 127 213 107 74 -110 81 -15 -79 209 199 142 219 -60 -99 80 12 241 69 -3
6595 -3 234 -33 -55 176 223 5 -87 1 180 -98 21 -76 -126 61 -33 31 -100 132 1 -112 -31 -171 145 100
6619 100 -84 -258 42 -132 -173 -85 72 -141 -109 -31 -28 114 -94 9 -233 27 -29 -31 -17 -222 -195 -34 -156 242
6643 242 -129 -30 -229 -81 -100 -68 -7 -246 -41 28 326 19 251 210 57 -49 -14 -175 -42 -79 -20 169 140
6666 140 -61 181 92 76 249 -13 56 211 44 137 -203 107 19 -31 125 163 334 -212 55 12 166 -344 78
6689 78 -187 -229 130 203 43 117 -67 95 93 38 -170 -306 -149 391 5 -41 233 -296 158 108 -33 29 -103
6712 -103 172 67 13 76 66 -302 122 63 -119 136 -13 61 281 -148 -100 77 72 160 145 -352 6 140 177 276
6736 276 75 -25 107 114 57 234 -77 118 99 104 82 71 -162 240 -57 91 -232 30 145 43 13 -35 -81 -39
6760 -39 -34 -425 -33 -253 -91 63 -236 0 172 53 42 -101 -34 -196 111 7 -38 -234 -18 9 -215 -16
6782 -16 -58 -150 -73 96 66 -215 -203 38 -34 -162 -376 -183 -152 65 -160 -123 104 -122 79 16 56 -221 255 -45
6806 -45 6 340 -209 74 -85 -9 74 60 -58 73 15 -128 64 -139 270 43 54 -129 -325 141 126 -181 225
6829 225 54 -39 25 -266 -233 -63 -58 132 -192 -230 -10 163 21 -28 44 -47 -71 -153 -33 66 -160 -199 -169 -148 -27
6854 -27 -38 -24 152 -80 31 -55 23 -76 -21 -85 -201 -182 15 193 -114 -61 -34 -119 11 30 84 89 202 -35 104
6879 104 -4 119 136 70 -39 -69 261 198 39 -76 269 -42 198 89 60 167 363 242 -41 -273 -37 28
6901 28 83 154 23 144 62 -206 178 -41 54 249 11 -265 149 -26 140 191 -181 -73 -255 -25 111 -47
6923 -47 -107 -30 -148 -336 197 -104 150 128 3 -22 -53 -244 -68 17 29 -5 -182 -12 8 -51 -189 -51 108 -32
6947 -32 -284 -70 21 477 -164 -171 179 -102 175 -131 198 -98 175 75 -44 -36 -177 273 -55 -148 85 234
6969 234 162 227 140 77 384 18 90 11 62 82 6 209 -73 42 -24 -15 -19 -13 224 -112 -82 -182 35 100 -1 108
6995 108 -64 -14 119 -285 -45 155 50 44 -2 126 -107 70 114 115 104 228 -78 26 143 -44 -76 13 -125
7018 -125 -212 -220 -42 -31 -17 -120 -32 99 76 24 -230 57 -39 178 81 109 133 163 -121 169 53 201 36 -35 108
7043 108 79 61 36 368 7 -100 92 182 -50 148 4 123 171 -185 -90 -41 70 203 37 58 113 -207 61
7066 61 -125 61 -110 -210 101 -152 -13 -192 -209 -47 -37 245 19 124 -131 0 -108 -22 -126 22 182
7087 182 -97 77 -8 212 220 -177 20 24 289 105 186 99 116 105 -109 -59 26 310 63 7 -32 85 136 103 21
7112 21 156 65 -74 207 166 -73 164 243 75 -28 87 220 221 110 102 142 -42 22 -49 -104 -106 65 82 -48 -45 -126
7138 -126 -137 192 -216 93 -31 14 -226 -57 11 -190 -192 -53 60 -80 -214 -229 -58 359 19 72 77 -141 108
7161 108 -48 -151 -116 163 -82 -50 41 30 159 208 12 169 167 -2 -33 110 94 147 189 -85 -87 68 103 116 271
7186 271 -111 177 -9 153 -218 44 -21 29 109 -1 115 -115 2 -221 229 28 -98 387 -246 -36 61
7207 61 -224 84 15 54 110 -218 -111 -62 1 -57 34 -85 51 199 -129 -34 -18 -74 -114 -83 155 -275 -130 -70 -195
7232 -195 -38 141 -66 48 146 -49 -102 -37 30 51 4 17 -1 -318 -45 83 12 74 -36 -27 88 -64 -164 -27
7256 -27 3 78 88 30 59 249 117 55 -84 -73 56 101 -66 211 21 70 327 -164 62 75 76 -33 38 103 185
7281 185 -70 182 64 -139 -50 69 131 77 -72 -13 -318 47 113 -332 207 21 258 365 43 -32 142 -87
7303 -87 -44 -160 31 -52 73 -173 -133 -125 -44 15 161 -80 137 -56 -156 -26 -77 6 135 -57 38 37 -55 19 19 -4
7329 -4 -24 -80 7 10 -3 157 234 -130 25 2 89 -92 39 8 116 196 -73 255 201 93 -133 163 1 -45 3
7354 3 299 -144 62 28 -54 69 -172 209 -53 19 54 -64 189 -39 25 -107 -213 -2 90 -31 -92 -76 -40 -30
7378 -30 143 35 -163 32 52 122 -74 58 -205 -113 49 -11 -42 169 -136 -171 -16 -192 107 -138 -239 6
7400 6 102 139 -119 332 -88 37 101 99 -9 -57 -224 -151 124 -203 177 86 210 52 -129 128 -93 72 220
7423 220 -94 127 326 292 79 78 -203 40 1 -74 -60 43 173 11 -62 208 192 -18 -278 -2 122 -376 -179
7446 -179 -3 -182 -116 -153 109 42 -112 94 67 -195 -106 13 -61 -184 -66 17 232 -69 -261 128 79 294 47
7469 47 -213 199 -229 160 -1 415 -36 136 220 75 -30 -65 102 0 191 -12 47 144 7 78 161 209 380
7492 380 55 148 149 194 25 153 -271 71 -30 -85 -24 38 49 13 59 -26 -174 -124 75 -142 63 57 19 123 76
7517 76 -128 -273 178 -37 154 9 -191 -285 -120 126 -259 227 -57 -215 107 -84 45 43 -216 -160 -132 46
7539 46 85 73 5 -83 76 21 -95 31 154 39 -140 -166 -1 143 -84 146 -106 129 38 327 122 -91 -127
7562 -127 243 -145 -87 124 83 -28 -29 90 69 102 -21 261 194 -67 21 -13 -159 98 74 180 -94 -20 164 224
7586 224 246 101 -195 -96 145 115 -366 55 -51 1 -26 -293 -90 -19 34 -216 -28 82 111 97 -102 14 53
7609 53 -34 233 42 -206 -580 76 -42 -43 78 61 109 -105 23 138 -16 25 -76 -99 -32 -91 11 -142 -11
7632 -11 97 58 8 190 278 -54 4 -85 233 84 96 78 -25 -228 17 180 58 133 -51 25 34 -76 -3 -327
7656 -327 109 -103 -127 13 -19 -52 -147 74 91 -68 48 -14 -35 36 243 -72 -207 -58 9 -113 324 96 167
7679 167 -90 -10 145 -76 66 -122 -228 -62 54 30 -56 47 22 -40 182 103 285 2 5 7 -200 144 -96
7702 -96 97 -201 49 -9 -122 -111 92 80 207 105 -91 29 -53 89 -29 26 -43 136 -135 241 -10 65 212
7725 212 18 114 95 122 -256 -22 -54 -142 32 -18 124 -23 63 -59 -33 -81 -2 -44 -274 -89 37 -273 -74 -204
7749 -204 -79 -78 -60 -27 -154 42 -196 -114 175 47 -149 100 -110 -43 -3 143 -135 -40 -6 70 160 -149 -255 -104
7773 -104 124 222 -118 347 135 129 50 94 -105 87 83 -40 133 47 32 -30 -78 -145 24 -152 121 72 107 -50 178
7798 178 -31 -134 21 -162 -69 37 -93 -105 105 174 -112 43 -15 -129 54 1 -68 -32 13 -186 -105 -75 -43 -89
7822 -89 -85 -64 -55 -250 -193 126 102 -242 -59 -71 -279 31 1 1 -109 162 -57 -180 26 -108 -168 21 -276 -102
7846 -102 -274 229 -21 123 -158 83 38 -21 214 156 -132 -269 52 6 172 -132 252 -58 157 44 141 128
7868 128 56 133 -158 2 -78 152 -189 -69 -38 58 -33 -80 133 157 -70 112 -122 -180 190 180 -87 -48 121 -9
7892 -9 -221 -22 -47 -85 89 67 -239 39 -60 -48 -24 -176 -34 178 -211 83 -185 356 -45 -184 -148 -253 18
7915 18 -174 -72 138 -155 -263 -95 84 14 -80 67 95 97 -272 -15 176 88 -11 -6 -62 67 24 -126 51 81
7939 81 -114 327 52 186 -107 3 128 -230 -56 10 175 52 65 -84 49 238 48 172 -69 -54 120
7960 120 232 -202 -34 182 34 159 26 -142 -21 -136 100 -156 -42 13 -284 167 -137 -146 -169 114 -3
7981 -3 -154 -296 140 -165 -96 31 15 237 -155 88 -109 207 34 91 -27 -134 -105 -77 -61 10 359 -20 94
8004 94 206 -65 -204 71 -85 219 284 97 -100 8 -70 35 121 -33 -73 153 294 -168 -135 215 12 -84
8026 -84 36 -270 -93 -146 25 -12 -203 -5 -5 151 -25 -112 4 -163 -158 63 -65 -114 110 -175 -180 -8 72 3
8050 3 147 227 146 -241 38 -129 34 -35 149 103 23 -50 15 -328 -64 40 28 42 -173 228 90 -20 144 57
8074 57 176 164 -30 26 -153 -185 -60 125 216 -152 27 23 42 113 -341 31 324 128 141 57 129 -57 -51 -53 7 -129
8100 -129 -12 -20 -152 -16 314 115 -124 95 14 -272 147 -104 51 -156 109 268 132 20 -49 52 -108
8121 -108 -40 -278 119 87 -147 -251 -112 -12 170 202 48 -15 -192 58 315 -1 132 -28 -264 -227 189 39
8143 39 -171 -127 -272 76 93 152 17 -188 -99 -160 -106 -34 -70 -5 19 95 107 296 79 22 -186 37 199 25 174
8168 174 51 111 102 -57 142 -221 -160 122 -14 60 -241 -20 72 -22 60 -64 186 155 -30 -153 42 298 -32
8191c2
##END NTUPLES=NMR FID
##END=
