##TITLE=1H_LR-722-R2-C1
 CDCl3, 8 sc, 
 24.9.2020
##JCAMPDX= 6.0         $$ Bruker NMR JCAMP-DX V2.0
##DATA TYPE= NMR FID
##DATA CLASS= NTUPLES
##ORIGIN= UXNMR, Bruker Analytische Messtechnik GmbH
##OWNER= root
$$ XWIN-NMR		Version 3.5
$$ Thu Sep 24 12:29:50 2020 Russian Standard Time (UT+4h)  she@DPX200
##.OBSERVE FREQUENCY= 200.1315066352
##.OBSERVE NUCLEUS= ^1H
##.DELAY= (6, 6)
##.ACQUISITION MODE= SIMULTANEOUS
##.ACQUISITION SCHEME= undefined
##.AVERAGES= 8
##.DIGITISER RES= 18
##SPECTROMETER/DATA SYSTEM= spect
##.PULSE SEQUENCE= zg30
##.SOLVENT NAME= CDCl3
##.SHIFT REFERENCE= (INTERNAL, CDCl3, 0, 15.7039)
##AUDIT TRAIL= $$ (NUMBER, WHEN, WHO, WHERE, WHAT)
$$ ##TITLE= Audit trail, XWIN-NMR		Version 3.5
$$ ##JCAMPDX= 5.01
$$ ##ORIGIN= Bruker BioSpin GmbH
$$ ##OWNER= she
$$ F:/spectra/data/she/nmr/H-F/1/audita.txt
$$ ##AUDIT TRAIL=  $$ (NUMBER, WHEN, WHO, WHERE, WHAT)
(   1,<2020-09-24 12:28:46.93 +0400>,<she>,<DPX200>,
      <created by zg, POWCHK disabled, PULCHK disabled
       configuration hash MD5:
       00 E9 B6 7A A2 85 ED C7 34 08 36 98 17 FE 4E 26
       data hash MD5: 16K
       7B F7 85 82 ED A4 AB 23 4C 68 D7 D4 EC EE CF F7>)
$$ ##END=
$$ 
$$ hash MD5
$$ 0E F8 36 AA C3 2E 3F 7A C4 C7 D6 F8 84 6A 24 15
##$RELAX= 
##$RELAX= 
##$RELAX= 
##$RELAX= 
##$RELAX= 
##$RELAX= 
$$ Bruker specific parameters
$$ --------------------------
##$DU= <F:/spectra>
##$EXPNO= 1
##$NAME= <H-F>
##$PROCNO= 1
##$TYPE= <nmr>
##$USER= <she>
##$AMP= (0..31)
100 100 100 100 100 100 100 100 100 100 100 100 100 100 100 100 100 100 
100 100 100 100 100 100 100 100 100 100 100 100 100 100 
##$AQSEQ= 0
##$AQ_mod= 1
##$AUNM= <au_zg>
##$AUTOPOS= <>
##$BF1= 200.13
##$BF2= 200.13
##$BF3= 200.13
##$BF4= 200.13
##$BF5= 200.13
##$BF6= 200.13
##$BF7= 200.13
##$BF8= 200.13
##$BYTORDA= 1
##$CFDGTYP= 0
##$CFRGTYP= 5
##$CHEMSTR= <none>
##$CNST= (0..31)
1 1 145 1 1 1 1 1 1 1 1 1 1 1 1 1 1 1 1 1 1 1 1 1 1 1 1 1 1 1 1 1 
##$CPDPRG= <>
##$CPDPRG1= <>
##$CPDPRG2= <>
##$CPDPRG3= <>
##$CPDPRG4= <mlev>
##$CPDPRG5= <mlev>
##$CPDPRG6= <mlev>
##$CPDPRG7= <mlev>
##$CPDPRG8= <mlev>
##$CPDPRGB= <>
##$CPDPRGT= <>
##$D= (0..31)
0 1.2 0 0 0 0 0 0 0 0.06 0 0.03 0 0 0 0 0.0002 0 0 0 0 0 0 0 0 0 0 0 0 
0 0 0 
##$DATE= 1600936126
##$DBL= (0..7)
120 120 120 120 120 120 120 120 
##$DBP= (0..7)
150 150 150 150 150 150 150 150 
##$DBP07= 0
##$DBPNAM0= <>
##$DBPNAM1= <>
##$DBPNAM2= <>
##$DBPNAM3= <>
##$DBPNAM4= <>
##$DBPNAM5= <>
##$DBPNAM6= <>
##$DBPNAM7= <>
##$DBPOAL= (0..7)
0.5 0.5 0.5 0.5 0.5 0.5 0.5 0.5 
##$DBPOFFS= (0..7)
0 0 0 0 0 0 0 0 
##$DE= 6
##$DECBNUC= <off>
##$DECIM= 32
##$DECNUC= <off>
##$DECSTAT= 4
##$DIGMOD= 1
##$DIGTYP= 9
##$DL= (0..7)
0 120 120 120 120 120 120 120 
##$DP= (0..7)
150 150 150 150 150 150 150 150 
##$DP07= 0
##$DPNAME0= <>
##$DPNAME1= <>
##$DPNAME2= <>
##$DPNAME3= <>
##$DPNAME4= <>
##$DPNAME5= <>
##$DPNAME6= <>
##$DPNAME7= <>
##$DPOAL= (0..7)
0.5 0.5 0.5 0.5 0.5 0.5 0.5 0.5 
##$DPOFFS= (0..7)
0 0 0 0 0 0 0 0 
##$DQDMODE= 0
##$DR= 18
##$DS= 0
##$DSLIST= <SSSSSSSSSSSSSSS>
$$ [...]
##$SUBNAM2= <"">
##$SUBNAM3= <"">
##$SUBNAM4= <"">
##$SUBNAM5= <"">
##$SUBNAM6= <"">
##$SUBNAM7= <"">
##$SUBNAM8= <"">
##$SUBNAM9= <"">
##$SW= 16.880792210976
##$SWIBOX= (0..15)
0 0 2 0 0 0 0 0 0 0 0 0 0 0 0 0 
##$SW_h= 3378.37837837838
##$TD= 16384
##$TD0= 1
##$TE= 0
##$TE2= 300
##$TE3= 300
##$TEG= 300
##$TL= (0..7)
0 120 120 120 120 120 120 120 
##$TP= (0..7)
150 150 150 150 150 150 150 150 
##$TP07= 0
##$TPNAME0= <>
##$TPNAME1= <>
##$TPNAME2= <>
##$TPNAME3= <>
##$TPNAME4= <>
##$TPNAME5= <>
##$TPNAME6= <>
##$TPNAME7= <>
##$TPOAL= (0..7)
0.5 0.5 0.5 0.5 0.5 0.5 0.5 0.5 
##$TPOFFS= (0..7)
0 0 0 0 0 0 0 0 
##$TUNHIN= 0
##$TUNHOUT= 0
##$TUNXOUT= 0
##$USERA1= <user>
##$USERA2= <user>
##$USERA3= <user>
##$USERA4= <user>
##$USERA5= <user>
##$V9= 5
##$VALIST= <valist>
##$VCLIST= <CCCCCCCCCCCCCCC>
##$VD= 0
##$VDLIST= <DDDDDDDDDDDDDDD>
##$VPLIST= <PPPPPPPPPPPPPPP>
##$VTLIST= <TTTTTTTTTTTTTTT>
##$WBST= 1024
##$WBSW= 4
##$XGAIN= (0..3)
0 0 0 0 
##$XL= 0
##$YL= 0
##$YMAX_a= 621016
##$YMIN_a= -658205
##$ZGOPTNS= <>
##$ZL1= 120
##$ZL2= 120
##$ZL3= 120
##$ZL4= 120
##$ABSF1= 10
##$ABSF2= 0
##$ABSG= 5
##$ABSL= 3
##$ALPHA= 0
##$AQORDER= 0
##$ASSFAC= 0
##$ASSFACI= 0
##$ASSFACX= 0
##$ASSWID= 0
##$AUNMP= <proc_1d>
##$AZFE= 0.1
##$AZFW= 0.1
##$BCFW= 1
##$BC_mod= 2
##$BYTORDP= 1
##$COROFFS= 0
##$CY= 11.3945322036743
##$DATMOD= 1
##$DC= 2
##$DFILT= <>
##$DTYPP= 0
##$F1P= 16.9975609425685
##$F2P= -3.02152046262296
##$FCOR= 0.5
##$FTSIZE= 0
##$FT_mod= 4
##$GAMMA= 1
##$GB= 0.15
##$INTBC= 1
##$INTSCL= 1
##$ISEN= 128
##$LB= 0.24
##$LEV0= 0
##$LPBIN= 0
##$MAXI= 10000
##$MC2= 0
##$MEAN= 0
##$ME_mod= 0
##$MI= 1.114404
##$NCOEF= 0
##$NC_proc= 0
##$NLEV= 6
##$NOISF1= 3.799351
##$NOISF2= 2.8
##$NSP= 1
##$NTH_PI= 0
##$NZP= 0
##$OFFSET= 15.70392
##$PC= 1
##$PHC0= -9968.711
##$PHC1= 9.600898
##$PH_mod= 1
##$PKNL= yes
##$PPARMOD= 0
##$PSCAL= 0
##$PSIGN= 0
##$REVERSE= no
##$SF= 200.130013532006
##$SI= 16384
##$SIGF1= 3
##$SIGF2= 2
##$SINO= 400
##$SIOLD= 16384
##$SREGLST= <1H.CDCl3>
##$SSB= 0
##$STSI= 0
##$STSR= 0
##$SW_p= 3612.71676300578
##$SYMM= 0
##$S_DEV= 0
##$TDeff= 0
##$TDoff= 0
##$TI= <>
##$TILT= no
##$TM1= 0
##$TM2= 0
##$TOPLEV= 0
##$USERP1= <user>
##$USERP2= <user>
##$USERP3= <user>
##$USERP4= <user>
##$USERP5= <user>
##$WDW= 1
##$XDIM= 8192
##$YMAX_p= 0
##$YMIN_p= 0
$$ End of Bruker specific parameters
$$ ---------------------------------
##NTUPLES= NMR FID
##VAR_NAME=  TIME,          FID/REAL,        FID/IMAG
##SYMBOL=    X,             R,               I
##VAR_TYPE=  INDEPENDENT,   DEPENDENT,       DEPENDENT
##VAR_FORM=  AFFN,          ASDF,            ASDF
##VAR_DIM=   8192,          8192,            8192
##UNITS=     SECONDS,       ARBITRARY UNITS, ARBITRARY UNITS
##FACTOR=    0.000296,      1,               1
##FIRST=     0,             0,               0
##LAST=      2.424536,      0,               0
##MIN=       0,             -658205,         0
##MAX=       2.424536,      621016,          0
$$ Real data points
##PAGE= N=1
##DATA TABLE= (X++(R..R)), XYDATA
$$ [...]
$$ plain form
2217 -909 -1389 -1034 -1094 -1457 -668 -1083 -1055 -281 -958 -536 -349 -727 -225 41 -610 130 268 -437 391 25 -127
2238 -127 783 225 210 1351 241 547 1097 256 1012 1156 469 1486 914 577 1521 784 1130 1328 730
2257 730 1209 1113 304 1107 797 196 981 -74 250 1082 -119 447 191 -503 525 -214 -516 93 -537
2276 -537 -558 -155 -1064 -506 -817 -1056 -575 -1072 -1073 -674 -1356 -946 -1081 -1369 -595 -1038 -883 -1011 -1120 -484 -492 -1040
2298 -1040 -522 -1042 -680 -482 -678 -451 -762 -347 -20 -319 101 270 78 313 328 -28 534 762 630 939
2318 939 442 1045 819 654 897 603 590 1120 1255 949 783 1076 1274 699 699 644 892 1107 591 903 463
2339 463 -121 943 132 269 665 -49 872 336 -755 -31 -854 -431 727 -1252 -845 -341 -1463 80
2357 80 -997 -1755 72 -1289 -406 -170 -2487 -376 -350 -1486 -47 -1976 -1406 689 -1743 -604 -1000
$$ packed form
2217i09m80L55o0l63P89m15K8P74o77M22J87l78N02K66o51P40J38p05Q28l66j52
2238a27R10n58j5J141j110L06N50q41P56J44o87J017n72l37R44p37L46J98n98
2257G30M79r6q09Q03l10o01P85j055L24Q32j201N66k56o94J028p39l02O09o30
2276e37k1M03r09N58l11k39M81m97jL99o82M10j35k88P74m43J55j28j09O36qn48
2298a040N18n20L62J98j96K27l11M15L27k99M20J69j92K35J5l56N62K28j32L09
2318I39m97O03k26j65K43k94j3N30J35l06j66K93J98n75%n5K48K15n16L12m40
2339D63n84J064q11J37L96p14R21n36j091P24q23M23J158j979M07N04j122J543
2357H0j077p58J827j361Q83K36k317K111K6j136J439j929N70K095k432J139l96
$$ plain form
2374 -1000 -1844 838 -690 -1209 320 -1232 515 753 -1330 732 -204 -206 1622 -942 167 1151 -441
2391 -441 1961 462 -402 1598 322 1252 1387 -839 1464 1358 658 1617 -477 778 2326 338 995
2408 995 419 57 2652 511 42 1059 -139 1579 475 -1165 704 -51 254 659 -1265 -298 77
2425 77 -962 339 -812 -1091 -81 -858 -20 -387 -2153 -725 -565 -647 -767 -1971 -690 29 -743 -999
2443 -999 -1903 -531 141 -792 -825 -1302 -55 597 -1063 -646 -648 -298 758 -977 -415 871 -499 606
2461 606 236 -569 1442 -246 354 1901 -610 1349 691 -505 2795 78 -188 2106 -26 1795
2477 1795 1517 -1469 1825 1188 -93 1716 -831 817 2234 -1192 959 470 -487 2052 -722 -316
2493 -316 1691 -848 471 326 -1281 1323 -861 -1117 449 -1030 -372 -583 -1841 396 -497 -1191 -362
$$ packed form
2374a000q44K682j528n19J529j552J747K38k083K062r36kJ828k564J109R84j592
2391d41K402j499q64K000j276R30J35k226K303j06p00R59k094J255J548j988O57
2408I95n76l62K595k141m69J017j198J718j104j640J869p55L05M05j924R67L75
2425G7j039J301j151k79J010p77Q38l67j766J428J60q2j20j204J281P19p72k56
2443i99r04J372O72r33l3m77J247O52j660M17kL50J056j735N62J286j370J105
2461F06l70q05K011j688O00J547k511J959o58j196L300k717k66K294k132J821
2477A795k78k986L294o37j281J809k547J648J417l426K151m89r57K539k774M06
2493c16K007k539J319j45j607K604k184k56J566j479O58k11j258K237q93o94Q29
$$ plain form
2510 -362 -1254 -53 -321 -1899 -527 -590 -812 -431 -2105 70 1 -1081 -248 -1070 -273 407 -1601 53
2528 53 -124 -789 749 -1088 -168 1140 -1059 534 387 -226 1721 -393 -335 1921 187 1036 1019 -599
2546 -599 2132 990 -217 1598 326 1009 1457 -559 1200 1036 -88 1423 367 284 1589 -130
2562 -130 805 790 -221 678 223 -87 580 48 -219 58 -316 78 -587 -1091 -212 -178 -434 -709 -920 -413
2582 -413 -364 -805 -858 -856 -510 -725 -1116 -1007 -928 -428 -848 -965 -607 -813 -598 -264 -882 -250 -444 -914 35 -329
2604 -329 -405 45 -450 497 314 -63 411 360 502 663 69 444 829 513 558 468 641 623 340 940 717 711
2626 711 960 651 898 723 503 925 609 480 923 252 274 681 -121 429 226 -269 386 119 -137 246
2646 246 -370 -67 17 -508 -276 -322 -839 -334 -759 -619 -501 -710 -679 -830 -1093 -774 -721 -1111 -557 -673 -803
$$ packed form
2510c62q92J201k68j578J372o3k22L81j674K175o9j082Q33q22P97O80k008J654
2528E3j77o65J538j837R20J308k199J593j47o13J947k114N8K256j734Q49j7j618
2546e99K731j142j207J815j272O83M48k016J759j64j124J511j056q3J305j719
2562a30R35j5j011Q99m55l10O67n32k67K77l74L94o65n04Q79L4k56k75k11N07
2582d13M9m41n3KL46k15l91J09P9N00m20j17L58k06K15L34o18O32j94m70R49l64
2604c29p6M50m95R47j83l77M74n1J42J61n94L75L85l16M5r0J73j8k83O00k23o
2626G11K49l09K47j75k20M22l16j29M43o71K2M07q02N50k03m95O55k67k56L83
2646B46o16L03Q4n25K32m6n17N05m25J40J18k09L1j51k63L19N3l90N54j16j30
$$ plain form
2667 -803 -548 -958 -721 -576 -774 -453 -317 -281 -468 -289 -100 -83 145 -301 32 -54 -199 -70 230 56 180
2688 180 144 282 838 429 801 833 408 644 671 428 1025 866 647 1178 474 638 626 231 470 711 377
2709 377 832 504 307 727 339 454 738 142 -24 184 -314 -43 -33 -432 3 -361 -531 -193 -611 -571 -112
2730 -112 -499 -827 -505 -771 -704 -543 -1102 -652 -741 -1034 -599 -673 -809 -424 -669 -627 -37 -763 -465 -72 -507
2751 -507 -169 -241 -602 276 -26 -127 391 -149 108 447 -135 639 682 -140 974 550 28 1133 288 384
2771 384 832 108 868 1000 266 1158 719 327 1397 314 543 1066 3 802 415 -36 829 576 109
2790 109 849 -305 81 453 -208 189 -142 -605 253 -175 -462 -118 -773 -238 -192 -1115 -661 -896 -1070 41
2810 41 -965 -880 -362 -1079 -512 -548 -1178 -483 -564 -851 -255 -1044 -800 133 -606 82 -349 -958 240 -2 -34
$$ packed form
2667h03K55m10K37J45j98L21J36L6j87J79J89J7K28m46L33q6j45J29L00j74J24
2688A80l6J38N56m09L72L2m25K36K7k43N97j59k19N31p04J64j2l95K39K41l34
2709C77M55l28j97M20l88J15K84n96j66K08m98K71J0l99M35l64j70L38m18M0M59
2730a12l87l28L22k66O7J61n59M50q9k93M35p4j36L85k45M2N90p26K98L93m35
2751e07L38p2l61Q78l02j01N18n40K57L39n82P74M3q22J114m24n22J105q45R6
2771C84M48p24P60J32p34Q92m39l92J070j083K29N23j063P99l87m51Q65k53m67
2790A09P40j154L86L72o61L97l31m63Q58m28k87L44o55N35M6r23M54k35j74J111
2810D1j006Q5N18p17N67l6o30O95q1k87N96p89K44R33p39O88m31o09J198k42l2
$$ plain form
2831 -34 320 -508 111 655 -384 382 205 -88 1042 355 -184 884 150 918 1368 -18 831 773 8
2850 8 1655 470 111 1438 -218 600 934 -480 1001 1022 -43 1230 -163 -94 1216 -469 512 306
2868 306 -1123 1050 -250 -732 635 -1316 -285 976 -1425 55 -450 -1511 712 -857 -1084 134
2884 134 -1540 -380 64 -1992 87 -867 -1568 682 -1345 -1064 368 -1603 213 80 -1626 788
2900 788 -279 -720 968 -1527 -140 1052 -988 592 -21 -990 1796 29 -353 1361 -693 1040
2916 1040 1402 -1077 1126 443 -206 1871 20 71 1571 -375 1167 1207 -440 1048 452 384 1714
2933 1714 -475 -84 1451 148 572 14 -1215 1336 698 -809 170 -659 68 1046 -1285 -295 289
2950 289 -904 204 -539 -1505 415 -1013 -612 41 -1774 -290 181 -1466 286 -869 -1498 485 -892
$$ packed form
2831c4L54q28O19N44j039P66j77k93J130o87n39J068p34P68M50j386Q49n8p65
2850HJ647j185l59J327j656Q18L34j414J481K1j065J273j393O9J310j685R81k06
2868C06j429K173j300m82J367j951J031J261k401J480n05j061K223j569k27J218
2884A34j674J160M44k056K079r54p01K250k027K81J432j971J816j33j706K414
2900G88j067m41J688k495J387J192k040J580o13r69K786j767l82J714k054J733
2916A040L62k479K203o83o49K077j851N1J500j946J542M0j647J488n96o8J330
2933A714k189L91J535j303M24n58j229K551o38j507R79q29P27R78k331R90N84
2950B89j193J108p43r66J920j428M01O53j815J484M71j647J752j155o29J983j377
$$ plain form
2967 -892 -625 79 -1954 -104 799 -1584 -7 -664 -708 1621 -1120 -1023 903 -768 1061 176 -1554
2984 -1554 1540 509 -329 1376 -1137 581 1967 -1003 842 615 -881 2056 202 -57 1981 -541
3000 -541 1157 1619 -610 930 346 -219 2344 -424 -217 1473 -477 1139 593 -1513 1093 549 -429
3017 -429 1084 -1212 -233 1056 -891 -305 -128 -1286 1048 -691 -1256 177 -1112 -32 4 -1720 -142
3034 -142 -457 -1058 234 -1226 -1134 -89 -1002 -73 -360 -1329 57 -376 -642 -44 -876 -532 545 -474
3052 -474 -234 -146 -406 567 -25 -270 224 176 374 618 -326 512 359 203 744 17 289 1081 601 782 812
3073 812 48 933 779 488 968 219 363 761 259 164 546 163 1000 268 -294 500 -148 116 606 -535
3093 -535 -63 165 -451 275 -604 -705 -91 -851 -528 -67 -912 -438 -240 -678 -371 -573 -805 -257 -786 -589
$$ packed form
2967h92K67P04k033J850R03k383J577o57m4K329k741R7J926j671J829q85j730
2984a554L094j031q38J705k513J718J386k970J845k27j496K937j854k59K038k522
3000e41J698M62k229J540n84n65K563k768K07J690j950J616n46k106K606n44r78
3017d29J513k296R79J289j947N86J77j158K334j739n65J433j289J080L6j724J578
3034a42l15o01J292j460R2J045r13R29k87r69J386m33k66N98q32L44J077j019
3052d74K40Q8k60R73n92k45M94m8J98K44r44Q38j53j56N41p27K72P92m80J81L0
3073H12p64Q85j54k91M80p49J44L98n02r5L82l83Q37p32n62P94o48K64M90j141
3093e35M72K28o16P26q79j01O14p60L23M61q45M74J98m38L07k02k32N48n29J97
$$ plain form
3113 -589 -286 -1073 -221 -328 -715 60 -485 -522 114 -650 -362 -6 -328 -166 82 -239 79 -28 64 333 77
3134 77 186 297 61 338 450 451 814 282 550 523 628 620 566 387 657 593 508 564 599 394 322 495 569 294
3158 294 483 466 347 184 26 52 286 250 16 104 -156 21 -135 -209 -116 -377 -516 -312 -517 -409 -439 -373 -81
3181 -81 -383 -766 -570 -517 -468 -449 -547 -563 -386 -364 -556 -416 -434 -679 -213 -559 -245 -76 -302 -66 -316 -346 47
3204 47 -139 21 197 3 162 405 83 582 266 253 688 410 528 646 123 768 647 300 907 635 385
3225 385 669 432 500 787 330 520 668 413 504 509 200 547 -160 190 167 -107 184 34 -168 123 -444 -364
3247 -364 120 -353 -445 -422 -734 -244 -269 -624 -405 -580 -534 -524 -483 -586 -421 -331 -91 -548 -321 -293 -428 -503 -273
3270 -273 -450 -274 -393 -338 -98 -296 -200 -304 -253 136 213 -230 134 330 244 278 274 342 114 326 563 615 172
$$ packed form
3113e89L03p87Q52j07l87P75n45l7O36p64K88L56l22J62K48l21L18j07R2K69k56
3134G7J09J11k36K77J12JL63n32K68k7J05qn4j79K70o4q5N6L5k05p2J73P4k75
3158B94J89j7j19j63j58K6K34l6k34Q8k60J77j56p4R3k61j39K04k05J08l0O6K92
3181h1l02l83J96N3M9J9r8j6J77K2j92J40j8k45M66l46L14J69k26K36k50l0L93
3204D7j86J60J76j94J59K43l22M99l16j3M35k78J18J18n23O45j21l47O07k72k50
3225C85K84k37O8K87m57J90J48k55R1Nl09L47p07L50k3k74K91j50k02K91n67Q0
3247c64M84m73r2K3l12M90k5l55K19j75M6J0M1j03J65R0K40m57K27K8j35p5K30
3270b73j77J76j19N5K40j98R6j04N1L89P7m43L64J96q6L4mO8k28K12K37N2m43
$$ plain form
3293 172 599 553 573 747 429 414 875 684 579 722 254 642 731 47 450 293 491 506 -252 293 404 216
3315 216 224 -548 -634 487 -250 -284 -216 -811 64 -104 -795 -213 -675 -553 46 -1031 -775 -357 -799 -32 -527
3336 -527 -1013 -137 -573 -375 125 -1297 -381 259 -520 202 -1250 -989 740 -101 -62 -360 -976 793 776
3355 776 -535 167 211 547 1206 -462 49 591 100 1088 313 -373 729 640 773 1127 -411 133 931
3374 931 603 557 -148 -233 1018 1189 219 -109 -371 742 1150 -434 -517 90 579 893 -195 -918 141
3393 141 232 137 -311 -1094 -124 270 -219 -267 -832 -768 -176 -447 -556 -580 -873 -173 275 -520 -844 -739 -123 248
3415 248 -617 -1051 -345 202 113 -484 -1345 121 460 22 -31 -1119 31 868 1 -419 -198 -78 1085
3434 1085 342 -193 117 333 991 1028 -88 57 364 520 1117 181 -216 845 998 986 500 -516 574
$$ packed form
3293A72M27m6K0J74l18j5M61j91j05J43m68L88Q9o84M03j57J98J5p58N45J11j88
3315B16Qp72q6J121p37l4O8n95Q75j68o91N82m62J22N99j077K56M18m42P67m95
3336e27m86Q76m36J98N00j422R16O40p79P22j452K61J729q41L9k98o16J769j7
3355G76j311P02M4L36O59j668N11N42m91R88p75o86J102q9J33L54j538N44P98
3374I31l28m6p05q5J251J71r70l28k62J113M08j584q3O07M89L14j088p23J059
3393A41R1r5m48p83R70L94m89m8n65O4N92k71j09k4k93P00M48p95l24J05O16L71
3415B48q65m34P06N47q9n97q61J466L39m38n3j088J150Q37q67m20K21J20J163
3434A085p43n35L10K16O58L7j116J45L07J56N97r36l97J061J53j2m86j016J090
$$ plain form
3453 574 892 631 268 -492 39 1113 372 -234 -291 -64 824 292 -994 -326 -115 498 58 -1114 -550
3472 -550 28 -50 12 -892 -1186 -131 -340 17 -435 -1393 -315 24 -399 -653 -1264 -867 301 -251 -545 -791
3492 -791 -789 447 20 -609 -420 -247 131 97 -470 -542 224 296 435 75 -109 467 797 266 28 -32 129 778
3514 778 640 49 383 523 937 753 182 421 541 647 676 246 165 580 445 586 412 101 311 488 136
3535 136 237 -41 -159 181 96 56 -263 -34 -220 -26 -339 -333 -247 -164 -250 -419 -498 -441 -368 -517 -519 -374 -405 -618
3559 -618 -396 -537 -594 -216 -413 -446 -249 -557 -500 -182 -440 -62 -258 -94 -199 -191 -56 -126 -160 76 175 -113 448
3582 448 -74 281 536 479 261 308 275 499 652 131 609 300 496 455 691 248 436 128 838 498 438 339
3604 339 373 479 399 200 82 80 -6 198 -9 147 -27 -167 -136 -127 -169 -508 -170 -380 -239 -225 -373 -437 -643 -496
$$ packed form
3453E74L18k61l63p60N31J074p41o06n7K27Q88n32j286O68K11O13m40j172N64
3472e50N78p8O2r04k94J055k09L57m52r58J078L39m23k54o11L97J168n52k94k46
3492g91KJ236m27o29J89J73L78l4n67p2P66P2J39l60j84N76L30n31k38o0J61O49
3514G78j38n91L34J40M14j84n71K39J20J06K9m30q1M15j35J41j74l11K10J77l52
3535A36J01k78j18L40q5m0l19K29j86J94l13OQ6Q3q6j69p9N7P3j49kJ45l1k13
3559f18K22j41n7L78j97l3J97l08N7L18k58L78j96J64j05QJ35p0l4K36R9k88N61
3582D48n22L55K55n7k18M7l3K24J53n21M78l09J96m1K36m43J88l08P10l40o0r9
3604C39L4J06q0j99j18kq6K04k07J56j74j40L1Rm2l39L38k10J41J4j48o4k06J47
$$ plain form
3628 -496 -414 -304 -555 -382 -339 -428 -344 -364 -674 -525 -620 -100 -376 -266 -490 -316 -266 -87 -336 -77 -42 -324 -103
3651 -103 -211 -160 -38 104 190 461 147 511 341 399 489 513 434 654 237 241 691 665 605 466 389 731 473 387
3675 387 571 279 478 625 25 528 441 157 191 180 68 216 -229 76 173 -13 -97 -247 -342 89 -291 -276
3697 -276 -305 -540 -420 -676 -563 -352 -363 -415 -255 -464 -459 -362 -885 -494 -380 -343 -311 -359 -436 -156 -339 -144 -308
3720 -308 -545 -192 -264 -149 207 -196 225 137 -177 -32 381 -31 302 130 22 583 242 157 605 355 421
3741 421 589 94 813 471 142 744 328 465 623 -78 703 576 -20 839 219 180 915 -221 98 406
3761 406 -318 484 -59 -492 328 -323 -127 99 -1197 353 -15 -912 322 -669 -773 463 -670 -485
3779 -485 -24 -1621 5 -234 -1201 407 -754 -571 340 -1019 -320 -15 -708 458 -461 -926 329 -206
$$ packed form
3628d96Q2J10k51J73M3q9Q4k0l10J49r5N20k76J10k24J74N0J79k49K59L5k82K21
3651a03j08N1J22J42Q6K71l14L64j70N8R0K4p9K20m17MM50k6o0j39p7L42k58q6
3675C87J84k92J99J47o00N03q7k84L4j1j12J48m45L05R7j86q4j50r5M31l80J5
3697b76k9k35J20k56J13K11j1n2J60k09NR7n23L91J14L7L2m8p7K80j83J95j64
3720c08k37L53p2J15L56m03M21q8l14J45M13m12L33j72j08N61l41q5M48k50O6
3741D21J68m95P19l42l29O02m16J37J58p01P81j27n96Q59o20l9P35j136L19L08
3761D06p24Q02n43m33Q20o51J96K26j296J550l68q97J234r91j04J236j133J85
3779d85M61j597J626k39r67J608j161J83R11j359O99L05o93J166r19m65J255n35
$$ plain form
3797 -206 130 394 -873 -77 315 -354 415 -350 -387 863 -206 151 287 -403 738 756 -137 823 313
3816 313 471 1271 -12 300 727 416 984 580 -449 666 451 252 952 -288 97 958 121 154 -222
3835 -222 -549 881 233 -654 280 -502 -71 863 -887 -48 185 -831 599 -676 -1289 531 -799 -357
3853 -357 128 -1736 3 67 -1235 479 -1148 -1208 917 -1176 -651 69 -1566 1010 161 -1310 439
3870 439 -694 -200 1234 -1345 -78 721 -630 1088 -269 -862 1302 -429 265 927 -1203 938
3886 938 1234 -624 1191 -71 -108 1966 -292 335 822 -459 1645 579 -669 1205 94 571 1023
3903 1023 -843 448 857 -599 956 -495 -554 1257 -110 -46 360 -1288 481 552 -886 311 -969
3920 -969 -586 856 -533 -471 -296 -1101 515 -227 -1344 -148 -738 -302 128 -1622 -684 376 -814 -71
$$ packed form
3797b06L36K64j267P96L92o69P69p65l7J250j069L57J36o90J141J8q93R60n10
3816C13J58Q00j283L12M27l11N68m04j029J115k15j99P00j240L85Q61q37L3l76
3835b22l27J430o48q87R34p82M31R34j750Q39K33j016J430j275o13J820j330M42
3853c57M85j864J739O4j302J714j627o0K125k093N25P20j635K576q49j471J749
3870D39j133M94J434k579J267P99j351J718j357n93K164j731O94O62k130K141
3886I38K96j858J815j262l7K074k258O27M87j281K104j066j248J874j111M77M52
3903A023j866J291M09j456J555j451n9J811j367O4M06j648J769P1j438J197j280
3920i69L83J442j389O2J75q05J616p42j117J196n90M36M30j750R38J060j190P43
$$ plain form
3938 -71 -496 -1065 171 66 -699 212 -570 -298 458 -285 55 -159 -234 739 114 -402 307 -187 722 816 -520
3959 -520 484 746 302 1099 -61 -517 1168 678 491 779 -400 696 659 -336 866 63 191 1193
3977 1193 -335 353 473 -613 453 166 -282 696 -482 -33 578 -618 230 200 -883 460 -431 -932
3995 -932 130 -603 -395 -155 -973 -12 -278 -909 -18 -694 -560 6 -658 -480 -161 -778 -153 -182 -567 20
4015 20 -399 -301 111 -260 -254 -142 -300 341 77 -338 275 -143 164 273 -76 296 201 256 668 205 254 325 97
4038 97 364 578 527 445 436 254 661 396 343 397 354 177 177 25 305 481 -46 -20 276 167 342 -180 -265 386
4062 386 -49 6 93 -217 -194 -177 -584 -9 -541 -534 -127 -346 -578 -119 -316 -287 -462 -673 -329 -423 -560 -185 -475
4085 -475 -367 -447 -746 -132 -80 -464 61 -308 -472 -46 -70 21 129 -74 -157 162 106 248 271 40 66 299 438
$$ packed form
3938g1m25n69J236j05p65R11p82K72P56p43L40k14p5R73o25n16P09m94R09R4j336
3959e20J004K62m44P97j160m56J685m90j87K88j179J096l7r95J202q03J28J002
3977A193j528O88J20j086J066k87m48R78j178M49O11j196Q48l0j083J343q91n01
3995i32J062p33K08K40q18R61k66o31Q91o76J34N66o64J78L19o17O25k9l85N87
4015B0m19R8M12l71OJ12j58O41k64m15O13m18L07J09l49L72r5N5M12m63M9P1k28
4038I7K67K14n1q2rj82M07k65n3N4m3j77%j52K80J76n27K6K96j09J75n22q5O51
4062C86m35N5Q7l10K3J7m07N75n32PM07k19k32M59j97K9j75k11L44r4j37L75k90
4085d75J08q0k99O14N2l84N25l69j64M26k4R1J08k03q3L19n6J42K3k31K6K33J39
$$ plain form
4108 438 362 444 268 340 143 539 413 473 632 366 591 487 570 319 411 409 581 419 335 509 211 143 -123
4131 -123 159 153 -277 -75 224 10 -88 -330 -423 -6 -325 -312 -261 -193 -576 -140 -584 -304 -288 -358 -521 -409 -364
4154 -364 -242 -409 -640 -592 -443 -300 -377 -283 -346 -688 -354 -45 -137 -358 -259 -15 -103 30 -46 18 148 196 170 65
4178 65 -22 309 207 336 494 58 568 242 454 784 393 876 373 317 730 370 631 700 294 378 290 -95
4200 -95 564 164 117 555 82 50 170 -408 242 -43 -122 238 -395 -336 303 -281 -494 -73 -581 100 -234 -624
4222 -624 -474 -591 -244 -113 -826 -304 -189 -290 -52 -511 -645 -148 -414 -195 -331 -389 -213 110 -128 -137 -539
4243 -539 -296 614 -60 -270 189 -177 336 347 -151 309 341 318 702 537 143 733 170 786 717 222 667
4264 667 724 282 621 401 267 721 401 310 368 102 437 479 20 482 80 394 383 -270 -101 271 -53 303
$$ packed form
4108D38p6Q2j76P2j97L96j26O0J59k66K25j04Q3k51R2kJ72j62q4J74k98o8k66
4131a23K82om30K02K99k14r8k42r3M17l19J3N1O8l83M36m44K80J6p0j63J12M5
4154c64J22j67k31M8J49J43p7R4o3l42L34L09r2k21R9K44q8J33p6O4J30M8k6j05
4178F5q7L31j02J29J58m36N10l26K12L30l91M83n03n6M13l60K61O9m06Q4q8l85
4200i5O59m00m7M38m73l2J20n78O50k85p9L60o33N9O39n84k13M21n08O81l34l90
4222f24J50j17L47J31p13N22J15j01K38m59j34M97k66K19j36n8J76L23k38rm02
4243e39K43R10o74k10M59l66N13J1m98M60L2k3L84j65l94N90n63O16o9m95M45
4264F67N7m42L39k20j34M54l20r1N8k66L35M2m59M62m02L14j1o53J69L72l24L56
$$ plain form
4286 303 -373 -303 198 -104 -496 -107 -811 -140 61 -458 -357 -362 -564 34 -598 -339 -189 -810 -166 -323 -652
4307 -652 -286 -329 -362 63 -540 -523 -262 -399 103 -384 -341 241 -61 -88 158 -425 -30 475 121 99 -110 260
4329 260 686 238 13 381 96 868 569 -238 351 542 465 714 65 475 990 177 408 441 52 376 220
4350 220 186 665 -173 129 372 -18 168 -346 -444 457 -50 -465 -119 -353 -36 71 -677 -115 -198 -407 -129
4371 -129 -684 -456 12 -826 -532 -280 -527 -174 -330 -725 -61 -425 -713 -438 -398 -82 73 -462 -570 235
4391 235 -57 142 -161 -462 360 -249 39 284 -118 429 457 -30 537 87 215 376 225 403 577 24
4411 24 308 497 462 314 72 302 826 524 -40 344 245 841 468 -132 493 428 -71 200 -274 181 342
4432 342 -365 -317 39 -259 13 -183 -474 -200 -195 -425 -249 -343 -153 -301 -562 -48 -469 -542 -307 -368 -299 -373 -762
$$ packed form
4286C03o76P0N01l02l92L89p04O71K01n19J01nk02N98o32K59J50o21O44j57l29
4307f52L66m3l3M25o03J7K61j37N02m87M3N82l02k7K46n83L95N05l54k2k09L70
4329B60M26m48k25L68k85P72k99q07N89J91p7K49o49M10N15q13K31L3l89L24j56
4350B20l4M79q38L02K43l90J86n14r8R01n07m15L46k34L17J07p48N62q3k09K78
4371a29n55K28M68q38K94K52k47L53j56l95O64l64k88K75M0L16J55n35j08Q05
4391B35k92J99l03l01Q22o09K88K45m02N47K8m87N67m50J28J61j51J78J74n53
4411B4K84J89l5j48k42K30N24l02n64L84r9N96l73o00O25o5m99K71m74M55J61
4432C42p07M8L56k98K72j96k91K74Nk30J76r4J90j48k61N14m21p3K35o1O9p4l89
$$ plain form
4455 -762 -70 -99 -484 -424 -520 -351 230 -429 -375 -72 -46 -145 -186 -416 189 132 69 164 -35 406 415 -212 145 433
4479 433 214 556 265 137 496 151 291 480 587 415 280 287 594 420 272 426 335 416 -4 -198 319
4500 319 364 70 275 -302 339 577 -227 -5 212 -57 78 -190 -285 -215 -203 -90 23 -648 -385 -202 -466
4521 -466 -352 -398 -717 -129 -395 -383 -336 -707 -267 -131 -625 -229 -390 -620 -32 -134 -344 -462 -335 12 -181
4542 -181 -440 112 227 -156 -71 28 154 273 28 152 182 385 323 460 180 439 387 405 422 481 450 228 444
4565 444 412 526 189 293 346 179 708 144 265 449 52 316 189 116 173 -30 147 114 32 -248 -332 -187
4587 -187 -189 98 -133 -179 -372 -298 -481 -245 -437 -443 -308 -421 -428 -388 -287 -447 -558 -552 -390 -276 -692 -314 -337 -245
4611 -245 -394 -46 -232 -32 -206 -195 407 -50 -16 120 -7 11 30 276 280 312 -93 297 341 262 459 43 233
$$ packed form
4455g62O92k9l85O0r6J69N81o59N4L03K6r9m1k30O05n7o3R5j99M41Ro27L57K88
4479D33k19L42k91j28L59l45J40J89J07j72j35PL07j74j48J54r1Q1m20j94N17
4500C19M5k94K05n77O41K38q04K22K17k69J35k68r5P0J2J13J13o71K63J83k64
4521d66J14m6l19N88k66J2M7l71M40J36m94L96j61k30N88j02k10j18J27L47j93
4542a81k59N52J15l83Q5R9J26J19k45J24L0K03o2J37k80K59n2J8J7N9l1k22K16
4565D44l2J14l37J04N3j67N29n64J21J84l97K64j27p3N7k03J77l3q2k80q4J45
4587a87kK87k31m6j93P4j83K36j92oJ35j13pM0J01j60j11OJ62J14m16L78k3R2
4611b45j49L48j86K00j74J1O02m57L4J36j27J8J9K46ML2m05L90M4p9J97m16J90
$$ plain form
4634 233 316 210 142 107 408 485 255 217 502 309 511 332 430 165 264 275 196 -24 -63 189 -64 -23 28 -201
4658 -201 15 -305 -151 31 -261 -100 -316 -391 -447 -47 -590 -154 -509 -533 -214 -361 -190 -236 -376 -275 -606
4679 -606 -373 -294 -634 -342 -126 -380 -141 -24 -250 -183 -159 89 -79 -109 53 119 127 91 58 -3 -79 302 422 292
4703 292 382 548 293 329 176 287 313 581 373 486 306 231 276 331 151 420 468 256 193 428 242 347 270
4726 270 55 479 51 -154 120 -189 -264 -93 -154 95 -247 -244 216 -552 -250 63 -750 -341 -407 -470 -94 -512
4748 -512 -476 -296 -556 -285 -231 -554 -131 -292 -337 -5 -367 -320 -217 -571 -92 -336 -508 344 -410 -20 500
4769 500 143 123 218 -390 560 374 31 465 178 240 590 -7 481 371 265 507 240 132 660 329 430
4790 430 535 -66 279 339 231 757 -95 103 426 86 268 -44 -278 283 335 -328 -62 -380 2 226 -574
$$ packed form
4634B33Q3j06o8l5L01P7k30l8K85j93K02j79R8k65R9J1p9k20l9K52k53M1N1k29
4658b01K16l20J54J82k92J61k16p5n6M00n43M36l55k4L19j47J71m6j40J01l31
4679f06K33P9l40K92K16k54K39J17k26O7K4K48j68l0J62O6Ql6l3o1p6L81J20j30
4703B92R0J66k55L6j53J11K6K68k08J13j80p5M5N5j80K69M8k12o3K35j86J05p7
4726B70k15M24m28k05K74l09p5J71o1K49l42LM60p68L02L13q13M09o6o3L76m18
4748e12L6J80k60K71N4l23M23j61m5L32l62M7J03l54M79k44j72Q52p54L90N20
4769E00l57k0R5o08R50j86l43M34k87O2L50n97M88j10j06K42k67j08N28l31J01
4790D30J05o01L45O0j08N26q52J98L23l40J82l12k34N61N2o63K66l18L82K24q00
$$ plain form
4811 -574 -233 -117 -566 238 -126 -661 -242 -589 -191 225 -686 -678 -318 -462 11 -464 -796 -212 -154 -207 -369
4832 -369 -1082 -94 155 -529 -134 -430 -422 632 -126 -302 -284 -112 395 432 -116 389 207 49 716 -245 115
4853 115 472 85 604 339 -517 374 698 605 954 -123 124 1054 286 410 99 -198 1103 368 -359 308
4873 308 46 546 676 -648 313 240 76 445 -504 -322 202 -342 209 61 -920 252 -28 -548 283 -863
4893 -863 -438 145 -594 -361 -369 -845 324 -350 -967 -261 -703 -73 326 -819 -232 299 -316 308 -490 -403
4913 -403 459 95 -241 33 -536 251 468 -167 183 38 -29 398 56 307 434 160 529 384 -65 370
4933 370 513 318 533 193 133 453 569 341 0 26 711 640 303 144 47 188 488 -244 163 40 -47 143
4955 143 -144 -200 129 -142 -164 9 -439 -78 -124 -260 -273 -482 -286 -156 -442 -222 -436 -513 7 -171 -454 -277
$$ packed form
4811e74L41J16m49Q04l64n35M19l47L98M16r11QL60j44M73m75l32N84N8n3j62
4832c69p13R88K49o84L95k96QJ054p58j76J8J72N07L7n48N05j82j58O67r61L60
4853A15L57l87N19k65q56Q91L24r3L49j077K47R30p68J24l11k97J301p35p27O67
4873C08k62N00J30j324R61p3j64L69r49J82N24n44N51j48r81J172k80n20Q31j146
4893h63M25N83p39K33qm76J169o74o17P06m42O30L99j145N87N31o15O24p98Q7
4913d03Q62l64l36K74n69P87K17o35L50j45o7M27l42K51J27k74L69j45m49M35
4933C70J43j95K15l40o0L20J16k28l41K6O85p1l37j59r7J41L00p32M07j23q7J90
4955A43k87n6L29k71k2J73m48L61m6j36j3k09J96J30k86K20k14p7N20j78k83J77
$$ plain form
4977 -277 -189 -400 -41 -420 -211 60 -373 119 -383 -354 135 -242 215 105 -393 249 9 107 262 -90 38
4998 38 509 86 215 150 61 656 276 472 387 314 457 331 26 489 378 274 556 163 194 269 180 484 255
5021 255 35 220 267 88 100 91 -110 -94 -95 15 1 -319 23 233 -268 -126 -361 -291 -191 -301 -159 -355 -234
5044 -234 -364 -422 -552 -183 -400 -289 -543 -265 -167 -351 -544 -247 -208 -192 -172 -74 -58 -124 -71 30 63 -21 214 91
5068 91 31 80 -47 24 188 196 226 221 249 456 463 311 219 449 201 433 76 259 241 478 556 207 277 439 291
5093 291 232 160 114 124 -77 -12 110 86 50 94 -178 73 -240 -210 11 -322 -213 -39 -202 -379 -241 -189 -486
5116 -486 -127 -362 -345 -339 -540 -195 -274 -425 -259 -697 -359 -138 -259 -407 -419 -302 -353 -96 -208 -186 -187 196 -25
5139 -25 1 -77 138 -14 62 141 369 -2 258 416 168 568 243 622 468 551 464 382 359 829 281 545 386
$$ packed form
4977b77Q8k11L59l79K09K71m33M92n02K9M89l77M57j10m98O42k40R8J55l52J28
4998C8M71m23J29o5q9N95l80J96q5p3J43j26l05M63j11j04K82l93L1P5q9L04k29
5021B55k20J85M7j79J2rk01J6jJ10j4l20L42K10n01J42k35P0J00j10J42j96J21
5044b34j30n8j30L69k17J11k54K78R8j84j93K97L9J6K0R8J6o6N3J01L3q4K35j23
5068I1o0M9j27P1J64QL0nK8K07Pj52r2K30k48K32l57J83j8K37P8l49P0J62j48
5093B91n9p2m6J0k01O5J22k4l6M4k72K51l13L0K21l33J09J74j63j77J38N2k97
5116d86L59k35J7Ok01L45p9j51J66m38L38K21j21j48j2J17n1K57j12K2jL83k21
5139b5K6p8K15j52P6P9K28l71K60J58k48M00l25L79j54Q3q7q2k3M70n48K64j59
$$ plain form
5162 386 229 656 404 223 403 125 390 225 33 125 -113 -219 271 -295 -134 74 -126 -92 -79 -19 -24 -197
5184 -197 -168 -234 -573 -64 -257 -522 -182 -449 -288 -381 -512 -401 -437 -430 -231 -602 -538 -217 -211 -293 -295 -444 -306 61
5208 61 -330 -88 -168 -149 273 -144 332 -33 7 140 174 241 283 -53 367 475 -145 581 144 326 276 252 273
5231 273 329 149 606 289 76 621 290 489 343 -57 169 317 233 78 -181 -188 451 192 -117 136 78 304
5253 304 372 -158 -75 -139 -243 205 -284 -472 161 -476 -353 -402 -440 -266 103 -417 -346 -303 -581 -140 -214 -298 -184
5276 -184 -391 4 60 -566 -65 -197 69 335 -473 -286 286 67 269 55 -402 556 370 155 451 -187
5296 -187 269 659 114 464 -116 -149 647 402 25 255 -131 441 580 217 599 180 241 695 113 -207 231
5317 231 340 689 179 -287 150 305 138 199 -482 -57 312 17 138 -381 -397 233 -110 -178 -161 -608 -172
$$ packed form
5162C86j57M27k52j81J80k78K65j65j92R2k38j06M90n66J61K08k00L4J3O0nj73
5184a97K9o6l39N09j93k65L40k67J61r3j31J11l6PJ99l71O4L21Oq2kj49J38L67
5208F1l91K42q0J9M22m17M76l65M0J33L4O7M2l36M20J08o20P26m37J82n0k4K1
5231B73N6j80M57l17k13N45l31J99j46m00K26J48q4j55k59pO39k59l09K53n8K26
5253C04O8n30Q3o4j04M48m89j88O33o37J23m9l8J74L69n20P1M3k78M41p4q4J14
5276a84k07L95N6o26N01j32K66K66q08J87N72k19K02k14m57R58j86k15K96o38
5296a87M56L90n45L50n80l3P96k45l77K30l86N72J39l63L82m19O1M54n82l20M38
5317B31J09L49n10m66M37J55j67O1o81M25L69k95J21n19j6O30l43o8J7m47M36
$$ plain form
5338 -172 -16 -675 -461 -576 -364 -34 -530 -491 -90 -345 -290 -196 -666 -99 -195 -225 -55 -202 -396 261 -17 -344
5360 -344 -286 -182 370 286 -92 22 70 363 509 -148 273 351 165 557 282 118 515 474 221 446 95 469
5382 469 386 143 317 146 283 594 197 1 132 -59 113 393 -95 161 234 -160 456 -178 -166 236 -82
5403 -82 -49 -160 -421 50 -168 -276 -88 -329 -168 262 -315 -274 -310 -510 -352 -339 -445 -309 -394 -344 -318 -361 -157
5426 -157 -305 -215 -23 -378 -173 -7 -145 -48 -255 13 108 28 15 276 122 263 343 -13 346 203 144 518
5448 518 389 407 269 393 295 255 289 335 260 224 232 122 378 319 343 554 84 65 318 126 -160 168 107 53 132
5473 132 -230 39 162 -62 30 -239 -173 47 -131 -375 -31 -19 -341 -156 -327 -545 -246 -401 -343 -395 -541 -312
5495 -312 -347 -417 -67 -479 -447 -326 -215 -264 -292 -366 67 -47 -213 114 -275 -23 223 -198 188 -11 47 154
$$ packed form
5338a72J56o59K14j15K12L30m96L9M01k55N5R4m70N67r6l0J70j47j94O57k78l27
5360c44N8J04N52q4l78J14M8K93J46o57M21P8j86L92k75j64L97m1k53K25l51L74
5382D69q3k43J74j71J37L11l97j96J31j91J72K80m88K56P3l94O16o34J2M02l18
5403h2L3j11k61M71k18j08J88k41J61M30n77M1l6k00J58J3j06J36q5N0K6m3K04
5426a57j48R0J92l55K05J66j38R7k07K68R5q0j3K61j54J41Q0l56L59j43n9L74
5448E18j29J8j38J24r8m0L4M6p5l6Qj10K56n9K4K11m70j9K53j92k86L28o1n4P9
5473A32l62K69J23k24R2k69O6K20j78k44L44J2l22J85j71k18K99j55N8n2j46K29
5495c12l5p0L50m12L2J21J11m9k8p4M33j14j66L27l89K52K46m21L86j99N8J07
$$ plain form
5517 154 33 242 128 49 341 439 288 401 457 263 382 556 474 462 57 253 650 284 91 152 255 468
5539 468 147 -58 -122 176 165 108 56 192 -15 97 -155 -163 -157 -95 -45 10 -212 -308 -129 -320 -484 -305 13 -116
5563 -116 -166 -495 -263 -435 -265 -146 -337 -469 -202 -131 -165 -296 -398 -371 -389 -254 -34 33 -303 17 68 19 21
5586 21 -213 186 -101 34 304 141 231 276 -180 373 316 341 457 435 241 240 106 478 261 174 227 427 70
5609 70 170 103 186 87 -8 277 376 206 296 95 -34 297 96 149 -53 -219 -271 17 -219 -90 -49 -491 -131
5632 -131 -213 -401 -307 -197 -132 -5 -385 -122 -215 -520 -272 -230 -335 -281 -339 -538 -361 -301 -119 131 -351 -38 -151
5655 -151 -250 -176 -189 83 40 160 -140 193 -312 158 -31 173 214 -43 507 -122 15 401 410 418 294 300 379 276
5679 276 150 379 512 137 292 162 157 184 248 235 177 6 244 163 188 225 -77 -3 119 34 191 22 -179 278
$$ packed form
5517A54j21K09j14p9K92R8j51J13N6j94J19J74q2j2m05J96L97l66j93O1J03K13
5539D68l21k05o4K98j1n7n2J36k07J12k52qOO2N0N5k22r6J79j91j64J79L18j29
5563a16n0l29K32j72J70J19j91j32K67P1l4j31j02K7j8J35K20O7l36L20N1m9K
5586B1k34L99k87J35K70j63R0M5m56N53n7K5J16k2j94jj34L72k17q7N3K00l57
5609G0J00o7Q3r9r5K85R9j70R0k01j29L31k01N3k02j66n2K88k36J29M1m42L60
5632a31q2j88R4J10O5J27l80K63r3l05K48M2j05N4n8j99J77O0J82K50m82L13j13
5655a51r9P4j3K72m3J20l00L33n05M70j89K04M1k57N50o29J37L86RQj24OP9j03
5679B76j26K29J33l75J55j30nK7O4j3n8j71K38q1K5L7l02P4J22q5J57j69k01M57
$$ plain form
5703 278 -137 -410 -105 -307 -278 -327 -366 -160 -236 -261 -373 -536 -530 -365 -377 -177 -317 -240 -260 -146 -358 -28 -201
5726 -201 -282 -15 -308 -90 161 -226 0 -21 -312 385 203 30 302 -37 330 238 160 387 305 191 320 430
5748 430 310 331 208 352 134 148 266 195 231 194 308 287 262 -44 343 75 -135 195 -2 97 -184 -263 -95
5771 -95 26 -94 -117 -177 -55 -62 -249 -235 236 -150 13 -194 -209 -189 -57 -153 -280 -482 -251 -184 -332 -362 -123 -414
5795 -414 -268 10 -279 -128 -396 -237 -260 -155 -188 -252 -119 318 157 -7 303 -123 232 249 -190 386 432 87
5817 87 297 172 233 458 -40 223 427 112 -17 313 340 239 -49 102 539 471 278 302 249 156 239 -66 260
5840 260 104 -55 -22 -84 -70 86 99 91 -22 -220 30 -296 -109 -101 -73 -96 -301 -356 85 -75 -142 -321 -330 -279 -430
5865 -430 -322 -247 -96 -102 -238 -265 -147 -105 -40 -269 -25 -138 -187 86 11 -75 40 -79 180 157 193 105 125 169 222
$$ packed form
5703B78m15k73L05k02K9m9l9K06p6k5j12j63OJ65j2K00j40P7k0J14k12L30j73
5726b01q1K67k93K18K51l87K26k1k91O97j82j73K72l39L67r2p8K27q2j14J29J10
5748D30j20K1j23J44k18J4J18p1L6l7J14k1k5l06L87k68k10L30j97R9k81p9J68
5771i5J21j20k3o0J22pj87J4M71l86J63k07j5K0J32r6j27k02K31O7j48l0K39k91
5795d14J46K78k89J51k68J59k3J05l3o4J33M37j61j64L10m26L55J7m39N76M6l45
5817H7K10j25O1K25m98K63K04l15j29L30K7j01k88J51M37o8j93K4n3r3Q3l05L26
5840B60j56j59L3o2J4J56J3qj13j98K50l26J87QK8k3k05n5M41j60o7j79rN1j51
5865d30J08P5J51oj36k7J18M2O5k29K44j13m9K73p5q6J15j19K59k3L6q8K0M4N3
$$ plain form
5890 222 65 161 208 84 287 294 305 88 152 193 227 239 368 362 347 268 58 247 262 237 279 188 390 23 58 -177
5916 -177 223 -7 40 2 -43 -38 32 -199 -63 -40 -80 -271 77 -24 -166 -115 -407 -303 -396 -311 -137 -53 -235 -302
5940 -302 -224 -198 -387 -119 -62 -68 -166 -35 -184 -100 -174 -75 -12 -208 -361 -119 -125 -10 86 211 109 85 -164 185 278
5965 278 225 173 299 186 186 424 410 210 15 376 364 293 371 120 104 223 14 212 315 189 44 340 439
5988 439 182 182 23 -156 75 71 -28 -47 5 -258 -305 -48 -86 -92 -133 -79 -244 -124 -180 -299 -259 -119 2 -312 -182
6013 -182 -424 -202 -41 -197 -21 -89 -204 -214 -258 -150 -88 -238 -103 -83 -176 -146 -32 60 -232 44 100 142 28
6036 28 18 81 61 -89 350 136 281 278 304 99 137 158 198 455 146 509 356 269 98 263 217 140 169 -107 92
6061 92 132 188 185 97 -89 118 291 44 109 74 -387 -141 16 -151 8 -115 -226 46 -3 -325 -122 -366 -192
$$ packed form
5890B22j57R6M7j24K03PJ1k17O4M1L4J2J29oj5p9k10J89J5k5M2r1K02l67L5k35
5916a77M00k30M7l8m5NP0k31J36K3m0j91L48j01j42N1k92J04r3Q5J74Q4j82o7
5940c02P8K6j89K68N7or8J31j49Q4p4R9O3j96j53K42oJ15R6J25j02k4k49L49R3
5965B78n3n2J26j13%K38j4k00j95L61j2p1P8k51j6J19k09J98J03j26j45K96R9
5988D39k57%j59j79K31mr9j9N2k63m7K57l8om1N4j65J20n6j19M0J40J21l14J30
6013a82k42K22J61j56J76o8j15j0m4J08O2j50J35K0r3L0J14R2k92K76N6M2j14
6036B8j0O3k0j50M39k14J45lK6k05L8K1M0K57l09L63j53q7j71J65m6p7K9k76J99
6061I2M0N6lq8j86K07J73k47O5l5m61K46J57j67J59j23j11K72m9l22K03k44J74
$$ plain form
6084 -192 -280 -211 -178 -319 -315 -274 -122 -116 -76 -134 -38 -179 -179 -12 -160 -177 -5 23 27 -102 -155 23 -199 85 232 36
6110 36 281 137 68 167 157 249 122 18 188 289 42 476 395 220 273 272 -10 416 281 254 274 177 308 116
6134 116 -69 137 240 183 135 27 215 40 -164 13 1 -152 -138 -142 -32 -14 -102 162 -122 -361 -249 -45 -100
6157 -100 -76 -94 -151 -93 -245 -140 -212 -149 -77 -432 -272 -57 -273 -309 -175 -263 -5 -238 -280 125 -202 -63 169
6180 169 -182 -85 161 69 -78 -216 149 164 312 99 -25 30 378 198 355 338 350 169 377 326 7 57 89
6203 89 382 328 137 248 348 211 157 210 -55 57 132 157 -33 -136 57 -218 -229 -228 21 -64 144 -330 -144
6226 -144 -133 -218 -99 -197 -244 -413 -206 -196 -521 -421 -304 -111 -186 -330 -287 -115 -145 -77 -137 -105 -152 18 -11 29 -176
6251 -176 -203 184 205 98 19 215 84 12 88 158 -19 172 149 9 -17 73 121 267 171 283 106 171 202 -31
$$ packed form
6084a92q8O9L3j41MM1J52OM0n8R6j41%J67j48j7J72K8Mj29n3J78k22K84J47j96
6110C6K45j44o9R9j0R2j27j04J70J01k47M34q1j75N3jk82M26j35k7K0r7J31j92
6134A16j85K06J03n7m8j08J88j75k04J77j2j53J4mJ10J8q8K64k84k39J12K04n5
6157a00K4j8n7N8j52J05p2O3P2l55J60K15k16l6J34q8K58k33m2M05l27J39K32
6180A69l51R7K46r2j47j38L65J5J48k13j24N5L48j80J57j7J2j81K08n1l19N0L2
6203H9K93n4j91J11J00j37n4N3k65J12P5K5j90j03J93k75j1JK49q5K08m74J86
6226a44J1q5J19r8m7j69K07J0l25J00J17J93p5j44M3J72l0O8o0L2m7J70k9M0k05
6251a76k7L87K1j07p9J96j31p2P6P0j77J91k3j40k6R0M8J46r6J12j77O5L1k33
$$ plain form
6275 -31 119 68 277 287 428 27 476 245 39 -107 20 161 214 126 -30 285 -14 57 50 -218 83 181 -101
6298 -101 -242 -309 14 -192 -156 -281 -74 -181 -282 -231 -128 -154 -176 -166 -266 -225 -394 -383 -57 -232 -223 -143 -355 -221
6322 -221 -29 -408 84 11 -181 -64 185 -23 -100 106 361 168 -98 294 404 164 155 226 221 -122 140 -62
6344 -62 -115 126 374 146 242 401 148 211 117 323 214 221 -33 7 213 -151 118 77 76 -90 205 289 -49 -88
6368 -88 108 -202 -49 -162 -18 -218 -86 -149 -229 -250 -329 -262 -19 -269 -298 -110 -371 -231 82 -180 -69 -437
6390 -437 -19 -277 -414 -168 -80 16 -142 23 -182 130 248 -120 -115 346 325 93 -108 27 -65 12 306 149
6412 149 180 -47 111 177 224 173 98 254 136 248 33 233 143 180 172 -47 203 167 305 211 199 39 73 17 274
6437 274 77 100 185 10 -70 -125 -77 -13 -14 -477 -289 -21 -293 90 -222 -94 -231 -260 -426 -152 -91 -100 -90 -251
$$ packed form
6275c1J50n1K09J0J41m01M49k31k06j46J27J41N3q8j56L15k99P1pk68L01R8k82
6298a01j41o7L23k06L6j25K07j07j01N1J03k6k2J0j00M1j69J1L26j75RQ0k12J34
6322b21J92l79M92p3j92J17K49k08p7K06K55j93k66L92J10k40rP1nl43K62k02
6344f2n3K41K48k28R6J59k53O3r4K06j09Pk54M0K06l64K69m1jj66K95Q4l38l9
6368h8J96l10J53j13J44k00J32o3q0k1p9O7K43k50k9J88k61J40L13k62J11l68
6390d37M18k58j37K46Q8R6j58J65k05L12J18l68NM61k1k32k01J35r2P7K94j57
6412A49L1k27J58O6M7n1p5J56j18J12k15K00r0L7qk19K50l6J38r4j2j60L4n6K57
6437B74j97K3Q5j75q0n5M8O4jm63J88K68k72L83l12J28j37k9j66K74O1rJ0j61
$$ plain form
6461 -251 -288 19 -55 -281 -146 -468 -284 129 -61 -59 -179 -104 22 36 51 -326 -168 160 54 -15 126 124 154 54
6485 54 78 210 286 193 -8 55 213 157 19 53 202 152 353 278 360 100 535 281 120 166 111 -18 -15 -46 142
6510 142 77 170 1 32 143 -248 102 -237 41 10 27 3 -96 84 -122 85 35 0 -439 -272 -282 -264 73 -209
6534 -209 -359 -256 -216 -264 -171 -151 -11 -27 -246 -2 -210 -122 -38 13 135 -136 3 -13 -282 33 72 326 -81
6557 -81 -50 128 149 152 125 238 18 214 387 56 194 145 53 30 81 147 56 418 201 204 198 211 290 122 -18 53
6583 53 -170 -34 68 -188 -136 153 165 -150 116 -159 -40 -2 34 -138 144 -177 -219 -253 158 196 -236 -134 -310
6606 -310 -260 -420 -212 -258 29 -125 -430 -244 148 -150 -269 37 -158 -161 46 5 -137 -101 -21 -18 164 28 -127
6629 -127 -46 16 87 27 179 343 288 -42 65 264 76 322 316 175 254 268 329 81 198 94 165 -98 117 140
$$ packed form
6461b51l7L07p4k26J35l22J84M13j90Kj20P5J26J4J5l77J58L28j06o9J41kL0j00
6485E4K4J32P6r3k01O3J58n6j38L4J49n0K01p5Q2k60M35k54j61M6n5j29Ll1J88
6510A42o5R3j69L1J11l91L50l39K78l1J7k4r9J80k06K07n0l5m39J67j0J8L37k82
6534b09j50J03M0m8R3K0J40j6k19K44k08Q8Q4N1J22k71J39j6k69L15L9K54m07
6557h1L1J78K1Lk7J13k20J96J73l31J38m9r2k3N1O6r1L62k17LoJ3P9j68j40P1
6583E3k23J36J02k56N2K89J2l15K66k75J19L8L6j72K82l21m2l4M11L8m32J02j76
6606c10N0j60K08m6K87j54l05J86L92k98j19L06j95lK07m1j42L6Q0LJ82j36j55
6629a27Q1O2P1o0J52J64n5l30J07J99j88K46oj41P9J4O1k48J17j04P1k63K15K3
$$ plain form
6653 140 -260 136 -48 131 115 -10 149 -233 64 19 -180 57 9 97 -87 123 -234 32 14 -289 -199 -219
6675 -219 -119 -200 -260 -109 -108 -45 -18 -220 -34 -48 -58 -137 -380 -52 -276 -191 -312 66 -95 160 -43 -114 15 -226
6699 -226 122 -11 251 141 42 9 179 327 49 384 159 117 303 165 262 72 267 313 234 32 329 -20
6721 -20 243 -16 137 27 5 196 74 -117 257 32 124 327 29 68 53 -16 -36 165 24 64 -10 -136 39
6744 39 -24 192 96 -55 -337 -148 -147 -209 -128 32 -18 -284 -359 -123 -186 199 -204 -168 -104 -215 -289 -3 -64 -48 -103
6769 -103 194 23 220 6 131 -1 146 86 -33 169 163 -28 -14 35 163 196 238 132 138 113 11 41 96 144
6793 144 134 142 154 114 -9 -36 279 355 85 217 -15 196 129 181 -25 164 356 236 -126 -159 -68 54 70 -100
6817 -100 -305 -116 -91 152 15 -109 -234 -130 -404 -192 -6 -3 -210 -392 -336 -150 -241 -44 -60 -199 116 -121
$$ packed form
6653A40m00L96j84J79j6j25J59l82K97m5j99K37m8Q8j84K10l57K66j8l03R0k0
6675b19J00q1o0J51JO3K7k02J86j4j0p9k43L28k24Q5j21L78j61K55k03p1J29k41
6699b26L48j33K62j10r9l3J70J48k78L35k25m2J86j38R7j90J95M6p9k02K97l49
6721b0K63k59J53j10k2J91j22j91L74k25R2K03k98L9j5o9k0K01j41M0p4j26J75
6744C9o3K16r6j51k82J89Jo2Q1J60n0k66p5K36o3L85m03L6O4j11p4K86o1J6n5
6769a03K97j71J97k14J25j32J47o0j19K02oj91J4M9J28L3M2j06Ok5j02L0N5M8
6793A44j0QJ2m0j23k7L15P6k70J32k32K11o7N2k06J89J92j20l62l3R1J22J6j70
6817a00k05J89K5K43j37j24j25J04k74K12J86Lk07j82N6J86r1J97j6j39L15k37
$$ plain form
6839 -121 29 -242 -66 145 21 -10 -30 -42 -99 145 237 40 -19 126 137 -365 84 17 258 87 172 234 187 98
6863 98 77 -12 269 202 41 113 137 217 267 246 80 -2 4 81 70 153 269 -133 -120 358 -110 29 -56 -137 -21 -14 -76
6890 -76 -76 -28 -8 25 60 -62 -157 -287 -130 -217 -354 -103 -51 -170 -261 48 -197 -181 -94 -87 -129 -171 -158 -57 119 -89
6916 -89 -72 -128 -55 -50 -46 -17 146 -183 75 71 6 195 21 106 154 22 256 -88 209 19 265 280 372 116 131 222
6942 222 184 20 142 178 126 200 335 135 159 33 -181 -125 189 10 183 -125 -71 192 -16 -138 201 -5
6964 -5 23 6 -87 19 -115 -208 -127 -249 -297 -185 -152 -413 -102 -237 -151 -30 -131 -197 -103 -105 150 -147 119 -297 -81
6989 -81 -10 89 -209 -190 141 -174 2 -319 203 229 -50 44 -107 93 239 93 123 14 303 -64 5 167 198
7012 198 426 -28 349 92 81 359 118 108 249 57 -126 -109 50 -3 154 -28 -133 334 -145 115 215
$$ packed form
6839a21J50k71J76K11j24l1k0j2n7K44R2j97n9J45J1n02M49o7K41j71Q5O2m7q9
6863I8k1q9K81o7j61P2K4Q0N0k1j66q2OP7j1Q3J16m02J3M78m68J39q5q1J16Po2
6890g6%M8K0L3L5j22r5j30J57q7j37K51N2j19r1L09k45J6Q7Pm2m2J3J01J76k08
6916h9J7n6P3NMK9J63l29K58mo5J89j74Q5M8j32K34l44K97j90K46J5R2k56J5R1
6942B22l8j64J22L6n2P4J35k00K4j26k14N6L14j79J73l08N4K63k08j22L39k06
6964eK8j7r3J06j34r3Q1j22m8J12L3k61L11j35Q6J21j01o6R4kK55k97K66m16K16
6989h1P1R9k98J9L31l15J76l21N22K6k79R4j51K00J46j46L0j09K89l67O9J62L1
7012A98K28m54L77k57j1K78k41j0J41j92j83J7J59n3J57j82j05M67m79K60J00
$$ plain form
7033 215 -169 -52 -270 206 -150 -82 -57 -137 -276 -204 -263 -101 72 -145 -264 -230 -398 -103 -20 144 -107 -86 -194
7056 -194 130 -8 -100 -157 -11 63 -191 52 -174 -156 -180 16 22 -17 143 -179 29 -89 -67 44 -19 57 130 234
7080 234 -57 305 402 118 222 49 -216 120 147 90 263 26 -1 -35 150 -114 217 114 321 202 89 28
7102 28 -16 164 -59 5 -80 2 146 75 -34 -174 -29 180 68 -143 -74 -141 -161 63 -17 62 -254 -203 -312 102
7126 102 -175 -62 -87 -153 -184 -169 -151 -286 -69 -388 -429 -42 131 -267 -61 -183 39 130 101 2 114 144 48 -121
7150 -121 86 124 179 -18 22 -48 164 199 248 231 -176 207 261 203 251 216 124 127 199 145 263 69 138 288 304 109
7176 109 25 130 30 56 116 -51 -4 111 269 -36 -30 -42 -202 -76 108 -145 -112 -1 -175 30 74 -261 -332
7199 -332 -39 -170 -364 -5 -14 -196 -93 -302 -1 57 79 -75 -80 -26 -103 80 -195 -178 -100 206 -115 16 17 -71
$$ packed form
7033B15l84J17k18M76l56O8K5q0j39P2n9J62J73k17j19L4j68K95Q3J64k51K1j08
7056a94L24j38r2n7J46P4k54K43k26J8k4J96Ol9J60l22K08j18K2J11o3P6P3J04
7080B34k91L62R7k84J04j73k65L36K7n7J73k37k7l4J85k64L31j03K07j19j13o1
7102B8m4J80k23O4q5Q2J44p1j09j40J45K09j12k11O9o7k0K24q0P9l16N1j09M14
7126A02k77J13k5o6l1J5J8j35K17l19m1L87J73l98K06j22K22R1k9r9J12L0r6j69
7150a21K07L8N5j97M0p0K12L5M9j7m07L83N4n8M8l5r2LP2n4J18j94O9J50J6j95
7176A09q4J05j00K6O0j67M7J15J58l05Oj2j60J26J84k53L3J11j74K05M4l35p1
7199c32K93j31j94L59rj82J03k09L01N8K2j54nN4p7J83k75J7P8L06l21J31Jq8
$$ plain form
7223 -71 -13 169 130 -33 196 341 -123 186 89 134 384 124 189 -30 20 -60 181 135 248 156 113 38 197 -51
7247 -51 103 41 154 88 -59 69 -47 90 -39 -158 98 140 67 -71 105 16 -18 -149 -12 -138 -117 -288 -214
7270 -214 -59 -101 -109 -119 124 -60 24 135 -103 -172 126 -186 60 -91 -99 -204 -83 22 143 -84 -368 -98 21
7293 21 207 35 78 -187 73 143 406 -107 -150 -127 -29 185 149 -64 204 146 75 226 278 -173 -64 192 -61
7316 -61 39 82 190 133 76 198 31 -74 132 -115 79 227 -137 -83 2 -133 -52 123 -176 -6 -317 -103
7338 -103 104 -70 143 -173 -109 -214 40 -73 -226 1 -286 -392 -84 -193 -93 -38 -137 -59 -5 -89 -43 -57 -18
7361 -18 -75 82 96 41 68 179 -48 122 -151 -114 -100 -60 -76 79 32 188 -5 249 44 -49 144 80 49 336
7385 336 97 81 166 208 100 225 53 201 223 309 -252 -153 -74 90 90 242 56 113 -26 -150 111 -123 171
$$ packed form
7223g1N8J82l9j63K29J45m64L09r7M5K50k60O5k19N0q0K41m6J13r2m3p5J59k48
7247e1J54o2J13o6j47J28j16J37j29j19K56M2p3j38J76q9l4j31J37j26K1j71P4
7270b14J55m2qj0K43j84Q4J11k38o9K98l12K46j51qj05J21J05J21k27k84K70J19
7293B1J86j72M3k65K60P0K63n13m3K3R8K14l6k13K68n8p1J51N2m51J09K56k53
7316f1J00M3J08n7n7J22j67j05K06k47J94J48l64N4Q5j35Q1J75k99J70l11K14
7338a03K07j74K13l16O4j05K54j13j53K27k87j06L08j09J00N5r9P8N4q4M6j4L9
7361a8n7J57J4n5K7J11k27J70k73L7J4M0j6J55m7J56j93K54k05r3J93o4l1K87
7385C36k39j6Q5M2j08J25j72J48K2Q6n61R9P9J64%J52j86N7j39j24K61k34K94
$$ plain form
7408 171 165 -229 67 -110 22 -112 63 -198 42 113 -40 -242 -261 -46 -158 161 -238 -72 -165 -359 -3 -241
7430 -241 -300 34 -10 -152 122 -129 6 46 -196 -201 83 219 178 -41 89 253 159 37 245 -64 -33 52 79
7453 79 88 101 -27 199 -99 -85 127 190 -68 113 248 106 -94 210 95 29 96 102 -205 -194 -3 81 -60 125
7477 125 45 200 54 -166 80 -255 -71 -141 -124 -112 -220 -185 -144 9 70 -26 -63 -51 -152 -182 33 -162 -5 60
7501 60 -26 -221 294 -270 -130 -174 17 -251 123 -138 -10 -196 -39 146 -110 -191 -35 197 -19 -69 -231 -66
7523 -66 178 -38 -113 79 33 246 -35 276 -14 200 318 -156 77 150 244 -90 -19 188 154 -48 -113 49 396
7546 396 -105 10 58 181 -159 161 38 17 -54 -195 -136 -114 -140 -18 161 82 -55 -101 -85 -222 -328 -91 -141
7569 -141 -30 11 89 -22 -76 -104 70 -68 -187 39 56 -195 -24 -27 -140 115 -105 -22 -237 94 -9 21 114
$$ packed form
7408A71ol94K96j77J32j34J75k61K40P1j53k02j9K15j12L19l99J66r3j94L56k38
7430b41n9L34m4j42K74k51J35M0k42nK84J36m1k19J30J64r4j22K08l09L1Q5K7
7453G9RJ3j28K26k98J4K12O3k58J81J35j42k00L04j15o6O7Ol07J1J91Q4j41J85
7477A25q0J55j46k20K46l35J84p0J7J2j08L5M1J53O1r6l7J2j01l0K15j95J57O5
7501F0q6j95N15n64J40m4J91k68L74k61J28j86J57J85k56q1J56K32k16n0j62J65
7523f6K44k16p5J92m6K13k81L11k90K14J18m74K33P3R4l34P1K07l4k02o5J62L47
7546C96n01J15M8J23l40L20j23k1p1j41N9K2k6J22J79p9j37m6J6j37j06K37n0
7569a41J11M1P8j11n4k8J74j38j19K26J7k51J71lj13K55k20Q3k15L31j03L0R3
$$ plain form
7592 114 -108 128 180 213 6 122 104 -135 99 78 -140 153 251 65 230 87 74 -80 101 -1 244 179
7614 179 -160 -7 -116 120 -151 -119 45 97 -82 -50 5 11 -58 -87 66 -15 -172 -25 -61 -22 -305 -83 -154 -125
7638 -125 70 -72 -186 -123 34 -82 14 -200 -22 43 -64 -56 -66 -312 31 -103 -243 -119 -124 -142 -49 45 68 129
7662 129 -275 18 53 90 101 -141 184 103 -201 264 -56 202 381 108 3 124 96 134 150 108 183 156 233 -214
7686 -214 290 129 34 214 61 -74 271 83 145 92 103 -37 -155 210 110 -92 -98 -97 2 -169 -159 -170 -308 84
7710 84 -197 -159 -9 -210 19 -157 -155 97 -46 29 -54 -29 -15 -70 -161 -177 -125 -293 -148 56 47 -198 -42 51 -65
7735 -65 63 358 -92 -115 68 122 38 176 -76 -122 129 127 -131 37 20 -80 127 326 42 138 -40 79 4
7758 4 299 198 62 151 184 145 90 278 144 72 -86 361 26 -137 402 50 24 -33 -5 130 -40 -67 -55 157
$$ packed form
7592A14k22K36N2L3k07J16j8k39K34k1k18K93R8j86J65j43j3j54J81j02K45o5
7614A79l39J53j09K36k71L2J64N2j79L2N5Oo9k9J53q1j57J47l6L9k83K22p1K9
7638a25J95j42j14O3J57j16R6k14J78O5j07Qj0k46L43j34j40J24nj8R3R4K3O1
7662A29m04K93L5L7J1k42L25q1l04M65l20K58J79k73j05J21k8L8J6m2P5k7P7m47
7686b14N04j61r5J80j53j35L45j88O2n3J1j40j18L65j00k02oJR9j71J0j1j38L92
7710H4k81L8J50k01K29j76KK52j43P5q3K5J4n5r1j6N2j68J45K04rk45J56R3j16
7735f5J28K95m50k3J83N4q4J38k52m6K51kk58J68j7j00K07J99k84R6j78J19p5
7758DK95j01j36Q9L3l9n5J88j34p2j58M47l35j63N39l52k6n7K8J35j70k7J2K12
$$ plain form
7782 157 -255 -210 -107 42 -71 -281 -161 68 -160 93 -82 -7 120 -78 -82 -261 -20 46 -142 -72 97 -61
7804 -61 -71 112 -62 -66 -62 259 -196 -84 157 -53 -9 -95 -56 -156 104 136 185 -134 -96 145 269 -101 146 -132
7828 -132 -8 -9 131 14 164 111 124 78 116 27 -23 -25 -176 137 -37 51 116 215 -142 129 221 72 -26 132 -74
7853 -74 -47 -55 -56 -117 38 -159 -192 187 -50 92 77 -322 13 -214 -141 15 130 128 -25 13 -163 -172 -52 -99 -17 -82
7879 -82 66 301 -169 -7 187 -7 -183 -24 -157 109 -118 -34 29 80 -24 126 -319 76 36 88 -29 256
7901 256 -298 -79 180 251 -120 26 107 198 171 82 212 302 106 -23 157 133 258 -52 112 110 51 -262 30
7924 30 -76 100 44 -64 -1 -90 -134 61 -154 -123 30 -110 -84 -111 1 -43 -197 -15 242 -384 32 -170 -183
7947 -183 84 -343 98 174 -105 104 -252 -47 64 -169 43 102 79 -154 49 -90 -73 187 11 -132 3
$$ packed form
7782A57m12M5J03J49j13k10J20K29k28K53j75P5J27j98mj79K41O6j88P0J69j58
7804f1j0J83j74mML21m55J12K41k10M4q6L9j00K60L2M9l19L8K41J24l70K47k78
7828a32J24jJ40j17J50n3J3m6L8q9n0kj51L13j74Q8O5R9l57K71R2j49r8J58k06
7853g4K7qjo1J55j97l3L79k37J42j5l99L35k27P3J56J15kj53L8j76rJ20m7Q2o5
7879h2J48K35m70J62J94j94j76J59j33K66k27Q4O3N1j04J50m45L95m0N2j17K85
7901B56n54K19K59P1l71J46Q1R1k7q9J30R0j96j29J80k4J25l10J64kn9l13K92
7924C0j06J76n6j08O3q9m4J95k15L1J53j40K6k7J12m4j54J82K57o26M16k02j3
7947a83K67m27M41P6k79K09l56K05J11k33K12N9k3k33K03j39J7K60j76j43J35
$$ plain form
7968 3 -52 -25 -46 -87 -104 -42 82 -197 204 -110 310 196 -117 81 139 142 54 21 200 18 98 56 -175 -7 45
7993 45 74 -96 -102 44 -31 -10 -32 -70 100 79 57 -60 10 -66 -97 8 12 68 -55 -109 110 -14 70 -153 123 -13
8019 -13 257 118 -64 123 -158 134 21 100 -97 -239 19 -114 -137 80 -68 -124 -81 100 -149 199 -146 -111
8041 -111 44 230 -22 94 -120 68 -90 166 -137 125 -50 82 105 99 -142 48 13 -46 156 -119 -227 85
8063 85 94 54 230 -235 170 -49 -175 -50 129 208 88 -1 24 238 111 -92 -143 -46 37 -240 136 -76 -178
8086 -178 -1 -136 -55 111 -8 -224 9 -164 -20 -80 14 -25 90 -160 -6 -86 -178 70 16 -123 -26 -96 -67
8109 -67 69 -84 12 143 -28 12 276 -43 100 29 33 -57 -68 211 96 -107 68 -100 115 -17 -45 188 34
8132 34 -79 213 107 240 134 115 355 37 232 -61 229 1 118 39 109 251 11 302 -272 97 171 3
$$ packed form
7968Cn5K7k1m1j7O2J24k79M01l14M20j14l13J98N8Lq8l3J79j82Q0m2k31J68N2
7993D5K9j70oJ46p5K1k2l8J70k1k2j17P0p6l1J05MN6j23n4K19j24Q4k23K76j36
8019a3K70j39j82J87k81K92j13P9j97j42K58j33k3K17j48n6M3J81k49L48l45L5
8041a11J55J86k52J16k14J88j58K56l03K62j75J32K3ok41J90l5n9K02k75j08L12
8063H5Rm0J76m65M05k19j26J25J79P9j20q9K5K14j27k03n1R7Q3k77L76k12j02
8086a78J77j35Q1J66j19k16K33j73J44o0R4l9J15k50J54q0r2K48n4j39R7p0K9
8109f7J36j53R6J31j71M0K64l19J43p1Mr0j1K79j15k03J75j68K15j32k8K33j54
8132C4j13K92j06J33j06j9K40l18J95k93K90k28J17p9P0J42k40K91n74L69P4j68
$$ plain form
8154 3 262 64 -58 92 26 -107 72 -4 -176 266 -25 -149 15 15 -183 -138 -34 -81 -46 -187 102 63 34 -38
8178 -38 -10 102 87 -206 274 122 -235 19 -37 53 74 165 133
$$ packed form
8154CK59j98j22J50o6j33J79p6j72M42k91j24J64%j98M5J04m7L5j41K89l9k9p2
8178c8K8J12j5k93M80j52l57K54n6R0K1R1l2
8191A33
$$ Imaginary data points
##PAGE= N=2
##DATA TABLE= (X++(I..I)), XYDATA
$$ plain form
0 0 0 0 0 0 0 0 -8 8 -8 8 -16 16 -24 32 -40 48 -59 72 -88 104 -128 152 -179 211 -249 289 -335 386 -444
29 -444 510 -582 662 -755 853 -959 1080 -1213 1357 -1515 1691 -1879 2086 -2312 2560 -2828
45 -2828 3123 -3446 3798 -4183 4606 -5073 5590 -6162 6801 -7518 8326 -9246 10308 -11544
59 -11544 13008 -14768 16937 -19675 23261 -28163 35293 -46601 67244 -116679 466298 290836
71 290836 -479934 326617 -390987 244790 489402 -658205 104064 214468 -239289 499739
81 499739 -313110 -240805 478776 -271182 138727 237820 -406443 294943 9894 -158137
91 -158137 388194 -306160 -191321 244157 -145580 200656 -67791 -376635 276993 87130
101 87130 -114818 -29320 -272441 177408 249135 -225972 -117568 -82888 48363 182333 -174475
$$ packed form
0@%%%%%%qJ6j6J6k4L2m0N6p2Q8j07J31j60J92k32K80l31L90m60N38o24P21q30
29d44R54j092J244j417J608j812K039k293K570k872L206l570L965m398M872n388
45b828N951o569P244p981Q789r679J0663j1752J2963j4319J5844j7572J9554k1852
59a1544K4552k7776L1705l6612M2936n1424O3456q1894J13845j83923N82977j75462
71B90836p70770Q06551p17604O35777K44612j147607P62269J10404m53757P39028
81D99739q12849P2305P19581p49958M09909R9093o44263P01386k85049j68031
91a58137N46331o94354J14839M35478l89737L46236k68447l08844O53628j89863
101H7130k01948Q5498k43121M49849P1727m75107J08404L4680J31251J33970l56808
$$ plain form
112 -174475 -135435 69703 33299 54909 -76345 -88273 61119 20649 -10178 -25497 -38548
123 -38548 -27583 -39745 7367 -6232 -45139 -57300 -41055 98836 70264 -50583 -24074 -4822
135 -4822 100867 69937 -94014 14804 65648 51010 30092 -152207 -31423 87966 -24825
146 -24825 37978 -45642 -22474 144320 -44741 -4882 68908 -54087 113816 15398 -60880
157 -60880 139070 -52665 -9092 84196 -125124 66122 8556 -114062 161609 -25948 -44933
168 -44933 100767 -146121 55254 73521 -153441 113335 -9729 -74091 123960 -145537
178 -145537 -16465 111038 -132202 75254 6282 -105669 137179 -74999 -58077 96196
188 96196 -129105 20013 17198 -138712 82442 -36170 -85155 73329 -94453 -1778 63394
$$ packed form
112a74475L9040K05138l6404K1610j31254j1928J49392m0470l0827j5319j3051
123c8548J0965j2162M7112j3599l8907j2161J6245J39891k8572j20847K6509J9252
135d822J05689l0930j63951J08818N0844j4638k0918j82299J20784J19389j12791
146b4825O2803q3620K3168J66794j89061L9859P3790j22995J67903r8418p6278
157f0880J99950j91735M3573R3288k09320J91246n7566j22618K75671j87557j8985
168d4933J45700k46888K01375J8267k26962K66776j23064o4362J98051k69497
178a45537J29072J27503k43240K07456o8972j11951K42848k12178J6922J54273
188I6196k25301J49118k815j55910K21154j18612m8985J58484j67782R2675O5172
$$ plain form
199 63394 -79297 74985 24390 -53743 67572 -46371 -9195 59203 -58752 26715 6744
210 6744 -63035 27920 -37280 -14601 54798 -23131 31331 32915 -11505 56490 8613 6402 50947
223 50947 -5404 27557 27679 -8517 38535 -826 -14441 17828 -18790 16560 33504 2824
235 2824 36530 9401 -17603 10475 -13942 -65 27543 -1688 9677 8319 -21777 -2872
247 -2872 -3277 -12547 12685 1019 -10665 8951 -11783 -18649 -4774 -35561 -30700 -14590 -38898
260 -38898 -9044 -744 -28419 1457 -17921 -33571 13758 -9406 1465 35710 -17484 -2401
272 -2401 2471 -46092 1558 -5436 -34495 15910 -22314 -29351 17241 -25853 3642 32819 -14697
285 -14697 28254 26147 -9741 42875 12922 -5768 37191 -11171 -424 34820 -14857 16761
$$ packed form
199F3394j42691J54282n0595p8133J21315j13943L7176O8398j17955Q5467j9971
210F744o9779R0955o5200K2679O9399p7929N4462J584m4420O7995m7877k211M4545
223E0947n6351L2961J22l6196M7052l9361j3615L2269l6618L5350J6944l0680
235B824L3706k7129k7004K8078k4417J3877K7608k9231J1365j358l0096J8905
247b872m05r270K5232j1666j1684J9616k0734o866J3875l0787M861J6110k4308
260c8898K9854Q300k7675K9876j9378j5650M7329k3164J0871L4245n3194J5083
272b401M872m8563M7650o994k9059N0405l8224p037M6592m3094K9495K9177m7516
285a4697M2951k107l5888N2616k9953j8690M2959m8362J0747L5244m9677L1618
$$ plain form
297 16761 23119 -27262 19920 10764 -11820 47475 14047 829 36524 -19761 -4634 28300
309 28300 -15878 25351 28456 -19877 23593 -443 -24210 29099 -8419 -6667 30696 -23775
321 -23775 -1293 13627 -40460 -1130 -11283 -49236 8566 -12808 -22086 30508 -18998 -17245
333 -17245 15772 -36234 -345 22790 -22571 21333 2640 -44676 139 -31392 -39735 14035
345 14035 -30000 -16235 15956 -35744 3341 13794 -27875 26580 8140 -16215 39022 -3397
357 -3397 -3475 34950 -24471 -2132 14803 -32634 19974 18477 -15165 27886 -5695 -13187 32331
370 32331 -2949 11558 35315 -2455 17998 13525 -15576 18902 18357 5314 24424 4853 -1874
383 -1874 20437 3364 -1567 17149 -1896 -1823 16060 -13344 -6385 10731 -25719 -1978 5533
$$ packed form
297A6761O358n0381M7182r156k2584N9295l3428j3218L5695n6285J5127L2934
309B8300m4178M1229L105m8333M3470k4036k3767N3309l7518J752L7363n4471
321b3775K2482J4920n4087L9330j0153l7953N7802k1374r278N2594m9506J753
333a7245L3017n2006L5889K3135m5361M3904j8693m7316M4815l1531q343N3770
345A4035m4035J3765L2191n1700L9085J0453m1669N4455j8440k4355N5237m2419
357c397p8L8425n9421K2339J6935m7437N2608j497l3642M3051l3581p492M5518
370C2331l5280J4507K3757l7770K0453m473k9101L4478n45j3043J9110j9571o727
383a874K2311j7073m931J8716j9045P3J7883k9404O959J7116l6450K3741P511
$$ plain form
396 5533 -30564 18583 12313 -13810 31560 -20671 -26056 27894 -27196 3611 19475 -45376 15095
409 15095 -11432 -62564 8018 -36040 -20562 35719 -48316 -3716 20906 -39703 31150 -6582
421 -6582 -39691 43115 -15401 -6368 32355 -42855 10457 14291 -45638 12985 -15849 -14578 48772
434 48772 -10559 -4655 10728 -23226 30394 17102 -13180 25916 8361 16553 21633 -19830 5360
447 5360 22174 16576 21042 -5481 -434 18316 17460 13087 -10219 -6312 8222 10234 16732 -12898
461 -12898 -12368 14217 5933 12624 -10761 -20149 31660 24343 6342 -12556 -40418 15570 24037
474 24037 -15156 -12009 -36394 -624 21737 -43294 -27185 -17364 -7170 40227 -23493 -29834 9586
487 9586 -17786 28533 209 -47733 14644 -14833 4017 32524 -57841 -11541 3130 -29478
$$ packed form
396E533l6097M9147o270k6123M5370n2231n385N3950n5090L0807J5864o4851O0471
409A5095k6527n1132P0582m4058J5478N6281q4035M4600K4622o0609P0853l7732
421f582l3109Q2806n8516R033L8723p5210N3312L834n9929N8623k8834J271O3350
434D8772n9331N904J5383l3954N3620j3292l0282L9096j7555Q192N080m1463K5190
447E360J6814n598M466k6523N047J8750q56m373k3306L907J4534K012O498k9630
461a2898N30K6585q284O691k3385r388N1809p317j8001j8898k7862N5988Q467
474B4037l9193L147k4385L5770K2361o5031J6109R821J0194M7397o3720o341L9420
487I586k7372M6319k8324m7942O2377k9477J8850K8507r0365M6300J4671l2608
$$ plain form
499 -29478 39898 -35670 -41126 56498 -5876 18544 -1115 -76760 52944 39691 -19798 31108
511 31108 -45717 18227 75082 -50670 2134 8569 -16241 80253 -18175 -37310 49811 -20775
523 -20775 31289 25998 -61742 33782 12083 -9310 57950 -30502 -10134 36456 -20552 37537
535 37537 7191 -35533 42746 8218 1782 4901 -52735 14091 28030 -16114 -4020 -39586
547 -39586 -3158 30166 -24413 -10776 -12889 -1230 33902 -22068 -14896 4519 -13805 22164
559 22164 -19810 -31604 15904 -24177 1267 4638 -45314 8574 -14224 -27750 32549 -20791
571 -20791 -5163 23380 -33366 17990 4201 -37454 33647 907 -4989 30397 -36459 3612
583 3612 28595 -27228 18944 1877 -16640 40812 -7901 -10401 28776 -14892 8759 15382 -19706
$$ packed form
499b9478O9376p5568n456R7624o2374K4420j9659p5645J29704j3253n9489N0906
511C1108p6825O3944N6855j25752N2804O435k4810R6494r8428j9135Q7121p0586
523b0775N2064n291q7740R5524k1699k1393O7260q8452K0368M6590n7008N8089
535C7537l0346m2724P8279l4528o436L119n7636O6826J3939m4144J2094l5566
547c9586L6428L3324n4579J3637k113J1659L5132n5970P172J9415j8324L5969
559B2164m1974j1794M7508m0081K5444L371m9952N3888k2798j3526O0299n3340
571b0791J5628K8543n6746N1356j3789m1655P1101l2740n896L5386o6856M0071
583C612K4983n5823M6172j7067j8517N7452m8713k500L9177m3668K3651O623l5088
$$ plain form
596 -19706 26621 20387 -6425 22667 1556 -2348 21077 -4500 5344 28154 1671 1560 4329
609 4329 -15106 6772 8310 -17527 6562 4752 -11716 13502 -9422 -11996 23159 -10427 -3604
622 -3604 15467 -21171 11102 9245 -28214 11246 -14169 -27718 16138 -23061 -9660 11068
634 11068 -37211 1444 1338 -29682 17302 -9468 -10794 25185 -26135 -8520 10598 -21465 18455
647 18455 -795 -24271 18325 -10624 -7761 11083 -21776 9185 11867 -13974 12923 -2506
659 -2506 -168 18682 -10623 2715 9084 -1755 20965 6727 4262 16577 -4486 7353 8600
672 8600 116 19179 5123 4338 11831 -9562 2475 2282 -4732 15469 -1421 -888 13226 -4691
686 -4691 9625 5657 -10025 14417 1204 -3782 11602 -9666 1778 4467 -21999 -4094 -7988
$$ packed form
596a9706M6327o234k6812K9092k1111l904K3425k5577R844K2810k6483j11K769
609D329j9435K1878J538k5837K4089j810j6468K5218k2924k574L5155l3586O823
622c604J9071l6638L2273j857l7459L9460k5415j3549M3856l9199J3401K0728
634A1068m8279L8655j06l1020M6984k6770j326L5979n1320J7615J9118l2063L9920
647A8455j9250k3476M2596k8949K863J8844l2859L0961K682k5841K6897j5429
659b506K338J8850k9305J3338O369j0839K2720j4238k465J2315k1063J1839J247
672H600q484J9063j4056p85P493k1393J2037j93p014K0201j6890N33J4114j7917
686d691J4316l968j5682K4442j3213m986J5384k1268J1444K689k6466J7905l894
$$ plain form
699 -7988 -13010 8010 -11247 -9097 2676 -17049 -3163 -1551 -11677 8923 -2604 -9447 2408
712 2408 -12973 -6201 1021 -12150 -672 -3616 -12183 -16 -5641 -5943 1378 -6986 -2091 2529
726 2529 -2853 3113 1990 -195 3452 -981 678 6375 5994 8405 6228 1885 3497 2742 3862 7058
742 7058 7065 7309 4609 1097 1324 1155 3990 5904 5301 7783 6555 4835 7298 4850 4604 6264 1837
759 1837 3706 5362 646 2968 -759 -7042 -4258 -6601 -6282 1516 -1528 -1329 742 -7410 -4562 -2324
775 -2324 -5422 2325 259 -5169 -358 -7885 -9232 -2877 -10394 -6844 -2615 -11354 -3371 -2674 -9632
790 -9632 99 -5020 -8896 1724 -5761 -2460 6591 -4987 21 2106 -8847 3238 3226 -2559 9976
805 9976 789 -3019 7655 -4526 1809 10348 -2663 7330 6098 -6240 8575 3541 -1127 14140
$$ packed form
699g988n022K1020j9257K150J1773j9725J3886J612j0126K0600j1527o843J1855
712B408j5381O772P222j3171J1478k944q567J2167n625l02P321q364M895M620
726B529n382N966j123k185L647m433J659N697l81K411k177m343J612p55J120L196
742G058PK44k700l512K27j69K835J914o03K482j228j720K463k448k46J660m427
759A837J869J656m716K322l727o283K784k343L19P798l044J99K071q152K848K238
775b324l098P747k066n428M811p527j347O355p517L550M229q739P983O97o958
790i632R731n119l876J0620p485L301R051j1578N008K085j0953J2085j2n785J2535
805I976r187l808J0674j2181O335Q539j3011R993j232j2338J4815n034m668J5267
$$ plain form
819 14140 2292 3943 14685 -291 8322 11690 -2543 9727 5100 -3522 11029 777 -2327
832 -2327 7742 -7669 -3958 3878 -6613 5822 7020 -5404 5133 -1283 -6768 5735 -3742
845 -3742 -2407 7089 -7295 -4721 -1869 -13386 -2777 -3103 -12912 -968 -5363 -8490 2876 -7787
859 -7787 -7326 510 -9931 -3620 992 -7432 2160 86 -7458 -458 -6571 -6319 4415 -364 245
874 245 1631 -5010 238 2302 -2753 211 2638 2073 3530 1374 -1221 4488 8483 2719 4903 6239
890 6239 2041 12171 7582 -826 10304 735 231 12216 -4802 3556 9887 -8781 9138 2904
904 2904 -11495 15959 1878 527 18332 -14044 2178 15283 -14495 10836 379 -16019
916 -16019 20590 -10944 -15711 12560 -19951 3163 9290 -28207 10588 1350 -18084 17012 -16873
$$ packed form
819A4140j1848J651J0742j4976Q613L368j4233J2270m627q622J4551j0252l104
832b327J0069j5411L711P836j0491J2435J198j2424J0537o416n485J2503r477
845c742J335R496j4384K574K852j1517J0609l26r809J1944m395l127J1366j0663
859g787M61P836j0441O311M612q424R592k074p544P000o113K52J0734m779O09
874B45J386o641N248K064n055K964K427n65J457k156k595N709L995n764K184J336
890F239m198J0130m589q408J1130r569n04J1985j7018Q358O331j8668J7919o234
904B904j4399K7454j4081j351J7805l2376J6222J3105k9778K5331j0457j6398
916a6019L6609l1534m767K8271l2511K3114O127l7497L8795r238j9434L5096l3885
$$ plain form
929 -16873 -12265 16461 -22693 2098 8862 -24030 11885 -5183 -20538 14416 -16804 -7161 18380
942 18380 -17193 2546 3013 -21424 14513 -966 -15714 13335 -8186 1126 14260 -16696 5640
955 5640 12548 -7701 11912 -1116 -3940 21284 -1359 -2094 10032 -7369 7573 7033 -9405
968 -9405 12178 5770 -3642 11384 -2819 1626 14791 -2312 8450 11181 -6543 7893 2980
981 2980 -4125 11377 -6120 -4716 10606 -8008 -377 790 -11605 11260 -380 -13051 7520
994 7520 -5394 1040 7712 -19609 695 4866 -13232 6166 -9689 -9940 13234 -16018 -8224
1007 -8224 3593 -16542 9319 -904 -17681 11109 -11291 -9670 11040 -17603 2752 6549
1019 6549 -18046 14057 -797 -13366 14969 -9266 1400 14970 -17696 8792 11608 -10387
$$ packed form
929a6873M608K8726l9154K4791O764l2892L5915j7068j5355L4954l1220R643K5541
942A8380l5573J9739M67k4437L5937j5479j4748K9049k1521R312J3134l0956K2336
955E640O908k0249J9613j3028k824K5224k2643p35J2126j7401J4942n40j6438
968i405K1583o408r412J5026j4203M445J3165j7103J0762K731j7724J4436m913
981B980p105J5502j7497J404J5322j8614P631J167j2395K2865j1640j2671K0571
994G520j2914O434O672k7321K0304M171j8098J9398j5855k51K3174k9252P794
1007h224J1817k0135K5861j0223j6777K8790k2400J621K0710k8643K0355L797
1019F549k4595L2103j4854j2569K8335k4235J0666J3570l2666K6488K816k1995
$$ plain form
1031 -10387 13323 -8136 -8376 20332 -8145 399 12676 -8313 16133 5565 -12653 17303
1043 17303 4189 1802 16244 -8558 5827 13703 -9558 7574 2922 -6597 12375 -3856 -3870
1056 -3870 10954 -6163 2454 7427 -7604 5620 1281 -5558 10102 -2873 -7472 3232 -7084
1069 -7084 387 2128 -11874 760 1241 -8257 -1286 -8888 -5196 7174 -6628 -6733 -2354 -8344
1083 -8344 2064 -2896 -11195 1588 -2529 -2864 2674 -8863 -794 3262 -5492 3003 -2891 -5858
1097 -5858 6742 -2010 -789 1985 -9274 2484 4250 -2711 6899 -1008 1775 11631 -2833 2254
1111 2254 5675 -429 13192 3308 -3780 8844 -1063 3668 7630 -7693 5787 5805 -2766 10704
1125 10704 -955 -1116 11683 -3310 3331 5988 -6976 9053 3970 -5959 5981 -7128 -2909
$$ packed form
1031a0387K3710k1459k40K8708k8477Q544J2277k0989K4446j0568j8218K9956
1043A7303j3114k387J4442k4802J4385P876k3261J7132m652r519J8972j6231j4
1056c870J4824j7117Q617M973j5031J3224m339o839J5660j2975m599J0704j0316
1069g084P471J741j4002J2634M81r498O971p602L692J2370j3802j05M379n990
1083h344J0408m960q299J2783m117l35N538j1537Q069M056q754Q495n894k967
1097e858J2600q752J221K774j1259J1758J766o961R610p907K783R856j4464N087
1111B254L421o104J3621r884p088J2624r907M731L962j5323J3480J8q571J3470
1125A0704j1659j61J2799j4993O641K657j2964J6029n083r929J1940j3109M219
$$ plain form
1138 -2909 8532 -7806 48 2252 -8790 5439 -3250 -10383 5161 -5447 -3647 3266 -12206
1151 -12206 -1522 1813 -10089 2252 -3751 -8601 4862 -6242 -4216 3633 -9047 -1096 1321
1164 1321 -9199 1871 -2152 -6951 5000 -5157 -5402 3533 -4916 2926 5547 -4884 4966 3047
1178 3047 -2684 6632 -302 338 8594 -1448 1561 4485 -3098 4792 3283 -1876 6711 2351 1394
1193 1394 8071 1200 3741 6381 -779 4252 4835 135 5300 1976 -997 3392 -1413 -898 3557
1208 3557 -564 1505 1573 -2714 573 -400 -3159 570 -1600 -2346 -465 -3492 -2974 -793 -3241 -2564
1224 -2564 -1694 -3772 -1812 -1633 -3423 -1838 -3281 -4703 -3087 -4313 -3752 -1544 -3479 -3261 -2001 -3656
1240 -3656 -1743 -659 -1075 952 327 -955 293 -831 -564 1228 13 446 1014 -682 791 1053
$$ packed form
1138b909J1441j6338P854K204j1042J4229q689p133J5544j0608J800O913j5472
1151a2206J0684L335j1902J2341o003m850J3463j1104K026P849j2680P951K417
1164A321j0520J1070m023m799J1951j0157k45Q935q449P842K621j0431R850j919
1178C047n731R316o934O40Q256j0042L009K924p583P890j509n159Q587m360r57
1193A394O677o871K541K640p160N031N83m700N165l324k973M389m805N15M455
1208C557m121K069O8m287L287r73k759L729k170p46J881l027N18K181k448O77
1224b564Q70k078J960J79j790J585j443j422J616j226N61K208j935K18J260j655
1240c656J913J084m16K027o25j282J248j124K67J792j215M33N68j696J473K62
$$ plain form
1256 1053 674 2594 2190 2161 3653 3153 3600 4345 2660 2713 2994 2414 3269 3124 2780 3018 1631 1229 1920
1275 1920 1676 2595 2734 2379 1755 1050 342 337 372 485 242 -272 -487 -715 -805 -960 -1329 -1615 -1794 -1640 -1609
1296 -1609 -2231 -2045 -2673 -3523 -3751 -3748 -3605 -2737 -2524 -2466 -2811 -3069 -2632 -2242 -1615 -1565 -894 -1193 -1920 -1483 -2045
1317 -2045 -2202 -631 -1857 -1122 -379 -2020 323 986 -112 2251 859 855 4157 1582 2556 3856 221
1334 221 3096 2550 -366 4109 2300 1803 4969 -114 1942 4513 431 4613 3653 -216 4943 1342
1350 1342 -181 4642 -537 1040 3701 -1801 2347 1959 -2560 2715 -36 -2470 1983 -2495 -1090
1365 -1090 2195 -4096 -2123 -622 -5136 -736 -1929 -4817 1197 -2117 -3743 -26 -4673 -2472 945
1380 945 -4866 -927 -427 -5233 -549 -2940 -5273 1019 -3903 -3512 1565 -4085 343 1742 -3955 2328
$$ packed form
1256A053l79J920m04k9J492n00M47P45j685N3K81n80Q55j45l44K38j387m02O91
1275A920k44R19J39l55o24p05p08nL5J13k43n14k15k28r0j55l69k86j79J54L1
1296a609o22J86o28q50k28LJ43Q68K13N8l45k58M37L90O27N0O71k99p27M37n62
1317b045j57J571j226P35P43j641K343O63j098K363j392mL302k575R74J300l635
1334B21K875n46k916M475j809m97L166n083K056K571m082M182r60l869N159l601
1350A342j523M823n179J577K661n502M148l88m519N275k751k434M453m478J405
1365a090L285o291J973J501m514M400j193k888O014l314j626L717m647K201L417
1380I45n811L939N00m806M684k391k333O292m922L91N077n650M428J399n697O283
$$ plain form
1396 2328 588 -2760 4062 -1046 -18 4407 -2732 1356 2973 -2594 4309 1725 -396 5858 -300
1411 -300 1440 5237 -110 4267 3409 -149 5712 1510 722 4378 -79 3777 3597 -1012 3314 1106
1427 1106 1304 3695 -1893 1008 1699 -844 2170 -1816 -1152 2029 -3125 -163 -925 -3488 2470 -1666
1443 -1666 -2301 793 -5151 -301 -134 -5487 624 -3655 -4056 1351 -6060 -3004 -716 -5808 1128 -2632
1459 -2632 -5360 2244 -2850 -1114 1886 -5839 263 1271 -3254 2622 -2440 -2241 3695 -2538 -418
1474 -418 428 -2117 4540 1891 -1527 2548 293 2910 4392 -1075 1936 3140 2564 4052 116 822
1490 822 4212 2958 2662 608 703 4023 3427 2516 276 -288 2094 2373 1722 490 -1168 1636 1630 552
1508 552 -505 -2185 1462 2478 -630 -1325 -3581 -1050 2094 -1940 -3087 -3588 -2604 1454 -2276 -5160
$$ packed form
1396B328j740l348O822n108J028M425p139M088J617n567O903k584k121O254o158
1411c00J740L797n347M377q58l558N861m202p88L656m457L856j80m609M326k208
1427A106J98K391n588K901O91k543L014l986O64L181n154K962p62k563N958m136
1443a666o35L094n944M850J67n353O111m279m01N407p411L056K288n092O936l760
1459b632k728P604n094J736L000p725O102J008m525N876n062J99N936o233K120
1474d18Q46k545O657k649l418M075k255K617J482n467L011J204n76J488l936P06
1490H22L390j254k96k054R5L320n96r11k240n64K382K79o51j232j658K804oj078
1508E52j057j680L647J016l108o95k256K531L144m034j147n01R84M058l730k884
$$ plain form
1524 -5160 -2815 -2436 816 -1114 -5223 -2101 -1142 270 -364 -5338 -2945 -383 -984 332 -3604 -3659
1540 -3659 807 -839 407 -1368 -3368 2634 1772 586 624 -2936 1727 3920 -147 1583 -1327 881
1556 881 5799 498 557 1337 69 5404 2841 -809 3196 1288 3868 4067 -2100 1474 2372 2010 4567
1573 4567 -549 -356 3344 893 2491 538 -1964 2599 1252 302 277 -2980 241 1378 -1755 -850
1589 -850 -2719 -1755 990 -1727 -1632 -1765 -2503 356 -1484 -2599 -1594 -2781 -895 -1459 -3655 -1908 -2638
1606 -2638 -1607 -65 -3496 -2177 -1458 -2072 532 -1347 -1894 781 -1102 70 156 -2081 1079 607
1622 607 -290 1379 -584 611 2486 -112 1424 1449 162 2526 1636 1462 2904 889 1246 2508 898
1639 898 2140 2580 1605 2970 1879 980 2145 1286 1338 1654 698 754 1494 339 453 804 -145 507 329
$$ packed form
1524e160K345L79L252j930m109L122R59J412o34m974K393K562o01J316l936n5
1540c659M466j646J246j775k000O002q62j186L8l560M663K193m067J730k910K208
1556H81M918n301N9P80j268N335k563l650M005j908K580J99o167L574Q98l62K557
1573D567n116J93L700k451J598j953k502M563j347r50k5l257L221J137l133R05
1589h50j869R64K745k717R5j33p38K859j840j115J005j187J886n64k196J747p30
1606b638J031J542l431J319P19o14K604j879n47K675j883J172Q6k237L160m72
1622F07q97J669j963J195J875k598J536K5j287K364q90j74J442k015L57J262j610
1639H98J242M40r75J365j091q99J165q59N2L16r56N6P40j155J14L51r49O52j78
$$ plain form
1658 329 -728 395 -40 -893 277 -1296 -1355 -191 -2013 -1376 -550 -2553 -1344 -1644 -3187 -1168 -1992
1675 -1992 -2656 -801 -2518 -1893 -832 -2717 -1029 -724 -2602 -272 -1510 -2170 -171 -1669 -1141 251
1691 251 -1659 -254 272 -1012 772 499 -618 1277 40 125 1688 438 883 1665 443 1643 1683
1708 1683 789 2424 2199 1332 2308 1374 1333 2307 1377 1783 2196 768 1374 1719 620 1526 1251 606 1205
1727 1205 829 336 1332 380 -53 570 -805 -386 -206 -1109 -214 -620 -1653 -1097 -1655 -1744 -884 -1566 -1584 -961
1747 -961 -2211 -1460 -1432 -2195 -1352 -1560 -1992 -1398 -1839 -1644 -854 -1922 -1466 -1016 -1617 -818 -577 -760 -214 -340
1767 -340 -502 -3 -48 -36 606 319 556 952 551 954 1352 1206 1432 1769 924 1839 1605 1033 1758 1619 1373
1788 1373 1794 1526 1376 1682 1347 1632 1602 1189 1650 1604 680 1427 559 496 759 -20 334 592 -591 139
$$ packed form
1658C29j057J123m35q53J170j573n9J164j822O37Q26k003J209l00j543K019q24
1675a992o64J855j717O25J061j885J688L05j878K330j238o60J999j498N28J392
1691B51j910J405N26j284J784k73j117J895j237Q5J563j250M45P82j222J200M0
1708A683q94J635k25q67R76r34m1R74r30M06M13j428O06L45j099R06k75o45N99
1727A205l76m93R96r52m33O23j375M19J80r03Q95m06j033N56n58q9Q60o82j8O23
1747i61j250P51K8p63Q43k08m32N94m41J95P90j068M56M50o01P99K41j83N46j26
1767c40j62M99m5J2O42k87K37L96m01M03L98j46K26L37q45R15k34n72P25j39k46
1788A373M21k68j50L06l35K85l0m13M61m6r24P47q68o3K63p79L54K58j183P30
$$ plain form
1808 139 -227 -1090 -234 -935 -932 -69 -1197 -675 -567 -1719 -941 -1455 -1508 -1148 -1925 -1560 -1318 -2124 -1295 -1480
1828 -1480 -1894 -1360 -1688 -1516 -803 -1864 -972 -573 -1416 -274 -1014 -718 301 -486 -135 117 -422 598
1846 598 582 321 918 548 550 1348 278 1127 1546 488 1611 1350 882 1811 1309 1551 2121 889 1256 2132
1866 2132 1118 1951 1384 440 1780 1152 124 912 556 793 1828 -121 -398 611 -505 788 166
1883 166 -1420 600 -452 -1389 57 -1802 -925 381 -2470 -1261 -494 -2568 -65 -1274 -2486 -95
1899 -95 -2557 -1736 306 -2668 -978 -930 -2916 809 -1299 -2784 820 -1849 -416 567 -3368 541
1915 541 699 -1467 1306 -1581 -637 3093 -938 280 1204 -832 3117 937 -845 2593 287 1470
1931 1470 2718 -870 1877 2125 -38 3122 631 119 3117 -86 1788 2243 -914 2411 1656 283
$$ packed form
1808A39l66q63Q56p01LQ63j128N22J08j152P78n14n3L60p77L65K42q06Q29j85
1828a480m14N34l28J72P13j061Q92L99q43J142p40K96J019p87L51K52n39J020
1846E98j6k61N97l70KP98j070Q49M19j058J123k61m68R29n02K42N70j232L67Q76
1866B132j014Q33n67r44J340o28j028P88l56K37J035j949k77J009j116J293o22
1883A66j586K020j052r37J446j859Q77J306k851J209P67k074K503j209j212K391
1899i5k462Q21K042k974J690M8j986L725k108j485L604k669J433R83l935L909
1915E41J58k166K773k887R44L730m031J218R24k036L949k180j782L438k306J183
1931A470J248l588K747K48k163L160k491n12K998l203J874M55l157L325p55j373
$$ plain form
1947 283 1888 -959 331 2749 -372 327 -357 -1271 2261 -207 -1872 51 -1266 600 480 -2815
1963 -2815 -761 -281 -814 148 -2591 -2157 317 -1473 -935 -1525 -2955 -356 -1013 -1894 -783 -2313 -1219
1980 -1219 180 -1465 -1148 -1042 -1684 647 255 -1752 -569 -627 65 1468 -1480 -1151 1009 676 1396
1997 1396 275 -1402 1804 1614 346 1345 -568 1102 3350 352 811 1271 -268 3296 1324 -173
2013 -173 2615 256 1625 3111 -1269 1216 1720 -453 3347 20 -1196 2040 -610 835 1461 -3081
2029 -3081 1238 1113 -1496 1894 -2156 -1164 2494 -2560 -332 -87 -3100 1358 -918 -2932 795 -2774
2045 -2774 -1186 833 -3669 -302 -613 -3165 1142 -1841 -2466 720 -2498 -252 326 -3050 460 -407
2061 -407 -1609 1393 -1478 -647 1571 -1276 506 532 -1390 1684 319 -514 1634 -114 1105 1775
$$ packed form
1947B83J605k847J290K418l121O99o84r14L532k468j665J923j317J866j20l295
1963b815K054M80n33R62k739M34K474j790N38n90j430K599o57q81J111j530J094
1980a219J399j645L17J06o42K331l92k007J183n8O92J403k948L29K160l33P20
1997A396j121j677L206j90j268R99j913J670K248k998M59M60j539L564j972j497
2013a73K788k359J369J486m380K485N04k173L800l327j216L236k650J445O26m542
2029c081M319j25k609L390m050R92L658n054K228K45l013M458k276k014L727l569
2045b774J588K019m502L367l11k552M307k983o25L186l218K246N78l376L510q67
2061d07j202L002k871Q31K218k847J782K6j922L074j365q33K148j748J219O70
$$ plain form
2077 1775 93 1250 1053 694 2171 897 872 2012 527 1453 1512 512 1407 1192 426 1462 583 543
2095 543 1037 499 548 599 147 614 677 -64 65 -136 -466 -236 -635 -842 -252 -715 -756 -340 -1391 -713 -746
2116 -746 -1463 -341 -1131 -1588 -649 -1435 -1289 -499 -1938 -1007 -1031 -1697 -328 -914 -1593 75 -1202 -817 36
2135 36 -1258 -341 -355 -902 157 -415 -384 1086 -99 594 1058 -409 913 760 421 1283 939 622 1437
2154 1437 551 951 1280 779 1293 1173 999 1379 1343 1116 1461 1129 769 890 1018 810 680 688 595 484 252
2175 252 182 653 200 55 370 -256 -321 -240 -946 -237 -285 -788 -350 -958 -1199 -489 -1277 -1011 -826 -1544 -972
2196 -972 -687 -1280 -536 -1024 -1279 -501 -1201 -877 -333 -1144 -812 -788 -1253 -146 -292 -642 84 -42 -341 332
2216 332 -403 68 747 33 805 716 231 747 651 468 1235 637 829 1503 738 1236 1324 1020 1357 1105 547
$$ packed form
2077A775j682J157j97l59J477j274k5J140j485R26N9j000Q95k15p66J036q79m0
2095E43M94n38M9N1m52M67O3p41J29k01l30K30l99k07N90m63m1M16j051O78l3
2116g46p17J122p90m57R39p86J46P90j439R31k4o66J369n86o79J668j277L85Q53
2135C6j294R17j4n47J059n72L1J470j185O93M64j467J322j53l39Q62l44l17Q15
2154A437q86M00L29n01N14j20j74L80l6k27L45l32l60J21J28k08j30Qr3j11k32
2175B52p0M71m53j45L15o26o5Q1p06P09m8n03M38o08k41P10p88K66J85p18N72
2196i72K85n93P44m88k55P78p00L24N44q11L32K4m65J107j46l50P26j26k99O73
2216C32p35M71O79p14P72q9m85N16r6j83P67n98J92O74p65M98Q8l04L37k52n58
$$ plain form
2237 547 1457 1009 598 1379 709 378 1213 378 530 1042 211 551 639 -175 424 -148 -611 231 -457 -494 63
2258 63 -905 -198 -17 -1234 -556 -649 -1399 -394 -1043 -1139 -465 -1560 -951 -700 -1547 -245 -992 -1307 -395 -1235
2278 -1235 -750 -565 -661 -366 -615 -758 -455 -491 -604 -4 -320 86 -174 -173 155 -8 305 638 333 805 640
2299 640 767 1235 537 1117 820 691 1261 837 507 1218 810 1015 932 256 1201 1220 746 1099 453 696 648
2320 648 558 573 317 151 669 311 -278 -21 15 133 -5 -404 -579 -813 -180 -585 -942 -828 -1245 -400 -788
2341 -788 -1566 -617 -1078 -782 -306 -1808 -897 -587 -1290 123 -1245 -1613 11 -988 -431 -231 -1950 272
2359 272 -233 -908 680 -1580 -107 1222 -835 457 73 -753 2037 177 -517 1110 -480 1258
2375 1258 1344 -764 1556 762 826 1940 -334 1126 1599 319 2167 595 -217 2085 191 1297 1173
$$ packed form
2237E47R10m48m11P81o70l31Q35q35J52N12q31L40Q8q14N99n72m63Q42o88l7N57
2258F3r68P07J81j217O78r3p50J005o49r6O74j095O09K51q47J302p47l15R12q40
2278a235M85J85r6K95k49j43L03l6j13O00l16M06k60JL28j63L13L33l05M72j65
2299F40J27M68o98N80k97j29N70m24l30P11m08K05q3o76R45J9m74L53o46K43m8
2320F48r0J5k56j66N18l58n89K57L6J18j38l99j75k34O33m05l57J14m17Q45l88
2341g88p78R49m61K96M76j502R11L10p03J413j368l68J624r99N57K00j719K222
2359B72n05o75J588k260J473J329k057J292l84q26K790j860o94J627j590J738
2375A258Q6k108K320p94O4J114k274J460M73j280J848j572q12K302j894J106j24
$$ plain form
2392 1173 -978 1433 862 -10 1314 -972 413 1546 -832 127 -517 -763 1718 -747 -865 -365 -1316
2409 -1316 738 -398 -1971 -73 -844 -615 -59 -2495 -696 -136 -1445 -158 -1693 -1290 -348 -1630
2425 -1630 -251 -620 -1852 -21 -840 -264 -54 -1507 -372 529 -329 -289 -1015 -201 1311 -114 -415 -455
2443 -455 377 1457 308 3 405 958 1828 256 267 1166 510 1817 263 197 1708 341 936 1627
2461 1627 75 1553 981 -84 2183 281 549 1315 -900 1706 1048 -1496 1453 -106 -219 943
2477 943 -1951 366 1546 -1582 389 -977 -874 1652 -2008 -1329 566 -1752 135 -1181 -2312 829
2493 829 -1229 -1490 220 -1672 -49 -377 -2099 410 -764 -1218 -208 -1498 186 441 -1667 -87
2509 -87 -383 -179 412 -1403 149 933 22 486 -311 354 1225 -471 545 541 412 1695 -205 466 1709
$$ packed form
2392A173k151K411n71q72J324k286J385J133k378R59o44k46K481k465j18N00r51
2409a316K054j136j573J898p71K29N56k436J799N60j309J287j535M03R42j282
2425a630J379l69j232J831q19N76K10j453J135R01q58M0p26Q14J512j425l01m0
2443d55Q32J080j149l05M02N53Q70j572J1Q99o56J307j554o6J511j367N95O91
2461A627j552J478n72j065K267j902K68P66k215K606o58k544K949j559j13J162
2477I43k894K317J180l128J971j366J03K526l660O79J895k318J887j316j131L141
2493H29k058k61J710j892J623l28j722K509j174m54J010j290J684K55k108J580
2509h7k96K04N91j815J552P84r11M64p97O65Q71j696J016mj29J283j900O71J243
$$ plain form
2528 1709 134 1270 828 158 2422 53 283 1667 514 1607 659 -837 1953 743 -21 1170
2544 1170 -537 801 1129 -1057 780 277 -207 815 -1203 -207 637 -1103 -224 -34 -1223 371 -1084
2561 -1084 -1156 109 -1362 -879 -463 -1146 -257 -752 -1452 -433 -626 -471 -848 -1195 -352 -388 -994 -1071 -686 -248
2581 -248 -170 -599 -453 -350 60 -187 -368 -58 129 -5 330 123 559 449 399 1010 489 487 867 529 933
2602 933 1014 413 1092 540 780 877 369 849 1080 1191 682 439 632 1128 329 669 167 432 718 229 149
2623 149 78 142 246 223 -286 188 -381 -380 -279 -744 -468 -416 -751 -206 -774 -677 -322 -943 -767 -617 -1097 -281
2645 -281 -697 -1093 -588 -1009 -770 -345 -728 -491 -435 -795 -208 -403 -503 -193 -503 -44 -31 -338 -8 44 -27
2666 -27 555 301 338 319 637 398 671 500 330 438 692 798 875 942 653 766 736 744 878 737 633 796 482
$$ packed form
2528A709j575J136m42o70K264k369K30J384j153J093r48j496K790j210p64J191
2544A170j707J338L28k186J837n03m84J022k018R96Q44j740Q79J90j189J594j455
2561a084p2J265j471M83M16o83Q89m95p00J019j93J55l77l47Q43l6o06p7L85M38
2581b48P8m29J46J03M10k47j81L10J87j34L35k07M36j10n0O11n21kL80l38M04
2602I33Q1o01O79n52K40R7n08M80K31J11n09k43J93M96p99L40n02K65K86m89q0
2623A49p1O4J04k3n09M74n69JJ01m65K76N2l35N45n68R7L55o21J76J50m80Q16
2645b81m16l96N05m21K39M25l83K37N6l60N87j95j00L10l10M59J3l07L30N2p1
2666b7N82k54L7j9L18k39K73j71j70J08K54J06P7O7k89J13l0QJ34j41j04J63l14
$$ plain form
2689 482 776 368 347 707 183 208 455 -18 302 368 -170 269 110 -381 134 -58 -573 -102 -624 -624 -390 -922
2711 -922 -722 -611 -888 -533 -791 -1046 -442 -780 -743 -372 -926 -643 -614 -944 -495 -420 -757 -794 -514 -421 -140 -366
2733 -366 -289 -23 -202 -131 210 -314 94 400 -61 72 311 -36 859 456 291 1125 552 659 906 441 676
2754 676 1188 335 917 759 590 1007 358 522 999 101 603 671 -124 899 537 -28 422 -138 -256 1060
2774 1060 -512 163 308 -552 242 -574 -751 14 -575 -462 91 -1037 -401 -374 -797 -29 -895 -1335 -418
2793 -418 -870 -582 -334 -1072 -281 -339 -1088 -178 -673 -547 46 -1083 -620 95 -245 327 -39 -659 316 -206
2813 -206 26 545 -277 204 817 249 732 215 72 1375 374 456 495 -203 870 1188 202 1042 582 560
2833 560 1656 393 467 961 201 1123 941 -447 1005 368 79 1171 -486 -129 689 -402 398 56
$$ packed form
2689D82K94m08k1L60n24K5K47m73L20O6n38M39j59m91N15j92n15M71n22%K34n32
2711i22K00J11k77L55k58k55O04l38L7L71n54K83K9l30M49P5l37l7K80R3K81k26
2733c66P7K66j79P1L41n24M08L06m61J33K39l47Q95m03j65Q34n73J07K47m65K35
2754F76N12q53N82j58j69M17o49J64M77q98N02O8p95J023l62n65M50n60j18J316
2774A060j572O75J45q60P94q16j77P65n89J13N53j128O36K7m23P68q66m40R17
2793d18m52K88K48p38P91n8p49R10m95J26N93j129M63P15l40N72l66o20R75n22
2813b06K32N19q22M81O13n68M83n17j43J303j001Q2L9o98J073L18r86Q40m60k2
2833E60J096j263P4M94p60R22j82j388J452o37k89J092j657L57Q18j091Q00l42
$$ plain form
2851 56 -861 608 -317 -612 577 -1105 -420 289 -1347 -170 -696 -1344 528 -929 -989 144 -1877 -561
2869 -561 357 -1711 -91 -825 -1382 436 -1279 -636 485 -1340 263 77 -1661 683 -383 -288 1107
2886 1107 -1097 19 761 -978 1079 479 -1060 1363 -130 464 1755 -989 989 1328 -222 1605
2902 1605 94 -311 2259 -25 69 1443 -493 1291 1235 -603 1584 252 58 1920 -704 488
2918 488 1271 -863 1148 184 -1224 1012 -393 -297 1047 -1600 -254 705 -1003 303 -1005 -1551 808
2935 808 -579 -765 -63 -1409 95 329 -2071 -588 -654 -794 687 -1361 -1276 696 -929 -136 -91 -1588
2953 -1588 668 341 -979 695 -835 -384 879 -871 291 459 -1256 937 705 -319 1194 -267
2969 -267 525 1788 -839 160 1045 -79 1826 428 -1035 1788 608 522 1246 -1103 1196 1576 -542
$$ packed form
2851E6r17J469r25k95J189j682O85P09j636J177n26o48J872j457o0J133k021J316
2869e61R18k068J620p34n57J818j715O43J121j825J603j86j738K344j066R5J395
2886A107k204J116P42j739K057o00j539K423j493N94J291k744J978L39j550J827
2902A605j511m05K570k284R4J374j936J784n6j838K187j332j94J862k624J192
2918D88P83k134K011r64j408K236j405R6J344k647J346R59j708J306j308n46K359
2935H08j387j86P02j346J504K34k400J483o6j40J481k048Q5J972j625P93M5j497
2953a588K256l27j320J674j530M51J263j750J162J68j715K193k32j024J513j461
2969b67P92J263k627R99Q85j124J905j398j463K823j180q6P24k349K299L80k118
$$ plain form
2986 -542 1442 198 -309 2148 -716 -426 1317 -937 968 570 -1348 996 -444 -397 1421 -1046
3002 -1046 -325 748 -1278 908 -47 -1955 819 -591 -679 367 -2394 -230 729 -1604 -39 -1061
3018 -1061 -1223 959 -1006 -1308 13 -1404 93 -107 -1787 298 -330 -917 596 -977 -427 675
3034 675 -604 490 -129 -980 682 356 105 522 -658 369 1173 123 483 248 381 1408 422 291
3052 291 829 197 1010 996 19 981 681 636 788 -89 398 737 439 541 136 -488 609 512 128 244 -288
3073 -288 297 372 -315 160 -301 -648 190 -301 -455 -207 -602 -109 -265 -961 -450 -692 -698 -271 -984 -830 -56
3094 -56 -918 -381 -435 -1019 -277 -518 -824 -42 -512 -97 226 -725 -153 -12 -538 236 -121 -325 470 93 213
3115 213 349 118 543 770 39 641 341 153 917 700 346 774 251 613 882 526 739 482 429 626
$$ packed form
2986e42J984j244n07K457k864K90J743k254J905l98j918K344j440M7J818k467
3002a046P21J073k026K186r55j908K774j410q8J046k761K164R59k333J565j022
3018a061j62K182j965l02J321j417J497k00j680K085o28n87J513j573N50J102
3034F75j279J094o19q51J662l26k51M17j180J027Q04j050L60k35J33J027r86j31
3052B91N38o32Q13j4r77R62l00m5J52q77M87L39k98J02m05o24J097r7l84J16n32
3073b88N85P5o87M75m61l47Q38m91j54K48l95M93j56o96N11k42oM27p13J54P74
3094e6q62N37n4n84P42k41l06P82m70M15L23r51N72J41n26P74l57k04P95l77J20
3115B13J36k31M25K27p31O02l00j88P64k17l54M28n23L62K69l56K13k57n3J97
$$ plain form
3135 626 271 652 777 713 196 458 342 280 207 112 9 122 179 -137 -183 -46 9 -114 -47 -163 -285 -239 -474
3158 -474 -355 -459 -497 -358 -635 -425 -516 -558 -399 -782 -657 -461 -664 -309 -379 -771 -284 -345 -391 -384 -375 -471 -285 -252
3182 -252 -153 -185 -33 161 -247 13 234 239 231 557 237 247 653 348 551 406 326 602 427 575 551 644 519
3205 519 725 590 706 727 331 517 548 193 240 145 -2 310 -34 84 253 -143 6 178 -377 -33 -197
3226 -197 -421 -18 -158 -208 27 -740 -259 -519 -387 -506 -548 -948 -381 -673 -586 -423 -781 -298 -602 -748 -206
3247 -206 -306 -630 -313 -719 -292 -218 -450 -85 -147 -431 75 -85 87 172 4 92 106 247 221 244 74 497
3269 497 319 501 496 284 827 506 278 526 520 496 629 269 558 687 502 626 434 339 678 260 196 172 146
3292 146 281 257 111 311 23 -172 -3 -212 -330 122 -509 -189 -153 -608 -601 -107 -254 -142 -806 -524 -21
$$ packed form
3135F26l55L81J25o4n17K62j16o2p3r5j03J13N7l16m6J37N5j23O7j16j22M6k35
3158d74J19j04l8J39k77K10r1m2J59l83J25J96k03L55p0l92M87o1m6PRr6J86L3
3182b52R9l2J52J94m08K60K21NqL26l20J0M06l05K03j45q0K76j75J48k4R3j25
3205E19K06j35J16K1l96J86L1l55M7r5j47L12l44J18J69l96J49J72n55L44j64
3226a97k24M03j40n0K35p67M81k60J32j19m2m00N67k92Q7J63l58M83l04j46N42
3247b06j00l24L17m06M27P4k32L65o2k84N06j60J72Q5j68Q8J4J41k6K3j70M23
3269D97j78J82nk12N43l21k28K48ok4J33l60K89J29j85J24j92r5L39m18o4k4k6
3292A46J35k4j46K00k88j95J69k09j18M52o31L20L6m55PM94j47J12o64K82N03
$$ plain form
3313 -21 -506 -491 -743 -961 41 -219 -932 -579 -934 -173 139 -989 -345 -132 -548 88 -858 -579 206 -212
3333 -212 54 276 -919 452 412 -81 689 -514 9 1245 350 613 -32 -363 1452 928 -50 379 63
3352 63 1174 1469 -315 455 638 427 1220 46 -418 976 283 845 479 -567 459 514 14 358 -496
3371 -496 -376 663 -53 -328 -705 -1017 474 463 -1007 -741 -690 -166 347 -865 -1451 -93 -68 196 -973
3390 -973 -1584 -135 35 -595 -636 -1166 -373 522 -425 -528 -825 -427 198 93 -680 -325 -387 109 620 -361
3410 -361 -460 185 450 655 -252 -523 358 995 680 58 -618 531 1533 796 68 90 526 1501 525 -141
3430 -141 302 658 1053 638 -387 225 581 499 443 -68 -6 558 204 436 -329 -694 375 677 -15 -233
3450 -233 -946 -208 785 -59 -657 -973 -569 616 -249 -1256 -647 -594 255 -284 -1435 -534 80 -136 -1
$$ packed form
3313b1m85J5k52k18J002k60p13L53l55P61L12j128O44K13m16O36r46K79P85m18
3333b12K66K22j195J371m0m93P70j203N23J236q95K63o45l31J815n24r78M29l16
3352F3J111K95j784P70J83k11P93j174m64J394o93N62l66j046J026N5n00L44q54
3371d96J20J039p16k75l77l12J491j1j470K66N1N24N13j212n86J358K5K64j169
3390i73o11J449J70o30m1n30P93Q95r47j03k97L98O25j05p73L55o2M96N11r81
3410c61r9O45K65K05r07k71Q81O37l15o22o76J149J002p37p28K2M36R75r76o66
3430a41M43L56L95m15j025O12L56q2n6n11O2N64l54K32p65l65J069L02o92k18
3450b33p13P38R93q44n98l16M04J185q65j007O09N3Q49n39j151R01O14k16J35
$$ plain form
3469 -1 -1174 -990 253 -121 -294 -603 -1078 276 175 -190 76 -460 181 808 -193 -216 -64 -58 961 136
3489 136 -230 201 124 589 602 -21 63 769 689 719 -32 147 714 790 439 392 -5 531 913 438 213 189 503
3512 503 851 534 -177 68 372 318 52 -326 -219 150 59 220 -434 -489 -333 91 -401 -392 -215 -279 -150 -568
3534 -568 -578 -487 -516 -259 -499 -828 -577 -568 -36 -205 -437 -743 -576 -211 -262 -253 -543 -158 26 -322 -114 -249 -61
3557 -61 -76 -234 -25 316 137 151 -91 470 -34 290 245 364 336 415 306 305 636 14 536 203 604 495 263
3580 263 600 493 471 662 390 36 435 203 319 200 309 114 61 16 178 -105 -116 231 -411 -93 -61 -167
3602 -167 -437 -119 -165 -466 -352 -458 -252 -430 -602 -339 -366 -866 -645 -629 -172 -372 -559 -472 -433 -434 -461 -181 -463
3625 -463 -390 -46 -291 -190 -44 -133 -108 -100 61 -15 246 306 3 343 254 200 429 135 361 348 365 281 404 483
$$ packed form
3469aj173J84J243l74j73l09m75J354j01l65K66n36O41O27j001k3J52OJ019q25
3489A36l66M31p7M65J3o23Q4P06q0L0p51J79N67P6l51m7l97N36L82m75k25k4L14
3512E03L48l17p11K45L04n4k66l78J07L69r1J61o54n5J56M24m92RJ77o4J29m18
3534e68j0R1k9K57k40l29K51RN32j69k32l06J67L65n1Rk90L85J84l48K08j35J88
3557f1j5j58K09L41j79J4k42N61n04L24m5J19k8P9j09jL31o22N22l33M01j09k32
3580B63L37j07k2J91k72l54L99k32J16j19J09j95n3m5J62k83j1L47o42L18L2j06
3602a67k70L18m6l01J14j06K06j78j72K63k7n00K21J6M57k00j87Q7L9jk7K80k82
3625d63P3L44k45J01J46q9K5QJ61p6K61O0l03L40q9n4K29k94K26j3J7q4J23P9
$$ plain form
3649 483 451 431 258 495 280 592 760 540 439 116 295 139 319 375 606 59 150 400 84 86 121 -7
3671 -7 -172 -69 -182 -95 -151 -41 -228 -369 -396 -287 -469 -411 -550 -676 -335 -454 -712 -363 -244 -288 -520 -781
3693 -781 -503 -436 -655 32 -271 -219 -179 -608 -123 -70 -386 -223 -13 -144 229 -198 -76 257 108 423 273
3714 273 119 344 484 314 702 123 656 576 440 447 326 541 629 598 232 723 492 468 449 189 358 567
3736 567 25 599 39 295 346 -112 149 311 -323 -86 160 -328 -60 -277 -22 52 -529 -402 -298 -700 -20
3757 -20 -508 -993 -170 -554 41 -193 -1337 -97 -159 -806 228 -738 -681 274 -697 151 -76 -1151 353
3776 353 -162 -531 431 -738 121 755 -724 223 118 -223 1144 -74 -416 833 47 853 778 -592
3794 -592 766 707 206 880 -165 375 1380 56 517 330 -361 1315 540 -236 359 -195 562 894 -493
$$ packed form
3649D83l2k0j73K37k15L12J68k20j01l23J79j56J80N6K31n47R1K50l16KL5j28
3671gj65J03j13Q7n6J10j87j41k7J09j82N8j39j26L41j19k58L49J19m4k32k61
3693g81K78O7k19O87l03N2M0m29M85N3l16J63K10j31L73m27J22L33j49L15j50
3714B73j54K25J40j70L88n79N33q0j36Pj21K15Q8l1l66M91k31k4j9k60J69K09
3736E67n42N74n60K56N1m58K61J62o34K37K46m88K68k17K55P4n81J27J04m02O80
3757b0m88m85Q23l84N95k34j144J240o2o47J034r66N7R55r71Q48k27j075J504
3776C53n15l69R62j169Q59O34j479R47j05l41J367j218l42J249p86Q06p5j370
3794e92J358n9n01O74j045N40J005j324M61j87o91J676p75p76N95n54P57L32j387
$$ plain form
3813 -493 87 441 -379 718 -41 -455 457 -65 -93 193 -1131 -70 287 -553 279 -610 -846 463 -938
3832 -938 -922 -269 -784 -12 40 -1346 -375 -364 -589 216 -965 -849 425 -709 -129 -215 -1508 571 138
3851 138 -828 520 -851 -451 1177 -617 148 345 -826 1201 -16 -782 1153 -323 834 1274 -1061
3868 -1061 1042 901 -473 1475 -88 -308 1681 -259 632 1000 -976 1488 516 -541 1351 -765
3884 -765 21 1582 -843 326 468 -788 1730 -66 -1104 773 -705 276 809 -1524 413 155
3900 155 -858 584 -1227 -964 878 -769 -330 -352 -1390 566 -141 -998 145 -1098 -181 659 -1151
3917 -1151 -340 -539 -1026 680 -498 -1053 313 -452 135 457 -1395 198 348 -475 519 -529 -483 756
3935 756 -46 112 310 -154 968 912 -128 674 179 319 1119 -4 181 702 -110 821 744 -265 764
$$ packed form
3813d93N80L54q20J097p59m14R12n22k8K86j324J061L57q40Q32q89k36J309j401
3832i38J6O53n15P72N2j386R71J1k25Q05j181J16J274j134N80q6j293K079m33
3851A38r66J348j371M00J628j794P65J97j171K027j217p66J935j476J157M40k335
3868a061K103j41j374J948j563k20J989j940Q91L68j976K464r72j057J892k116
3884g65P86J561k425J169J42j256K518j796j038J877j478R81N33k333J937k58
3900A55j013J442j811K63J842j647M39k2j038J956p07q57J143j243R17Q40j810
3917a151Q11j99m87J706j178n55J366p65N87L22j852J593J50q23R94j048M6J239
3935G56q02J58J98m64J122n6j040Q02m95J40Q00j123J85N21q12R31p7j009J029
$$ plain form
3954 764 573 404 1040 -417 -29 903 -29 591 237 -743 803 349 -574 427 -345 -3 507 -583 67
3973 67 97 -615 242 -422 -630 390 -811 -420 -33 -930 -214 -248 -890 99 -883 -908 222 -971 -146 -104
3993 -104 -1081 224 -350 -635 -7 -616 -154 590 -682 79 -120 -168 386 -126 -545 402 -13 230 337 34
4013 34 389 188 134 728 357 62 506 172 777 656 -49 401 598 316 618 155 403 524 311 15 280
4034 280 -33 303 -47 -138 259 -26 9 49 -191 50 233 -427 -9 3 -314 -292 -376 -266 -388 -400 -176 -217 -488
4057 -488 -251 -661 -440 79 -545 -386 -256 -401 -307 -92 -582 -300 -105 -570 -175 -372 -383 -194 -411 -187 -193
4078 -193 -287 80 62 -162 248 93 36 105 348 318 261 167 330 307 171 469 391 356 431 254 526 398 338 508
4102 508 357 443 633 431 200 353 384 360 227 204 272 162 -70 96 210 107 -7 -21 -123 2 -142 -96
$$ packed form
3954G64j91j69O36j457L88R32r32O20l54r80J546m54r23J001p72L42N10j090O50
3973F7L0p12Q57o64k08J020j201L91L87q97P16l4o42R89r82k5J130j193Q25M2
3993a04r77J305n74k85O28o09M62P44j272P61j99m8N54n12m19R47m15K43J07l03
4013C4L55k01n4N94l71k95M44l34O05j21p05M50J97k82L02m63K48J21k13k96K65
4034B80l13L36l50r1L97k85L5M0k40K41J83o60M18J2l17K2q4J10j22j2K24m1k71
4057d88K37m10K21N19o24J59J30j45R4K15m90K82J95m65L95j97j1J89k17K24o
4078a93r4L67j8k24M10j55n7O9K43l0n7r4J63k3j36K98p8l5P5j77K72j28o0J70
4102E08j51Q6J90k02k31J53L1k4j33k3O8j10k32J66J14j03j14j4j02J25j44M6
$$ plain form
4124 -96 -185 -291 -184 -286 -299 -136 -546 -492 -491 -294 -351 -269 -388 -419 -426 -417 -151 -499 -374 -38 -228 -244 -194 -163 74
4149 74 -118 -67 -69 -283 -54 -278 -237 80 234 85 87 241 273 159 409 490 456 594 454 475 354 255 484 563
4173 563 371 342 396 387 398 622 78 229 544 16 317 392 221 219 -112 -53 111 -464 -167 -111 28 44 -77 -379
4197 -379 -190 -314 2 -96 -619 -319 -411 -397 -68 -381 -413 -400 -654 -523 -375 -594 -102 -479 -579 -306 -604 -322
4219 -322 113 -540 84 -335 -445 189 -302 -498 -25 -160 191 249 -217 312 471 -10 617 67 202 797
4239 797 18 373 396 182 795 721 106 393 131 485 875 170 143 852 267 831 385 -84 507 404 307
4260 307 217 -234 159 290 -400 -174 -40 -251 178 -131 -490 111 -569 -176 -330 -723 -313 -322 -570 71 -689
4281 -689 -633 -204 -366 -410 -544 -727 80 -396 -531 -359 -771 -198 103 -373 -346 -317 -425 366 -151 -487 138
$$ packed form
4124i6q9j06J07j02j3J63m10N4JJ97n7Q2j19l1pRK66l48J25L36j90j6N0L1K37
4149G4j92N1kk14K29k24M1L17J54j49KJ54L2j14K50Q1l4J38j40K1j21r9K29P9
4173E63j92k9N4rJ1K24n44J51L15n28L01P5j71kl31N9J64n75K97N6J39J6j21l02
4197c79J89j24L16r8n23L00r2J4L29l13l2J3k54J31J48k19M92l77j00K73k98K82
4219c22M35o53O24m19j10O34m91j96M73j35L51N8m66N29J59m81O27n50J35N95
4239G97p79L55K3k14O13p4o15K87k62L54L90p05k7P09n85N64m46m69N91j03r7
4260C07r0m51L93J31o90K26J34k11M29l09l59O01o80L93j54l93M10rk48O41p60
4281f89N6M29j62m4j34j83Q07m76j35J72m12N73L01m76K7K9j08P91n17l36O25
$$ plain form
4302 138 -280 342 522 -258 87 157 -21 674 -50 14 337 230 418 251 112 553 589 168 633 195 407
4323 407 834 -138 82 318 214 673 344 -216 252 466 175 372 -291 117 358 -136 197 8 -171 307
4343 307 -345 -196 275 -329 -43 -245 -436 -95 -659 -535 -151 -602 -271 -302 -760 -243 -379 -721 -201 -363
4363 -363 -386 149 -852 -488 -214 -313 -66 -298 -315 30 -253 -457 42 -160 95 124 -274 292 335 -104 494
4384 494 283 362 623 60 136 554 465 428 229 325 502 457 244 534 348 557 670 271 525 445 266 397
4406 397 113 240 367 -8 -73 605 -302 182 1 -12 214 -210 -506 49 -143 -253 -132 -566 -265 24 -475
4427 -475 -118 -345 -417 77 -612 -565 -118 -688 -470 -338 -450 -286 -337 -249 -117 -170 -139 -133 -233 73 87 -214 -33
4450 -33 -152 -25 351 -136 135 519 -83 353 44 306 533 116 109 641 466 507 488 331 672 535 236 329
$$ packed form
4302A38m18O22J80p80L45P0j78O95p24O4L23j07J88j67j39M41L6m21M65m38K12
4323D07M27r72K20K36j04M59l29n60M68K14k91J97o63M08K41m94L33j89j79M78
4343C07o52J49M71o04K86k02j91L41n64J24L84m51L31l1m58N17j36l42N20j62
4363c63k3N35j001L64K74r9K47k32j7L45k83k04M99k02K55K9l98N66M3m39N98
4384D94k11P9K61n63P6M18q9l7j99R6J77m5k13K90j86K09J13l99K54q0j79J31
4406C97k84J27J27l75o5O78r07M84j81j3K26m24k96N55j92j10J21m34L01K89m99
4427d75L57k27p2M94o89M7M47n70K18J32j12J64n1Q8J32n3L1Oj00L06J4l01J81
4450c3j19J27L76m87K71L84o02M36l09K62K27m17pN32j75M1j9j57L41j37k99R3
$$ plain form
4472 329 436 390 549 -9 377 543 448 308 403 94 417 341 41 290 -20 78 -93 130 -83 -51 -505 -50
4494 -50 -27 -249 -108 -274 -68 3 -240 -117 -469 -542 136 -453 -636 -247 -340 -249 -236 -886 -432 -419 -525 -151 -470
4517 -470 -195 22 -442 -231 -111 -409 -30 254 -101 139 -143 -257 578 -91 130 282 -12 468 316 105
4537 105 595 142 484 335 143 369 587 -100 375 521 313 492 334 498 450 294 294 521 146 112 149 54
4559 54 209 272 -34 -277 -175 187 89 -50 -151 -217 -156 -17 -93 -301 -134 -143 -384 -447 -302 -305 -576 -342 -417 -338
4583 -338 -203 -412 -427 -419 -580 -190 -300 -152 -139 -393 -249 -161 -387 -76 192 -205 208 -162 -61 126 90 81 74
4606 74 21 59 144 48 363 445 -9 471 445 363 271 380 447 334 355 317 435 452 516 253 367 383 208 189 287 27
4632 27 65 240 208 -51 -79 -31 55 -41 -90 18 -201 -171 -188 -532 -239 -266 -476 -265 -251 -428 -487 -566 -472 -184 -550
$$ packed form
4472C29J07m6J59n58L86J66r5j40R5l09L23p6l00K49l10R8j71K23k13L2m54M55
4494e0K3k22J41j66K06P1k43J23l52p3O78n89j83L89r3R1J3o50M54J3j06L74l19
4517d70K75K17m64K11J20k98L79K84l55K40k82j14Q35o69K21J52k94M80j52k11
4537A05M90m53L42j49j92K26K18o87M75J46k08J79j58J64m8j56%K27l75l4L7r5
4559E4J55O3l06k43J02L62r8j39j01o6O1J39p6k08J67rk41o3J45lk71K34p5P9
4583c38J35k09j5Qj61L90j10J48J3k54J44Q8k26L11K68l97M13l70J01J87l6rp
4606G4n3L8Q5r6L15Q2m54M80k6q2r2J09O7j13K1l8J18J7O4k63J14J6j75j9R8k60
4632B7L8J75l2k59k8M8Q6r6m9J08k19L0j7l44K93k7k10K11J4j77n9p9R4K88l66
$$ plain form
4657 -550 -519 -401 -356 -431 -326 -168 -230 -169 -340 -187 -225 -78 50 -87 -53 -39 135 90 -75 -126 238 -267 60
4680 60 -63 -85 120 100 324 273 278 334 566 177 118 478 370 476 338 267 478 399 399 322 401 322 307 89 199
4705 199 234 257 317 -282 131 276 111 -50 144 -235 126 44 -216 34 -307 84 -127 -247 -410 -476 -440 -330
4727 -330 -152 -496 -21 -311 -485 -169 -451 -234 -349 -255 -36 -367 -618 -195 -460 -112 59 -358 127 -21
4747 -21 -244 -21 -159 12 291 -320 346 60 -167 541 -14 52 463 73 279 654 285 618 315 166 836
4768 836 177 88 474 490 498 544 -109 520 534 55 419 123 170 405 -133 169 73 -422 154 93 -177 332 -381
4791 -381 -346 57 -408 -92 -360 -853 396 -189 -706 -326 -843 -51 -91 -588 -533 -309 -381 -34 -669 -711 -76
4812 -76 -331 -337 -136 -601 -318 -123 -122 210 -442 -179 264 6 271 -67 -580 524 510 -110 179 -280 189 989
$$ packed form
4657e50L1J18M5p5J05J58o2O1j71J53l8J47J28j37L4J4J74m5j65n1L64n05L27
4680F0j23k2K05k0K24n1NN6K32l89n9L60j08J06j38p1K11p9%p7P9p9j5k18J10
4705A99L5K3O0n99M13J45j65j61J94l79L61q2k60K50l41L91k11j20j63o6L6J10
4727c30J78l44M75k90j74L16k82K17j15R4K19l31k51M23k65L48J71m17M85j48
4747b1k23K23j38J71K79o11O66k86k27P08n55O6M11l90K06L75l69L33l03j49O70
4768H36o59q9L86J6QM6o53O29J4m79L64k96M7K35n38L02r6m95N76o1k70N09p13
4791c81L5M03m65L16k68m93J249n85n17L80n17P92m0m97N5K24p2L47o35m2O35
4812g6k55oK01m65K83J95JL32o52K63M43k58K65l38n13J104j4o20K89m59M69Q00
$$ plain form
4834 989 197 241 264 86 884 503 -192 292 580 561 762 -206 365 632 88 701 -114 -255 786 361 165
4855 165 493 -432 109 491 -134 168 -116 -289 755 -153 -384 -260 -668 396 -4 -916 -208 -159 -428 222
4875 222 -858 -502 246 -544 -86 -518 -837 420 -495 -365 -137 -1079 -81 157 -432 -13 -178 -546 430
4894 430 0 -294 227 -347 294 501 -361 64 -36 53 442 -340 -99 954 487 388 -28 -257 950 417
4914 417 -155 494 362 281 502 83 471 382 70 714 48 81 557 139 486 266 -237 28 613 54 406
4935 406 -109 -8 309 -93 -153 -366 -685 310 108 -585 -278 -557 -181 13 -565 -577 -92 -284 -56 -443 -589
4956 -589 -36 -66 -403 -330 -443 -505 -61 -430 -133 -451 -188 91 -29 9 56 -280 92 119 -135 -160 -58 246
4978 246 562 103 220 355 180 502 292 64 487 532 182 411 79 385 513 253 462 134 323 595
$$ packed form
4834I89p92M4K3j78P98l81o95M84K88j9K01r68N71K67n44O13q15j41J041m25j96
4855A65L28r25N41L82o25L02k84j73J044r08k31J24m08J064m00r12P08M9k69O50
4875B22j080L56P48p90M58m32l19J257r15J30K28r42R98K38n89M19j65l68R76
4894D30m30k94N21n74O41K07q62M25j00Q9L89p82K41J053m67r9m16k29J207n33
4914D17n72O49j32q1K21m19L88q9l12O44o66L3M76m18L47k20n03K65N85n59L52
4935D06n15J01L17m02o0k13l19R95k02o93L07k79L76J94n78j2M85j92K28l87j46
4956e89N53l0l37P3j13o2M44l69K97l18K63K79j20L8M7l36L72K7k54k5J02L04
4978B46L16m59J17J35j75L22k10k28M23M5l50K29l32L06J28k60K09l28J89K72
$$ plain form
4998 595 157 283 522 -52 234 241 -113 129 130 -55 122 74 -67 120 -107 -48 57 -607 -114 -6 -248 103
5020 103 -255 -217 -160 -194 -532 -303 -335 -268 -462 -324 30 -298 -166 -175 -271 -26 -207 -466 -158 -243 -327 -41 -183
$$ packed form
4998E95m38J26K39n74K86Pl54K42Jj85J77m8j41J87k27N9J05o64M93J08k42L51
5020A03l58L8N7l4l38K29l2O7j94J38L54l28J32rr6K45j81k59L08q5q4K86j42
$$ [...]
8191g2
##END NTUPLES=NMR FID
##END=
