##TITLE=1H_LR-722-C3
 CDCl3, 8 sc, 
 28.10.2020
##JCAMPDX= 6.0         $$ Bruker NMR JCAMP-DX V2.0
##DATA TYPE= NMR FID
##DATA CLASS= NTUPLES
##ORIGIN= UXNMR, Bruker Analytische Messtechnik GmbH
##OWNER= root
$$ XWIN-NMR		Version 3.5
$$ Wed Oct 28 11:45:34 2020 Russian Standard Time (UT+4h)  she@DPX200
##.OBSERVE FREQUENCY= 200.1315066352
##.OBSERVE NUCLEUS= ^1H
##.DELAY= (6, 6)
##.ACQUISITION MODE= SIMULTANEOUS
##.ACQUISITION SCHEME= undefined
##.AVERAGES= 8
##.DIGITISER RES= 18
##SPECTROMETER/DATA SYSTEM= spect
##.PULSE SEQUENCE= zg30
##.SOLVENT NAME= CDCl3
##.SHIFT REFERENCE= (INTERNAL, CDCl3, 0, 15.7039)
##AUDIT TRAIL= $$ (NUMBER, WHEN, WHO, WHERE, WHAT)
$$ ##TITLE= Audit trail, XWIN-NMR		Version 3.5
$$ ##JCAMPDX= 5.01
$$ ##ORIGIN= Bruker BioSpin GmbH
$$ ##OWNER= she
$$ F:/spectra/data/she/nmr/H-F/1/audita.txt
$$ ##AUDIT TRAIL=  $$ (NUMBER, WHEN, WHO, WHERE, WHAT)
(   1,<2020-10-28 11:44:36.00 +0400>,<she>,<DPX200>,
      <created by zg, POWCHK disabled, PULCHK disabled
       configuration hash MD5:
       00 E9 B6 7A A2 85 ED C7 34 08 36 98 17 FE 4E 26
       data hash MD5: 16K
       23 CF 6F 97 7A 62 4F 47 11 25 28 FC A9 11 87 9E>)
$$ ##END=
$$ 
$$ hash MD5
$$ 11 6C D3 66 57 2C E1 D1 3D B1 8A F2 D2 11 01 13
##$RELAX= 
##$RELAX= 
##$RELAX= 
##$RELAX= 
##$RELAX= 
##$RELAX= 
$$ Bruker specific parameters
$$ --------------------------
##$DU= <F:/spectra>
##$EXPNO= 1
##$NAME= <H-F>
##$PROCNO= 1
##$TYPE= <nmr>
##$USER= <she>
##$AMP= (0..31)
100 100 100 100 100 100 100 100 100 100 100 100 100 100 100 100 100 100 
100 100 100 100 100 100 100 100 100 100 100 100 100 100 
##$AQSEQ= 0
##$AQ_mod= 1
##$AUNM= <au_zg>
##$AUTOPOS= <>
##$BF1= 200.13
##$BF2= 200.13
##$BF3= 200.13
##$BF4= 200.13
##$BF5= 200.13
##$BF6= 200.13
##$BF7= 200.13
##$BF8= 200.13
##$BYTORDA= 1
##$CFDGTYP= 0
##$CFRGTYP= 5
##$CHEMSTR= <none>
##$CNST= (0..31)
1 1 145 1 1 1 1 1 1 1 1 1 1 1 1 1 1 1 1 1 1 1 1 1 1 1 1 1 1 1 1 1 
##$CPDPRG= <>
##$CPDPRG1= <>
##$CPDPRG2= <>
##$CPDPRG3= <>
##$CPDPRG4= <mlev>
##$CPDPRG5= <mlev>
##$CPDPRG6= <mlev>
##$CPDPRG7= <mlev>
##$CPDPRG8= <mlev>
##$CPDPRGB= <>
##$CPDPRGT= <>
##$D= (0..31)
0 1.2 0 0 0 0 0 0 0 0.06 0 0.03 0 0 0 0 0.0002 0 0 0 0 0 0 0 0 0 0 0 0 
0 0 0 
##$DATE= 1603871075
##$DBL= (0..7)
120 120 120 120 120 120 120 120 
##$DBP= (0..7)
150 150 150 150 150 150 150 150 
##$DBP07= 0
##$DBPNAM0= <>
##$DBPNAM1= <>
##$DBPNAM2= <>
##$DBPNAM3= <>
##$DBPNAM4= <>
##$DBPNAM5= <>
##$DBPNAM6= <>
##$DBPNAM7= <>
##$DBPOAL= (0..7)
0.5 0.5 0.5 0.5 0.5 0.5 0.5 0.5 
##$DBPOFFS= (0..7)
0 0 0 0 0 0 0 0 
##$DE= 6
##$DECBNUC= <off>
##$DECIM= 32
##$DECNUC= <off>
##$DECSTAT= 4
##$DIGMOD= 1
##$DIGTYP= 9
##$DL= (0..7)
0 120 120 120 120 120 120 120 
##$DP= (0..7)
150 150 150 150 150 150 150 150 
##$DP07= 0
##$DPNAME0= <>
##$DPNAME1= <>
##$DPNAME2= <>
##$DPNAME3= <>
##$DPNAME4= <>
##$DPNAME5= <>
##$DPNAME6= <>
##$DPNAME7= <>
##$DPOAL= (0..7)
0.5 0.5 0.5 0.5 0.5 0.5 0.5 0.5 
##$DPOFFS= (0..7)
0 0 0 0 0 0 0 0 
##$DQDMODE= 0
##$DR= 18
##$DS= 0
##$DSLIST= <SSSSSSSSSSSSSSS>
$$ [...]
##$SUBNAM2= <"">
##$SUBNAM3= <"">
##$SUBNAM4= <"">
##$SUBNAM5= <"">
##$SUBNAM6= <"">
##$SUBNAM7= <"">
##$SUBNAM8= <"">
##$SUBNAM9= <"">
##$SW= 16.880792210976
##$SWIBOX= (0..15)
0 0 2 0 0 0 0 0 0 0 0 0 0 0 0 0 
##$SW_h= 3378.37837837838
##$TD= 16384
##$TD0= 1
##$TE= 0
##$TE2= 300
##$TE3= 300
##$TEG= 300
##$TL= (0..7)
0 120 120 120 120 120 120 120 
##$TP= (0..7)
150 150 150 150 150 150 150 150 
##$TP07= 0
##$TPNAME0= <>
##$TPNAME1= <>
##$TPNAME2= <>
##$TPNAME3= <>
##$TPNAME4= <>
##$TPNAME5= <>
##$TPNAME6= <>
##$TPNAME7= <>
##$TPOAL= (0..7)
0.5 0.5 0.5 0.5 0.5 0.5 0.5 0.5 
##$TPOFFS= (0..7)
0 0 0 0 0 0 0 0 
##$TUNHIN= 0
##$TUNHOUT= 0
##$TUNXOUT= 0
##$USERA1= <user>
##$USERA2= <user>
##$USERA3= <user>
##$USERA4= <user>
##$USERA5= <user>
##$V9= 5
##$VALIST= <valist>
##$VCLIST= <CCCCCCCCCCCCCCC>
##$VD= 0
##$VDLIST= <DDDDDDDDDDDDDDD>
##$VPLIST= <PPPPPPPPPPPPPPP>
##$VTLIST= <TTTTTTTTTTTTTTT>
##$WBST= 1024
##$WBSW= 4
##$XGAIN= (0..3)
0 0 0 0 
##$XL= 0
##$YL= 0
##$YMAX_a= 725146
##$YMIN_a= -791365
##$ZGOPTNS= <>
##$ZL1= 120
##$ZL2= 120
##$ZL3= 120
##$ZL4= 120
##$ABSF1= 10
##$ABSF2= 0
##$ABSG= 5
##$ABSL= 3
##$ALPHA= 0
##$AQORDER= 0
##$ASSFAC= 0
##$ASSFACI= 0
##$ASSFACX= 0
##$ASSWID= 0
##$AUNMP= <proc_1d>
##$AZFE= 0.1
##$AZFW= 0.1
##$BCFW= 1
##$BC_mod= 2
##$BYTORDP= 1
##$COROFFS= 0
##$CY= 11.3945322036743
##$DATMOD= 1
##$DC= 2
##$DFILT= <>
##$DTYPP= 0
##$F1P= 15.9154993809931
##$F2P= -4.1035820241983
##$FCOR= 0.5
##$FTSIZE= 0
##$FT_mod= 4
##$GAMMA= 1
##$GB= 0.15
##$INTBC= 1
##$INTSCL= 1
##$ISEN= 128
##$LB= 0.24
##$LEV0= 0
##$LPBIN= 0
##$MAXI= 10000
##$MC2= 0
##$MEAN= 0
##$ME_mod= 0
##$MI= 1.114404
##$NCOEF= 0
##$NC_proc= 0
##$NLEV= 6
##$NOISF1= 3.799351
##$NOISF2= 2.8
##$NSP= 1
##$NTH_PI= 0
##$NZP= 0
##$OFFSET= 15.70392
##$PC= 1
##$PHC0= -10687.65
##$PHC1= 11.00088
##$PH_mod= 1
##$PKNL= yes
##$PPARMOD= 0
##$PSCAL= 0
##$PSIGN= 0
##$REVERSE= no
##$SF= 200.130013532006
##$SI= 16384
##$SIGF1= 3
##$SIGF2= 2
##$SINO= 400
##$SIOLD= 16384
##$SREGLST= <1H.CDCl3>
##$SSB= 0
##$STSI= 0
##$STSR= 0
##$SW_p= 3612.71676300578
##$SYMM= 0
##$S_DEV= 0
##$TDeff= 0
##$TDoff= 0
##$TI= <>
##$TILT= no
##$TM1= 0
##$TM2= 0
##$TOPLEV= 0
##$USERP1= <user>
##$USERP2= <user>
##$USERP3= <user>
##$USERP4= <user>
##$USERP5= <user>
##$WDW= 1
##$XDIM= 8192
##$YMAX_p= 0
##$YMIN_p= 0
$$ End of Bruker specific parameters
$$ ---------------------------------
##NTUPLES= NMR FID
##VAR_NAME=  TIME,          FID/REAL,        FID/IMAG
##SYMBOL=    X,             R,               I
##VAR_TYPE=  INDEPENDENT,   DEPENDENT,       DEPENDENT
##VAR_FORM=  AFFN,          ASDF,            ASDF
##VAR_DIM=   8192,          8192,            8192
##UNITS=     SECONDS,       ARBITRARY UNITS, ARBITRARY UNITS
##FACTOR=    0.000296,      1,               1
##FIRST=     0,             0,               0
##LAST=      2.424536,      0,               0
##MIN=       0,             -791365,         0
##MAX=       2.424536,      725146,          0
$$ Real data points
##PAGE= N=1
##DATA TABLE= (X++(R..R)), XYDATA
0@%%%%%%%%%qJ6j6J6k4L3m1N6p3R0j11J35j60J91k31K78l27L83m46N16n96O87
$$ 0 0 0 0 0 0 0 0 0 0 -8 8 -8 8 -16 17 -24 32 -41 49 -62 73 -87 104 -127 151 -176 207 -239 277 -319 368
31C68p91R05j032J171j322J490j679J887k112K360k632K926l248L603l989M411
$$ 368 -423 482 -550 621 -701 789 -890 997 -1115 1245 -1387 1539 -1709 1894 -2095 2316
47B316m874N377n924O524p186P915q718R608j0598J1706j2956J4376j6004J7897
$$ 2316 -2558 2819 -3105 3419 -3767 4148 -4570 5038 -5560 6146 -6810 7566 -8438 9459
61I459k0125K2790k6040L0103l5339M2339n2146O6675j24150Q05453p88293m4191
$$ 9459 -10666 12124 -13916 16187 -19152 23187 -28959 37716 -86434 719019 -69274 -113465
73a13465K09536q87436J386375k81188q69879Q58605n70131L22382O70347j279266
$$ -113465 96071 -791365 595010 313822 -556057 302548 -267583 54799 725146 -554120
83e54120N29233K48061n18040Q91315o94505m25046Q89205n67254L81812J86328
$$ -554120 -24887 223174 -294866 596449 -98056 -523102 366103 -201151 180661 366989
93C66989r58911P07188J16668l50961N35782p22286P9681P62999n92813P6778
$$ 366989 -591922 115266 231934 -119027 416755 -305531 -225850 537149 -55664 21114
103B1114r4243l34385Q61673k35622n17263L19471k46679L73117K28528o97826
$$ 21114 -73129 -407514 454159 218537 -298726 20745 -225934 147183 375711 -322115
113c22115K76114J65623j69112L25257m21981j14871M74194k50092O3112Q322
$$ -322115 -46001 119622 -49490 275767 -146214 -261085 213109 -36983 26129 34451
123C4451l80066L93462Q5182k28891J99213k75483K9606L80545k76684L1076M2419
$$ 34451 -345615 47847 133029 -95862 103351 -172132 -142526 238019 -38665 -7589 34830
134C4830k26522L59980q7122l22535K45465j00906J13864J92949m65570J25312
$$ 34830 -191692 168288 81166 -241369 4096 -96810 17054 210003 -255567 -130255
144a30255K26064j70727K50058k08670j64845M16114k21013k9604J56122l17094
$$ -130255 95809 -74918 175140 -33530 -198375 217739 -3274 -32878 123244 -193850
154a93850K91689M6145l37136K81270j58655k8733L53685l61799O9008J58241
$$ -193850 97839 143984 -193152 88118 -70537 -99270 254415 -107384 -38376 119865
164A19865k94984L51313o5310k58795L42921k47567N328K46468l87371K14533
$$ 119865 -175119 176194 110884 -147911 195010 -52557 -47229 199239 -188132 26401
174B6401J16785k77769K87076k00841j13573L72785k56402N9446J22960l01507
$$ 26401 143186 -134583 152493 -48348 -161921 210864 -45538 13908 136868 -164639
184a64639K75576l4468k17839K77198j91933r921J91699k89557J51310Q3283j94518
$$ -164639 110937 76469 -141370 135828 -56105 -66026 125673 -163884 -12574 70709 -123809
195a23809K30363j19996j05094K21056j64247O9835J03411k11613J34282k8343
$$ -123809 106554 -13442 -118536 102520 -61727 8108 111519 -100094 34188 5845
205E845j24772J69698j09696k61J21843j61018O9459L0403r7148J56316m2766
$$ 5845 -118927 50771 -58925 -59186 62657 -98361 -28902 1501 -95647 60669 17903
216A7903n9361R9461r9832L6856O2755j05155P1118j1613p6606P5787m5567N731
$$ 17903 -41458 58003 -41829 -4973 57782 -47373 23745 12132 -64474 11313 -34254 -28523
228b8523P4486o9166K5703J5065n6320P2317K651k0428M8383o0463j2374L2153
$$ -28523 45963 -23203 2500 17565 -38755 33562 36213 15785 64168 3705 -8669 23484
240B3484m5835M0167J8569m6329L0581k2564k0077N4306j6052R445K6324m8004
$$ 23484 -22351 17816 36385 -9944 20637 -1927 -22004 32302 16250 25695 52019 4015
252D015J0693R261k4924L4912j8130k9412J7819l4857Q434L4954k0650K2380n533
$$ 4015 14708 23969 -955 33957 15827 -13585 4234 -30623 -22189 12765 -7885 14495 8962
265H962l4099L3144n890K046L9220l2671j2890j090l9924K2615J0571j8162K2503
$$ 8962 -25137 8007 2117 4163 43383 10712 -2178 -3268 -43192 -20577 -10006 -28168 -5665
278e665k1969j8908K3938p236K2044K3252k1012R660n681j6151K6516n453r082
$$ -5665 -27634 -46542 -22604 -29840 -7796 15456 -5556 4104 -1577 -17728 8788 3335 -5747
291e747O361l2476k824J6908r176K4004Q516k3445J1041l752j013L6726o92l165
$$ -5747 614 -31862 -34686 -17778 -26954 -2950 5566 -17879 -6838 -10590 -11603 25123 24431 21266
305B1266N741l3403l253J3515q171K1167k064k2133J1449j1013L560L2561p915
$$ 21266 27007 -6396 -9649 3866 -4305 16862 14798 -7335 4114 -6899 -3339 29222 21307
318B1307O165L634k8088J5413N095j2789K0437k1721k3657J3958j6276J2666K6812
$$ 21307 27472 31106 3018 18431 23526 10737 31174 9453 -14204 -246 -16522 -3856 22956
331B2956j8882P063p10k2357K3792R669k396J7299k3343k1801J100j6361J1863
$$ 22956 4074 11137 10427 -11930 11862 21531 19135 36434 13091 -8710 -7610 -23971 -12108
344a2108J2613j7415J087q061j0738K2279M653L341J7903j3795p984Q179r017
$$ -12108 505 -16910 -15823 -23884 -34622 -12343 -7690 -4349 13554 -241 -8225 -46 -9063
357i063J0429R535k3621j0121n364j0714K0724J4261j2137N026k664r826K0133
$$ -9063 1366 10901 -12720 -22841 -28205 -38919 -18195 -3934 -16071 -11045 -13709 -23535 -3402
370c402M700J09K6768j3836k0522M083k3406J8586L1272l0710N077m728k3091
$$ -3402 1298 1407 28175 14339 -6183 -2100 -25506 -6920 24352 -6358 -1281 -6009 -29100
383b9100N0926r025j9904M7144l3844N512L0828o4765M1094K7276n8010M2604
$$ -29100 21826 12801 -7103 40041 6197 11709 42537 -22228 18866 46142 -11868 30736
395C0736m6056l6743R7529m0641L23L9699q9057O4294L0186p7602P8735l1828
$$ 30736 -15320 -52063 45466 4825 5148 44847 -44210 20084 50270 -27332 51403 19575
407A9575k6977Q5522j11319o040O9624p3034Q2483k1010j12491J09700k6446j0483
$$ 19575 -7402 78120 -33199 -39239 30385 -42649 39834 18824 -93667 16033 -10413 -20896
419b0896Q7431j22950M1285P9838j03030O7487l1911o3749J40282p8749n7247
$$ -20896 66535 -56415 -15130 64708 -38322 29165 -2746 -66495 73787 -4962 -62209
430f2209O0318q5604J03284M7765j41289O3273j3943p629J19676j19349j0733
$$ -62209 -1891 -87495 15789 63554 -77735 -14462 -28405 -36034 83642 -35707 -46440
441d6440R8845p4126N6634l7093j05657J42887m402m6362M0981j16117O4981J06840
$$ -46440 52405 -21721 34913 -2180 -107837 35050 30648 -15714 25267 -90850 -25869 80971
453H0971r4808L3872l1376m0147J41021o2486n9099N5266o1256Q6871J8033j54389
$$ 80971 -13837 20035 -11341 -51488 89533 27047 -32052 23214 -38042 48829 66862 -87527
465h7527O5209L1338J0307Q7623j54606k9183J37205l6571M7983m6067j16985
$$ -87527 -22318 9020 19327 106950 -47656 -76839 60366 23795 71778 25711 -91274
476i1274J59818Q55r2734L7123r7937Q9374J14026j69934J4152J1442k4359J73002
$$ -91274 68544 69399 -23335 13788 -84149 5225 119251 -50683 -36531 -25089 -49448 123554
488A23554j05315r9089J16554p0411Q5162L9957j97721J06786L1861o9164J12001
$$ 123554 18239 -80850 35704 -34707 50455 90412 -107309 -523 31338 -37826 74175
499G4175j62653j9849J97544j00912K8087k7680j47861K25753J4167j27059P9582
$$ 74175 -88478 -108327 89217 -11695 16392 -11288 -159149 66604 80771 -46288 33294
510C3294j27869Q5218J43709k22532M3870M4104n9459J79312j50360j08530J91594
$$ 33294 -94575 -9357 134352 -88180 -44310 -206 -59665 119647 -30713 -139243 52351
521E2351p4287O9514K5233k15167J61876M2769r2885J23509j60137J151J74291
$$ 52351 -21936 47578 72811 -142356 19520 62289 -30596 92913 -67224 -66073 108218
532A08218j54951N3093N816j20695K14383n5663j14254J12014j22825J10508J12513
$$ 108218 -46733 6360 12176 -108519 105864 50201 -64053 47961 -74864 35644 148157
543A48157k14258Q1549r62o1657J74025j61723m5259J57730j19921Q3758q739
$$ 148157 -66101 15448 14486 -47171 126854 -34869 -80128 77602 -42319 41439 32700
554C2700j60693J98023k2630p3473J07255j63535P5051J23114j69092R4874l5849
$$ 32700 -127993 70030 47400 -26073 81182 -82353 -7302 115812 -53280 41594 5745
565E745r8098J82026j20487l5490J29036j42106J04708L2948j77109J52041k9327
$$ 5745 -92353 89673 -30814 -66304 62732 -79374 25334 58282 -118827 33214 3887
576C887m7638J53797j70505J2601J16007j47817J14043j4437j30595J77615q8119
$$ 3887 -43751 110046 -60459 -47858 68149 -79668 34375 19938 -110657 66958 -21161
587b1161m9098J34516j46460Q6314P8047j74748J25770k2195q3668J71506j24420
$$ -21161 -70259 64257 -82203 4111 82158 -92590 33180 10985 -72683 98823 -25597
598b5597k3921J20481j53542Q5421M5402j36353J48448m4580p9561J38679j16743
$$ -25597 -49518 70963 -82579 2842 48244 -88109 60339 15759 -63802 74877 -41866
609d1866K8299J11118j43508Q2715R358j17853J36949o3756n1337J28183j19569
$$ -41866 -13567 97551 -45957 36758 46116 -71737 65212 1456 -49881 78302 -41267
620d1267K5403P0650j26094J09597J1405r8324J13948p2404k1031J13918j13766
$$ -41267 -15864 54786 -71308 38289 49694 -48630 65318 -7086 -28117 85801 -27965
631b7965L8101M7023j15778Q9540k8587o8801J23020p3561o922P2415j15871O9440
$$ -27965 10136 57159 -58619 30921 2334 -66467 56553 -17008 -23930 48485 -67386 2054
643B054L8605q7757R8657m8947m9513R9666q9360J6192N7938r7125P5148p005
$$ 2054 40659 -47098 51559 2612 -46901 52765 -36595 -20403 37535 -59590 15558 8553
655H553p9776R4395m5180n13P5433j02199L6659L7925o8486Q1733l6583m7555
$$ 8553 -71223 23172 -22008 -22521 52912 -49287 -12628 25297 -43189 38544 1961 -45594
667d5594Q3536p1406N387M9359p1817P0387M977o9995O7446l7539J84P1238o9730
$$ -45594 37942 -33464 -28077 21282 -50535 19852 24829 -45166 22280 -15259 -15075 56163 -13567
680a3567K4114K0205o4093O0430k1106l2737O2483n2066O511L3982o0230N1479
$$ -13567 10547 30752 -33341 27089 5983 -26754 35729 -16337 -9826 24156 -36074 15405
692A5405J3289l9277M9299m0037j0210N6339m0773J6580Q610n0989L7488j3703
$$ 15405 28694 -10583 38716 -1321 -11531 44808 4035 20615 29225 -21764 15724 2021
704B021k5730M1886k4088P255J8340m5193K3445J2201j4464L3935k3615j4486
$$ 2021 -23709 18177 -5911 1344 19684 -25509 -2064 10137 -4327 29608 5993 -8493
716h493K3048k6708J0393J0844k5705J6890q114j7553K1551q278N099J6000j8964
$$ -8493 14555 -12153 -1760 9084 -16621 269 -7845 -25398 -3847 -12125 -7026 8974 -9990
729i990K457J616o751J9621l062r407J741j6147J910Q319m826J1913P17q943M677
$$ -9990 -7533 -5917 -12668 6953 3891 -5516 -3775 -19922 -18012 -9693 -14519 -2606 -1889 -10832 -6155
744f155m268M394J5537o72n90k707r312J181J946O16J908m592l756k227K355Q680
$$ -6155 -10423 -6029 9508 8836 8246 5539 -3773 -2592 -646 -30 1878 -2714 -6470 -8697 -6342 2338
760B338M904L696j64n671K137L915L875N804m427p508o969o757L548M497K047
$$ 2338 7242 10938 10774 5103 7240 11155 15030 20834 16407 8899 1930 -4827 -1279 3218 5265
775E265L015p061l803L412j44R837O300o299J252o783p279P982k549k688K931
$$ 5265 8280 1219 -2584 828 684 10521 16821 10522 11774 4991 -2288 5694 3145 457 3388
790C388j3009k911O931l515R601M297j1009L639l122l272J4551l494l149K458
$$ 3388 -9621 -12532 -5601 -9116 485 4782 -6227 -2588 -5710 -8982 5569 2075 -1074 1384
804A384j8172K30O404p595J5577m2j3237J1444r562K33K3334j1455M104P435k3995
$$ 1384 -16788 -16558 -10154 -17749 -2172 -2214 -15451 -4007 -13569 -13336 9998 -1457 2647 10082 -13913
819a3913J2201L345j5720K0401j0828j2847J8071j7709Q575K2224j7611J3922
$$ -13913 -1712 1633 -14087 6314 -4514 -17361 710 -16999 -8424 13800 -3811 10111
831A0111r22j9971K6729l799n269K0624k6909j498J2119k5814J8979O114j7367
$$ 10111 9189 -10782 15947 12148 6879 27503 594 -904 11215 -14599 4380 10494 -6873
844f873K3784j6143j4416K8158j1499J0319J5125l1050J1606M379j6351K0428
$$ -6873 16911 768 -13648 14510 3011 13330 28455 -2595 9011 13390 -2961 17467
856A7467j4573j0148J9893k1894R38J1358j4634K4396k036k3043J4851j1670P997
$$ 17467 2894 -7254 12639 -9255 -8317 3041 -11593 12803 10767 -12276 2575 -9095 -1098
869a098K3855k6970P04Q15j7799K1493j0539j1107K4354j3623N621J274k6221
$$ -1098 22757 -4213 -3509 -2694 -20493 1000 -9539 -20646 3708 -9915 -4294 -3020 -29241
882b9241L0569Q373j0169J2409l3770R537K7784k9719J5727j1001k0591M4141
$$ -29241 1328 9701 -468 11941 -21829 -12292 15492 -14227 1500 -9501 -30092 14049
894A4049k8743q351L4052l1538L6046N557n3998M6031r630n028N0567o6110N600
$$ 14049 -14694 -23045 11007 -20531 15515 21072 -32926 13105 3475 -1553 49014 -17096 -11496
907a1496L3840n2797N5325j6174n0034P9200m1554r826M9338p7436N9612L8054
$$ -11496 22344 -30453 24872 8698 -41336 37864 -3690 -13516 35822 -41614 17998 56052
919E6052q2721N8632l3211k7141R8201q0768o992N4085p9118O9022q97q1658R6595
$$ 56052 -26669 31963 -1248 -28389 69812 -10956 -17948 36137 -42981 26041 25144 -56514 40081
932D0081l4619k4706P0509r6519L8104O2402q6614O2655k5569o5372J01628n3775
$$ 40081 5462 -19244 51265 -45254 -7150 55252 -31362 31293 5724 -59648 41980 -11795
944a1795j7236O7260q7113M8865L6157r0391O9660j3103l3523Q7709p8389j4880
$$ -11795 -29031 38229 -48884 -19 36138 -54253 15407 2304 -31219 56490 -21899 -36779
956c6779O7105o4701N0416L157q6173Q0031j4349l4966O6863o6121K0793O1962
$$ -36779 30326 -34375 16041 19198 -66975 13056 -1293 -36259 30604 -35517 -14724 47238
968D7238q4234L7463J4042m8116Q2483m1297m4639O7518n8556J9929M4625p9911
$$ 47238 -36996 467 14509 -33607 48876 7579 -37060 30458 -28098 -8169 36456 -43455
980d3455N4739P480n8386P3888m1485j6441P8997p0260K1321L0699p9626P6128
$$ -43455 11284 18764 -39622 34266 -7219 -23660 55337 -14923 6398 37097 -42529 33599
992C3599m821o1514P4392o1639p52P4207r1216M4387L1834p6566Q0496m2187m3025
$$ 33599 28778 -32736 41656 -19983 -20735 53472 -37744 6643 38477 -38089 42407 220 -42805
1005d2805J04922p1180P423M5280j01399Q0005M815q2251R6463n5814j4266Q6026
$$ -42805 62117 -9063 -1640 43640 -57759 22246 27061 -55190 41273 -14541 -28807 57219
1017E7219j10213M5440N1629r1496R0049l7969o4288J12634p5934L207O5483j11183
$$ 57219 -52994 -7554 44075 -47421 42628 4659 -59629 53005 -22929 -19722 45761 -65422
1029f5422P0172J8149q7790R7107m8228k3384R9661r9165J9642N2055q2023R1044
$$ -65422 4750 22899 -64891 32216 -16012 -39396 60265 -38900 -19258 32797 -49226 41818
1041D1818j8220q2269R2633n2684m044O8389r9472M7757M2966p9897O5911l0398
$$ 41818 23598 -58671 33962 -18722 -22766 45623 -53849 -6092 36874 -43023 22888 -7510
1053g510l2788J00465o2557j1455M4932o9003O4977J3985p9501O1081k5916j7396
$$ -7510 -40298 60167 -2390 -13845 31087 -37916 27061 41046 -38455 22626 -3290 -20686
1065b0686O9303p4903J0335N5356n6883M4624j4361n8990Q4393j6432k5065L8163
$$ -20686 48617 -26286 -15951 39405 -17478 27146 12785 -46205 38188 21756 -3309 34854
1077C4854p0509L1073M8612o8364L3541p755l1100P3411m8204k6080N5137m1902
$$ 34854 -35655 -4582 44030 -24334 9207 1452 -29648 43763 -4441 -30521 24616 -17286
1089a7286L7891J2518p8913N2943K594k5155N3500o6741o022N9649n1648L1633
$$ -17286 20605 33123 -45790 7153 9747 -15408 38092 -28649 -34671 24978 -26670 4963
1101D963J29n3764P5291j7671l5648M2858n0034L6710M3675p6888K7016m557k3691
$$ 4963 5092 -48672 26619 8948 -26700 16158 -33876 2834 46509 -30379 -3363 -7920 -31611
1114c1611P0194n4036k0101N3535m5069L6407M926o1842O8031o941k5954M3456
$$ -31611 38583 -15453 -35554 17981 -27088 9319 14245 -47597 20434 13493 -12461 30995
1126C0995n9544J9903M8349n4943L0103j3932l7874O6859k9190j3127L7235m8897
$$ 30995 -28549 -8646 39703 -15240 14863 931 -36943 29916 726 -12401 24834 -24063
1138b4063L6127J8051n6107M2158q519j1207M9141n6744n688L7995l3786L3771
$$ -24063 12064 30115 -25992 16166 7647 -3560 45581 -11163 -16851 21144 -12642 21129
1150B1129p945m4329M9729j3282j3237L1061l9246K1330K4645m4447K3072o443
$$ 21129 13184 -31145 18584 5302 -7935 23126 -16120 5210 29855 -14592 8480 2037
1162B037j7329M3416l1616j3921K4916l1637K3963J4220l6045K8269o933j6568
$$ 2037 -15292 28124 -3492 -17413 7503 -24134 -171 14049 -21996 6273 -660 -17228
1174a7228L3296k5828m50K9000k7982J0628l51k9308L0849k699j5362J9947k3669
$$ -17228 16068 -9760 -10210 18790 -9192 1436 1085 -28223 2626 -73 -15435 4512 -19157
1187a9157M782K3555k3751J3979O744j8610K2380j0206j2460K5023j3423p29J0516
$$ -19157 -14375 9180 -14571 -592 6152 -12458 9922 -284 -12744 12279 -1144 -1873 8643
1200H643k4313J0183R571j2538J7127n443j0596J5071r198K209J3178j1143O959
$$ 8643 -15670 -5487 4084 -8454 8673 3230 -7366 7705 -1493 716 13894 2751 9710
1213I710L63j3830Q259j780k920J1171q865l884O627n814O100N617o669L905p51
$$ 9710 10073 -3757 4502 2722 -198 10973 2108 -1776 4851 -963 5137 10754 4085 7990 7239
1228G239o646M957L75k276K482n731n649K271r20K215M851k645j848L62k901L591
$$ 7239 593 5550 5925 3649 6131 400 -5249 -2978 -3898 -1683 3168 523 -1325 -963 -3864 -273
1244b73M264j577J104l859n994J898k018R4L898m982j196J271l270O063L576k385
$$ -273 3991 2414 3518 -341 -6335 -4437 -6455 -6361 -2463 -7445 -8641 -7370 -10640 -4577 -1001 -3386
1260c386L296k149l441N078k51K02K398o031k683N75j352M898L033j723O35j326
$$ -3386 -90 -2239 -5680 -602 -853 -651 1747 -4284 -6967 -6392 -7744 -2846 187 -1536 -901 -2227
1276b227j197M175K763K228J449l956k392L46r18K759J495l089K39r24j027N535
$$ -2227 -3424 751 3514 5742 7191 3235 843 1189 271 3030 4525 1436 1675 751 -276 5259
1292E259R15J70K884m946o91L252k588L530K32p008K78l628p89O985k282J217
$$ 5259 6174 6344 9228 4282 3591 6843 4255 7785 8017 1009 1287 -2341 -3130 3855 1573 2790
1308B790J194o153M227n31j019Q496n707k043J530j0903N910K658p890P820p854
$$ 2790 3984 -2169 2058 1527 508 9004 3297 1254 2784 -8119 -2209 449 -7441 379 -7475
1323g475l864J0730q430N731O456j1741J0433l711q114J5263r480J957Q044k1821
$$ -7475 -11339 -609 -9039 -3308 3148 -8593 1840 -1871 -9985 5278 -4202 -2245 5799 -16022
1337a6022R590L903j2494K1526j0728q296K0231j9245P368J4200k1327K1261j957
$$ -16022 -6432 -2529 -15023 6503 -4225 -12521 7710 -11535 -4167 10033 -11294 9967 8010
1350H010k0921K2572j5156r71K3441k7022R623Q958k3997K7878n395j5740K9143
$$ 8010 -12911 9661 -5495 -6466 16975 -10047 -424 8534 -15463 12415 7020 -8720 20423
1363B0423k2063k34K1732k9779J9863Q335k9421K4527j3625j4097L3668k3165
$$ 20423 -1640 -1874 19858 -9921 9942 18277 -11144 13383 -242 -14339 19329 -3836
1375c836K592J9512l1469K0525M665k4836L1802j1921j3308K5069l0651O949K0876
$$ -3836 -1244 18268 -13201 7324 11989 -12847 18955 7034 -6274 18795 -11856 -4907 15969
1388A5969l1273K0360k204k5017L3504j6915q562L0890k8935J0725J4408l5502
$$ 15969 -15304 5056 2852 -22165 11339 -5576 -14138 16752 -12183 -1458 12950 -22552
1400b2552K9405j73k1709L0594k8356n871L0717l1430J7199R305l2425L5946j2309
$$ -22552 6853 6680 -15029 15565 -12791 -18662 12055 -19375 -2176 7129 -25296 10650 -1659
1413a659k0055L6674k7994J1787K3775m6595K5722L657k4537M2374l1824j1570
$$ -1659 -21714 14960 -13034 -1247 22528 -24067 1655 5312 -19225 23149 -8675 -20245
1425b0245M0083l6698K0886J0316m1123M7944j0870k5204L8288m0825J8686L4949
$$ -20245 19838 -16860 4026 14342 -26781 21163 10293 -14911 23377 -17448 1238 36187
1437C6187n5298K8307n527k8629N9896l7866j3199M2753m5358L3468R757n6924
$$ 36187 -19111 9196 3669 -24960 34936 -2930 -16129 26624 -18734 14734 24491 -32433
1449c2433N4100r367j9479M3504o0423J2887M3519m8844L2665j5394l8172O7636
$$ -32433 21667 12300 -7179 36325 -24098 -11211 32308 -16536 16129 735 -37437 30199
1461C0199k9827j5433L5133m9004L9888J9509o1743L8543r310j0228N1712n8853
$$ 30199 372 -15061 20072 -28932 10956 30465 -31278 7265 -2045 -12273 39439 -19414
1473a9414p454L9719l2744L5901j0786m7843N4700j0056j2357K5701m7676K7445
$$ -19414 -26868 12851 -19893 16008 5222 -42621 12079 2023 -10334 15367 -32309 -4864
1485d864L5120m5301J7084j3979j3756N7016l0628k2375K3351k5571L5668J1484
$$ -4864 30256 -15045 2039 -11940 -25696 31320 692 -21683 1668 -23903 11765 23249
1497B3249n0886K5840M601n122L1445m4824n977M3253j7762J0737j4319l7766
$$ 23249 -27637 -1797 2804 -2318 29127 -15697 -21674 21579 3817 14554 235 -37531
1509c7531N1401P565k4405J2122l2987K2507M0779m5469K584O227j0234M6849
$$ -37531 13870 21435 -2970 9152 -23835 -1328 39451 -6018 -3434 2793 -7441 39408
1521C9408l0757l6242L7469j2062J8742P883n9870L0206K0093j7247K8668m1911
$$ 39408 8651 -27591 9878 -2184 16558 24441 -35429 -5223 14870 -2377 26291 -15620
1533a5620p232N2734k9746P247k246l7963N6423l279l7596K1314l3900K6706M1424
$$ -15620 -22852 29882 136 7383 5137 -32826 23597 20318 -17278 4036 -29864 -3158 38266
1546C8266n8906Q869N331j2413N3660l8960k8215M3604j9873K2312j345n5732
$$ 38266 -20640 -11771 -6440 -18853 34807 -4153 -32368 11236 -8637 13675 12330 -43402
1558d3402M5887R614j9936K1694m6165J2965M6570l6387J2380p522k4082N2246
$$ -43402 2485 12099 -7837 13857 -32308 -19343 27227 -9160 3220 -4302 -28384 23862
1570B3862j6591k1685K3800k7210K4982J6317m5710J8194J723l152L4212l5680
$$ 23862 7271 -14414 9386 -17824 7158 23475 -22235 -4041 -2318 -5470 28742 -6938
1582f938j1453K7651j1483K1237p589l2287L1891J768r497R185k8432J4504K4480
$$ -6938 -18391 9260 -2223 19014 11425 -20862 11029 12797 3300 12485 -15947 -1443 23037
1595B3037k4905J550m591m541L0896j2475j5801J1047q641J3726O240k2240Q354
$$ 23037 -1868 -318 -4909 -9450 21446 8971 -6830 4217 -4424 9302 15542 -6698 1656
1608A656L329n798J0183j5836n091J7469n883K091j757j5711J4853P371q614M896
$$ 1656 4985 -813 9370 -6466 -11557 5912 29 2120 363 -15348 -495 6876 -1738 3158
1622C158j0506L33J5407j1330l455M171o080J0485l427j3024J0457N22K627M875
$$ 3158 -7348 -7015 8392 -2938 -6393 -2222 -8302 2183 -1244 -14268 -3811 -3289 -662 4213
1636D213j4296L708Q005m936P070n796m769R708p108n75M404o392Q548Q04p257
$$ 4213 -10083 -6375 1630 -3306 3764 -2032 -6801 2907 -4201 -4776 -372 -6764 1784 2588 -4669
1651d669N909m028L231Q182p517K229n71m200Q276m696k057N091o991M141K13
$$ -4669 1240 -2788 443 8625 1108 3337 2766 -1434 6842 2146 89 5180 -1811 2330 2543
1666B543o167R769j660k146N275r010M202N506o368O174l337n907O581o942L52
$$ 2543 -3624 6145 4485 2339 7614 -1396 2806 8312 1944 8118 4781 -1126 5455 -1487 -1135
1681a135O204p492N132p86p622Q461k781q88P419q530J060L955q448O505K54p430
$$ -1135 5069 -2423 2709 1923 -5699 2762 -19 -907 6512 -2018 -958 2997 -5451 1054 1308 -6122
1697f122O487n248k923P597m662K135M002p543L415R92l694O656j755l523L924
$$ -6122 365 -4883 -7806 -209 -4871 -2736 1266 -6277 -2862 -1870 -5564 1092 -663 -4186 -262
1712b62n586p7M625m032L418J644n331L845L54j807O438j657k597M079l867l1
$$ -262 -5848 -5925 -1300 -5332 -1914 -270 -5601 -1756 -1402 -3209 3229 1572 -1025 3054 -813 -844
1728h44M561m026J642P25n102K820J296j315N314j385k020L122k847J667L688
$$ -844 3717 -309 1333 2058 -3044 -224 1072 -243 5071 3686 1666 4788 1941 3608 7296
1743G296l578J925q98m967L016p28j473M115l106j679K857l313K162K881l010
$$ 7296 3718 5643 4745 -222 2794 2066 593 4708 1602 -77 2780 -533 1629 4510 1500
1758A500J910p59l598K631m95j296J426k691j855N35q64J462J664r61o27l41q22
$$ 1500 3410 2651 -947 1684 1189 -107 1319 -1372 -3227 -2692 -3556 -2094 -430 -1391 -2018 -2359 -3181
1775c181P09J688n88M1q16k791N28M30j055L425j485k409L485k526J097M615l747
$$ -3181 -2472 -784 -1372 -1331 -2147 -4938 -4410 -3980 -5035 -1610 -3095 -5504 -2019 -4545 -3448 1167 -2580
1792b580K771J053n966N159l83l179O586n575j622N025n638M921L466o136O473
$$ -2580 191 1244 -4722 437 54 -3125 3461 -2114 -3736 1289 -4349 572 4038 -2098 4375
1807D375k487l852Q954n687J449O457r568L992R0p548J0419k936m951P569q449
$$ 4375 1888 -1964 6990 1303 2752 9209 -359 3633 3723 -3825 6594 3658 -1293 6276 -2173
1822b173L151P448j0262O632J467p371Q560p027k715J0299p975J591J371j0859
$$ -2173 978 8426 -1836 4796 6263 -1108 7452 425 -2290 8009 34 1625 2996 -7863
1836g863R467N75n987Q820q673n05R848j0732M675L007r472J1655n220r311J0039
$$ -7863 1604 2179 -3808 5012 -3661 -4166 5682 -5050 -375 2632 -6840 4815 -405 -9716 323
1851C23p313N195P056j6989P015L597n550J3048j1646m026J5837j1041L752J440
$$ 323 -6990 -1795 5261 -11728 -4713 -1116 -6666 6382 -5264 -9290 6547 -4494 -742 698
1865F98j4253J9315j529j4213J1560j2085O522J7210k1636O563M855j1933K1943
$$ 698 -13555 5760 4231 -9982 1578 -10507 -3985 13225 -8411 -1848 3007 -8926 13017
1878A3017j0814j1606K0809j3876O344Q090k7278J8217O413j3610J8776k1825
$$ 13017 2203 -9403 11406 -2470 3874 11964 -15314 2903 9316 -4294 14482 -7343
1890g343l972L0500j9631M991L011k3780L2473k314k4450K0210j6608R293K1641
$$ -7343 -11315 19185 -446 4545 7556 -16224 16249 13935 -10515 9695 -6913 2380 24021
1903B4021l8965R688J2058j3871K8461k2887j9152L5064j6943O768Q713l6615
$$ 24021 -14944 -5256 6802 -7069 21392 -1495 -20647 14417 -2526 4242 12955 -23660
1915b3660K9669P047k5268K2813k5129N79L7362l2688L464O384k3818M0411q295
$$ -23660 6009 13056 -12212 10601 -14528 -13949 23413 -9275 -5811 573 -23245 17166 8871
1928H871k9285K5969j8627J3189K2215m5592J5569J3474j6509K8184k9846j4939
$$ 8871 -20414 5555 -13072 117 22332 -23260 -7691 5783 -10726 17458 -12388 -27327
1940b7327M3873j8396M076K952l5760L9882Q074k8311J9991k3232P833L4761l9056
$$ -27327 16546 -1850 2226 5178 -30582 9300 17374 -10937 9054 -14178 -6345 28416 -10640
1953a0640L637J0298j7082L6829j7067k8437L1162j2891J3368J4058m5009K0381
$$ -10640 -7003 3295 -13787 23042 5975 -22462 8700 -4191 9177 23235 -21774 -1393
1965a393J5198j5614K3220k9506r002M0424k1222Q05J102k7222L9929K740l0013
$$ -1393 13805 -1809 21411 -8095 -17097 23327 2105 2910 4012 -23210 16719 19459 -10554
1978a0554J5301j7225J3739K8174l9084K777J0522j1971K9884k1306k3166L1211
$$ -10554 4747 -12478 1261 29435 -9649 -6872 3650 -8321 21563 257 -22909 8302
1990H302j0797O771O891l7119K3720J5170j8302J6171k4414m019L6541k0418j857
$$ 8302 -2495 4276 11167 -25952 -2232 12938 -5364 10807 -13607 -17626 18915 -1503 -3360
2003c360K700k2155L3286j047k7396J8209j2460J0570K2364l7570O521J4199j1896
$$ -3360 -660 -22815 10471 9424 -17972 237 -12223 -1653 20711 -16859 -10338 3861 -8035
2016h035K6621k1076j9138L2081j3316M495Q101l2581K5742R198k1890J9770j9398
$$ -8035 18586 -2490 -21628 10453 -2863 1632 9733 -22848 2894 12092 -9798 9972 -9426
2029i426m25L2881k6970K984P037k1270L2632o039k4050K2696j6714P378K0291
$$ -9426 -9851 23030 -3940 -956 6081 -15189 17443 11404 -12646 10050 -6664 714 21005
2042B1005l4957J4167J0307j7540K4504j8984j2753L2114j8214M007Q074k8890
$$ 21005 -13952 215 10522 -7018 17486 -1498 -14251 17863 -351 3656 11730 -17160
2054a7160K4975L067k0705K0608j7588l54K3687k5777Q049P778j8816K3697q706
$$ -17160 7815 10882 -9823 10785 -6803 -7157 16530 -9247 -1198 6580 -12236 11461 2755
2067B755j5792K1206j4800M649J3673k5874J1858M399j3357J8621j2246o484J8905
$$ 2755 -13037 8169 -6631 -1982 11691 -14183 -2325 2074 -11283 7338 -4908 -11392 7513
2080G513j4592M435N886j5765J6590o20j1945J2025j0141J404J2042j4591N411
$$ 7513 -7079 -2644 3242 -12523 4067 3447 -8498 3527 -6614 -5210 6832 -7759 -2348
2093b348M121j0284J1963m006n744J2096p699P35O607j0223P310K263p307P758
$$ -2348 1773 -8511 3452 -554 -6298 5798 -1901 -1166 5441 -4782 2528 4791 -2516 5242
2107E242m731l765Q729o321K451L941q116O314K31n530P915l870j360O360p663
$$ 5242 511 -3254 5475 -846 1605 5546 -2570 3744 3975 -1555 6360 2490 1130 7490 -173
2122a73J493L702o440N323r66n478O617m021q78N635n497K472J829p027N895r59
$$ -173 1320 5022 -1418 3905 2939 -2539 4078 57 -821 4814 -683 1789 3618 -3409 2486 1527
2138A527l419N331n637p31M356o479L376K125m908M999k403l245N695l600Q42
$$ 1527 -1892 3439 -2198 -2929 1427 -5052 -1676 449 -4459 540 -1863 -5108 587 -3013 -2171
2153b171L448n386K554N62m061M409j415j758L244l681J021K258k572L090J51
$$ -2171 1277 -4109 -1555 -993 -5054 -645 -2060 -3818 -574 -4255 -3234 -976 -3548 -458 -307
2168c07k422K924j606N04K790k081J32O04j855J214Q58p40J344k07n33M20K14
$$ -307 -2729 195 -1411 -907 1883 -198 -66 538 -1317 -103 755 15 1359 1152 619 1039 1253
2185A253J197K97K80n93n43O14p81O54K83o40L10q32k79J062n75P08P51j546L90
$$ 1253 2450 2747 3027 2434 1891 2505 1724 2378 2661 2021 2331 1499 1220 2282 1707 2415 3166 1620 2010
2204B010m02o80J660q23r59K54j704l89J302j482J012J09j748Q30k6p02J922q01
$$ 2010 1608 928 2588 1765 806 1060 -644 -1033 269 -1213 -201 -92 -1840 -1010 -1036 -1738 184 -617
2222f17p86M12j471K60N95q24L28m49j245Q83L9K07J232j90o95Q31o81O62J179
$$ -617 -1403 -991 -2462 -2202 -1607 -2431 -2103 -2552 -3797 -2914 -2875 -2668 -1436 -1626 -2321 -1490 -2171 -1509 -330
2241c30p25K32K12j840J465J71p66K308r76p89J988j384Q70K228k103J658k81
$$ -330 -1055 -823 -611 -2451 -986 -815 -1581 727 -249 -1038 950 -434 436 2664 561 2219 1938
2258A938j711K585j690k11K398k630J427j31k018L487n02j570K700k974M77K577
$$ 1938 227 2812 1122 911 3309 679 2106 1975 -43 3444 2942 1372 4072 1098 1575 4152
2274D152l183K195l76k918L238k866r59L139l351K323L71m458L570r77j1L681
$$ 4152 969 3164 2788 -130 3108 242 -717 2422 -929 1394 1765 -2693 877 -100 -111 3570
2290C570n951J085K455m086M084k813l251O146l807p98K376m965N670J505o016
$$ 3570 -2381 -1296 1159 -2927 1157 -1656 -4907 1239 -2568 -3366 -990 -5955 -285 1220 -4796
2305d796L945k855M64O712p232R75K324m471O260k595m969P071k623M28L451q059
$$ -4796 -851 -3706 -3242 3470 -3762 -2787 -463 -4934 1326 -1269 -6238 833 -1790 -1362 2089 -5970
2321e970M654M922m576M107m394k803R310l647j757K025n667P052K102p908L704
$$ -5970 -1316 3606 -970 3137 -1257 -4060 5250 1603 -154 1871 -3796 3256 5358 -2550 1154
2336A154m88R94O986r079j917O856k431M728k819r116Q670O60l488L842q305L436
$$ 1154 666 1660 8646 -433 -2350 4506 2075 6803 3984 -5132 3538 4198 710 4552 -3753 -317
2352c17Q405q626J420q68l881J2182m801p732N937n674O614M475j4685N713J752
$$ -317 8088 -538 882 14 -3867 8315 3514 -4218 1719 -3955 2659 7134 -7551 -1838 -86
2367h6l310J0058j2282k656J3024p699M936k414j2539J6611m16p531O611j2884
$$ -86 -3396 6662 -5620 -8276 4748 -2951 1985 -429 -12968 3643 3227 -4304 2307 -10577
2381a0577P250J1305j5288N979k100m491J7399j2906m819J1298r827J2202k09
$$ -10577 -3327 7978 -7310 -1331 -3431 -7922 9477 -3429 -8248 3050 -6777 5425 5216
2394E216j7722J4845k037k007J1254j9196N330J2334j2009R974o837q511K0672
$$ 5216 -12506 2339 302 -1705 9549 -9647 -4317 8017 -3992 5982 -855 -9366 11306
2407A1306r204l285O547j3961J5685M242j7455J0695o687Q07J5650j8118J133
$$ 11306 2102 -1183 5364 -8597 7088 11330 -6125 4570 -2117 -1310 14340 -3778 -2645
2420b645Q164r262J3454o162j2028J5544n156J9O050j6700R544P105j0300P499
$$ -2645 5519 -3743 9711 3549 -8479 7065 1909 1928 7978 -8722 822 7927 -2373 5126
2434E126q883l065J5468r692j305M009r415J1805N99j2546Q768l416L99R372j3720
$$ 5126 -3757 -6822 8646 -1046 -2351 1658 -7757 4048 4647 -7899 869 -2547 -2148 7224 -6496
2449f496O06P535o440P285l370r522J2197k586l040O461j0262N163P815j0783
$$ -6496 -5890 1645 -4795 2490 -880 -10402 1795 -791 -3831 2630 -7632 -2469 5346 -5437
2463e437N360j161n814J3040o876n141R029q898O421N742j3416Q787O00o902J2500
$$ -5437 -77 -1238 -7052 5988 -888 -6029 3000 -5898 523 6265 -7151 1636 2236 -4666 7834
2478G834r878j317J1562j1047N512K641j2576J4020l433o973J2264j2374L508
$$ 7834 -2044 -3361 8201 -2846 2666 5307 -7269 6751 3318 -3655 8609 -3765 -257
2491b57R410j3745R582K0r975J4303r016k992J1618j2843O017M389j3285J1814
$$ -257 9153 -4592 4990 5010 -4965 9338 322 -2670 8948 -3895 2122 6511 -6774 5040
2505E040l710o152J2841j1068J530P635j2673R840o14q802J1685q386j088R116
$$ 5040 1330 -4822 8019 -3049 -1519 6116 -6557 3283 2669 -6133 5552 -2834 -3922 5194
2519E194j1757N844K953r339R933n108m429R994p757L033L941j0008Q106r06m700
$$ 5194 -6563 -719 2234 -7105 2828 -2280 -6709 3285 -4472 -1439 2502 -7506 600 -306 -5006
2534e006Q286p864O96O490q185N532q3n828R160l797k844N997o592M781L623p871
$$ -5006 3280 -4584 -3888 2602 -5583 -51 -134 -5962 3198 -599 -3443 2554 -4038 743 4366 -3505
2550c505N150j626k091P200o199k62M717m829M331k03n488O639j145j833L854
$$ -3505 1645 19 -2072 5128 -1071 -1333 3384 -1445 2886 2683 -2805 3834 2689 856 4710
2565D710n832K223M239m606K217j086l488N533k031k592L797l568J788K773n551
$$ 4710 -1122 1101 5340 734 2951 1865 -1623 3910 1879 -713 3084 -484 1304 4077 -1474
2580a474K104J252j811L831l870k643M255k385P74J150n169L799Q90l504K595
$$ -1474 630 1882 71 3902 32 -2611 1644 -741 33 1183 -3986 -187 703 -2801 -206
2595b06k027k81M231m042k95K085k856L534m97l928K702j045L94K082l027R53
$$ -206 -2233 -2514 1717 -2325 -2620 -535 -3391 143 -354 -4282 -1580 -2625 -2231 -149 -3176 -2223
2611b223J913k088K095j165j059L534j676j69O56k285K434P25j532J112r97N45
$$ -2223 -310 -2398 -303 -1468 -2527 1007 -669 -838 -182 -2467 -33 692 -840 272 -725 -180
2627a80J760j415N60O65n88J699j342m62J350o23R02l98j524J295m57K86R16j333
$$ -180 1580 165 725 1390 802 2501 1159 697 2047 1424 2326 1928 404 1699 1242 1528 2444 1111
2645A111L53O68j421J228l75k25J365j374o00L79j197J176j03j507P07q84K07
$$ 1111 1464 2132 711 1939 1564 1339 2704 1330 730 1109 -88 1088 985 -522 185 -699 -492
2662d92Q14j040L03N21j202N89j6j179R23l26n82L12q39J87M96l45J22R5l23J27
$$ -492 322 -718 -415 106 -1096 -507 -523 -1702 -779 -1105 -1687 -1375 -2214 -2027 -1531 -1876 -1754 -1659 -1982 -1855
2682a855K72j75O03j97n9J19n09M05M96k22L18J45n54M96L21o3J064l13j10P18
$$ -1855 -1583 -1758 -1155 -1352 -1411 -1292 -1801 -1396 -900 -1122 -804 -659 -1213 -717 -396 -459 605 292 182 900
2702I00m12L12Q48q04J55J86n99O83J5j26O22j27o5J76k45L71M47l75M04n62n25
$$ 900 488 800 1648 844 999 1185 586 1269 1284 1158 1780 1653 1588 1764 1519 1890 2337 1962 2366 1804 1279
2723A279N40j57n07M78q81kq2k82K07j19m1N8r2q85J64J98O2l22o76l73K78M31
$$ 1279 1819 1662 1155 1633 752 750 668 386 593 474 433 491 399 -486 -322 -124 -62 -384 -1060 -1433 -1155 -724
2745g24p13J00k44o01J253p95n25J131k64J33p0j243R96Ol64R72j201m8J689j347
$$ -724 -1437 -1337 -1581 -2182 -929 -1724 -2249 -1118 -1382 -1249 -1319 -2562 -1566 -1560 -1924 -952 -2153 -2201 -512 -1859
2765a859R26K60r07J411L86j477J579n36K57J764k597O87R01j193K386q35j770
$$ -1859 -933 -673 -1580 -169 217 -1260 319 -217 40 1804 -793 -106 795 -398 1988 1153 -617
2782f17K724j350O02J213k672K148J424k655K077k006o39L921l023n99J638k974
$$ -617 2107 757 1359 2572 -100 2048 3472 817 2894 888 249 4170 1147 548 2186 -788
2798g88L641l96l574L370j315n67K684m338J503K117l400L083k270k828N061k452
$$ -788 2853 2457 -1117 2253 938 371 3055 -1283 220 2337 -1063 2020 -250 -3078 1983 -469
2814d69q80K450m901L098J862m597M100k178j996N665m875k86L346m530M375k91
$$ -469 -1349 1101 -3800 -702 1160 -3437 663 -1515 -3511 2154 -2721 -3007 339 -4191 184 -107
2830a07n167N060j673q44M499n549J879L570n599M909j222l425O514m356o91M377
$$ -107 -5274 -214 -1887 -2731 1768 -3781 -1902 1668 -3931 978 -244 -3669 2845 -1511 -2202 2175
2846B175n472M111J755n961N704j927k386O188m819J027L812o091M407L13m820
$$ 2175 -3297 814 2569 -3392 2312 385 -2001 4187 -632 395 4207 -1884 2523 2836 -1984
2861a984O237l541j368N738o213K239L091o086N910j881l911O484m581L1M602
$$ -1984 4253 712 -656 5082 -1131 1108 4199 -1887 4023 2142 -1769 4715 134 165 4767
2876D767o785L921Q43o071O950k978l063N777n598K463K868q008O011J96m467
$$ 4767 -2018 1903 2746 -3325 3625 647 -2416 3361 -2237 226 3094 -4914 1097 1293 -3174
2891c174O426o637k98P387p357K733J205o584Q480k658n500P823n919K365N072
$$ -3174 3252 -3385 -3683 3704 -3653 -920 285 -6299 2181 -477 -5977 1846 -4073 -1708 3364
2906C364r620N412J440n389Q443n765l270Q459o781L414L020r901Q518L67n053
$$ 3364 -6256 -844 596 -4793 3650 -2115 -5385 3074 -3707 -293 2727 -7174 1344 1711 -3342
2921c342P648q097J267R150q803K904Q24o247J1135l668o618P352n309L931M808
$$ -3342 4306 -3791 -2524 6626 -2177 727 1551 -4696 6439 2771 -3847 3505 -1804 2127 6935
2936F935j1184N641K292m778P924p680k277R691o384K157J411q871Q983O95o075
$$ 6935 -4249 1392 3684 -1094 6830 -850 -3127 6564 180 2337 3748 -5123 3860 4555 -1520
2951a520N496o574J527P869q844J531J445m575R266m225o591O742l553L289K776
$$ -1520 3976 -2598 -1071 6798 -2046 -515 930 -3645 5621 1396 -5195 1547 -2006 1283 4059
2966D059j1117N154L432l971N446p164j854R962n421r9J254o680Q998L93p398
$$ 4059 -7058 -1904 1528 -2443 3003 -4161 -6015 3947 -1474 -1573 -319 -6999 1999 2392 -5006
2981e006M727m401K700O979r561J563K594l556Q323m699o040Q553l244K016K408
$$ -5006 -279 -4680 -1980 4999 -4562 -2999 -405 -3961 4362 -337 -6377 2176 -1068 948 3356
2996C356r924O593L592n232M941n924p57J0044o455j88J792n805R302q50p560
$$ 3356 -6568 25 3617 -1615 3326 -2598 -3355 6689 234 46 1838 -3967 5335 4485 -3075
3011c075N998l894K839N360j0039K701L358l987P043n707m855Q627l558J251J617
$$ -3075 2923 -971 1868 7228 -2811 -110 3248 -739 6304 597 -4258 4369 811 2062 3679
3026C679q448O582K240n412L840m910N94P360o914K52J011l491O852k174n228
$$ 3679 -4769 1813 4053 -1359 2481 -2429 -1835 5525 -1389 -1137 -126 -3617 3235 1061 -4167
3041d167M723k609J725K875p155K781K092k290L246l925j616N363k443N01j48
$$ -4167 556 -2053 -328 2547 -4608 -1827 265 -2025 1221 -2704 -4320 1043 -1400 -899 -1047
3056a047l756M918M77k868K105k768J424L738m509P19J124j547L998k084k611
$$ -1047 -4803 115 592 -2276 -171 -2939 -1515 2223 -2286 -1567 -443 -1990 2008 -76 -2687
3071b687L272q88R00J276l757K165J383j122J657j811m78L060k104J78K12j595
$$ -2687 585 -303 597 1873 -1884 281 1664 542 2199 388 -90 2970 866 1044 1256 -339
3087c39K988m69k069J811j273M83K143k847P04N01j070J480q89j557K259j169
$$ -339 2649 2180 111 1922 649 1132 3275 428 1132 1633 563 2043 1154 -403 1856 687
3103F87j24N41k027J125J026j642R82r40n80J725j143l03N43j536J103P2j454
$$ 687 563 1104 -923 202 1228 -414 568 -372 -952 773 -370 -673 -130 -1666 -563 -491 -1945
3120a945J116l38k21N80j035J76N03l61L09n0m14Q43o68P4O32n76L34J8m05N10
$$ -1945 -829 -1167 -1388 -808 -1843 -1667 -1164 -1525 -1216 -1266 -1680 -837 -1505 -1431 -799 -1375 -1041 -1023 -1428 -918
3140i18J33p7M69k64M4L92j40O72Q2o4K82l91M19j81J30L94J73RJ69n91M41J11
$$ -918 -785 -862 -393 -657 -613 -221 -361 311 393 329 611 220 639 458 588 982 1155 1164 1333 742 1183 1294
3162A294k64O88k78j58L87l69MM9l49K50k16k76K42j63l73M56l20k09R8j37L8
$$ 1294 1030 1718 1440 1282 1669 1300 1304 1353 1004 1254 1038 762 1004 841 468 924 604 395 493 356 394
3183C94J71r54M24j93l48L86m64J21j24n18m1K54l57N04k58n04M38r4k27L17n18
$$ 394 565 -389 35 -158 -506 -120 -584 -463 -587 -1105 -1146 -892 -1249 -745 -1003 -1507 -1069 -1163 -1390 -1073 -1591
3204a591L29j76l31M06L36k97M17m7k45M22k14M7P26l16L67Nl54R29j78j52M90
$$ -1591 -1262 -1438 -1769 -1363 -1027 -1324 -907 -954 -1199 -777 -991 -944 -218 -534 -167 -162 -516 413 235 83 573
3225E73p59N69L54l28P56k50k94Q64n32J09M41n66O53j11q21J113q29K81Q93j357
$$ 573 -186 383 737 409 1165 915 621 1485 953 1062 1503 937 1590 1479 658 1771 942 1223 2116 759
3245G59L85L39q38J076n10j030J548r54n21N18j149J127k6j536J259j150K24R78
$$ 759 1144 1483 645 1721 1211 181 1729 775 254 772 -377 750 724 -812 447 -703 -479 499
3263D99j685P76J56j114J465j124r01J695j202K50Q21j969J316J96j076J360j246
$$ 499 -1186 -410 -254 -1368 97 -1027 -1928 -233 -1435 -1185 -364 -2333 -1017 -821 -1897 -537 -1783
3280a783n0J656j567N60L96j125J908l53j426J510q57O89J584k779J091R09j009
$$ -1783 -1833 -177 -1744 -1184 -788 -1913 -5 -358 -1784 -274 -1131 -442 1142 -1637 -546 363 -646
3297f46J838j400o96K592p78m10P54j853K040Q96k407J104l63L7J898k090r2J189
$$ -646 1192 -208 -904 1688 910 500 1254 -599 1441 2337 -70 1034 671 708 2606 516 424 1613
3315A613j230J919m46k180K221o42l46J712l334Q23K312k144J440j806j896M282
$$ 1613 383 2302 1856 -324 1897 1255 909 2621 -713 110 2422 278 1718 -88 -1984 2298
3331B298j188j615J051k777L194J267m689J744k41J21K951m812l54L496j714J720
$$ 2298 1110 -505 546 -2231 963 2230 -2459 -715 -956 -835 2116 -2696 -3050 446 -1268 452
3347D52j236l770M932m30j781K030m065K464L003l770J460j273j060N247k723
$$ 452 -784 -4554 378 -52 -1833 197 -3868 -1404 1599 -2171 -711 -1984 -3044 2203 -520
3362e20k176K281k537M482Q15n785K702K19R73L044n645l02M631j018J255k577
$$ -520 -2696 -415 -2952 1530 2345 -3440 -738 -519 454 3498 -2147 -2449 2182 1164 2419 -158
3378a58l244O262K34k440P7k851L652L276m598M07p10M76M557l824k583K731j226
$$ -158 -3402 2860 3094 654 731 -2120 1532 4808 210 617 -93 383 4940 1116 -1467 1264 38
3395C8L614p38n429K702J634J33J063n125K26M419j156J16k966j905N750n27k768
$$ 38 3652 2914 -2515 187 1821 1954 3017 -2108 -1882 2537 1381 1497 -1469 -3374 2376 1849 -919
3412i19j75k464M517K288n563l38M08J542L878n167k180L685m72K323k069m562
$$ -919 -1094 -3558 959 3247 -2316 -2654 -2246 -704 3174 -1993 -4173 -488 -960 1363 -706 -5268
3428e268M380J306q09M09m451K100M561k754l02j841o78O112k022k821J104j540
$$ -5268 -888 418 -391 18 -4433 -2333 2228 -526 -828 -2669 -3347 2765 743 -2078 -974 -2514
3444b514M541J130o136J782R49J098K959n222j080M254l41J485k108m002N376
$$ -2514 2027 3157 -2979 -1197 -248 850 3809 -1413 -2493 1761 1420 2905 797 -3205 2171
3459B171O27j276J7l620K848L559l517l83q19J75M617k678k901J914q04K672K90
$$ 2171 2798 1522 1539 -2081 767 4326 809 426 -393 -218 4399 1721 -1180 734 -70 2602 2892
3476B892m846J439J550j76J415l932j24L380r73m9j420j865L707K73k201k92j388
$$ 2892 -1954 -515 1035 859 2274 -1658 -1782 1598 625 576 -844 -2709 998 1271 -930 -1222 -2610
3493b610K226J840l037k06J46J95K555k276j675J625j03J232k98k597J660J222
$$ -2610 -384 1456 -1581 -1787 -1641 -1446 1109 -1167 -2842 -1217 -1320 -88 -386 -2983 -1323 -101
3509a01k38J84k130O09K471j115Q6j079k77K687m99j293N39o31J691J116k623
$$ -101 -339 -155 -2285 -1676 795 -320 -234 -1313 -1590 1097 598 -695 -156 -787 904 2020 -603
3526f03Q44J36M0K010j914o80J462j69N78l69j684J771L62q19P24j608Q37J171
$$ -603 241 377 417 2427 513 -167 1295 1126 1704 1335 -349 1422 1784 965 1689 81 918 2089
3544B089j613P38m70n47J356p03p94Q78p59M14M04j509R24L2o45P13j229q1J034
$$ 2089 476 1214 744 197 1553 850 56 934 175 589 993 -516 408 440 -205 508 -721 -802 232
3563B32j118K92K09j120J251m00q14Q28p56L78M95q97L53J39m18Q68n38r3K37
$$ 232 -886 -594 -385 -1505 -254 -654 -1468 -640 -1396 -1018 -523 -1420 -1067 -928 -1346 -478 -1016 -1109 -872
3582h72r8j8L61n46M41Q0M3J81l58K83L59k71N19j9l17P41k40l7K28k7P1J93r4
$$ -872 -970 -988 -627 -1173 -732 -652 -609 -428 -786 -503 -144 -415 104 85 -232 509 269 232 460 433 504 697 603
3605F03J16RP4M7J90k01K11j82L29j78l85L80K48k19k1j83j60K70n16L10k25J49
$$ 603 719 728 802 849 1039 838 1049 867 1196 1018 633 1013 1261 1042 1021 838 678 948 432 742 517 666
3627F66j61O6n18J41J54l71N0j44j50J12m04K0J11m7l5j14j55Q9j74M8o5j06J4
$$ 666 505 571 53 194 348 -23 27 -117 -267 -155 -559 -539 -428 -475 -510 -624 -779 -690 -864 -816 -881 -987 -973
3650i73N3j61K37j4l21M1K66k77K25J70R1K7K20m27P34j68j91J91J85n5N7J1R7
$$ -973 -920 -1081 -844 -858 -1179 -1138 -872 -1149 -924 -754 -663 -636 -416 -843 -109 -277 -468 -277 -92 -147 -90 -79 18
3673A8K69j43K88K26k61L55j36J38K63J66l42L24m38K38K81k85J61k9n36P30l49
$$ 18 287 144 432 658 397 752 616 754 1017 1183 841 1165 727 965 1246 961 1122 1093 557 1287 938
3694I38k83O58n01k20K43l21K37Q2p28O21o09m50N03r9j53p7n88P49k93n74M52
$$ 938 655 1313 812 592 835 514 751 833 105 726 117 -333 170 71 -82 -159 -747 2 -291 -865 -413
3715d13k89k27P56p35K0K08o03L89N3p25N81j52L25J62q63O62K0j40N53n81j77
$$ -413 -702 -929 -173 -908 -888 -680 -1283 -894 -841 -1566 -985 -1137 -812 -650 -1513 -851 -831 -971 -418 -999 -1176
3736a176Q67m32M56j25m52R52K96r59P23l43N35O13r37J30M85l14R74r50l23J010
$$ -1176 -309 -741 -285 -410 -862 90 386 -573 150 -193 342 955 18 148 633 319 1293 343 20 1030
3756A030n07M38K89j350J011L89n85J102j867M76J840j621L35m68o24J966r22
$$ 1030 523 961 1250 -100 911 1300 715 1817 -50 426 2266 645 980 512 -112 1854 932
3773I32r69N47o03J002P01k495P73M16L9J025k500j08J850q15N65r53j979L044
$$ 932 -37 510 -93 909 1610 -885 -112 304 343 1368 -1132 -1240 610 -205 360 -593 -2572 472
3791D72j49j280M16j702J468J636k470M70m79l2K585j739j270P54q0J830l10k817
$$ 472 323 -957 -541 -2243 -775 861 -1609 -1139 -1618 -1650 935 -804 -2074 -1320 -1400 430 120 -2697
3809b697J588O80K88N82k346K29K457l32N4j064j541L447J59j634Q0r99J999J538
$$ -2697 -1109 -429 -141 441 -1905 -1676 781 449 503 -561 -2102 1345 1504 -130 -50 -1049 950 2488
3827B488k287l16k1J011J936j797k039J586M29J165n70k663J492J624l48M4k469
$$ 2488 201 -115 -136 875 2811 1014 -1025 561 990 2155 1585 -1078 414 2038 1690 1734 -735
3844g35M58K776q36r75q81q52L027J71k583J12m81J446J626l234n45J508m95K289
$$ -735 -277 2499 1663 688 -193 -1045 1982 2153 -430 -318 -799 647 2273 -961 -1506 2 -493 1796
3862A796k448k188L191l36rnl137K314J727j916N57j898K84L697k383p92K13r49
$$ 1796 -652 -2840 351 15 6 1 -3136 -822 905 -1011 -454 -2352 -2068 1629 -754 -1546 -1333 -2282
3880b282L351n09l246J786k22J300J397m123R23J883o32J849k544j288L693q90
$$ -2282 1069 560 -2686 -900 -1122 178 1575 -2548 -1625 258 -374 1475 -1069 -2357 1336 446
3896D46R8l78k057L132O21k093J240j803J381K662k993M9K82q29L055j640j932
$$ 446 544 166 -1891 1241 1862 -231 1009 -794 587 3249 256 305 587 -242 2813 1173 -759
3913g59J870m81J308L14l418J741J043n22P78k586K8K988j683j19n10r07K339
$$ -759 1111 630 1938 2252 -1166 575 1618 1096 1874 -712 -684 2304 621 502 -8 -915 1424
3930A424m36j708P87p77J016Q91k230j38P74l80J563j487j202J500k54M47k73
$$ 1424 988 -720 67 -710 306 1197 -1033 -1171 -397 -777 786 -701 -1903 -403 -657 -210 -483
3947d83j855J335J371j352L71r28m6K085j305n67N39p70J935qk161J170K39q9
$$ -483 -2338 -1003 368 -984 -613 -1541 -1587 498 -807 -1374 -835 -1605 330 322 -1839 -669 -430 -519
3965e19J058j646K56J745j350R09k96r57J908n46p05J302j488O12J261j348P96
$$ -519 539 -1107 -851 894 -456 453 157 -800 1108 562 -143 1159 -329 283 1544 196 992
3982I92l31o53J785q32o22R42q70J025O6j849J340J31p34J016j445L36J038j148
$$ 992 661 8 1793 961 339 1281 411 1436 1502 -347 993 1124 390 1406 -39 297 1335 187
4000A87N84k85o76R08o78j57N76j123P58k4p11O91o59l82R67o93Q5K66r10O69
$$ 187 771 486 -190 718 40 -117 459 -664 94 70 -641 50 -609 -991 -24 -717 -632 -366 -1276 -607
4020f07m0k26L64o49K37L14l76J97K31m75K59Rl48P16o40L43M17m32M47p0j50
$$ -607 -647 -873 -509 -1158 -921 -607 -983 -786 -555 -1030 -771 -762 -1110 -394 -1034 -691 -274 -706 -259 -329 -479
4041d79N70l04k85O48q0K27J74o93M60M48l58K73j06j59P45m51L2K81l69L26J95
$$ -479 91 -213 -498 150 70 297 471 -222 238 686 328 601 495 336 1081 630 662 943 574 900 1095
4062A095l06K93r3k89K44k29J44M5l60M24M8p03L10k7m87M59m56J08J85k62k51
$$ 1095 789 1082 989 700 944 715 859 904 544 968 1016 313 623 596 109 568 112 220 405 143 -108
4083a08j46j35M59l04l35L87m62J31n6j50k15J67k15L47m65j61N95l64J65M9l4
$$ -108 -254 -389 70 -234 -569 -182 -644 -513 -569 -719 -934 -767 -982 -635 -1100 -1261 -666 -1030 -865 -816 -850
4104h50n4L66k57M8J24J08J94j76r3K50n8K39j43O5J98j32J41K97k19n2M88n32
$$ -850 -904 -538 -795 -747 -623 -515 -321 -497 -590 -340 -398 -159 -302 -237 -39 -171 -30 267 48 -4 484 -48
4126d8M74r1M4L96k75K08J4M9m9J20j37J99r5k15K60n7K5Kj34n3j84J18J06j43
$$ -48 426 335 379 775 500 708 722 771 722 842 705 904 809 594 854 797 822 824 690 637 453 571 677 534
4150E34k3m4P1l87N7l09J62j4j35q0k73J60P0p4k98J83l89J29j18k9K70l05NO6
$$ 534 511 467 538 151 208 -101 61 47 -88 -168 -441 -281 -211 -285 -583 -400 -789 -660 -778 -807 -537 -842 -837 -771
4174g71r3j33J77K27m4j71J62m3j01L76k47j51L87j45M48k19j80O94j67k13N29
$$ -771 -864 -997 -820 -593 -637 -808 -646 -689 -790 -414 -661 -812 -425 -570 -122 -341 -521 173 6 -207 322
4195C22o10M49M55m68l7K75k27O83l40Q1O12q28P08L11r86M67r3j42R43j325K24
$$ 322 -288 161 616 148 111 386 159 842 502 583 1195 367 1075 1386 400 867 774 632 1575 250 474
4216D74J021j028M39j87p31R38o5o87Q63j170M99Q44j348N64n91l52J530r74p55
$$ 474 1495 467 906 719 -12 926 861 174 1037 -133 366 1210 -138 426 -165 -517 1013 39 -716
4235g16O14m60M60L23j761J170j45k80R82j319k19J367p78L5l1j128J925n28l54
$$ -716 -102 -562 -102 221 -1540 -370 -515 -795 187 -1132 -1351 16 -762 -727 -758 -1886 39 -489 -843
4254h43K35p89O17J088j318K64j71rJ574r37o71P41o3P88O1j551J145M9J38N83
$$ -843 -608 -1397 -780 308 -1010 -746 -917 -926 648 -289 -960 -219 -282 506 567 -984 161 210 348 931
4274I31j097J3J265n31Q7l35m82J689m71o21M86o34J014L12j511N00m3qJ075j175
$$ 931 -166 -153 1112 581 668 333 -149 1540 1069 448 934 300 1314 1626 115 615 572 564 1639 464
4294D64m20R32r37J015l15j677J935n52m20R19j792P46R33j248O15m90o72J598
$$ 464 44 976 39 1054 739 -938 997 445 25 944 -848 -102 831 -417 198 -292 -964 634
4312F34j233l68J005j164R58M91j852R30k9j86R02j608N7J446j075P25j56r66
$$ 634 -599 -967 38 -1126 -168 323 -1529 -599 -628 -814 88 -1520 -1463 -17 -1092 -367 -523 -1489
4330a489J649n27n57P03q20P26N86j416R72o7o10J422p96k09R97n58K35N67j347
$$ -1489 160 -367 -924 -221 -1041 -315 271 -1145 -173 -240 -850 572 -224 -433 564 6 241 808 -539
4349e39J095L6j09P22j088J78O84n25M41j41o38J295n27m57N62n81P47R8j373
$$ -539 556 592 483 1205 117 295 979 454 895 754 116 1411 884 427 989 408 1155 1253 -120
4368a20Q45J14n44P11r01J27O40n34kj04n46P72n47n29R54o99J81K52j044P70
$$ -120 725 839 295 1006 105 232 872 338 336 232 -314 458 -89 -618 336 -363 -182 70 -974 -204
4388b04%o61N87n16J1N32m24J08K19p21N51J8n16N35l81L1Q16j079K12L89k55
$$ -204 -204 -865 -278 -794 -783 -251 -675 -567 -348 -1069 -518 -500 -1016 -481 -862 -831 -15 -1094 -882 -493 -748
4409g48P42o54l23Q74k6j99J38m88P07O25o69k4K6L97N02q21J77M03l1M9o6m04
$$ -748 -6 -660 -983 -109 -135 -334 -196 -684 23 648 -21 -45 -19 378 880 59 236 639 608 657 591 187
4431A87Q13j85K8P1o29M74L04k40J8l35q5N92k35m63M6l45P45J27p65k67K23P01
$$ 187 1000 815 843 914 285 759 1063 823 841 506 421 1013 778 315 361 16 761 888 123 -144 79 780
4453G80l02n86n49O40J94j61n64RN70q1m30m18l9M53K00l42k81J03K44K62n32
$$ 780 478 -108 -657 -17 177 16 -548 -539 31 -50 -480 -898 -937 -484 -284 -626 -907 -804 -560 -298 -830
4474h30k73J99M27Q1r5n25L7O85j33P3m91j22Q78kj17m01M19O73k41l63j0o2O78
$$ -830 -1103 -904 -477 -396 -491 -1016 -979 -294 -427 -354 -845 -967 -89 -91 -208 -609 -190 483 242 -121 -131 -193 485
4497D85J72p86J11K96M31J48l39l78L99K47j98n5l25M16L06j1k23l28K09J06m1
$$ 485 657 -129 -18 278 709 857 518 140 539 786 588 533 208 624 930 919 696 368 577 683 642
4518F42k69j0L05j37P8m40k21K93J75p0m78j73L67N6j22l65n6K33Q8k39l15J65
$$ 642 373 363 668 531 609 169 -52 241 416 346 -132 -305 62 118 -4 -369 -425 -192 -104 -343 -658 -493
4540d93K74q8k89j84n9J4L65k33r9L5J02J25j76OOM70j69q7J5L39k16P3K5k85
$$ -493 -219 -307 -596 -780 -839 -825 -460 -693 -792 -757 -655 -530 -706 -700 -694 -224 -393 -480 -465 -126 -342 -269 -244 -529
4564e29N12k27L3L05l23K68M43l79P4m9K9J06N5J73r5J27J08K28l92J60R4j35
$$ -529 -17 -244 -211 94 -229 39 482 103 177 128 157 263 318 491 396 523 631 859 467 627 721 586
4586E86k41J08J87o9q4Q7K59l00l37M45k79L8Ql32J02J32j64p2R1j88J84j62n04
$$ 586 345 453 640 571 487 574 833 533 196 641 362 400 408 76 178 310 146 74 165 -23 161 -1 -505
4609e05K26Q8k13K38k73L5Q5k54np0N0j8k26M43j18o5j91K75PP1k20q3J71o0K31
$$ -505 -279 -191 -404 -166 -439 -404 -319 -573 -578 -648 -598 -616 -842 -399 -517 -582 -773 -498 -491 -420 -640 -723 -552 -612 -381
4634c81J1k98L27j00J56L12k03R1R4K02r4L9k09L45J91j49PQ4J97k03K56L7O4
$$ -381 -370 -668 -341 -441 -285 27 -176 -85 9 211 117 156 -53 292 483 334 341 425 622 419 675 712 776
4657G76k36q1J27k33J66J44k72K05J01j14j38K67l83O7p9l97L02J28r8N0k03q5
$$ 776 540 459 586 353 519 663 391 596 697 583 445 712 329 396 317 -80 222 350 252 302 99 14
4679A4J59j85k09Q2kJ92k75O6j55k62J81j29j57l1J49K3j23R4j14L5J77j74K4
$$ 14 173 -12 -221 -139 -141 51 -224 -158 -313 -575 -394 -523 -680 -711 -562 -539 -662 -568 -682 -647 -470 -644 -620
4702f20k01J54L01m81M13qr3J40K57l99M24J22k25J76l33L52q8P7K82l8P9J76
$$ -620 -821 -667 -366 -847 -434 -442 -535 -395 -138 -537 -113 9 -216 -40 -373 -21 -109 -32 250 212 291 467
4724D67j41J1J46J26k70J08J56n2r6KL65k64J89Mk61K07j34j2q4o7J8Mj42l3O
$$ 467 326 337 483 609 339 447 603 551 455 457 822 558 747 751 490 697 563 551 467 400 418 422 280 247 253
4749B53j86N25o13J6K0l72L18L3k80K00j66l4J72n82M40R1l42L69o38j63O97k03
$$ 253 67 592 -21 -5 15 -357 -39 -6 -286 -86 -252 -286 -114 -696 -256 -165 -507 -138 -776 -939 -242 -445
4771d45Oj66m70N56lk14L85l10J81J64o52M24n0L01J09k24k18L91R1K80k33n25
$$ -445 -439 -605 -1075 -519 -522 -736 -351 -661 -480 -316 -968 -544 -594 -293 -184 -408 -626 -235 -144 136 -97 -622
4793f22R95k19j10M37o86M27M73o76M10j9m89J130o17l91O21m55P96%j060O77
$$ -622 373 154 44 481 -205 222 695 19 429 410 -79 1051 434 43 664 209 1005 1005 -55 622
4813F22J37k33P14j078j40J183p77Pk99m24J047k75o47M14p33Q85L18j204K08
$$ 622 759 526 1240 162 22 1205 428 435 136 -288 759 484 -163 251 -482 403 721 -483 -275
4832b75j24L38Q25j396n13Q14k8M68l35j172R45K65k12l1q18N69Q43p79p1l63
$$ -275 -399 -61 764 -632 -1145 -331 -359 109 -226 -1398 -453 -188 -400 -431 -1249 -680 163 -616 -687 -1050
4852a050N1J528o95q06J83P6J021K85j325k48M21R21K01j447k2J296J62J66p64
$$ -1050 -999 529 -166 -972 -789 -713 308 593 -732 -980 -559 362 563 -884 -906 390 552 718 -46
4871d6n87J260N18o44k98q40J073R30q63r8n17M82J232q68r52M95M12P50k57j487
$$ -46 -633 627 1145 501 203 -637 436 1366 503 405 -112 370 1602 734 -218 277 689 1439 1182 -305
4891c05L72M28N92Pj663J05J357k4m03q57m68J688q5r18k83m90J045Q59j426l37
$$ -305 67 495 1087 1094 -569 -464 893 869 466 -391 -859 829 744 -174 -457 -947 98 957 -469 -806
4911h06j20P86R33j558m06Q14j4M48n45j169R06Q27k73j77q96M03J014k82l82
$$ -806 -926 -140 793 -765 -1171 -357 -371 77 -468 -1637 -731 96 -177 -354 -1250 -847 167 -115 -497
4930d97m71n2J229j41q18L00k34J138M10j465K2O22M72K42q52k76O99K62J24m39
$$ -497 -968 -1020 209 68 -750 -450 -684 454 864 -601 -579 43 515 757 -95 -371 328 590 714 275
4950B75m79Q30N99l82n26k08K60P88l57o78O4L67N67m98l05l63M84M36l55o56
$$ 275 -204 626 1225 843 317 109 369 1157 800 122 186 553 1120 622 317 -46 438 874 519 -137
4970a37J19O25k6k97l98J22M86j99k54o03L72K41n1l69k62NN44R7m47p6k45K05
$$ -137 -18 607 581 284 -114 8 494 295 41 -562 -190 51 0 -369 -631 -626 -82 15 -432 -508 -753 -548
4992e48K10n56lL21J35J94l55j44L32J55k22j86N9k46K57N57m86J39L3K38p8M1
$$ -548 -338 -894 -897 -576 -441 -247 -602 -746 -414 -259 -481 -667 -608 -854 -597 -40 -526 -387 -354 -116 -194 -153
5014a53NR7L19K59o05Q1K66J21Q7r7l55M40Lk62nJ10L23r7J85j56n5K63j36k72
$$ -153 -148 -51 268 527 -78 3 269 390 477 380 25 465 468 206 201 311 634 537 722 566 511 774 638 366
5038C66J56j76L7P5j2j48j22q9K97m3l83L43j14r7Nj90j11K03k94j3J52l49K07
$$ 366 522 346 383 458 446 298 176 87 384 341 -42 301 187 90 95 -95 -206 -3 -297 -310 -158 -507 -300
5061c00j13J99j44k11K50K4j45o6Rj14j45M7J99j63M25j94jj28J09K81l66L17
$$ -300 -413 -214 -358 -569 -319 -295 -440 -506 -497 -611 -756 -709 -510 -673 -248 -442 -443 -571 -462 -181 -547 -230
5083b30o9N2L37j56o4J2M1K91j17o2J20j00P7R3l0k1K73om1Q5J2o5R8m5j06O1
$$ -230 -299 -247 90 -66 -130 -118 -77 214 97 35 155 55 132 225 195 174 447 441 400 485 497 432 530 485 379 440
5109D40L2J91J9j44J23o0k52J66j47q5n6J49j86l11M17O8k21j99J95J16l21K63
$$ 440 472 663 682 538 661 601 349 515 368 283 227 376 190 -121 296 364 143 -56 139 255 -66 197
5131A97m69q6m6J25j17J7n7L67o49N24n28L59k39k01M02j75l1Q8j72K44j15J56
$$ 197 -272 -358 -404 -279 -396 -379 -436 -69 -718 -194 -722 -363 -602 -803 -401 -576 -607 -519 -691 -447 -562 -406
5153d06j92k58L73J88j62J26jL35j73r1J98j65N71j17p2j25q3J54L80j84m3K1
$$ -406 -598 -856 -483 -295 -457 -331 -332 3 -170 -261 -63 -228 343 226 154 29 -54 100 480 296 253 274
5175B74K59q1j66K25J27j26J70j01m32L63j14J3J4J6K57k9k93j01j54K38Q8q6
$$ 274 533 452 286 511 638 512 682 581 149 512 398 411 425 441 698 669 376 275 121 359 447 361
5197C61k2l45j0L54k35k78Q3o9J34k3n27K3L76K1k3P8o07M13j88L90k71l58K84
$$ 361 339 -6 -16 338 103 -175 -92 -161 -27 -50 -577 -554 -178 -157 -180 -102 -709 -296 -484 -94 -365 -723 -439
5220d39O9r4N0n19L89M66n50J22k15L34P08o02l57M05j1P81l80q43O71J55k3M14
$$ -439 -370 -464 -414 -933 -544 -78 -628 -506 -721 -387 321 -281 -638 -233 -244 537 157 -686 -15 140 117 531
5242E31j013L88N70j12L8p25L00P67m8k72j31m89J158j34o24j41P3O86L43j193
$$ 531 -482 -94 476 364 402 -323 -23 744 696 424 293 -196 962 828 204 63 136 822 1165 -28
5262b8J87O7J87Q08j062n27Q29j46L61k97r42O01N81l61j14p56K67R94m26o78
$$ -28 159 226 413 1221 159 -368 461 315 676 379 -563 38 619 258 144 -612 -345 649 223 -455
5282d55m36L04R86J2j110j03K36Q87K9j288k73Q00L69n1l96q54J012M39j07n88
$$ -455 -891 -587 399 411 -699 -802 -566 321 350 -938 -1211 -411 -42 -93 -489 -1343 -331 108 1 -587
5302e87p32R40J243p71o01o15O89J082m45p43j19M07J146m59j037L17M08O96R0
$$ -587 -1319 -379 864 93 -508 -1123 -434 648 203 -540 -659 -252 894 435 -602 -285 123 819 909
5321I09j492K74J070K01m36r28k89J584K61n67o18k21R77N21p97l31k38P94O75
$$ 909 -583 -309 761 962 526 -402 -691 893 1154 587 -31 -252 725 1246 449 118 -120 674 1349
5340A349j033l09K2M23Q93r02j298O13O08M45l30j362M48R11N2m60j093J27J228
$$ 1349 316 7 29 452 1345 443 -855 -242 366 811 481 -881 -433 478 530 70 -1023 -896 332
5359C32q6o22l30j24J124l72o99r3K11P40J97j199j9M83Q1M51p63n77Q07M73n2
$$ 332 246 -376 -706 -830 294 -78 -777 -870 -659 81 278 -921 -940 -457 -376 75 -688 -1265 -458 15 -37
5380c7n00m48O25N30Q1m55l08O18L04j27m05j93M10L73j60m41k10P29K79k14q4
$$ -37 -537 -985 -360 170 251 -204 -512 106 410 283 -122 -315 95 468 308 -133 -343 386 665 451 367
5401C67k79K97L24l84m63M26J43K90k09n43M30J26J08k23q4p1J04M11o58j50P2
$$ 367 88 385 709 325 -138 288 431 721 512 -31 399 525 633 410 326 255 359 770 112 -38 34
5422C4L94Q9m50j33J35J60k46k05k13K35PM51p10j55K81Q8l6j84l9P4K74j97k8
$$ 34 428 517 67 -66 69 229 -17 -222 -435 -200 -193 258 -452 -607 -326 -238 -274 -458 -497 -423 -149 -346 -374
5445c74j74j76J90K19k59O0J76m0R0r8R1n9K21K4K41m17K92N6k11J85kL3K36o6
$$ -374 -548 -724 -534 -315 -574 -514 -338 -378 -288 -386 -295 -354 -133 -109 132 -285 7 63 -148 37 35 68 304 238
5469B38Q3rn4J19j47K45J01k17QK05l06K9o6L34j55q5m3K01J11J06n75K40J50
$$ 238 321 312 258 377 230 475 576 359 367 572 266 295 229 563 408 323 280 481 592 698 123 363 513
5492E13k63J6L0k80r7J75m6J10j33J9j61pn0J51j63L0k04J80j68J99l35J20j07
$$ 513 250 266 296 16 -81 94 48 158 25 44 -117 -124 -174 -23 -186 -156 -360 -180 -348 -149 -484 -364 -471
5515d71J86k64J34r9J92J6J41n61N60k06j05j33K25N7Ql7N3J36J09Q0o0k81M24
$$ -471 -285 -549 -415 -514 -322 -306 -165 -726 -166 -372 -477 -610 -385 -328 -320 -357 -304 -168 -59 21 -39 -320 104
5538A04p2P0O7j24J42q5J00J96r3j07J84K30j58J5l58M00l8M4k3P9k08j11K89
$$ 104 32 102 169 45 187 102 202 398 305 198 382 612 454 469 111 511 473 517 494 573 365 254 543
5561E43n8q5o8Q9jj66K17l11L34k15k24K36j56o0l0%l4J58l68n1k59J99P1l71
$$ 543 485 400 332 421 420 254 471 160 494 279 55 291 135 75 45 45 11 169 -199 -250 -509 -310 -239 -610
5585f10L32P9l73j24M13k54J38J12j49M7j73J30p5q0L4J97j96L97k39O0L1m9O9
$$ -610 -278 -199 -572 -696 -283 -537 -399 -287 -436 -389 -562 -432 -507 -587 -553 -356 -552 -155 -394 -334 -303 -352 -283
5608b83K38j24K46j95J01n2J49j99L62m06L71j97K99P8k17n2J78N1M18l15k16
$$ -283 -45 -169 77 -118 -17 -69 80 -119 243 -163 208 11 310 388 171 119 297 348 766 451 235
5629B35K85q3n5N41o88L46J9k64J10j36J81N2n8m2l70k84K29L87k05n9k35N7K20
$$ 235 520 437 382 923 235 581 600 336 446 310 491 543 485 443 73 -211 18 405 200 141 -94 -37 183
5652A83n6n4k55r0L62j66k75q1r9J95J67j41R5J63m10J92l78m5L08lJ07j21n14
$$ 183 127 73 -182 -272 90 -76 -351 -432 -531 -336 -169 -310 -215 -52 -462 -270 -648 -693 -385 -388 -281 -402 -916
5675i16O95K80l37J7k01K43M53m51J73m68M27M68l02j82J21K69J1j26l76K31L61
$$ -916 -221 59 -278 -261 -462 -219 234 -217 -44 -512 -85 383 81 -101 20 289 300 174 -202 29 390
5696C90J71o3k68k69N27m9J81j83k74N88Jl58j89j00N25m4m41m3N1J49K38m71
$$ 390 561 498 230 -39 488 439 620 437 163 751 752 394 205 105 630 586 145 102 153 302 540 69
5718F9k15M16r0J25l63k27N20k97J20k0n85J30O50k05l78k96Q0O21l18l56K35
$$ 69 -146 270 180 305 -58 -285 235 -62 58 38 -547 -417 233 28 -350 -646 -566 55 -263 -619 -384
5739c84m81P81J16r10l0L76J19N16q99J20M17r1L99n61l00O33J95k11j61l26O22
$$ -384 -865 -84 32 -878 -908 -532 -413 103 -796 -676 -259 -350 49 -512 -812 -179 16 -195 -356 -682 -60
5760f0M22l64lj66L8Q92p74o0K46j74M78j72j10k01L87L42p1p03M44M17k83J09
$$ -60 362 -2 -5 -171 -133 759 -15 -75 171 -3 475 303 193 -8 379 721 650 -53 391 808 525 634
5782F34l88k62O97J08k69k99k69O19Rl36k34j47N79K0o95M79j25r3J72m57L2J92
$$ 634 246 -16 681 789 520 221 -48 571 580 244 10 -137 442 462 -233 246 121 28 200 -257 -225 -33
5804c3k27L45l28m52N92N6j75o2l75L95M9l65J23j63K30K14n78L04J60J6J93m16
$$ -33 -260 85 -243 -695 -103 -47 -222 -284 -659 -264 -215 -580 -457 -620 -390 -176 -754 -450 -290 -274 -81 -497
5826d97j95L66j4J3O7k53M62m0q1J40l93K61L17j17p4m0J63L98l84j80M12j39
$$ -497 -692 -326 -340 -327 -260 -513 -51 -91 -172 -32 -425 -164 153 36 -38 -78 85 483 99 -81 331 192
5848A92M19Q0n43L60j69K04J97q00O05l70M02m42j0J69L54l14l19J67j18L09R
$$ 192 611 691 148 508 339 543 740 -60 545 175 577 135 125 294 648 334 15 182 64 373 382
5869C82k13M1j37k1O6k84J04N5k97K55Pl56N92m27M5j60k27K91P7j03K64n88K73
$$ 382 169 210 73 52 118 -166 -62 -7 -304 -49 -42 -398 194 -233 -188 -348 -575 -284 -207 -310 -46 -634 -361
5892c61J57j41j63j20L42K34m66P3m1J26J44Kj40nL41l28o9K34q1L42j0j42J10
$$ -361 -204 -345 -508 -628 -286 -52 -518 -445 -486 -360 -216 -214 -354 -359 -18 -346 -415 -181 -262 80 70 -72 38
5915C8m5J63N5k20K79J46j26L28n84K25K12o9L2q2L7J1j43J48K14j09j56m0m0
$$ 38 -7 156 211 -9 270 416 290 618 34 259 471 402 434 352 389 400 257 405 619 510 354 314 274
5938B74n8j24K20J00l68J06K21k24k71P2r7K38J24k94l9j72N5Q1j7l34K84p2P2
$$ 274 216 92 312 412 44 150 371 147 -124 -52 -149 89 213 -81 -120 -292 -237 -156 -173 -507 -223 -295 -223
5961b23r1k8J14j99qq2j90L89r1J09J10m35M51l8j97j0J97k63K24K15k11R5j61
$$ -223 -314 -342 -228 -427 -435 -517 -707 -318 -409 -300 -190 -625 -174 -212 -409 -419 -222 -485 -261 -46 -257 -162 -323
5984c23M8R4L11R8j47p0J53j77qL33j45R1L7L7R9k32J0R2Q6l0J15j25K03Q0k32
$$ -323 -275 -181 130 228 81 11 164 -13 -21 312 167 258 295 332 431 199 209 301 387 357 472 347 550 630 398
6009C98J33k97lP5P7N3k53j14J32p5rQ7k73P8J5m8R2j88o8J44j69k45j1K62l2
$$ 398 531 234 231 306 383 436 183 69 201 126 117 204 -69 9 24 -24 68 -120 -188 -44 -213 -458 -469 -207 -239
6034b39j77q1J27J40l21J99j34K43j69l8j26N0kJ38J00r9j1K01p0J71j64K35j10
$$ -239 -416 -497 -370 -230 -551 -352 -486 -243 -412 -450 -576 -526 -528 -390 -290 -389 -400 -199 -269 -98 -262 -27 -137
6057a37j2j87J0N70j74k0k9l4J47J36j38PJ25K53j47o5j71K03j92L24p5L9j06
$$ -137 -149 -336 -326 244 70 50 21 -13 134 270 132 139 264 517 370 305 134 337 145 469 394 433 327
6080C27J38q2k6j74r8M24m08j34M48j46J63k88J65P0n13N5N5R1L9k12L0K21j46
$$ 327 465 383 357 183 85 509 101 -33 415 269 432 144 309 379 -134 -79 -24 67 106 -106 -76 145 -1
6103am0l5j17J92n4j64K1j3k47N93o36J06k27K93P3j56K47j06K9o7K49n56L61
$$ -1 -41 -76 -193 -1 -55 -219 -198 -211 -458 135 -501 -395 -622 -329 -256 -412 -165 -271 -242 -309 -60 -616 -255
6126b55m7J57J49j43lJ17L1K4L7j80j3J07M17k31l36J41K66j17q2J74K70k21l1
$$ -255 -302 -145 4 -139 -142 -25 6 30 67 -113 -126 -19 398 167 -169 -28 238 121 39 213 483 262 231
6149B31O6L5r2R5J81l39J09J93j18K4q1J44p0j1j46j32J57n5J99l15Q2K28k25
$$ 231 297 332 240 335 516 177 286 479 361 385 304 448 378 367 221 89 246 191 390 75 157 385 160
6172A60r6j99l3O02p50M80m05p9K54r3r3K15m76L05r2k28K18Q6L4q2l48J94N45
$$ 160 64 -135 -168 434 -316 164 -241 -320 -66 -159 -252 -37 -513 -208 -300 -528 -310 -224 -190 -272 -620 -426 119
6195A19r12O83o0n69N66j94O2J02j94K30J87k40K79l49M24J33o29L73M8j63M84
$$ 119 -793 -110 -170 -739 -173 -367 -305 -203 -397 -167 20 -220 59 -290 134 267 -362 11 59 -104 380
6216C80k60P0K02k2j13J54m78L83J57l30K09r2j8K29m91K84r4%J35N0k21K11l12
$$ 380 120 190 392 370 257 411 -67 316 473 143 352 260 242 471 -20 264 170 170 305 355 134 345 33
6239C3M41j30o18N37k69L62j05k70J71p3J25j23n07L65K31j03k55j67l02O79J15
$$ 33 474 344 -274 263 -6 356 251 -19 152 79 204 81 -426 -61 170 67 -188 -355 -657 22 137
6260A37n55K03jPL56p33L5L96k25K46l33oL28m2L88l51m41O98k42k21J48j90L25
$$ 137 -418 -215 -216 -209 147 -586 -551 -155 -380 -134 -467 -473 -145 -187 201 -150 -591 107 -135 -356 -208 -398 -73
6283g3L63l08O5k01J73J06O4k46Q5OL63N9q36L88K39J01J8k27K57K43l24j7j60
$$ -73 290 -18 47 -154 19 125 189 -57 28 34 397 456 -380 8 247 348 366 139 396 639 315 298 138
6306A38j16M59j81l61K96J60k3M1j69mN2k29J92k66K7Q0M5r5j90j72L84K72n22
$$ 138 22 481 300 -61 235 395 372 413 244 240 292 63 255 -11 16 96 141 46 -144 -316 68 340 -182
6329a82k62j01K89L67j78l97M4m8M85l94j91K40j54N55k02o07M83P1J40k39j21
$$ -182 -444 -545 -256 111 -67 -464 -420 -468 17 -377 -568 -328 -482 73 -129 -736 -253 -182 -42 -281 -402
6350d02o7N34l11N8k94K47M78l16j00p0J91L42J61q70K36M33j19K25l34L1M32
$$ -402 -469 65 -246 -188 -482 -235 243 -73 -173 -243 -52 290 451 -419 -183 250 131 356 22 53 485
6371D85k96J84l35q2N81J03k53Q4k94J42L31n01K11l20K80K2j70k27J64J67J74
$$ 485 189 373 38 -44 537 640 387 471 177 319 650 149 360 40 320 342 172 -55 109 276 450
6392D50j24o08J08L74K2k0m43L3M62J18l78l93M1N71k94j17j80n9O28m70k77K35
$$ 450 326 -282 -174 200 222 202 -241 -208 254 372 -6 -399 -358 213 -81 -198 -378 -437 191 -279 -556 -321
6414c21O1J51Rl80J43j78J32K49q4k46M58k10Q8j52j84M64k3q9m3j25J48K81j80
$$ -321 -260 -109 -100 -480 -337 -515 -383 -134 -218 -464 -6 -216 -128 -280 -464 0 -23 -112 -155 -280 -132 149 -31
6437c1NJ88o7J23J57l61J88K64j23J25n65K07L43k37J39j54R8Q7r2J7j73J33L6
$$ -31 -26 162 95 218 375 14 202 466 343 468 -97 110 453 216 355 201 299 386 294 311 138 271 307
6460C07k8J7jj80K38o4j87j61J71K31k12k44K94j05J26j83R3l40p4K11j8n1J46
$$ 307 279 296 295 115 353 289 102 -59 112 343 131 -113 181 76 202 19 112 -228 -302 -91 -109 -160 -14
6483a4m96M94L3k87L3j14J25J22k10j70J97o0K28k96J88K6lj88J19%J09j30J71
$$ -14 -510 -16 17 -270 -237 -351 -226 -104 -314 -484 -287 -347 -119 -415 -227 -201 -204 -392 -273 -273 -164 -294 -123
6506a23o2p4K92j02l2N0J78k25J53L27l41K00r9J14p1M2m3J68O6m01L69j34R0
$$ -123 -185 -259 33 -69 -101 -51 127 -98 55 382 41 241 142 256 185 227 184 352 418 17 386 252 342
6529C42k34N17m24J80j01q7J6J5O3RLj08j40J97j67QP9j24M9J56k31k43J16j17
$$ 342 108 625 201 381 280 193 209 224 287 296 299 191 51 248 81 89 168 44 93 249 18 -225 -109 -226
6553b26N0O9r9j79K65r9n1J4n3K50r9l39N47j09l70J64P3L7j26Lj17M04l18L08
$$ -226 -176 -107 -206 -385 -120 -219 -270 -256 -309 -59 -158 -497 50 -59 -429 -265 -192 -155 -281 -278 -395 9 -309 -1
6577aK24o72L61J7q8K08j25n6J6K05l51L45n1K87Q4l85J81R8Q6rk83K18r6M7J03
$$ -1 223 -449 -88 -71 -159 49 -76 -132 -116 89 -262 83 32 319 403 18 199 297 383 374 91 309 213 260 363
6602C63k44K23j6O7j29j15J96k1jk46J50j88J74P4m77M15K02l35J7k72K01J27
$$ 363 119 342 326 393 264 149 345 324 323 77 227 39 213 287 -190 225 427 92 109 -163 38 165
6624A65k70J78k4j90NJ54l18J6nJ40r4j30o1O1R3J4PK4k73J2M64l97k6K26k00
$$ 165 -105 73 49 -141 -136 18 -300 -284 -289 -149 -243 -373 -434 -373 -280 -266 -259 -235 -508 -496 -32 -429 -455 -229 -429
6649d29L07O5k13L4K39k2K74n75L22j14lN43k55l63J99K61j74J11l77M57o0k09
$$ -429 -122 -57 -270 -236 3 -19 255 -320 2 -112 -115 428 173 -190 9 270 96 207 -170 287 227 18
6671A8L57m40J89M87m18j14Q0P5K97k26n5K08k34J3R1m80K30j14L2M54n47J53
$$ 18 375 -65 124 611 193 79 159 234 531 305 250 458 224 237 328 -152 78 -36 -4 450 -97 56
6693E6L85n77O70n06l89N02j14J09j21m88N18q1m44K44o1l7N92n74j5J2j0M33
$$ 56 441 -136 534 28 -361 141 27 136 15 -473 45 -36 -480 -236 -297 -334 258 -316 -331 -319 -329 104
6715A04m56l63O35J57k37k49j85K75K40q1k22P6P2N86n53j21J62K44l2K18o63
$$ 104 -352 -715 -80 77 -160 -409 -594 -319 -79 -160 -382 -306 -234 352 -201 -322 -160 84 52 270 -393
6736c93J89M6J21M43l87k61M35j9L42k50j90P4K09m0k28r6M25M39o46J36k20k33
$$ -393 -204 -158 -37 406 19 -242 193 174 516 266 76 150 359 319 91 -5 420 859 213 349 129 -104
6758a04Q22o22j16K68k0J59k24m47N24J70j49O3o82R0R82o91J35k86j70P27o20
$$ -104 718 96 -20 248 228 387 163 -284 240 410 261 324 -358 -268 714 23 158 -128 -298 429 -191
6779a91j00J29l68N59J88r04J06K83j44N85o80o8L27J3L59q35k7O76N4q2Ln95
$$ -191 -291 -162 -530 29 217 -687 -581 -298 -442 143 -537 -605 -278 -265 94 -741 -768 -92 -38 -120 -117 -712
6801g12Q01J06l45j13k09O45K74m94k79L90k29N78l33n39L24M31L47j69q25O06
$$ -712 89 195 -150 -263 -472 173 447 -47 -326 64 -165 413 80 -459 -135 296 643 474 -351 255
6821B55J02j78J82m50rP26L7l81ol37N92R5l31M1n40P01p8m97L3K11J96J59n46
$$ 255 357 179 361 -89 -98 628 665 284 278 -59 533 628 297 338 -202 499 421 -76 -43 168 364 523 -23
6844b3m61N78Q0O9k32m35K97P8J37k70k39K50n9K24l06l7j06L23J0j99q4J50j15
$$ -23 -484 94 174 243 11 -424 -127 -49 88 -182 -421 -171 -230 -6 -312 -349 -455 -132 -122 -321 -405 -255 -370
6867c70M67n16j05K63R1j12j70K59j00K96J74k23j10J95J01j04n9J19p9Q5m8j44
$$ -370 97 -419 -524 -261 -170 -282 -452 -193 -293 3 177 -46 -156 39 140 36 -23 96 17 102 54 -90
6889i0J66j35L13j74j20K39K9K50k42L1J7N6J67k33j13KK28M0l76J52k58M96M
$$ -90 76 -59 254 80 -40 199 228 478 236 267 284 340 507 274 161 163 391 431 55 207 -51 445 449
6912D49k62J69l00P3L7J51r8k75j25J58k03p3K51J10l09J86nk1jk88K72m34J56
$$ 449 187 356 56 129 166 317 219 -56 -181 -23 -226 -299 -48 62 -247 -61 -66 -87 -88 -376 -104 -538 -382
6935c82K81o3k14L19k14K9k43jL19r8J44k87J50J93j8j19j82R4J56M8J17J57k83
$$ -382 -101 -164 -378 -59 -273 -244 -487 -488 -169 -267 -123 -410 -260 -67 -85 -204 -386 -292 -136 -88 29 186 -97
6958i7j55L24k2J59j93K80j63n8L28p33M53j47J33K21L1J8j53j3R1j9j24J98k24
$$ -97 -252 72 50 209 16 296 133 75 403 -330 123 -24 109 330 361 379 226 213 304 285 161 359 135
6981A35J17L8r7J54k27N1o1k60K71j38J58J08P7l29k61L50k74N3P5p7j14M9n3
$$ 135 252 290 193 347 120 171 110 -150 121 -17 141 249 326 -3 -264 86 -188 -135 -60 -137 -251 -202 -255
7004b55K23m0k46K37k15K85p4k43M7oj9J65Rj60K33k36M0J00k17P6L18q0q2j6
$$ -255 -32 -72 -318 -81 -296 -11 -85 -328 -281 -287 -306 -141 -132 -292 -59 -295 -255 -155 -372 -296 22 -58 -140 -156
7028a56q8O7J30N8j13J48j30L28k5j83K03o0j72M07k81K55m09J67j78L00J9k21
$$ -156 -244 -177 -47 11 -102 46 -84 244 219 36 239 179 7 414 133 388 -21 146 -32 268 287 66
7050F6K70r7j26L02k45J49P0j50j68J82rR3k54j0K9K65j84j0k22L0J53k41J32
$$ 66 336 239 113 415 170 319 389 239 71 253 244 337 83 73 102 367 183 173 -49 -19 134 -107 25
7073B5j03j2lJ1M1K88n03O8q1j10J09J00j34J72j95m1K70q9J68m33o0J42J37K56
$$ 25 -78 -90 -93 -82 -41 247 -256 -188 -269 -379 -270 -170 -304 -132 -327 -368 -98 -187 -19 -452 -512 -370 -233 23
7097B3j30l8o2J21L5k4j84r0L36J07l73M16m49P42k94k57M46k61J97J31k05K2
$$ 23 -107 -145 -207 -86 -51 -75 -259 -349 -13 94 -279 137 -312 430 136 -121 325 64 261 392 187 209
7119B09J84k82J14K31m23L35L6k98L41m58M13N2l82J16p8l9M05k84k30L32k94
$$ 209 393 111 225 456 33 368 404 106 447 -11 402 454 72 188 110 71 476 192 -38 294 0
7140@O06n24j77L47k96P2L49n99J5M76m23K03k68J20J73l24j73J86l88L41M7j71
$$ 0 606 82 -95 252 -44 28 377 -222 -207 269 -154 49 -219 -99 74 -250 -423 -237 -625 -284 -237 -408
7162d08K99k39M03j50l49J57J90j93K85j91l15L31j35L26r1l19M75J6m16l8m3
$$ -408 -109 -348 55 -95 -444 -287 -97 -290 -5 -196 -511 -180 -315 11 -80 -399 76 92 -324 -362 -405
7183d05K26O09o00j74M30j01M14l0p75P77j16j24M19p77K11O91o44K42j86k28
$$ -405 -179 430 -170 -344 86 -15 399 369 -406 371 255 131 550 -227 -16 675 31 273 87 -141
7203a41P22l89J6l30O5M13L3m77K56k04L3O18p11k4L37l07K01l92k05Q42m19J98
$$ -141 581 192 208 -122 -57 356 389 -88 168 -36 -3 615 -96 -120 217 -90 111 -281 -486 356 -63 135
7225A35l8q45J010n0m80L94n76k71J358j055Q9r0R0P59n60p05O15j40L14K51p15
$$ 135 97 -748 262 212 -268 126 -450 -721 637 -418 -329 -419 -329 430 -130 -835 -220 -360 -46 205 -510
7246e10K29M07k65J39k79q9L95l43M72k11m72Q23k95j60L10m04M03M68q49R2L26
$$ -510 -281 126 -139 0 -279 -368 27 -316 156 -55 -527 296 1 -159 151 -253 150 618 -231 -139 187
7267A87M7K32j08l67L00l2J17j14l47L25q5O7K71m88J43L52l71j7J52k15L91j00
$$ 187 234 466 358 -9 291 259 376 262 -85 240 155 222 493 5 148 500 129 112 264 49 440 340
7289C40k88J55l35L89j28m78L49N4L2j20j59l0K69p8K40m35k66N01k4m13K04l6
$$ 340 52 207 -128 261 133 -345 4 58 90 -30 -189 -219 50 -28 212 -223 -489 12 -12 -425 -221 -257
7311b57N2J92l53M32l13O6K95l66l92O36j37j81K99m74L29J49j53M42l91k74O36
$$ -257 -205 -13 -366 66 -247 -181 114 -252 -644 -8 -145 -326 -27 -501 -172 -23 -176 266 -125 -399 237
7332B37j76j8Lj85N71k91l48L22o6L3K93n54K62J89j02J56k31M7K55k17N3j42
$$ 237 61 43 46 -139 432 141 -207 115 49 82 375 -179 83 272 170 326 95 142 397 180 233 91
7354I1mJ64jm8K49j37j64q5J42j26L90m17lK88l63J56j80J62q4j04kJ04k35K04
$$ 91 87 251 250 202 451 314 150 65 207 81 471 54 51 339 -24 132 -48 114 30 -74 -76 28 -207 -3
7378cq4p3Q2r5P3l34p9M74r7l70K16k5J5r1M70Pk85j08O2p0J62J67k64L18j00
$$ -3 -87 -160 -78 -173 -100 -434 -513 -39 -136 -506 -290 -315 -300 -391 79 86 -199 -307 -245 -315 -153 14 -250 68 -32
7403c2j65lK27O0J60m48M23j14O8Q5m16L5K18K2l4J87K05l38P3O1K62k06k05L8
$$ -32 -197 -200 27 87 247 -201 222 108 176 261 -155 -120 98 120 86 273 478 140 213 274 536 330 125 163
7427A63K60j52K2p4%K8p4k4Nq7j17J12j60J85k6r9J95%l26K22J29k30k04k7J64
$$ 163 423 271 293 219 219 247 173 149 154 67 -50 62 -98 87 61 -38 157 157 -169 53 182 -48 -252 -279 -115
7452a15O7P7k41K71l39L24l1l14J52p5P5l27J99J38qq9lK11o3k48K22j99J38k20
$$ -115 -48 29 -212 59 -280 44 13 -301 -149 -224 -149 -476 -277 -139 -147 -236 -239 -28 -91 -339 -117 -316 -178 -398
7476c98K02p2K63L9l11L21j27J66q6kQ2J64j75M0j46R4J48O2o3J28q8Q3j4k47
$$ -398 -196 -268 -5 34 -277 44 -83 83 -3 -5 77 241 66 106 -40 54 202 264 201 329 241 324 310 63
7500F3K82lJ81j64k41J51k14K44j63n6K94j91J09k46j86K97j82J26o2P2j63J72
$$ 63 345 342 523 359 118 269 55 299 136 80 374 183 292 46 -140 157 -25 101 39 111 -52 120
7522A20o9j85J05j6q4J56l35J25R9l5j24j43R1K00q1j26n0L9K04j53Q0k93L56
$$ 120 51 -134 -29 -45 -129 27 -308 -183 -84 -119 -243 -386 -295 -95 -176 -302 -352 -313 -109 -262 -182 -475 -119
7545a19j7n5J80j77j02J96K7j89J21R2n3m2r6L9J99L65p6k60k0qJ25J64j94k4
$$ -119 -136 -191 -11 -188 -290 -94 -67 -256 -135 -43 -96 -138 -234 -195 4 369 293 33 13 5 130 294 100 76
7569G6j9p4L75k51J08p3R8J4k17J38J80j11K2K45l76k07L12J49m25L9rk4K92l63
$$ 76 57 -17 358 107 215 142 240 254 37 175 355 244 266 511 135 -72 240 389 -36 3 -6 -30 262 -101
7593a01j15P9J01K15l72J90J6j10J82o5m34M04P1j40j33n7k03o8M27p6j16N2R8
$$ -101 -216 -137 -36 179 -193 -3 13 -97 85 20 -414 -10 61 -79 -212 -269 -472 -540 -113 -189 -305 -253 -155
7616a55O1o6m8r4L73k24J77k76J76R1k4j27q0L16k75K18j51J20J3O2jN6j14M25
$$ -155 -94 -160 -208 -302 71 -153 24 -252 -76 15 -9 -136 -216 100 -175 43 -108 12 25 87 86 142 28 453
7640D53l47p8L60k55k04N63n63N05k60j57K77O0k3o8q4r8r3o4J22J75k36J64J20
$$ 453 106 28 388 133 -71 492 -71 434 174 17 294 354 331 263 179 81 -12 -76 46 221 -15 149 269
7663B69l89M48m69J61j4l02M68m38j2J75j7l08N00k98J43J28j51o0j47Q3L32m28
$$ 269 -120 328 -141 20 6 -296 172 -266 -278 -103 -120 -428 72 -226 -83 45 -106 -166 -313 -230 102 -326
7685c26KJ23O7J59j53k74M90k42p8K22m68J6L25mJ63j82k90P63l71J24P8l36M60
$$ -326 -324 -201 -134 25 -128 -402 88 -154 -232 -10 -478 -462 -137 -141 22 -160 -450 313 -58 66 144 -192 268
7708B68R5o64L36J64N5p5k48m5M3J26k1J3o3M48n09L88k1k14K95j75QM2l03P5
$$ 268 363 -301 35 199 254 179 -69 -114 -71 55 34 47 -16 432 -77 311 290 76 371 196 204 246 -57 18
7732A8K58q2k14J12j01K30M3n72M87m38J30J90l50J93O4k27K15j21J36K44m15
$$ 18 276 194 -20 92 -9 221 264 -308 179 -259 -129 61 -289 -96 -32 -259 -44 -165 -29 215 -200
7753b00L25l21l43M44o0l03M45l04K27O5l23P8K14l20M35j01k61L52l92K54r2
$$ -200 125 -196 -539 -95 -155 -458 -13 -317 -90 -25 -348 -270 -56 -376 59 -42 -303 49 -343 -89 -181
7774a81k93M20R2n78N44l00J56L62o29M19J46l88M91k96j26N90o2p2J17n07L00
$$ -181 -474 -54 38 -540 4 -296 -140 222 -407 12 158 -230 261 -35 -161 429 367 295 412 -95 205
7795B05Q2j62L63l44L8Q9j61J63o2rM59l92l36K56p6J66j48k93M82k82q7L60n69
$$ 205 287 125 488 144 182 271 110 273 211 202 661 269 -67 189 113 279 131 -162 320 38 -49 311 -258
7818b58K61K56n40J45p2o4M11j05j89k7k9J3M30n92J24K41j35L84n93j2J29p6
$$ -258 3 259 -281 -136 -208 -272 139 34 -155 -182 -211 -198 232 -360 -236 5 -130 254 -339 -351 -222 -298
7840b98L06O3m35K25j11J45M7pj50O27o17k6J95k01L51j30l67O33o1j32J02k48
$$ -298 8 71 -364 -139 -250 -105 -58 -65 -215 412 -205 -231 -36 -237 114 -16 -383 250 189 57 159 -89
7862h9m3K93nJ12r4j60M51m97K72J07m21L79R2r6r1j38J92R9k73m5J98j78N6k1
$$ -89 -132 161 156 268 174 14 465 -32 240 347 -74 305 397 301 210 72 264 363 90 45 243 65 121 100
7886A00k85L71q8j61R5j09l8K70k31M4j05J34o7K4p5J8J40j80q9P7J34o4L4M3
$$ 100 -185 186 98 -63 32 -77 -115 155 -76 -32 -137 -3 -70 -46 -121 -103 37 -143 -232 -155 -21 -85 -51 -8
7910hj49n8k1J5J0R5l32L48k02L01k34K1K98m3k39p9L51K1Q2j78j25PK64j2kk91
$$ -8 -157 -215 -236 -221 -211 -116 -448 -100 -302 -1 -235 -214 84 41 -198 -277 74 95 177 -1 -126 -119 145 133 131 -160
7936a60J70j13Q3J91k14K12j73j46N31j61j84J09o5K2K4l00M65j27pR0j8k51K08
$$ -160 10 -103 -20 171 -43 169 -4 -150 381 220 36 145 80 102 126 -174 291 164 157 247 229 -22 186
7959A86j73jL46m06K60l12J96q1J01j8K0j34k3J10l20M88k56r2K5N1j45j55J50
$$ 186 13 12 358 -48 212 -100 96 15 116 98 118 -16 -39 71 -249 239 -17 -109 -84 -33 -178 -333 -183
7982a83K17j03j61j1Jo2M21m07K50j08J51k04n2R6K29q8jk5J55p2J63k59k8J94
$$ -183 34 -69 -230 -241 -240 -302 119 -288 -38 -146 5 -199 -251 -155 74 -14 -15 -40 115 43 206 -53 -81 113
8006A13JL5k31K08l08q5L73j47K13k30K52J31j99R2Kp1k0J58p5j70P0qj31M5r1
$$ 113 114 149 -82 126 -182 -267 106 -41 172 -58 194 325 126 218 220 149 129 287 212 42 112 104 -27 18 -73
8031g3K99p8j36L33k83J1L37o13K71J03o9k07M9M3K76j82k3J14l92R1J65NM3N8
$$ -73 226 148 12 345 62 73 410 -203 68 171 102 -105 -56 -13 263 81 58 172 -220 -129 36 41 84 142
8055A42l37J36j19P2j77N6K98k29j46L47k99J4M16k52j26K44k75J74k34M0J37
$$ 142 -195 -59 -178 -106 -283 -227 71 -158 -304 43 -256 -242 174 -78 -204 40 -235 -61 -295 -255 -118
8076a18Mj00N7j97L47O1l0M22l36K50k81l3J58M5m3j09Q3N6l2j5j35L6M2K30J04
$$ -118 -114 -214 -157 -354 -7 54 24 446 110 360 79 46 204 249 206 97 180 236 204 189 54 90 132 362 466
8101D66l70N0J10j85J74r8p9K5m7n9K57k11M4J16j76L1k15L80n9j12k37K35j96
$$ 466 96 146 256 71 245 147 68 93 46 -13 244 33 77 193 17 48 -167 213 154 42 -195 40 -156
8124a56J43r1l24N04k28J83k69k53K0M07j04j69J95r9Mn3J14J99j41P9k93R1J83
$$ -156 -13 -104 -428 76 -152 31 -238 -491 -471 -64 -168 -337 -142 -241 -237 -290 -176 23 -118 -39 -332 -241 -58
8147e8j39J97J40k06K2k11L50r5l85M03K23k05J29k63p4L34Q2l0K11l71K04M4
$$ -58 -197 0 140 -66 -44 -255 95 0 -385 18 241 36 165 -98 -172 162 244 214 425 54 258 302
8169C02K8l78M04r6P5j39j67L70k40R1k84j7K82J12k48j03m3J58L04k33M6k43
$$ 302 330 -48 356 260 335 196 29 399 159 250 -34 -51 231 343 95 -8 -51 107 411 178 224 -19
8191a9
$$ Imaginary data points
##PAGE= N=2
##DATA TABLE= (X++(I..I)), XYDATA
0@%%%%%%qJ6j6K4l2L2m0N6p2R6j23J47j76K15k63L12l68M37n13N96o92Q00r20
$$ 0 0 0 0 0 0 0 -8 8 -8 16 -16 16 -24 32 -40 56 -67 80 -96 119 -144 168 -200 237 -276 320 -372 428 -492
29d92J061j219J388j576J784k010K262k544K851l186L554l958M397m874N400n974
$$ -492 569 -650 738 -838 946 -1064 1198 -1346 1505 -1681 1873 -2085 2312 -2562 2838 -3136
45c136O597p282Q029q843R740j0727J1815j3022J4367j5868J7557j9477K1677
$$ -3136 3461 -3821 4208 -4635 5105 -5622 6193 -6829 7538 -8330 9227 -10250 11427
58A1427k4229K7233l0823L5199m0669M7729n7224P0708r1427J27457k06813O57031
$$ 11427 -12802 14431 -16392 18807 -21862 25867 -31357 39351 -52076 75381 -131432 525599
70E25599j47919r50356Q73575p92349P63675L71851j370147P63596J44170m41373
$$ 525599 377680 -572676 300899 -491450 272225 644076 -726071 37525 181695 -259678
80b59678R22392j024356l4388R51730p40181M59380n9100q81970J030431j91657
$$ -259678 662714 -361642 -396030 555700 -184481 274899 215799 -666171 364260 172603
90A72603l28008N40878q79049L21043O51610p21732L72324k16065l25217R29463
$$ 172603 -155405 385473 -493576 -172533 479077 -242655 129669 -86396 -411613 517850
100E17850m55218l59117L74725l54855N73381O5395q39961L90568Q2532k0189
$$ 517850 62632 -296485 78240 -276615 296766 362161 -477800 -87232 -4700 -24889
110b4889L58309o50785M9482N11772l18458J66140j20504k91145N57982j15363
$$ -24889 333420 -317365 -267883 243889 -74569 91571 -28933 -320078 237904 122541
120A22541k39483J95968l11280K18231K73429m04029J04990l1086j32429M20657
$$ 122541 -116942 79026 -232254 -14023 259406 -144623 -39633 -70719 -203148 217509
130B17509j84953j85856K36091j85046J94339J11833m14090K28549J07682j26336
$$ 217509 32556 -153300 82791 -102255 92084 203917 -210173 18376 126058 -278
140b78K07114l56520n8829M15037k20622M3262J2604k81748L94587l0743k63922
$$ -278 206836 -149684 -208513 206524 -14098 29164 41768 -239980 154607 123864 -140058
151a40058K80863j99394P0981K46800m09052J60636J02461k38722L34120k18271
$$ -140058 140805 -58589 12392 259192 -149860 10776 113237 -125485 208635 -9636
161i636j88775L45221k58578J28073J71356l95356K80894K461k29040L43322k58825
$$ -9636 -198411 146810 -111768 16305 187661 -207695 73199 75660 -153380 189942 -68883
172f8883k7022L20302l47768J20547N2098k83056L71553j03877j92022K70925
$$ -68883 -95905 224397 -123371 -2824 49274 -233782 137771 33894 -158128 112797
182A12797k49427J04203J87145l18577K20520O229j98068K60804j95729l1825
$$ 112797 -136630 -32427 154718 -163859 56661 62890 -135178 125626 -70103 -101928
192a01928K34950k46781J02142M7036k22581K35457m2964q7340J95081j82215
$$ -101928 133022 -113759 -11617 35419 -187162 48295 5331 -82009 113072 -69143
202f9143L4127J24942j71973J40508K364j19636J48462j20441l7048J20737j20606
$$ -69143 -35016 89926 -82047 58461 60825 -58811 89651 -30790 -67838 52899 -67707
213f7707Q5178L6592j34294J07206k4326l1754J18669q8173J3937O0566j00255
$$ -67707 17471 54063 -80231 26975 2649 -29105 89564 1391 15328 75894 -24361
224b4361N8733J0415n5990P2810n8840l4926N3285n6410M1929M1262n5657L8840
$$ -24361 34372 44787 -11203 61607 2767 -32159 21126 -35284 6645 47907 -7750 31090
236C1090k1589l5530O3189k3268L472L6953o3730J972P046m0327M5901n35k8538
$$ 31090 9501 -26029 37160 13892 17364 54317 -9413 -7441 -395 -40722 5179 4644 -23894
249b3894L1684l3380l955M2828k0191K0820O215m2789K0559r351j3775L7204k7860
$$ -23894 7790 -25590 -29545 13283 -6908 13912 20127 -22662 -2103 -11454 -25229 11975 -15885
262a5885j3650P301l8552K6892K3142j3476L7392j4616k4574K7506j4933J6930
$$ -15885 -29535 -22234 -60786 -33894 -10752 -24228 13164 -1452 -26026 1480 -13453 3477
274C477L1541l1072K294j0512l4409K4143J314l304K1902k4400j713J8603q902
$$ 3477 35018 3946 6240 -4272 -38681 -14538 -13224 -16528 5374 -19026 -20739 -2136 -11038
287a1038K9816J3922j7454J1621j4595q197K6891r983k290M392l5533j192J1857
$$ -11038 18778 32700 15246 26867 12272 4075 30966 20983 18693 23085 -12448 -13640 -1783
300a783n676K9790N166j9828R903j4566k328L1746m689K026j3l4532K087R52j0648
$$ -1783 -7459 22331 27497 7669 17572 3006 678 32424 27735 29761 29748 -4784 -2697 -1745 -12393
315a2393K5324p767j5878J1680j7642J1574K6333j5320J1614n249l0814J8523
$$ -12393 12931 5164 -10714 966 -16676 -5102 21231 5911 17525 12276 -18538 -15
327a5j580q377K0291k6840j7278R081j9237J8896K5338j0642J2046p131j8910
$$ -15 -1595 -9972 10319 -16521 -33799 -24718 -43955 -25059 279 -10363 1683 -5448 -24358
340b4358K0128M307N892J5900k3913j3682r80j5136J3875P537j2191J0595o027
$$ -24358 -4230 77 5969 21869 -2044 -15726 -16706 -31842 -17967 -10430 -22621 -12026 -18053
353a8053r378K1809O932Q495J6329j6555j0190J0222l468J1249R966k5043j0857
$$ -18053 -27431 -5622 1310 9805 26134 9579 -611 9611 6143 17392 27358 2315 -8542
366h542J853j0650J5408J3955p383J7524l326k4740J6441K205P036L3420l3259
$$ -8542 -6689 -17339 -1931 12024 4641 22165 18839 -5901 10540 12745 19781 53201 19942
379A9942k0801J3123k6456K8286R847m6136L6387o853k6217M9408l8346O561O1192
$$ 19942 -859 12264 -14192 14094 23941 -22195 14192 7339 -18878 30530 -7816 -1255 59937
392E9937o4826R802R831n9662Q3651r218o9035N2550o2847R005Q0152q7746L9333
$$ 59937 -4889 4913 14744 -44918 38733 29515 -39520 13030 -49817 -40812 39340 -48406 -9073
405i073L6199p0635Q2413m6340n6959J17749n3084K250L6693j32057P6131M5094
$$ -9073 27126 -43509 38904 -7436 -64395 53354 270 2520 39213 -92844 -16713 28381
417B8381q5666Q1620o8763l2174J33540r0661N788N9904q8210J10797o885j22157
$$ 28381 -57285 24335 -44428 -76602 56938 -33723 -27935 31969 -56241 54556 47671 -74486
429g4486R6850l1064J4208Q5541j57302J3461P4870n9086R4913n8374p8049J41790
$$ -74486 22364 -8700 5508 91049 -66253 -52792 22078 -37008 57905 -469 -78518 63272
441F3272m7605j8032M0865j04599J09160N6196j23073L9889m9886M87J36420j03489
$$ 63272 15667 -2365 38500 -66099 43061 99257 -23816 16073 -33813 -33326 103094 -395
453c95l4917M7288n7936J09757o159j16692Q5399j2515R038N8278j48368K9463
$$ -395 -35312 11976 -45960 63797 57638 -59054 26345 13830 22868 81146 -67222 -37759
465c7759J03109n6143M1014r3689p8418J75761j5779m5211J8461j05849J20792
$$ -37759 65350 9207 50221 -43468 -121886 53875 38096 -7115 11346 -94503 26289
476B6289P2790j52465M2851r183R082J30969j61741n8987J10110n0424R8674l6936
$$ 26289 99079 -53386 -10535 -19718 -10636 120333 -41408 -100395 9715 -40709 57965 21029
488B1029j67862J45862Q944k2923R3011j69524M3698J41049j23816O3703m8530
$$ 21029 -146833 -971 7973 -14950 78061 -91463 -47765 93284 -30532 33171 -15359
499a5359r6168K17583o7157j03292O6306j23686J47893J04135k14724O8136l087
$$ -15359 -111527 106056 38899 -64393 1913 -121773 26120 130255 -84469 -16333 -19420
510a9420j5561J82397j82886n1496J67292r2789Q7911m3185j86300K12868K148
$$ -19420 -34981 147416 -35470 -86966 80326 -12463 75448 32263 -154037 58831 60979
521F0979p9986Q8216j80525Q2802J62257j65648P3901l5580r1607K12235j06779
$$ 60979 -19007 69209 -111316 -28514 133743 -31905 41996 6416 -85191 127044 20265
532B0265p1570J13032j32280J22158M0939k10722J22474j4728j5093J63736j99830
$$ 20265 -51305 61727 -70553 51605 92544 -118178 4296 -10432 -25525 138211 -61619
543f1619o621J36827j10648J22200n2140j45170K00758o8948n0534Q5262j69174
$$ -61619 -68240 68587 -42061 80139 27999 -117171 83587 14639 -35895 49367 -119807
554a19807J23353Q2416j77044J03660n6980k9704J92630j54502n635R3347j38209
$$ -119807 3546 85962 -91082 12578 -44402 -74106 118524 -35978 -41613 51734 -86475
565h6475J41934j2263j44178J64261q3308k4941J19749j84907P9914R4039j35774
$$ -86475 55459 43196 -100982 63279 -20029 -44970 74779 -110128 -30214 63825 -71949
576g1949J32238p1163r0704J90947j09465M796R6086j66638J21625K3686j51101
$$ -71949 60289 -10874 -101578 89369 -20096 -15300 80786 -85852 35773 59459 -91642
587i1642J50929p0783l7874J51046j68623L8736J02422j40130J34276k1973j26388
$$ -91642 59287 -11496 -49370 101676 -66947 -28211 74211 -65919 68357 46384 -80004
598h0004J62993r0900k4063J31143j52140O4470N5210j53608J23979k6146p3451
$$ -80004 82989 -7911 -31974 99169 -52971 11499 66709 -86899 37080 10934 -62517
609f2517J54226j10354j2116J05597j33243Q6645L6154j25706J24924n1833p2353
$$ -62517 91709 -18645 -30761 74836 -58407 28238 64392 -61314 63610 11777 -60576
620f0576J22517j06948K1241Q7439j38233P2435J8063q8714J28910n7337m5326
$$ -60576 61941 -45007 -23766 63673 -74560 -2125 15938 -72776 56134 -1203 -46529
631d6529J09170j03778K9551N8251j09573R6591r348r0361R6334p5732m177J02061
$$ -46529 62641 -41137 -11586 46665 -62908 33683 24335 -66026 30308 -45424 -49601 52460
643E2460j03070M5660L0376r6214J03001k4634n2232J01448p9069R724N8683j05617
$$ 52460 -50610 -4950 25426 -70788 32213 7579 -44653 56795 -22274 -12550 46133 -59484
655e9484O7002J7450o7420Q3543o5055k2276R4847p0614L6602K7011q5412Q1197
$$ -59484 7518 24968 -42452 41091 -23964 -46240 48607 -22007 14595 41606 -43806 37391
667C7391j7793n1260Q1082n7285R709M7862r5130M3521J9066m6682P7375m3280
$$ 37391 19598 -31662 49420 -7865 1844 49706 -45424 -1903 17163 -29519 47856 4576
679D576k6167O3956n8709K9984L0183o3039N4782j7634m1490N4936n0146P155
$$ 4576 -21591 42365 -16344 13640 43823 -19216 35566 17932 -23558 31378 -18768 -11613
691a1613M4686o2781K6881J586l7716O6425j8725k0444L7164m5763J9204K3479
$$ -11613 33073 -29708 -2827 -1241 -38957 27468 8743 -11701 25463 -20300 -1096 22383
703B2383m3835L5488n704k8675K6612l7691J865L6304k6355J8595k182k8877L4266
$$ 22383 -21452 14036 8332 -20343 6269 -31422 -29557 6747 -19608 -1013 -3195 -32072 2194
716B194p019n536K6963k4711L766R315k5617J8072K489j3226J5851j5927n831
$$ 2194 -4825 -10361 16602 -8109 -4343 4972 -20645 -2573 -84 -13310 2541 -13386 -19217
729a9217J6341m303J5144N723j5944N912m302l05J5076o654J26J215j6455J831
$$ -19217 -2876 -7179 7965 13688 -2256 3656 -646 -951 14125 7471 7597 8812 -7643 -5812
743e812K398L17J4690j015n921K316l071N504Q567L4o00n939o307j362q41L388
$$ -5812 -3414 -3097 11593 10578 4657 6973 3902 9406 17973 18007 17407 11468 5161 3799 2958 6346
759F346j118n819l468n038L563Q802L724N002l021o981l3l64M650M682m637m950
$$ 6346 5228 -591 -4059 -9097 -5534 3268 6992 11994 8973 1992 1959 1595 6245 10927 6290 1340
775A340r827q021M509N89M100N734q536o38K769k885J1062M414o806L188p696
$$ 1340 -8487 -16508 -11999 -11410 -7310 -1576 -10112 -10750 -7981 -10866 196 4610 -2196 992 -6704
790f704o337R886k917n41L513j3589J95O846k145J4109L123q907O212q304j481
$$ -6704 -13041 -3155 -6072 -6613 -3100 -16689 -16494 -9648 -11793 2316 5439 -3468 2744 -5560 -7041
805g041J5736o530L816L062k1187O202J636p820K2898m991r837J6136j4715N333
$$ -7041 8695 2165 5981 9043 -12144 -5942 -4306 -12126 10772 5781 -4056 12080 -2635 2698
819B698J9971j6756J1386K107k4379J6562n953r730K3174j9696n966J2109k1069
$$ 2698 22669 5913 17299 19406 -4973 11589 5636 -4094 19080 -616 -6582 5527 -15542
832a5542K0389J3141j8007J9373j1776j3656K5625j6712K243J8617k8272P747
$$ -15542 4847 17988 -19 19354 7578 -6078 19547 2835 5078 23695 -4577 3170
844C170k293k7234K7162l44j1192J9894k4543K31K4565j7193J3062K368k1149
$$ 3170 877 -26357 805 461 -10731 9163 -15380 -15149 9416 -7777 5285 7653 -13496
857a3496K0514j0225j3575K0004j4143N605P390l0731J3505Q248m294K6110j9230
$$ -13496 7018 -3207 -16782 3222 -10921 -5316 2074 -28657 -15152 -6904 -11198 14912 -4318
870d318j1670J9014j3831J3785N405k2744K0929n786j4576J1754k1173J8540K2701
$$ -4318 -15988 3026 -10805 2980 8385 -14359 6570 784 -13792 -2038 -23211 -4671 18030
883A8030k5184R949j1355k509M2434k4021m880J4278k8939L2612n526l6661M0394
$$ 18030 -7154 2795 -8560 -11069 31365 7344 2464 16742 -12197 20415 14889 -21772 18622
896A8622j9160l260K7846n6229K8152L1166l4684M5052l3954k9981O6600m1367
$$ 18622 -538 -3798 24048 -32181 -4029 27137 -7547 37505 3551 -26430 40170 -1197
908a197J2031K7457p2940N7017J594o2508O3047m5085O17P6727r0327J9181L5674
$$ -1197 10834 38291 -34649 22368 23962 -38546 24501 -20584 -19967 56760 -33567 -14386 21288
921B1288o0731Q7096l1083o7109Q8691n4601O044N4338j01528O0771K6586q2674
$$ 21288 -39443 47653 16570 -50539 38152 -16449 -10405 43933 -57595 3176 29762 -52912
933e2912P4091m4516k2900J04853q1310N668M4074q6942Q2522O495p8056Q1260
$$ -52912 21179 -23337 -46237 58616 -22694 -17026 27048 -59894 22628 29123 -48933 32327
945C2327n0560j6200P9854r1479K5352N0685p0682P0310k4341o2737R7311l6276
$$ 32327 -18233 -34433 45421 -46058 -20706 29979 -40703 29607 5266 -57471 39840 3564
957C564r186M9993q9411M6830M1794p7602N6379k2192l5401Q2847o6626j1224
$$ 3564 -5622 44371 -45040 1790 43584 -34018 22361 169 -35232 47615 -19011 -30235
969c0235O6776n7778M7576J0281q0235P2389j1315l2636O9374o7293L034N3935
$$ -30235 36541 -21237 26339 36620 -43615 28774 17459 -15177 54197 -13096 -10062 43873
981D3873p7869M3294J1107o1622P9578l4608l5966P1338o6317K9460N1137r0782
$$ 43873 -33996 9298 20405 -41217 38361 3753 -32213 39125 -27192 2268 53405 -37377
993c7377N4347j771n5537Q8997o0341k2308P9393q4833L3319K7014q3247R7159
$$ -37377 16970 15199 -40338 48659 -11682 -33990 45403 -39430 -6111 20903 -62344 34815
1005C4815j8035o2012Q3212p3983J9430P1811j07995O1353J4476p9710R5450o2988
$$ 34815 16780 -45232 37980 -36003 -16573 55238 -52757 8596 23072 -56638 38812 -24176
1017b4176k8393J07056r2582K9408M0832j01532J01135p650p0682R8260p7865
$$ -24176 -52569 54487 -38095 -8687 32145 -69387 31748 24098 -46584 51676 -26189
1028b6189O46Q4988j07723N3765K4478q4964R8469m9422m9770J03229o9965K8272
$$ -26189 -25543 59445 -48278 5487 29965 -54999 43470 -5952 -55722 47507 -22458 5814
1040E814M8243j10755P5479J6211o5190Q4259o3415j7045Q8748q8179J8966L2572
$$ 5814 54057 -56698 18781 34992 -30198 54061 -9354 -26399 62349 -25830 -6864 25708
1052B5708o9988Q5103j9095o7947P5678m1178J2320N8187r1890L3238L0672n6443
$$ 25708 -44280 40823 21728 -46219 29459 -11719 601 58788 -33102 136 30808 -25635
1064b5635O3305l7071l9976Q0554m9937n119L2352o8086O2515K5922o8837M2937
$$ -25635 37670 599 -39377 41177 -8760 -13879 18473 -49613 12902 38824 -30013 12924
1076A2924k9614q953P5656o4235o013L7903m9966N0391r792o3752O7982j5049
$$ 12924 -16690 -25643 50013 -14222 -20235 17668 -32298 18093 8301 -55451 12531 -2518
1088b518j2324M2041p2381K8103N1511n3330L8698k3792m1167P9120l4436j6958
$$ -2518 -14842 27199 -45182 -17079 34432 -18898 19800 -3992 -45159 33961 -475 -17433
1100a7433L6773n9666M4756K2855p0287M6574r777p077O5023o9983n044M7839
$$ -17433 19340 -40326 4430 27285 -43002 3572 -6205 -13282 51741 -18242 -23286 24553
1112B4553l9327N0230j6363n9428O8153k3587j3042L7355o5343L9405L4287o1006
$$ 24553 -14774 35456 19093 -40335 27818 4231 -8811 28544 -36799 2606 36893 -24113
1124b4113M0343k0179j6654P1470m9014p733K9399m9732N0632M039n2858M4938
$$ -24113 16230 -3949 -20603 50867 1853 -5880 23519 -26213 24419 28458 -24400 20538
1136B0538k8202m504M4689n9200J8839L0376l7608M0784k6393l4166O0495k3030
$$ 20538 -7664 -12168 32521 -26679 -7840 22536 -15072 25712 -681 -34847 25648 2618
1148B618k130J8924n3216L4106J6143m1816L2024j8596p706M2303m1226L228K6156
$$ 2618 488 19412 -33804 302 16445 -25371 6653 -11943 -19649 22654 -18572 -15344 10812
1161A0812k8339L3177p976l6321L6539j5049k961K9463m0692R104J7569l0775
$$ 10812 -17527 15650 7674 -28647 7892 -7157 -10118 19345 -21347 -12243 5326 -25449
1173b5449K8428l997j9668L7376j7403q515K0481k5523K0134J5759l0543J5340
$$ -25449 2979 -1018 -20686 16690 -713 -9228 11253 -14270 5864 21623 -8920 6420
1185F420p105j3005K9575j9140n280K0195k1217J1705Q276k0682K4704k01j5505
$$ 6420 -685 -13690 15885 -3255 -8535 11660 -9557 2148 10424 -10258 14446 14245 -1260
1198a260J6738j5916n86J9910j6872M320L167j9469J3275lp856J6114q310k695
$$ -1260 15478 -438 -1024 18886 2014 6334 9501 -9968 3307 3304 -4552 11562 3252 557
1212E57Q706j2834N684P342q145P330n753j0729Q443l719j383O883q183j54M015
$$ 557 9263 -3571 2113 9455 1310 8640 2887 -7842 601 -3118 -4501 2382 -5801 -5955 -1940
1227a940n113M999N069l966J842k803n454L851J508j611J889m720m766J741r73
$$ -1940 -7053 -2054 3015 -951 891 -1912 -7366 -3515 -2007 -3618 -1729 -6449 -11215 -9474 -10447
1242a0447L400O036j767J07L83l208M902K691r43L132m524m195K445k583J770
$$ -10447 -7047 -1011 -2778 -2671 -2288 -5496 -594 2097 1154 4286 -238 -4433 -1988 -4571 -2801
1257b801M357n369J212J089k671O736L656j427K747l376k772M065j59J487J538
$$ -2801 1556 -3813 -2601 -1512 -4183 2553 6209 4782 7529 4153 1381 5446 5287 6774 8312
1272H312n073k618p96j285M032K984k04K93k260j636L217O29J541J126n105k086
$$ 8312 3239 621 -175 -1460 2572 5556 5352 5645 3385 1749 4966 5595 7136 8262 3157 1071
1288A071m4k624L100N07l683J336k793j305O085j08P13K195o702q67K021k573
$$ 1071 1027 -1597 1503 2010 -1673 -337 -3130 -4435 1650 1542 2255 4450 -2252 -3119 -1098 -3671
1304c671M993k439n303J575n851J473M567k662O890j046n876N951m420L163Q641
$$ -3671 1322 -1117 -6420 -4845 -10696 -9223 -4656 -7318 -428 -1474 -7350 -1399 -5819 -2656 5985
1319E985r379K865n51r693J0630l584m328J0488j1552L309P270j1015J4787O78
$$ 5985 -3394 -529 -1080 -10773 -143 -3727 -8055 2433 -9119 -5810 1460 -9555 5232 5910
1333E910q689J3733j4866N28J6702j5976J0748J360k1226J9519p537q157K3259
$$ 5910 -2779 10954 -3912 -3384 13318 -2658 8090 9450 -11776 7743 206 -7951 15308
1346A5308j8263N384J4083k6886J8059L960j6775K6210j7912j0403K3618k4602
$$ 15308 -2955 2429 16512 -10374 7685 11645 -5130 21080 3168 -7235 16383 -8219
1358h219J1106J2265k9396K2870l916j9368L0374j8328o83K5162l2330J0853J0026
$$ -8219 2887 15152 -14244 8626 4710 -14658 15716 -2612 -3295 21867 -10463 390 10416
1371A0416k7297K9785p495k1779K7351k4205j74K4175k9614J8683R510k9046K6819
$$ 10416 -16881 12904 5409 -16370 10981 -13224 -13398 10777 -18837 -154 9356 -19690 7129
$$ [...]
8191c76
##END NTUPLES=NMR FID
##END=
