##TITLE=1H_LR-722-C1
 CDCl3, 8 sc, 
 22.9.2020
##JCAMPDX= 6.0         $$ Bruker NMR JCAMP-DX V2.0
##DATA TYPE= NMR FID
##DATA CLASS= NTUPLES
##ORIGIN= UXNMR, Bruker Analytische Messtechnik GmbH
##OWNER= root
$$ XWIN-NMR		Version 3.5
$$ Tue Sep 22 12:02:34 2020 Russian Standard Time (UT+4h)  she@DPX200
##.OBSERVE FREQUENCY= 200.1315066352
##.OBSERVE NUCLEUS= ^1H
##.DELAY= (6, 6)
##.ACQUISITION MODE= SIMULTANEOUS
##.ACQUISITION SCHEME= undefined
##.AVERAGES= 8
##.DIGITISER RES= 18
##SPECTROMETER/DATA SYSTEM= spect
##.PULSE SEQUENCE= zg30
##.SOLVENT NAME= CDCl3
##.SHIFT REFERENCE= (INTERNAL, CDCl3, 0, 15.7039)
##AUDIT TRAIL= $$ (NUMBER, WHEN, WHO, WHERE, WHAT)
$$ ##TITLE= Audit trail, XWIN-NMR		Version 3.5
$$ ##JCAMPDX= 5.01
$$ ##ORIGIN= Bruker BioSpin GmbH
$$ ##OWNER= she
$$ F:/spectra/data/she/nmr/H-F/1/audita.txt
$$ ##AUDIT TRAIL=  $$ (NUMBER, WHEN, WHO, WHERE, WHAT)
(   1,<2020-09-22 12:01:21.06 +0400>,<she>,<DPX200>,
      <created by zg, POWCHK disabled, PULCHK disabled
       configuration hash MD5:
       00 E9 B6 7A A2 85 ED C7 34 08 36 98 17 FE 4E 26
       data hash MD5: 16K
       93 53 8C 8A EF 7F AB DE 25 0B B6 78 20 AB D0 E1>)
$$ ##END=
$$ 
$$ hash MD5
$$ 43 4F 4D 1A 7D E1 1D B2 39 67 EE 32 17 F4 89 35
##$RELAX= 
##$RELAX= 
##$RELAX= 
##$RELAX= 
##$RELAX= 
##$RELAX= 
$$ Bruker specific parameters
$$ --------------------------
##$DU= <F:/spectra>
##$EXPNO= 1
##$NAME= <H-F>
##$PROCNO= 1
##$TYPE= <nmr>
##$USER= <she>
##$AMP= (0..31)
100 100 100 100 100 100 100 100 100 100 100 100 100 100 100 100 100 100 
100 100 100 100 100 100 100 100 100 100 100 100 100 100 
##$AQSEQ= 0
##$AQ_mod= 1
##$AUNM= <au_zg>
##$AUTOPOS= <>
##$BF1= 200.13
##$BF2= 200.13
##$BF3= 200.13
##$BF4= 200.13
##$BF5= 200.13
##$BF6= 200.13
##$BF7= 200.13
##$BF8= 200.13
##$BYTORDA= 1
##$CFDGTYP= 0
##$CFRGTYP= 5
##$CHEMSTR= <none>
##$CNST= (0..31)
1 1 145 1 1 1 1 1 1 1 1 1 1 1 1 1 1 1 1 1 1 1 1 1 1 1 1 1 1 1 1 1 
##$CPDPRG= <>
##$CPDPRG1= <>
##$CPDPRG2= <>
##$CPDPRG3= <>
##$CPDPRG4= <mlev>
##$CPDPRG5= <mlev>
##$CPDPRG6= <mlev>
##$CPDPRG7= <mlev>
##$CPDPRG8= <mlev>
##$CPDPRGB= <>
##$CPDPRGT= <>
##$D= (0..31)
0 1.2 0 0 0 0 0 0 0 0.06 0 0.03 0 0 0 0 0.0002 0 0 0 0 0 0 0 0 0 0 0 0 
0 0 0 
##$DATE= 1600761680
##$DBL= (0..7)
120 120 120 120 120 120 120 120 
##$DBP= (0..7)
150 150 150 150 150 150 150 150 
##$DBP07= 0
##$DBPNAM0= <>
##$DBPNAM1= <>
##$DBPNAM2= <>
##$DBPNAM3= <>
##$DBPNAM4= <>
##$DBPNAM5= <>
##$DBPNAM6= <>
##$DBPNAM7= <>
##$DBPOAL= (0..7)
0.5 0.5 0.5 0.5 0.5 0.5 0.5 0.5 
##$DBPOFFS= (0..7)
0 0 0 0 0 0 0 0 
##$DE= 6
##$DECBNUC= <off>
##$DECIM= 32
##$DECNUC= <off>
##$DECSTAT= 4
##$DIGMOD= 1
##$DIGTYP= 9
##$DL= (0..7)
0 120 120 120 120 120 120 120 
##$DP= (0..7)
150 150 150 150 150 150 150 150 
##$DP07= 0
##$DPNAME0= <>
##$DPNAME1= <>
##$DPNAME2= <>
##$DPNAME3= <>
##$DPNAME4= <>
##$DPNAME5= <>
##$DPNAME6= <>
##$DPNAME7= <>
##$DPOAL= (0..7)
0.5 0.5 0.5 0.5 0.5 0.5 0.5 0.5 
##$DPOFFS= (0..7)
0 0 0 0 0 0 0 0 
##$DQDMODE= 0
##$DR= 18
##$DS= 0
##$DSLIST= <SSSSSSSSSSSSSSS>
$$ [...]
##$SUBNAM2= <"">
##$SUBNAM3= <"">
##$SUBNAM4= <"">
##$SUBNAM5= <"">
##$SUBNAM6= <"">
##$SUBNAM7= <"">
##$SUBNAM8= <"">
##$SUBNAM9= <"">
##$SW= 16.880792210976
##$SWIBOX= (0..15)
0 0 2 0 0 0 0 0 0 0 0 0 0 0 0 0 
##$SW_h= 3378.37837837838
##$TD= 16384
##$TD0= 1
##$TE= 0
##$TE2= 300
##$TE3= 300
##$TEG= 300
##$TL= (0..7)
0 120 120 120 120 120 120 120 
##$TP= (0..7)
150 150 150 150 150 150 150 150 
##$TP07= 0
##$TPNAME0= <>
##$TPNAME1= <>
##$TPNAME2= <>
##$TPNAME3= <>
##$TPNAME4= <>
##$TPNAME5= <>
##$TPNAME6= <>
##$TPNAME7= <>
##$TPOAL= (0..7)
0.5 0.5 0.5 0.5 0.5 0.5 0.5 0.5 
##$TPOFFS= (0..7)
0 0 0 0 0 0 0 0 
##$TUNHIN= 0
##$TUNHOUT= 0
##$TUNXOUT= 0
##$USERA1= <user>
##$USERA2= <user>
##$USERA3= <user>
##$USERA4= <user>
##$USERA5= <user>
##$V9= 5
##$VALIST= <valist>
##$VCLIST= <CCCCCCCCCCCCCCC>
##$VD= 0
##$VDLIST= <DDDDDDDDDDDDDDD>
##$VPLIST= <PPPPPPPPPPPPPPP>
##$VTLIST= <TTTTTTTTTTTTTTT>
##$WBST= 1024
##$WBSW= 4
##$XGAIN= (0..3)
0 0 0 0 
##$XL= 0
##$YL= 0
##$YMAX_a= 609921
##$YMIN_a= -672841
##$ZGOPTNS= <>
##$ZL1= 120
##$ZL2= 120
##$ZL3= 120
##$ZL4= 120
##$ABSF1= 10
##$ABSF2= 0
##$ABSG= 5
##$ABSL= 3
##$ALPHA= 0
##$AQORDER= 0
##$ASSFAC= 0
##$ASSFACI= 0
##$ASSFACX= 0
##$ASSWID= 0
##$AUNMP= <proc_1d>
##$AZFE= 0.1
##$AZFW= 0.1
##$BCFW= 1
##$BC_mod= 2
##$BYTORDP= 1
##$COROFFS= 0
##$CY= 11.3945322036743
##$DATMOD= 1
##$DC= 2
##$DFILT= <>
##$DTYPP= 0
##$F1P= 16.9975609425685
##$F2P= -3.02152046262296
##$FCOR= 0.5
##$FTSIZE= 0
##$FT_mod= 4
##$GAMMA= 1
##$GB= 0.15
##$INTBC= 1
##$INTSCL= 1
##$ISEN= 128
##$LB= 0.24
##$LEV0= 0
##$LPBIN= 0
##$MAXI= 10000
##$MC2= 0
##$MEAN= 0
##$ME_mod= 0
##$MI= 1.114404
##$NCOEF= 0
##$NC_proc= 0
##$NLEV= 6
##$NOISF1= 3.799351
##$NOISF2= 2.8
##$NSP= 1
##$NTH_PI= 0
##$NZP= 0
##$OFFSET= 15.70392
##$PC= 1
##$PHC0= -9969.853
##$PHC1= 12.8009
##$PH_mod= 1
##$PKNL= yes
##$PPARMOD= 0
##$PSCAL= 0
##$PSIGN= 0
##$REVERSE= no
##$SF= 200.130013532006
##$SI= 16384
##$SIGF1= 3
##$SIGF2= 2
##$SINO= 400
##$SIOLD= 16384
##$SREGLST= <1H.CDCl3>
##$SSB= 0
##$STSI= 0
##$STSR= 0
##$SW_p= 3612.71676300578
##$SYMM= 0
##$S_DEV= 0
##$TDeff= 0
##$TDoff= 0
##$TI= <>
##$TILT= no
##$TM1= 0
##$TM2= 0
##$TOPLEV= 0
##$USERP1= <user>
##$USERP2= <user>
##$USERP3= <user>
##$USERP4= <user>
##$USERP5= <user>
##$WDW= 1
##$XDIM= 8192
##$YMAX_p= 0
##$YMIN_p= 0
$$ End of Bruker specific parameters
$$ ---------------------------------
##NTUPLES= NMR FID
##VAR_NAME=  TIME,          FID/REAL,        FID/IMAG
##SYMBOL=    X,             R,               I
##VAR_TYPE=  INDEPENDENT,   DEPENDENT,       DEPENDENT
##VAR_FORM=  AFFN,          ASDF,            ASDF
##VAR_DIM=   8192,          8192,            8192
##UNITS=     SECONDS,       ARBITRARY UNITS, ARBITRARY UNITS
##FACTOR=    0.000296,      1,               1
##FIRST=     0,             0,               0
##LAST=      2.424536,      0,               0
##MIN=       0,             -672841,         0
##MAX=       2.424536,      609921,          0
$$ Real data points
##PAGE= N=1
##DATA TABLE= (X++(R..R)), XYDATA
$$ [...]
2040f2q350J7952j0232k168R711j5132J0366M445j3663J2402o290m593J4518j2977
2054d073J767P673j2485J1360r06j1034J2248o200j089R242j3105M996N342q913
2068e177Q905l897n340J0502o711j89N346q095N900J545o881O443l614j866O502
2083C373n712J376L134n425M460J19l811M248j761j072L928l745N15K387l133
2098a119J922J88k991L124m88j297K288j987k06J937k173J277J642l007K203l18
2114I95k229K791j604q56K821l074J164J590l366K538M60k878L074k058q45L595
2130B118l595J267J428l984L476n08k209L814k334n22K877l809J621J528l300
2145b132L325r79k146K770k253J58K292k752J496P31j978K143o03o49J686j665
$$ y = [-62, -8412, 9540, -692, -2860, 6851, -8281, 2085, 6530, -7133, 5269, -1021, -5614, 8904, -4073, -2306, 5367, -7118, 4242, 3336, -7698, 4550, -1650, -2739, 6503, -6602, -1606, 3736, -5177, 3728, -169, -5509, 4993, -1718, -1907, 3439, -4656, 1244, 2789, -4092, 2351, -1263, -3129, 3373, -2339, -963, 2171, -3254, 1206, 1325, -2486, 1762, 1, -1071, 2857, -888, -373, 2014, -1119, 803, 991, -2000, 1124, 636, -661, 1627, -360, -566, 1371, -802, 475, 2117, -890, 1313, 995, -1234, 1557, -47, -903, 1918, -1156, 8, 1598, -1768, 770, 1230, -1648, 1426, -632, -1477, 2118, -1477, -210, 1218, -2766, 710, 202, -2007, 1807, -527, -1049, 1828, -1981, -360, 1168, -2132, 1193, 214, -1932, 838, -1415, -1257, 1035, -1717, -221, 510, -1468, 675, 72, -577, 1109, -556]
2161e56L46R51j055Q24k46o96J81J02k51M25R8K98j76L35n82J36N37m55N04N22
2181A242j698R51O6r33J529j156k75J674j855Q77Q52k118J638l26j433J935j340
2198c70j06J745k107P06J023k392J893J48j475J918r03r87J575j207q9J456k027
2215a199O61L75j395J369J9j261J859n96q54J664j110n4J246j169K68Q93j868
2232a152J160K06j448J642q21n87J827j122l03K191k002N86P64k160J683O28j829
2249g37K069r71j391K466j883L25J757k175R74O84k046K037l94j310K015j891
2265d71L23J404k048J111M07j675J873r84n91J732j063K06K98r81N21j35n65P65
2283A27o78J6N19o98P36n41k47J010o88O01l54n05J074n47l14K64j185J505K02
$$ y = [-556, -210, 741, -314, 510, 264, -432, -251, -149, -400, 25, 123, 421, 245, 580, -2, 134, 671, 216, 720, 1242, -456, 495, 561, -372, 1157, 1, -274, 1400, -455, 422, 1274, -844, 794, 468, -965, 970, -370, -476, 1269, -838, -132, 891, -1501, 392, 540, -935, 983, 80, -907, 668, -539, -628, 828, -1199, -538, -163, -1558, -189, -170, -1431, 428, -168, -1022, 642, -468, -522, 724, -445, -177, 716, -1152, 8, 214, -1234, 408, -413, -1000, 827, -295, -598, 1593, -409, 177, 941, -1219, 464, 1092, -737, 1332, 361, -1030, 1436, -447, -122, 1635, -540, 434, 1118, -928, 1109, 715, -595, 1420, -471, -148, 1256, -792, 319, 726, -949, 924, -60, -651, 1081, 18, 224, 522, -459, 62, -73, -638, 127, -551, -535, -16, -714, 22, -519, -766, 244, -444, 157, -197, -702, 372, -175, -489, -225, -1410, 95, 297]
2302B97j286J119q92L25J299j768P05N99o33J349r05j172J546p02O01P2j447J195
2320C02J47k87M15q81L94P45j10q0j009L96O61k0p9j537R05J250r84Q67j509m52
2340h66K832j912j06P68k114L295o13l201K862k500J338K593m413J410J042k121
2356a706M327l030k086M326l090K145N45n214M627K83k499K933m772J897M164
2371B850m736K537j637k063O070l355j342K846l894M534J38n041L939j768J50
2386g72M031n619J598J673k695M953l552k362M755k830K651m3n376N109j03j825
2402d07K396n014K845L878m235J611k102m57N300m063n06J854k332L353j028l643
2418b550L529j415N38J921l783J682Q52j419K551k181j043J728q72J758r11k522
$$ y = [297, -989, 130, -762, -437, 862, -906, -201, 398, -235, 1114, 209, -963, 583, -119, 482, 554, -893, 302, 449, 162, 577, -304, 90, 835, 725, 645, -364, 32, 693, 673, 594, -943, -38, 1212, 228, 1095, -414, -866, 1966, 54, -52, 716, -1398, 1897, 1284, -1917, 945, -1555, -217, 2376, -2037, -627, 415, -1706, 2621, -409, -2495, 1831, -1259, 886, 1431, -3783, 844, 1127, -1372, 1561, -3211, -1314, 2850, -1886, 651, -986, -3049, 3021, -334, -1676, 1170, -2724, 1810, 1948, -3093, 846, -922, -772, 3259, -2360, -762, 911, -1784, 3169, -383, -2745, 2010, -820, 1831, 1788, -3588, 1521, 1418, -407, 1989, -3025, -180, 3698, -537, 1074, -1028, -1485, 3815, -248, -754, 1100, -1232, 2121, 1093, -2550, 979, -436, 102, 2023, -1760, -78, 774, -645, 1906, -275, -1318, 410, -462, 1296, 385, -2137]
2434b137J734P03K46q73j999K261J221j38k005j367K643O33p84n18j585K511N72
2451A118k354J190r56O77K151l825J851J078k492L438k587m60L372m717K576K534
2467B594m441L339k196q85N441n413M86L456m375M640j723m356O409k607j294
2482i25L228n301M378J321n874M847j555q85M014n776K180L341m914L278j382
2497b5j901M848m187k21L489l163J904q89k368M837k376r96J792k208K988j466
2513E8k397L021p62m7L17k386L044j23k320J935j570J594M94k997K857o4j196
2530e42J552k645J750J598l411J949o9q93K730l700O20L151k634J310n70j583
2546a387L566j981j416K501j701J212l3k591K765N5j830K214j409R8J160k046
$$ y = [-2137, -403, 300, 546, -327, -2326, -65, 1156, 1018, -987, -2354, 289, 922, 138, -380, -1965, 546, 1118, -1236, -46, -1002, -325, 1826, -1999, -148, 930, -1562, 1876, -711, -1171, 2201, -2516, 60, 2594, -1847, 1492, -704, -1589, 3852, -1561, -1075, 2381, -1994, 2646, 923, -3433, 2976, 369, -925, 2303, -2998, 1380, 2701, -3173, 1674, 119, -766, 3248, -2528, -348, 2993, -1921, 1357, -25, -1926, 2922, -1265, -1486, 2003, -1160, 744, -145, -2513, 2324, -52, -1048, 744, -1464, 1524, 58, -2339, 682, -80, -127, 190, -2196, 848, 725, -1595, 340, -1230, 364, 858, -2139, 718, 654, -542, 1010, -1635, 115, 1713, -1698, 251, 182, -711, 2019, -1681, -1061, 2090, -544, 766, 196, -1387, 2179, 198, -1218, 1283, -418, 794, 761, -1830, 935, 990, -840, 1374, -35, 63, 1223, -823]
2562h23J196Q45j631P08p09M23R34j061o43Q22N51m42n66j73O82R47j019r68R69
2581D2j25K62l23q17Q61O44j317P57p09R1J115j114K22N26j030J164N7j170J004
2600A40o71n3J254j113M4N23p16J290l38r15Q38m1k7K44j032N02O15n16L25m29
2620g6k9O28o38L10k49J42N10m51j63L44m73P87m70l20N47p85M54N15q92Q02m61
2641C2m49J041q44QQ63o13K33K3p78O02j50k97N65o27k2K91l20M83r6k03L45m0
2663D7o07O10m79j24N64n31k6L13%J25J72j67JK25o24M63J5l85O68l76k62M08
2685C0k82K0O04n05J58K09l58J21L88m45M11j30l18M49n20L55L78m91P1J21n18
2706b52P84j40n75L74P6l51P61j98k46L00m38j61L52m42J58m2j05L26j04m49M52
$$ y = [-823, 373, 1218, -413, 295, -414, 9, 943, -118, -761, 61, 612, 170, -396, -569, 113, 1060, 41, -927, 42, -83, 179, -144, -961, -100, 544, -773, -16, -725, -634, 481, -633, -411, 115, -915, 249, 306, -864, 140, -531, -584, 670, -443, -399, 124, -592, 698, 360, -555, 283, 242, 215, 459, -573, -71, 544, 28, 353, -76, -105, 523, -115, 195, -54, 88, 598, 147, -16, 328, -145, 642, 172, -148, 399, -386, 68, 583, -309, 493, 32, -417, 624, -220, -212, 651, 38, 271, 294, -484, 118, -32, -329, 236, -391, -413, -122, -442, 41, -55, -258, 87, 47, -560, 50, -429, -553, 11, -520, -546, -233, -233, -108, 64, -103, -102, 123, -501, -38, -23, -408, 260, -116, -378, 30, -252, -232, 372, -133, 25, 234, -124, -3, 385, -60, 351, 221, -97, 352, -168, 187, 565, 74, 145, 266, -252, 532, 392, -183, 191, 267, -84, 677, 479, 233, 533, 95, -66, 286, -156, 2, -40, -145, 181, 77, -372, 80]
2727H0j62j58K85j72j05L45l30MM12o76K45K6l36N62J92p55R59o81n0N54q72M03
2749b30M51q55P26j72q77J341l20l38O28q53O94M70j310R05L2q52J297q04j25
2768a92R78j058L22N67j081P75J04q18J375j102J43Q40j225P14M30j238J080k10
2786D04j049J249p95JR84j744J228N07j336J267q91l84J258j093L7P50j248J269
2804D14Pj314J385q36l55J480j457M02O06j383J393j35r70J064p63N1J057j570
2822i24M36J023j284J248m18j235J925r26l5P22j489J049N43j279J148o25m60
2839e81J811j457l48J738j728J210L94j851J633n86o60J706j639L42J186k151
2855i81J512O8j486J709r88k24J849j905L29J531k265J694Pj979K234j120m71
$$ y = [80, -82, -240, 45, -127, -232, 113, -217, -213, 199, -477, -232, -206, -542, 20, 212, -543, 416, -265, -315, 239, -633, -230, 221, -634, 92, -80, -957, 384, 64, -274, 354, -499, 195, 665, -645, 260, 292, -560, 737, -67, -192, 786, -272, 50, 617, -464, 311, 415, -403, 972, -130, 13, 853, -372, 342, 772, -466, 614, 404, -645, 604, -191, -190, 794, -950, 278, 785, -551, 716, -175, -559, 699, -394, -357, 393, -855, 414, 421, -893, 492, -344, -699, 781, -676, -274, 332, -1051, 342, 207, -763, 301, -462, -411, 646, -924, -488, 535, -749, 499, 81, -1154, 771, -155, -190, 532, -957, 92, 635, -644, 504, -121, -581, 1230, -227, -575, 1163, -565, 645, 1039, -812, 821, 235, -425, 1281, -358, -16, 1170, -981, 531, 599, -887, 822, -166, -390, 1459, -446, -117, 1414, -851, 843, 850, -1129, 1105, -15, -486]
2872d86J701k320R97J305k164J678p04j333K633j922J36J424k152J602N28k455
2888a532K444j474j056L320k607K62J528k721K619J03k508K565j584q1K496l374
2904a600J121K165l022K176q95j965L643j641q15K293k923J927J010l087K501
2919H88r09j304L100j991p85K575k958K305O48l173K221n06m23K637l053j98K442
2936A516j995J307m80k275L397p52j834J505j743J683J547l191J400J89j306K150
2952A118j473p57K269j790O18R56k436J237P27j407K125j617j414K703j080k9
2968b50Q82k671K449Q15k534J295o75K17K471k969j30J875j402J755p47k334L269
2985A316r65q67J832k828J307K076l089J881l54j862L278j560r30J968k753J858
$$ y = [-486, 1215, -1105, -108, 1197, -967, 711, 7, -1326, 1307, -615, -479, 945, -1207, 395, 923, -1532, 912, -562, -1618, 1702, -905, -643, 885, -1836, 783, 886, -1622, 943, -641, -722, 1774, -1600, -479, 1686, -1336, 840, -55, -2020, 1623, -18, -833, 1460, -1463, 464, 1474, -1613, 888, -21, -1325, 1775, -216, -1001, 1574, -1384, 921, 1569, -1604, 617, 111, -312, 2325, -728, -926, 1516, -479, 828, 348, -1927, 1470, 718, -1116, 389, -1354, 329, 1876, -1315, 85, 274, -1032, 1118, -355, -1112, 1157, -633, -15, 941, -1495, -258, 469, -938, 1187, -430, -1844, 859, -221, -250, 632, -2039, 410, 1225, -1309, -14, -689, -472, 1999, -970, -1100, 775, -627, 1128, 381, -1953, 1316, 351, -516, 1316, -1512, -205, 1871, -1218, 663, 309, -1553, 1725, 165, -765, 1203, -1550, 308]
3001C08J495k883J479j00j007L030k661q03K319j615J542J7l216K894J5j357J421
3018H78k498J354J900k110N07j67j076K360r27j387J754j273Q42Q68k173J096
3034e2J94o85J237j170o21J396p57Q80m8j520J117J62j80L63j280O62Q16o69K41
3053H6m17NJ089n60o92L90l74M59N95j058N09k1J34M43q97j08Q87k40R4j43p21
3074e40J052m6n34L27m98J59O70o51J44J25l25R64l50q22N91n05M17N66r60J07
3094a09L81q31R14o2q76R01k72n51N97l11O1N66j171R00r9p78J053m15k50J043
3114F91j171L03M77j102Q33O3n34Q47n79l42P67o90N10r9k28R3K70k31N88n72
3134a06J33L03k93P4K05j07J7k1k64k37L37r6J01J67J09l95Q8K53o2pj2q3Lk5
$$ y = [308, 1803, -1080, 399, 299, -708, 2322, -339, -1142, 1177, -438, 1104, 1121, -2095, 799, 814, -543, 878, -1620, -266, 1634, -476, 31, -136, -1212, 1148, 221, -1166, 588, -685, 157, 1025, -1148, -52, 142, -543, 694, -476, -1097, 299, -458, 422, 374, -1146, -29, 133, -47, 316, -964, -302, 514, -155, 86, -331, -326, 763, 203, -489, -99, -473, -14, 581, -477, 32, 11, 145, 588, -309, -417, 470, 230, 324, 181, -540, 512, 466, -68, 259, -239, -80, 590, -61, 83, 208, -117, 847, 497, -325, 266, -239, 178, 744, -216, -109, 272, -559, 355, 293, -583, 318, 46, -505, 92, -219, -158, 408, -763, 137, 38, -740, 313, -102, -352, 691, -480, -177, 300, -802, 31, 94, -440, 407, -172, -514, 253, -437, 73, -26, -254, -161, 109, -122, 466, -106, 27, 330, 37, 111, 316, 209, 226, 205, -59, -296, 41, -55, 46, 213, 322, -73, 15, 268, 206, 199, 187, 104, 107, 82]
3158H2p3J56j19L34l60p0J90r2NQ0j67j03N0r6J32R0k08J68k40K10r8o3K3J38
3182c1m5k0K39k18j04J64k55J8O7r9L49j74j34L00j30J46k89K28p4J59l23K93
3204F7J12k35K93l85J23J91K4m9o6m35N40j85k52O41k84j88N11l34J54M5l85M08
3226C11p2k95M12m40M44j78l98L42J90j48Pk99k12N04l69L18rk90J06P8j90R7
3248i1j76K88K4k53Q6O5k84M08j88J13o8n04L49K17l1M2k43L9K08j40r4K55k11
3271a89K12j69j28N55n06K61J09n66L72K63l65K08m4J67O7l92P9L38j32kj01q5
3293d8n6j2J04N93k90j30M3N5j07J55p38O77ml99L60n88O23M04r74J12M91o10
3315c39Q17n82m85Q31l03K26N0r59Q58N13j196M70l73K4R71q61J32L92q05Q20
$$ y = [82, 9, 165, 46, 380, 20, -50, 140, 48, 53, 133, -34, -137, -87, -183, -51, 39, -169, -1, -241, -31, -129, -192, -169, -31, -76, -96, 143, -75, -179, -15, -270, -252, -185, -284, 65, -109, -243, 57, -73, 73, -216, 12, -62, 97, -226, 67, 179, -56, 237, -148, -25, 166, 190, 141, 75, -360, 180, -5, -257, 384, 100, -88, 423, 89, 243, 288, -97, 311, 239, -56, 356, -84, 360, 182, -216, 126, 316, 168, 175, -124, -336, 168, -201, 117, 108, -182, -76, 2, -188, -91, -267, 21, 45, -208, -122, -57, -341, 67, -121, -8, -76, -580, -231, -14, -45, -3, -246, -207, 1, -139, -233, 22, -189, 23, -146, -274, 281, -225, 36, 145, -421, -49, 214, -151, 57, 13, 180, 247, -145, -66, 272, 140, 138, 37, -48, -104, -116, -12, 581, 291, 161, 204, 259, 152, 307, -431, 246, 242, -157, 203, -385, 238, 642, -332, -220, 271, -339, 478, -104, -589, 242, -61, 165, 215, -744, 114, 627, -569, -99, -472, -448, 523, -338, -206, 186, -619, 201]
3335B01N6r10P01k46j99J189j421q2Q38m78J201q20j020J328k30m8K94j225J247
3354C76K83q11K99o99K02J307p90n79L94k52Q57J47j203M18J30J51O51j299o3
3373d81O25L32K51m83q91P30O71o17R4p12N37R35n25p97l93P17O24o5j062K24
3393b86M14J84j9o49j76N07L12j29l17m81P94J68M8n58n23P00L18J04o78k90K60
3414b97P00N8j115K14K69Q51k86j088J62P36N32o16q62L80P65K0k2q62J25P53
3434D17L6k87m02j21O74L68m45l64l74P60L64l89o99J01M85O87k08j137J13N96
3454A75L84j21q93K22O92K24m52p34N2N62L64m48m09j21P19M05p69m66K39K99
3474g6M87m8q82KN01J77o5p74J23Q08M6l40l42k05N91L88j73n30k97M90M05q9
$$ y = [201, 257, -653, 48, -198, -397, 792, -629, -711, 127, -351, 850, 30, -990, 338, 108, 60, 354, -871, 376, 659, -152, 147, -552, -350, 957, 167, -412, -18, -270, 587, 734, -469, -51, 79, 230, 881, -418, -481, 144, 476, 727, 244, -647, 83, 754, 137, 231, -481, 56, 991, 466, -331, -724, -7, 617, 552, -510, -286, 128, 312, 293, -356, -532, -25, 287, 158, -159, -640, 154, 322, 370, -188, -711, -11, 307, 411, -267, -557, -297, 403, 461, -654, -440, -171, 680, 394, -694, -532, 204, 736, 120, -742, -362, 403, 423, 401, -461, -336, 417, 453, 166, -236, -357, 317, 685, 240, -124, -498, 262, 626, 237, -462, -361, 124, 811, 603, -534, -421, 175, 559, 438, -455, -233, 459, 683, 231, -503, -451, 111, 475, 27, -382, -503, 216, 621, -148, -614, -375, -76, 411, 363, -519, -517, -16, 161, 96, -678, -555, 253, 299, -41, -383, -588, 3, 391, 218, -312, -609, -119, 286, 197]
3496A97p07M71K3L09j99m82K30J37P2N3o42K46N46j3l49K27m56N43L01k35k14
3517E8j46M2N26l96L1J67j62J59r0j00k19P3K49K95o08k1M05kk9k16J4K9K57k83
3541C3k32L41j78r8q3O2J51k23K60J50m36J21j44L23rl67K68n9l9J94m11K28m6
3564a94K6K83l23P2O3j63J61K13j89n9J60k77L6J33j51N42j33k92J79p4J4J14
3586A41j64m5J27J8m5j41J3K72l76J70J23J32P9r9j79P6j20J26R8K1M1k85rk5
3610e1K57j85Q1j22K98j87l0o6qj95L53jl05O7R4j6j11J13k17pK22j18P3k53J89
3635a25m3L6j59O3L14k93J58M7j26j97K87o8j24N19k99N2R8k21K14l28M19l26
3657a02J14r9N5l3Q5J63L3l4o8k08N6M0j65K09k6J32K14l86P4j93p1L95l41J80
$$ y = [197, -510, -39, -16, 293, 94, -388, -158, -21, 51, 104, -538, -292, 254, 241, -108, 119, -337, 206, 507, 272, 58, -88, -46, 480, 84, 115, 282, 120, 279, 189, 89, -130, -57, 192, 487, -121, -142, 263, 261, 232, 16, 30, 59, 316, 33, -199, 142, -36, -134, -217, -155, -4, -227, 33, 183, -253, -132, -276, 47, 38, -329, -61, -120, -159, 35, -376, -148, -194, -168, 115, -208, -136, -73, -236, -75, 138, -51, -110, 50, -227, -191, -58, -209, 333, 200, -92, 87, 13, 27, 141, -23, -68, 59, 77, 32, -109, -96, 176, -200, -30, 93, 225, 304, 205, 26, 102, -18, 108, 206, 227, 268, -17, -26, -51, 206, 21, 102, -20, 278, 91, 61, -5, -13, -208, 145, 144, -161, -94, 0, -16, -127, -14, -231, -238, -16, -134, -61, -314, -125, -168, -132, -291, -228, 86, -207, -49, -2, -128, -325, -38, -106, -230, 289, -10, 42, 140, -81, 133, -195, 224, -102, 12, -87, -32, -65, 20, 183, 216, 182, 114, -94, -38, 2, -163, 46, 20, 152, 366, -20, 54, -139, -210, 185, -156, 24]
3681B4J84j44J48J37l70K58l84J82P4L9l01L43k5k97o6J30l4J33K8j42j5J63j08
3704d3l32K62ro4J55J9p4K25j99O2j91R9K4K32k95J78k73K97J32o1j55m8J39J46
3728B26k40K11k58K93m14M98l04l1L02k27r9K20l47K34k21K85J48k75K2M6k50
3749a81N28m11k69Q00l24j86J42j85N75k42j57Jn10o0Q90p05K06J64k46M94l21
3770Cm01P65l88J99J07q01M78K29l36J73j85m93Q13l46O5L76j053Q93J68p32M52
3791a4l73O2P14p48r3M84j55N70o02m74Q24l20J85J93o43O9O83k07J87l86k59
3812c03P91o24J18J56n25O03K34o02J52JJ6N19o59k9M65k76M87m07l84J58L09
3833B00O1o9n36K50O05m12j01J22o14J040m38m09M12m60L04P76j183l1M04k16
$$ y = [24, 208, 64, 212, 349, -21, 237, -147, 35, 109, 148, -153, 190, 165, -132, -198, -68, -102, 31, 59, -83, -98, 65, -43, -375, -113, -122, -186, -31, -12, -86, 139, -60, 2, -189, -90, -66, 166, -129, 49, -224, 73, 205, 144, -11, -59, 80, 226, -14, 197, -61, 232, -182, 316, 12, -19, 283, 56, -43, 177, -170, 64, -157, 128, 276, 1, 23, 69, -181, 347, -64, -333, 467, 143, -43, 99, -86, 489, 247, 90, 91, -419, -479, 411, -294, -88, 76, -170, 324, 3, -398, 367, -21, 178, 285, -516, -38, 191, -145, 28, -157, -650, 163, -183, -118, 258, -795, 98, 266, -466, -14, -387, -325, 389, -359, -452, 32, -123, 447, -155, -629, 195, -125, 60, 253, -390, -321, 362, 155, 342, -44, -303, 488, -136, -18, 138, -387, 216, 450, -152, 0, 1, 17, 536, -123, -152, 313, 37, 524, 117, -267, -109, 200, 261, 192, -344, -94, 511, 99, -2, 120, -494, 546, 108, -301, 111, -349, -45, 731, -452, -483, -79, -295]
3853b95N15j57q14J085m94N28k28r80Q50O08j027R40r65k16J462j031j7M17q05
3872f24R50M5j280Q75l55K51J001j509L54P97j072J373p80q84J289k89k11N47
3890D78j071P00O15j094P18m90l34J276r28k9N64r86J149m14o91P15l02P6O34
3909E86j001L14L93o20J043r91m16J054m74J96j77l03M68K63o75J96k57K75O49
3928E23o51l14L09J5K35J12n95L38L25m38Q5m58Q7P54m05J13J9l55K91J23l56
3949b43M12l03J6N23n62K29m9m41Q53N8p86L80j50R5O33r47M21N21q89M79j95
3970E5l66J098o67p7J02l95L63K52p78R24m70m36R85r32L73L33n18L33L66r68
3990d23J022o90R6L79n96K55K19l71K23m09O8O81n57k07M79o50M37m7l22N01m5
$$ y = [-295, 220, 63, -751, 334, -160, 368, 140, -840, 10, 618, -409, 531, -434, -650, 812, -219, -236, 181, -624, 326, 371, -909, -34, -389, -138, 863, -646, -292, 505, -567, 806, 26, -858, 431, 142, -69, 478, -593, 107, 722, -372, 346, -144, -478, 798, -130, -159, 405, -581, 568, 154, -537, 178, -124, -48, 586, -415, -101, 292, -328, 715, -276, -692, 362, -112, 84, -93, -396, 72, 335, -340, -144, -401, -126, 523, -128, -442, -133, -118, 117, 229, -366, -28, 297, -141, -56, -514, -427, 327, -78, 35, 54, -301, -10, 113, -243, 169, -134, -118, 405, -157, 72, 23, -418, 435, 493, -293, 87, -63, 32, 665, -282, 139, 660, -229, 250, 55, -311, 787, 120, 43, 145, -250, 113, 365, -413, 511, 41, -395, 590, -342, 31, 364, -154, 179, 545, -423, 599, -91, 5, 384, -212, 43, 262, -109, 114, -295, -227, 454, -103, -310, 169, -481, -44, -91, -413, 88, 43]
4011D3k52L36k73L5K98k22o4%j10J59j8R8L4n6J17j73q6K40M7m92M13j89J1L42
4035B38l63j3N10l55L43k93o9M36l57Rl4M2p7K22j65j27K22l00L36n1m41K17J31
4058F1J66Nl74P7K4j12K16k67o7O76q16L30J49J0j44M24m98K18Kj76J47l90L80
4081D1K06k41j28R0j41M4L4J70j79m7J44r2M8J48j5j69J30K22l29L5J02J46q6
4104A33j87N5Jp3J64j89J96j2j09J22j00K23J01j93J7r4Q5r8K51l29J66l66L37
4127A01k7P9j34O2m8j75K46j02m4O8k43K15J36j41J51k33J74j2k74J66j67K18
4149A6k02L4j8J53j31j5M6J81j89J8O9l15P7R3K76j50k2O1J10j52n0K17j93N5
4173c1j32j6K32j51J99nj17K70j61j67K31j46l3Q8j8j53rK88l7l6n1kJ71q3P1
$$ y = [43, -209, 127, -146, -111, 187, -35, -99, -99, -209, -50, -68, 30, 64, 8, 125, -48, -134, 106, 153, -339, 74, -115, -104, 238, -125, -138, 372, 17, 360, 67, -2, 434, 77, 86, 52, 94, 17, 239, 74, -53, 169, -131, 205, 154, -287, -70, 61, 227, 232, -142, -65, -41, -153, 63, -204, -271, 405, -411, -81, 68, 78, -66, 358, -140, 78, 80, -96, 51, -339, 41, 247, 6, -122, -32, -173, -129, -95, 75, -104, -151, -7, -99, -51, 97, 82, -87, 43, 265, -64, -29, 73, 219, 133, -54, 1, 2, -71, 93, -96, 100, 88, -21, 101, 1, 224, 325, 132, 149, 55, 140, 42, 293, -36, 130, -236, 101, 74, 153, 19, 81, 33, -142, 104, 2, -42, 26, -217, -2, 134, -7, 144, -89, 85, 73, -201, -35, -202, 16, -186, -152, -170, -17, -148, -163, -117, 64, -125, -107, -38, -353, -276, -183, 93, -57, -79, -18, 92, -60, -110, 107, -86, -31, -163, -179, 53, -98, 101, 96, -21, 249, 88, -79, 152, 6, -27, 61, 43, -110, -119, 169, 132, 96, 45, 43, 214, 131, 202]
4198B02k18m6M7J33l3Q9m9k20J91J33l21K11m34Q1L26p4q5J38j26K52n37J85K66
4221A11q8Rk68J27O4M69l66p9L4j72M00j52k14K13j87J1J94m52K76Pn5N31l20
4244I3k66K66k10Q5Q3k22K86q1k24K55o5N5M46p04K37J5k74M06j43J82p6j63M7
4267B8K89k82j85L32o0J99k68k31K64K0j16K79k55M0J46j27n7l6q4M65n74J06
4289a07J70k63L61j35l8j23J47k7k24K62j55j09M15Q3k45j99J22O3L51l24l32
4310c07L38r8M2k4j34M6M34k87q3j08m7K99P8k92m8J23Q2J55l42K35J7j48N2J8
4334Al1J83o8j63L23k74K91R6o09L15P6j09P6n0RJ81j41k70J92p4Q2r7L22l21
4358f0Q0k3J4J67k90J79k02N05m49j4r9J00l6J68j16k03K93R4k0l05PL72n17M32
$$ y = [202, -16, -62, -15, 118, 85, 174, 125, -95, 96, 229, -92, 119, -315, -234, 92, 18, -67, 71, -55, 197, -340, -155, 111, 23, 32, -236, -109, -45, 424, 58, -21, 13, -159, 241, 89, -125, 88, -99, -88, 106, -346, -70, -63, -118, 413, 93, -173, 93, -117, -32, 51, -171, 115, 34, -190, 65, 0, 55, 501, -203, 34, 49, -225, 181, 38, 220, 144, -19, 28, 317, 35, -150, 182, 122, 321, 53, -178, 86, 106, -10, 269, 14, 54, 200, 73, 16, -20, -104, 361, -213, -107, 63, -200, 161, 26, -12, -135, 12, -15, -239, 23, -132, -241, 174, 257, 12, -187, -65, -2, 349, 25, -307, 31, -67, -25, -49, -183, -137, 297, 10, -73, -181, -228, 71, 149, -143, -191, -68, 14, 169, -173, 62, 79, -69, -17, 1, -30, 153, 85, -78, 245, -29, 262, 358, -251, 64, 140, 31, 107, 57, 66, 247, 106, -164, 28, -46, 36, -61, 261, -60, 20, -3, 11, 178, -112, 67, -135, 370, -79, -93, -192, -92, -128, 40, -76, -279, 14, 108, 88, -217, -210, 162, -355, 77]
4382G7P1j91k93K34j45K3L53k63j9%k34L89m8k42M55k95N1Mn3J46m4j29O3J50
4406F0J89j05l7j13K52l82LO3O4L59m20m7N19k97o2J2J39Oj42o2r1J43M8q2J77
4431A94k76K46k44K62J7k51K80j44J6R8j81j93J97j72L6J13l02R6K62P5j34J7
4453A2j69L11l94N5J08k2K02r0k12J25l0k27J25Q6J34J67l01r1M12k27Q9j77J23
4476Ij61K02J6j04PK30j67j13K43k44J16n5L15m13J79J80j52N6q8j52J4K31N0
4499A99j50J13j6Q5j88k06Q6K35o1j86R5j07J93j77J39J45m81K26M8P5mJ12k79
4522a04j03J83K13m07q1J55J34j73N0k1K29k76L8m8M47k86Q5K41k68J28J55k07
4544H4m0k34L9J51k41J48J47k03J96K9m0o3%L5o3j4J13J08j94M32k37%j88Mj36
$$ y = [77, 148, -43, -336, -102, -247, -224, 129, -134, -153, -153, -387, 2, -46, -288, 167, -128, -77, -73, -126, 20, -24, -153, -90, 60, 249, 144, 107, -6, 246, -136, -133, -70, -6, 353, -67, -114, 405, 108, 46, 58, 197, 203, 61, -1, -92, 51, 99, 17, 194, -82, 164, -80, 182, 199, -52, 228, 84, 100, 198, 17, -176, 21, -151, -115, -2, -304, -208, 54, 129, -5, 12, -157, 154, -240, -185, -77, -99, 103, 13, -199, -74, -104, -331, -206, -120, 14, 181, -120, -211, 201, -26, 63, -114, 9, -152, 50, 66, -38, -31, 199, 32, -81, 162, -82, 34, -21, 294, -119, 60, 240, 88, 144, 56, -96, -82, 149, 199, 49, 162, 146, 231, 43, -163, -77, 158, 97, -89, 6, -101, 92, -85, 54, 199, -282, -56, -8, 67, 63, 175, -104, -207, -24, 189, -218, -299, -144, -10, -183, -133, -154, 75, -201, -163, -211, 236, -50, 35, 276, 8, 136, 291, 84, 44, -190, -151, 0, -241, -93, 54, -149, 47, 76, 36, -27, -27, 8, -55, -69, 44, 152, -42, 390, 153, 153, -35, -31, -167]
4569a67M87m70K47M9l1j02K9O0j23n7K7jL96l03R6N8k71K37j1J7j42k8k7K5pK22
4595B10k62J64k21P0p1j18K62l28K21j31J45M6pJ13j23k13J63J77j83k65L48j1
4617a4M4o5K19l43K23k9k3k33K71oj11N8J32l2k43M88l02Q1j35N4j4J98j18L8
4641A38m6K1Kj25O4R7j57J10L0j51J71j92K21R2k62Q3k37L16p6k27J02p8K39j16
4665A9p3M1P1m9o5L03l18j43oJ67j41L90k95N1p7K07m5j18Q1k47K9P6j5J0K62
4690A15j63P1j74J01J23J76k13j04K47n3k21J02j09O1n0J59j43M7M8j06J61J42
4712B17o0k22J2K31k53lJ77j63J03K32l28j83L25J16j29j09L16k12j05r3K5L19
4734B13l06J27K64j30l50K15L5j80PK08k40J70j73Q6J58k05K2J27k75n0J94oJ84
$$ y = [-167, 320, -150, 97, 146, 115, 13, 42, 102, -21, -78, -51, -52, 344, 41, 137, 195, -76, 161, 150, 167, 25, -3, -30, -5, -12, 210, -52, 112, -109, -39, -110, -228, 34, -294, -73, -204, -59, -13, -20, 93, -30, -243, -80, 97, -86, -351, -3, -14, 30, -35, 184, -159, 64, 35, 12, -221, 50, 44, -67, -9, 123, 91, -152, 336, 34, 115, -20, 34, 20, 218, 100, 138, 92, 113, 115, -10, 54, 151, -6, 104, 134, -17, 154, -38, 183, 275, 13, 96, -141, 175, 99, -128, -26, -104, 135, 19, -54, -13, 58, 9, -56, 247, -71, -214, -220, -53, -194, 196, -99, -48, -125, 82, 37, -81, 0, -247, -218, -142, -157, -147, 115, -48, 23, -151, -50, 73, 249, 36, -68, 179, 126, -95, 7, -102, -41, -91, 68, -75, -28, 20, -86, 75, 217, 157, -65, -53, 178, -75, -78, 99, -64, 39, 271, -57, -240, 85, 201, 72, -37, 279, 67, -38, -131, -106, 213, -93, 34, 298, 168, -182, 33, 68, -112, -105, 103, -137, 33, -140, -54, 104, -101, -79, 48, -227, -277, -83, -89, 95]
4757I5k42O1K6o3M3K61l05J59K6l5J51m65J86p9J56K40l04K26j20K54j07k03p1
4780a10R2r2n2L99l98P9M26l86L0N5j7j11J24M7J26q4J23mj07j65P3J11l19K6
4804a34j05N43l09R2j21J8Q0k01Q5R3o8p7J79k08L0J29k50K17K96k46j53j31J57
4827h4J59qk04l1J99R6l32l27K84J27K11K8k33J53j84J61O1j79j64N20j23j74
4849d4P8l25K92l9N9j26M4j04M55k93j59J39J93P6j58k76J82L4Q9R9m74N03j10
4872A35n3j27l2j67N31k33M8j3k47J34L13l07m8k22K59K16j94J47J8l17L92k09
4894B4k33J47N6J50R6n01k31N26l48M60k25k0L10o3j11J49j96j03L90l33J11p6
4916b1k13M49l84q9J56K12j9R0l14L87k46l8R4r9j61L72j61O1q0j97K71N7k59
$$ y = [95, -147, -86, -60, -123, -80, 181, -124, 35, 61, 26, 177, -288, -102, -181, -25, 215, -89, 137, 17, 271, 164, -39, -110, -18, -110, -162, 237, -161, -82, 344, -42, -12, 43, 26, -85, 39, 86, 212, 128, 251, 247, 140, -25, 48, 159, -160, -134, -239, 304, -5, 87, -34, -16, 64, -137, -52, 41, -27, -104, 75, -133, -103, 26, -224, -7, 289, 43, -110, -241, -84, 75, 67, -137, -168, 31, 127, -205, -532, -248, -121, 90, 118, -115, 38, -146, 15, 76, -103, -267, 253, 130, -44, 34, -291, 1, -38, 21, -105, -61, -165, 290, -3, -162, -23, 170, 246, 88, -188, -6, 28, 117, 216, -258, 245, 135, 82, -45, -77, -244, 287, 54, 102, 89, -158, -24, 289, -18, -66, -288, -29, 187, -7, 140, 158, -159, 233, 24, -209, -62, -6, 144, 240, -261, -492, 34, -314, 146, -79, -99, 211, 148, 37, 186, -10, -113, 277, -56, 55, -21, -234, 215, -169, -258, -102, 110, 91, 181, -133, 254, 8, -30, 64, -35, -196, 176, 15, 76, -4, -201, 70, 127, -132]
4939a32J75j17J16K10m02J92R6K8l2p8j63N4J86J62k83k44L34k67L14j76M3o5
4961d9R2O4k25P8LL3P5L2k65K80N0j81k42J29J98j77J99j31m10M47k12J11k3J50
4985B6k44r1L54k27L33l20M21k04r6J16k53Q9K05n0L3q4r1Q9r0J91j48K53j06
5008A06pJ06j62k04J73k37K83p3L74l56P2O6j58N1P8j76N2J04k0L3j86J12k0J38
5032A49k12j78K98q5P5J0rj26J19k01K96k61L18k03J24j7p8k41L5L5J23K84m75
5055b20L59q5J81l78K6rJJ90j30j01L14j99N6k3J57Ql5j56j52J16K47Q6j76O4
5079A41l25R7K64l2l71Q8MR5L09l00k60L29j3p5K68r6K00j25p7k16K29k59L5J21
5103C1J72k07LJ67k83J47O5kj15J4P3k33J25J1J83j41J31p1k4j87L39ll40L09
$$ y = [-132, 43, -74, 42, 252, -150, 42, 138, 166, 134, 56, -107, -53, 133, 295, 12, -232, 102, -165, 149, -27, 16, -49, 43, 107, -118, -40, -37, -4, 71, 103, -162, 118, 168, -13, -255, -126, 72, -105, 94, -37, -447, 0, -212, -101, -124, 26, -218, -309, 45, -182, 151, -169, 252, 48, -48, 68, -185, -96, 109, 59, 92, 8, -83, 6, -84, 107, -41, 212, 106, 99, 205, 43, -161, 12, -225, 58, -15, 359, 3, 75, 141, -17, 34, 112, -64, -12, 92, 72, 105, -81, 31, 11, 149, -63, -241, 57, -28, 47, 57, 48, -78, 41, -160, 136, -125, 193, -10, 114, 97, 19, -222, -187, -152, -29, 255, -220, 139, 54, 235, -143, -117, -126, -125, 65, -65, -166, 148, -51, 5, -18, 139, 147, 112, -44, -196, -80, 167, 253, 77, 141, -184, -87, 177, 145, -226, -138, -134, -39, 270, -30, -290, 39, 26, -49, 219, 123, 323, 198, 121, -95, 134, -125, -90, 31, 203, -4, -1, 166, -117, 30, 95, 93, -22, -8, 65, -168, -43, -32, 151, 10, 141, 70, 46, -141, 198, 195, -145, 164]
5127A64m43L11j12m5p9L24L6m9l50K04J64M1j29N9k65J67m5J64k45J28PQjN3J48
5152B15j86j81j5k0K06K81k53J22l24R1R0j2j7k16M23J77l19k29K24M9j15J27
5174A18Kj07J19j44j8K01p5k00K71j63J03J24j08m0M4j07j88J29l9P5Q4l78N7
5197b40M86k97j96K48N6k62K96l15J04o5K28N9r6p9k5J0l3k8J0R2K7j47o2n7q
5222b94L71j62K9k8K46k24O1p1N21m09M5j01j32J49m2L0k3L3K21kj87k3p2p6K50
5247A10m8l81K93j5J17r8j04o9L17K17l45rj00J01K11k93L27k89J46Jk58K5J14
5270c0Q7j13J00p1j30N7L38j55j26K15p5k2P5O1m16L20j42Oj67Q8K00j54J80j18
5294Hj97K19R0k21J20k1j56J30J7j14K86k09R9j11J2P0Q6j28K2j8q3R2K07Kk13
$$ y = [164, -279, 32, -80, -125, -204, 120, 156, 107, -243, -39, 125, 166, 37, 96, -169, -2, -47, 117, -128, 0, 7, 15, 14, 67, 215, 29, -152, -167, -187, 19, 300, 47, 169, -155, -64, 26, 14, -3, -219, 204, 381, 62, -167, 57, 106, -9, 118, 120, 13, 132, -12, -30, 171, 96, -104, 167, 4, 107, 231, 123, 83, 127, 20, -168, -39, -78, -3, 81, -297, -240, 246, -51, -247, 1, 57, -205, 91, -224, -120, -185, 43, 102, 6, -73, -98, -88, -121, -149, -139, -47, -20, -167, -229, -286, -294, 77, -85, -56, -84, 162, -62, -1, -72, 449, 40, 85, -16, -148, 1, -41, -11, -34, -1, 220, 218, 31, 8, -64, -140, 110, 62, -319, -26, -41, 76, -22, -126, -195, 122, 339, -6, -15, -115, -14, 197, -96, 231, -58, 88, 89, -169, -144, -30, 57, -56, 44, -27, -157, -100, 238, 83, -43, 172, 97, 75, 150, 211, -205, 115, -27, -21, -188, -100, 100, -54, 126, 8, -189, 30, 120, -101, 19, -2, -158, -28, -11, -125, 161, -48, 51, -60, -48, 22, 108, -20, 2, -16, -99, -7, 200, 202, -11]
5319a1j55J60R2j32P8l82M31K3q7l6n5J39K69r3k24k05J10K20K11k68p7j16L43
5342B35Pm02j90L45l9L62m38k0M6J18J5j19M6k02J12P7k10J86J25k00J20j19L30
5365A85l28M5J2N8K2j01R7O9j64L03k59J53K58m29K02l16K50m8R7l06K24N8R8
5388A80m15L43q6N0J29k05J71n0o7R2j93J26n9J9MK30j36k36L37j84J05j57P5
5411G3r9J59q2K23j12k48J2r0K91j38lK16l17J27J02qj58J29n8m8k0j16j5o8Q5
5436a63l1M8j35L06r9J0K10j19J22k92K13M2k14j1J59J33l13o2K33j25K47k6K8
5459A61k50R5r0J12Kk3R8r8n7j3J12J58r7o1L2k43L52K0k70L36k92ojK00j46L6
5485F7k81J17R0O7j09j30J24J03k09L3O6N9J99k38lk1J43Pp8n1l9j24j6L74j70
$$ y = [-11, -166, -6, 86, -46, 32, -350, 81, 104, 17, -19, -74, 65, 334, 241, 17, -188, -78, 142, 353, 85, 8, -108, 235, 242, -160, -350, -5, -44, 318, -120, -140, -94, 24, 39, -80, -34, -236, -124, -47, -257, -71, 54, -146, -26, -145, 185, -143, -98, -86, -28, -6, -107, -10, 59, -105, 198, -61, 92, 350, -79, 123, -193, 57, 9, 106, -200, 24, 82, 180, -235, 108, 22, 72, 201, -4, 167, 117, 50, 142, -51, 75, 16, 35, 39, 269, 133, -103, 234, 50, 155, -2, 73, -26, 133, 51, 274, 162, -86, -74, -164, 127, -11, -14, 202, -115, 12, 114, 106, -52, 77, 19, -29, -49, -165, -180, -248, -163, -194, -146, -281, 25, -74, -64, 146, 27, 149, -143, 70, 112, -102, -113, 46, 179, -134, -196, 37, -88, 159, 133, 161, -89, 6, -84, 28, 30, 7, 105, 7, -50, -63, 49, 207, 110, 49, 81, -162, 190, 210, -60, 276, -16, -22, -23, 177, 31, 67, -214, -97, -7, 60, -49, -179, -55, 48, -161, -128, -62, -3, 196, -42, -45, -66, 77, 84, 6, -45, -84, -208, -224, 150, -20]
5510b0J22p0P2j66K4J12qj49J53j86K87m88K00qJ53J9o1O9p8o8N4J44l7Q3j40
5535A3J34j41J13q2J85k72n6j34M92j10k28j1K17k20N3J36J58k66K98j31n4n9
5557C5J96l26J36J34j50j02M3J9K23j99k29K68m3j30J34P8r5j98K55r9Q2k3Pk10
5581a94j44L99j11k9n7KO5J87k92J66j66J14K95l73p0J27J0K1M63m83J09O2k14
5604a13J43j23J82J0k4k8L7n6ln0R7%j40K90j99j32J11m0j33J58o3p1K70J45l74
5629a06K7L8K59Nk28qJ42k04K45k74K98k20J13k73J57N4k15M90j45j67Oj6J19
5652I7M9l85O9K06m83N06R4O0j19j73m1k32L79J28k89J00K55k50J2rJ0l7j38K45
5676E4Lr6N3Kl7j52K89Q2l46J06P8JM3j16k19L24j53k4J2n7K48q4O5Q5N5m32K97
$$ y = [-20, 102, 32, 104, -62, -38, 74, 66, -83, 70, -116, 171, -317, -117, -125, 28, 47, -14, 55, -23, -91, -37, 107, 70, 153, 13, 147, 6, 119, 37, 222, -50, -106, -240, 252, 142, -86, -97, 120, -100, -47, 89, 247, -19, 279, 148, 94, 35, 231, -95, 41, 175, 25, -77, -34, -15, 208, 9, -220, 48, 5, -125, 9, 87, -8, -206, 49, -50, 32, 9, 16, -194, -338, 61, -50, -79, -136, -134, -69, 118, -174, -8, -174, -60, 235, -138, -208, -81, -71, -50, 413, -70, 39, 101, -113, 30, -93, 89, 99, 75, 47, 84, 28, 25, -25, 72, 72, -68, 222, 23, -109, 2, -38, -171, -13, -76, -147, 123, 268, -106, -79, -41, 218, 223, -5, -13, 129, -75, 170, -104, 194, -26, 87, -186, -29, 25, -190, 300, 155, -12, -6, -22, 97, 146, -239, -170, 36, -447, 59, 153, 213, 94, -79, -120, -352, 27, 155, -134, -34, 221, -29, -17, -26, -16, -53, -191, 54, 57, -39, 14, 16, -21, -173, 116, 198, -148, -42, 36, 37, 80, -36, -255, 69, -84, -108, -96, -153, 95, 11, 76, 161, 216, -216, 81]
5703H1P3M8j85k8M4m7j94K04r8O7pk54L60L2r0Q4j00J32q6r0J03J37m3j40Q1o2
5729B2K44l20J00j20l87N55j09l6Q2j59O1R2m9j56K72m02L53J33k75K17n8n6o2
5752e8j85J2L87k21%J45j97K32m24L10L0Mj78J24J6K51l79K1J13J19j32J08j09
5775a1M5j32J69J79k84J30m8Rl16J44L00j56j13r4K00P7j18j69M4M1Q2k9r1M40
5799B99l47j94L12l03LR7K32Nj36j88J01M9q8K88j69j70L36Q4l34N4Q7J36r8l8
5823A8k52L34m5q4L1K30j89k17K05j43K33Nj9lm8j62J79j95K56p2j38J83j21o3
5847g7K40j40J01l0o9K22j5m2k09j49j6N68j62r1R1l98L24m89M80k18J22k4j67
5870a48L7J82k39K2K34k05L17l78J80K48o12O15k24r9P8j45K87j46k20K90O2k24
$$ y = [81, 154, 202, 17, -11, 33, -14, -208, -4, -102, -35, -42, -296, 64, 96, 6, 90, -10, 122, 36, -54, 49, 186, 143, 3, 84, 22, 266, -54, 46, -74, -461, 94, -15, -51, 31, -128, -67, 25, -24, -180, 92, -310, 43, 176, -99, 118, 60, 4, -58, -243, -231, 156, -65, -65, 80, -117, 115, -309, 1, 31, 35, -143, -19, -3, 248, -131, -110, 3, 122, -10, 98, -11, 34, -98, 71, 250, -34, 96, 48, 57, -259, -115, 185, 29, -84, -178, 22, 99, -19, -188, -144, -103, -21, -50, -141, 299, -48, -242, 70, -233, -230, -133, 99, 104, -32, -220, -119, -70, -158, 130, -39, -209, 127, 211, -123, -69, 18, 154, 56, 18, -234, 100, 55, -29, 2, 232, 43, -174, 31, -112, 121, 126, 107, 104, 56, -106, 73, -122, 134, 62, -76, 107, -14, -77, 163, 23, 124, 94, 25, 247, 232, 190, -19, -168, -184, 384, 222, 131, 222, -176, 148, -341, 139, -79, 43, 19, -148, -111, 71, -168, -146, 88, -117, 200, -178, 2, 250, -362, 253, 29, -70, 8, -137, 150, 4, -216, 74, 136, -88]
5892h8O5q1K37k26J64l70L30Q3r5J5o1l4J06K40k91J14j31K0O9j3j21J14j89K14
5916G1J4j50J37q4k72K69P9O8pm40N10l22J30J08k82M75l08j9K2m9o8R8j60J25
5940e5M4J53k22M1Q8j51K19k41K74j36j83L19k91J99j9N8m9p3k12J98Ol49L91
5963Ij00J1J21k1L04k25l3j59J38o0J7j59J10K38k00r0j8J31j36J82l27K20l1
5986g8K72O9k84K00k25Q7mj24J01o7J0o4J69mj12J50j05p7K38k42L4j0M05m47
6010a08j11K57j40K07k66K37qk49L14j00q8J27J0J50k58j08K71l69L67m6j34l
6032d8Q6O6j96n8K20k00ML03j27k01J56J19k11J27j8j73J91k28M04l48N9J94M1
6055A62j44k25K42J96j58j1K17m73M05k55k5K06l0p2J05k5j42r9m7K28j58L24
$$ y = [-88, -23, -104, 133, -93, 71, -299, 31, 114, 19, 34, -27, -61, 45, 285, -6, 108, -23, -3, 66, 53, -68, 46, -143, 71, 85, -65, 72, -12, -284, -15, 64, 132, 125, -315, 195, -127, 3, 111, -171, 304, -4, -23, -1, -50, -118, -20, -180, -55, -11, 142, -80, -39, 49, -102, 117, -124, 150, 14, -169, 150, -141, 58, 39, 97, 48, -25, -237, -39, -33, -382, 9, -91, -80, 41, 20, 324, 99, 66, -93, 45, -15, 2, -157, -47, 191, -9, -99, -117, 14, -122, 60, -267, -47, -78, 194, 263, -21, 179, -46, 41, 37, -87, 14, -53, -43, -107, 62, 58, -54, 96, -9, -86, 152, -90, -56, -66, 339, -108, -219, 38, -102, 105, -161, 76, 68, -181, 133, 33, -55, 72, 82, 232, -26, -134, 137, -232, 135, 89, -45, -48, 38, 104, -92, -150, 70, -130, -126, 177, 50, -151, 5, 124, -87, 40, 22, -151, 40, -188, 216, -132, -73, 121, 162, 18, -207, 35, 231, 73, 62, 279, -194, 211, -44, -69, 137, 107, 35, 140, 115, -27, -126, -173, 55, -103, 221]
6077B21j36m45L75l3kM4n0Om4m1K19m18M91j35J98k20l3J51k69L3R1m9j66L2J58
6102b2Pl36M26K00j85j15K27j82J55k87q5J97L5R7n7l11K66j01J57p6K85k82R0
6125A03p0l18K25J35K6n9L5J3j97L24j81j57K73L3l52J74K0k14K84j33M7J00j67
6148e6K45k90JK08j46K42j07p3j06K60l48K20N5MP2l35p1K9M0M13l39O9J98j3
6172A72j42p7o6J27k57R4K10j36j3Q5J87l42K34k34K71k43K22j1j31Qj12J33K39
6195B18k07J0P3j84J58q4J54M4m7m20M86p8j98K4J88l9M6J12n15L46j12J4J77
6218A66l08K63k04KqJ85Q3j52q2kR8m7j90J23K7L13k42k66M55k10K6M4o0J32m4
6243A02R0k08k24K27n6M9J12k10M9O8N2j63Kk29K34K75o4L6j41K69k32j06N0j70
$$ y = [221, 85, -360, 15, -18, -20, 24, -26, -20, -64, -105, 114, -304, 187, 52, 250, 30, -3, 148, -121, -88, 3, -46, -212, -180, -22, -15, -351, 75, 275, 90, -25, 202, 20, 175, -112, -197, 0, 35, 132, 75, -236, 30, -71, 86, 10, 295, 13, 103, 33, -285, -60, 75, 101, 42, 77, 90, -107, 217, 36, -121, 152, 185, -167, 7, 27, -187, 97, -36, 11, 111, -56, 189, -101, -100, 108, -38, 204, 97, 24, -82, 178, -170, 50, 105, 109, 181, -154, -225, -196, -156, 257, -82, -13, 185, 172, 30, -47, -113, 14, -243, -149, 61, -75, -88, -3, 184, -158, 76, -158, 113, -130, 92, 81, -50, -42, -154, -21, 218, 11, 21, 94, -90, 68, -16, 138, 182, 135, -285, 201, 123, -75, -51, 137, 98, 144, 256, -259, 87, -25, -11, 166, -142, 121, -83, -81, -89, 96, 179, 27, -55, -57, 41, -6, -196, -73, -46, 267, 25, -241, 214, 4, 30, 74, 14, 146, 102, 192, -16, -240, -13, -69, -20, 92, -118, -69, -1, 51, -112, -110, -339, -105, 170, 106, 142, 1, 270, 38, -68, -18, -188]
6267a88O8J94k43K04j01j8J96m6k12J18pj22M3K48k57J07%p8K78j20P5K56k63
6290A32j62rl1r6J0J05L45m67Q1n3K80j75j24m4L40j97K92j61j45Q1j32L95l31
6313f6Q3J24k52J24n5j30J07R9P5j00n2P5k17q6j11K27OL7O7L5j22m4k7J85r5
6338a13p5J19n4L18l16O8L24l98K24k49j95M40j12J23O5k59J3J37j0j0J04p3J60
6361B31k45j1J76l13P9L23k53Q1j09j3M3L4l5L4K55k24k61j0K23q1k9R6J29l6
6385H4k23Q7pj26K09p8J21J2o4M2j55J31l3k1k8j21L03Rj45O0k34J61l4k57M34
6410A27j13J86l33J74n4J41p2q6l4K18k78n8J75l4m1Q8J2P5j53K27j34k1O4j31
6434e5K16q5k23J03J66m3N9p3L1j51J4K02p8m0L5L5k23L35j96K1J85j20j41J55
$$ y = [-188, -120, 74, -169, 35, -66, -84, 112, 66, -146, -28, -35, -157, -114, 134, -123, -16, -16, -94, 184, 64, 139, 395, 132, -30, -39, -70, -166, -156, -51, 294, -173, -92, -145, 135, -40, -164, -208, 132, -65, 227, 66, -79, 2, -130, 265, -66, 17, 141, -111, 13, -42, -172, -65, 34, 109, 9, -43, 32, -185, -271, -382, -155, -149, -112, -45, -10, -132, -176, -203, -18, -113, -188, -69, -123, 195, -121, -53, 271, -127, 97, -152, -347, 93, -19, 104, 169, -90, -77, 60, 50, 40, 144, 71, 231, -14, -25, 151, -162, -83, 240, -13, 68, -41, -54, -11, 23, -12, 22, 277, 53, -208, -218, 5, -76, -105, -9, 120, 84, -139, -52, -59, -185, 24, -54, 67, 79, 15, 57, -98, 33, 0, -21, -49, -170, 133, 142, -3, 57, -177, -16, -50, -307, 127, 14, 200, -133, 41, -13, 128, 56, -30, -64, 154, -124, -182, -7, -41, -82, 6, 18, 93, -60, 167, 33, 12, 76, -55, 161, 76, -147, -44, 122, 79, 138, 65, 96, -55, -41, 161, 83, 43, 78, 113, -110, 225, 29, 50, 235, 115, -26, 129]
6458A29j60J19j27J25M4K7j55J41M5j84j87M23m4k70l08M34o6m5N7j55L51k51
6480e7k9J88Q8m36J46J20K9l12N6K31j73J42q1J65J06k5m43L26Lk27oO7P1K77
6504B26j19j89q7R4K35j76J9L0j92N29k36k68K51J6O9k69J22q8J4L41k73oj10
6527f7Oo3K64l37Q1O2j34L62l12q8K17J77Q3k85Q6M3j33n6n8K32l32K63K48m96
6551b37pO6J5J84n4J76l93K30k20K10m8j0J24j04L3kJ18j83J47J3P6j65n9Q9n5
6576e6o3K82k55Q1k19M7R3m6N3qPK06o7r0P1M0r6j35L37q5J5j05K95l14O9k31
6602a74O3P2r7K58k32J67j09P5%J38k58J5J05r8M5j31K41m6K46j05n8qk91J38
6626d4J45ok21J23Nl16M44j89J84k92J91rj74L20j87J77j74P2k11J28k6p8K99
$$ y = [129, -31, 88, -39, 86, 130, 157, 2, 143, 188, 4, -183, 240, 196, -74, -382, 52, -14, -59, -2, -157, 194, -57, -86, 102, 190, -246, -100, 20, 49, -263, -207, 24, -149, -7, -88, 77, 183, 158, -285, 41, 44, -183, -189, -122, -51, 226, 107, -82, -169, -75, 160, -16, 3, 33, -159, 370, 134, -134, 117, 133, 202, -67, 55, -33, -19, 322, 49, 43, -67, -61, -124, 140, -197, -116, -54, -188, 174, -138, -226, -9, 168, 251, -34, 52, 95, -38, -94, -152, 80, -252, 11, 259, -237, -244, -178, -163, 21, -33, 143, -250, -20, -240, -30, -78, -88, 36, -68, -35, -37, 81, -102, 45, 58, 134, -31, -90, -1, -56, -119, 163, -92, -11, -230, -183, -90, -136, -83, -91, -84, 122, 55, -35, 36, 76, -20, -155, 182, 97, 112, 7, 302, -12, 57, -174, -111, -39, -136, 122, -110, 57, -52, 23, 23, 161, -97, -82, 23, -75, -30, -161, 80, 34, 280, 175, 117, 109, -182, -44, 101, 95, -126, -3, 2, -314, 130, -59, 125, -167, 24, 15, -159, 161, -26, 151, -23, 49, -162, -34, -60, -138, 161]
6649A61k26j5K06l3k7o6L7P9l64Q6J91p0KJ11k25ML97l02K50l71K88M9j80L03
6673B85n1l75K3J89l3j06j50Q1M14r2k06P3j10k01J07L29k21J9kJ86j92k11K30
6696a4M9mj73K02K8l6j28p1N0J3P4J14J91l49R4j96J73m9NK39l98J49J27n6Q5
6721A19k17R8J81j25m9j34L19j26q5K43J01n06K09p5lJ15RNJ38j37P2JRK49O9
6746D80l09k37Q6k22M29k87j03J53K1J85q4l23M54j53j02J5l26N09k13k20L78
6767A31k31N2K31j38K9l21N5M86j60j10M0k29J23Nl3J38k74M03j86R6K8q1j08
6790e4K33r4j32J41P6O4j52j67K52j2k02r1J80l78N01k5k02j32o9L68p7j42J4
6813a00J10k2KJ40P8k81M21o2j37k30M5K03n1%j17j93J05J14j32J97l05J45k0
$$ y = [161, -65, -80, 126, 93, 66, 0, 37, 116, -248, -162, 29, -41, -39, 72, -153, -149, 248, -54, 196, -175, 113, 162, -18, 285, 234, -141, -118, 71, 38, -68, -218, -137, 277, 185, -21, 52, -58, -259, -152, 177, -44, -25, -27, 159, -33, -244, -14, 35, 31, -142, 60, 88, 52, -76, -147, -97, -84, -10, 104, 295, -54, 40, -156, 17, -32, -27, 212, -186, -37, 90, 34, 119, -98, 0, 181, 56, 7, -127, 192, 66, -19, 224, 325, -181, 28, -47, -50, 65, 74, 79, 217, 80, 152, 153, 162, 411, 480, 171, -66, 20, -202, 227, -60, -163, -10, 11, 196, 112, -211, 243, 90, -12, 3, -323, 186, -27, -247, 131, -100, -48, 183, 45, 74, -247, -192, 294, 134, 24, 64, -165, -42, -37, -70, 68, -206, 197, 11, 107, 135, 54, -54, 179, 85, -47, 94, 170, 234, 82, -85, 167, 155, -47, -138, 42, -336, 165, 140, -62, -194, -263, 105, 28, -114, -100, 10, -12, -10, 130, 208, -73, 348, 286, 149, -81, -36, 167, 116, 116, -1, -194, -89, 25, -107, 90, -215, -70, -90]
6836i0PJ95k0r2k09K71J24l5m08K28Q2N4j70j25P5K82l38QL81k35p1l14J40M02
6860A42k80O5R0r5K32N2l38n2L46j91N2J42k71L43l95K09J49l24j14M28N2j68
6882G4j88J83J82j93R2j27qP9k97J09J40ML9n8r2M15l65o3J47j10M3L24m18OJ34
6907E2o3J26J22m30N2l3L24k96P1J86p8K1j08j30K4L99p5k42K2Q2j15oj08K53
6931E0m9M3q8L7J22J9l09J95l2K42j68l0k19M21j57m4L1J48k62J04j88j00J33
6954a01J21j27j1p7J67O7M5K3m57O70j29k93J2j00p3M83q2k5r9j49K72jl13L36
6978A59q8K4j57Q7q5jm5K87l12J42n9r1K35K1M3k72J25K59k94j7kj67L11j54j48
7003a99K50l0j28M08m17O7J2j64O2N8L79l49J04q4jL1j47K68l27J94O2j56K10
$$ y = [-90, -83, 112, 92, 0, -209, 62, 186, 151, -257, -29, 53, 107, -63, -188, -113, 169, -169, -161, 220, -15, -86, -400, -260, 142, -138, -73, 17, -78, 154, 206, -132, -184, 162, -29, 23, 165, -106, 237, -158, 51, 200, -124, -238, 190, 242, 74, -114, 69, 251, 58, 150, 23, 15, 94, -203, -94, 46, 50, 89, 31, -61, 354, -11, -74, 73, -37, 6, 330, -88, -82, 52, -11, 115, 237, -193, -141, -174, 150, -146, -75, 111, 33, 54, -54, -184, -160, 239, 164, -78, -56, 26, -89, -95, -203, 50, 1, 44, -44, -7, 115, 134, -175, 20, -12, 230, 62, 32, -187, 234, 77, 33, 64, 212, -50, 54, -134, -234, -101, 20, -107, -118, -195, -28, 39, 84, 107, -350, 320, 191, -102, -90, -190, -263, 220, 138, 113, 14, -135, 137, 136, -177, 159, 71, 95, -62, 25, -60, -61, -106, 181, -131, 11, -48, -139, 96, 117, 160, -112, 13, 272, -22, -39, -41, -208, 103, -51, -199, 51, 21, -107, 301, -116, -49, -37, -201, -139, -81, 298, -51, 53, -31, -32, -1, -148, 120, -207, -13, 49, -107, 103]
7026A03j7k35J91O9p6O1j20J41j56j44L85pj91J31j68k26J73J18m3j77M75l45
7048e8k2J12j84K27q2M2J35q6o5j23p9J66j88J06K27j54J04O6q2M0j73lj12L91
7072B05j97p2J39j56J42k63K68k91n0J61L5M0M3r0M6J46m67K11K72k51KJ26J28
7095A27o9l26J99J12j92Q1j20nK65n6K5O4M2k20N7r7R0p6k9K6k2J54L0N6N8j29
7121D5j56k0J42k28L03J6Q3l20L49k88m5K56p2j97M2k02J63P2M4Q1j46pM0o3Q8
7146b0r2K74k82k6j35K51J40j08k89K07J10O9j39O1J31k28K32nj89k80K49K70
7168B01k99K50o6l09J19M2r2j24J87Q2r0P8K14j34m2N5l9j98K9r5K48j1r8N9P6
7193D3Jk63q9L94k68J60J74j50j90N23l40J0J34k58K32J03r7j45k90K91K03q5
$$ y = [103, 86, -149, 42, 111, 35, 96, -24, 117, -39, -183, 202, 195, 4, 135, -33, -259, -86, 32, -11, -188, 287, -58, -80, 32, -152, 75, -7, 35, 170, 84, 19, -104, -183, -17, -205, -99, 128, -26, 78, 144, 62, 102, -71, -74, -186, 205, 8, -64, 75, -81, 61, -202, 66, -225, -275, -114, -79, -39, 4, -86, -40, 106, -361, -150, 122, -129, -127, -1, 127, 58, -268, -69, 43, -149, -68, -188, -193, 72, 16, 41, 105, 147, -73, -16, -113, -23, -99, -128, -102, -124, 30, 60, 116, 174, 45, -111, -131, 11, -217, 86, 102, 185, -135, 214, -74, -119, 137, 65, -132, -90, -292, -129, -57, -13, 68, -78, -85, -45, -108, -20, -112, 162, -120, -146, -281, -30, 110, 2, -287, -80, 30, 99, -40, 21, 152, -76, 156, 151, -38, -318, -69, 201, -98, 152, 86, -223, -104, -62, -154, -278, -91, -9, -99, -21, 193, 59, 17, 72, 33, -165, -136, -231, 17, 6, -92, -33, 43, 44, -219, -308, 86, -182, -22, 152, 2, -188, 335, -5, 5, 139, -119, 113, 216, 119, -26, -316, -25, 178, 93]
7215I3J0j33O5P2j9k41J21j22K99j08j46J36N5k17Kj04J03J72P2m18L38r6j28
7238a94K08M0k92L39j27J40Q3k25m9R0K55j02k58Q7J52l48K17nm45M94O8Q5k54
7261d1m4J19J45k39K7J47k65J60J43k85J38L1j18R0j3K00l14K87j30O4j33J15
7283H4o6J67k36J2Q2j35K46Lm63K43M5j00J98l73J88mJ08J05q0M1j69K12J2M6
7307A66j06j08L33k03j15k66K01J99p5p4Q8J37j83K5J42j42p3M1J4Qk11J56N0
7330Do5J62k6j94J61j49K32n0N5j23j44J71K7j90K2N2O9qJ85m03K03j08L9N5K43
7355B20n12K38J93l02K12no9Q6j50O1n5J12J58k63p7J11O4n7N3N1lj34J27l40
7379b81L12k66R3L22M8l26M9K86j83J34j09L2L5j86J41k67Q5j34L23l08L5K57
$$ y = [93, 103, -30, 35, 107, 88, -153, -32, -154, 145, 37, -109, 27, 82, -135, -133, -237, -134, 38, 110, -308, 30, -66, -194, 14, 54, -238, 101, -26, 114, 197, -28, -77, 13, 268, 166, -92, -5, 147, -201, 16, 11, -434, 60, 128, 213, -41, -85, 34, 179, -60, -33, 114, -151, 9, 152, -133, 5, 36, -82, 8, -5, 195, -119, 168, 38, 102, -31, 84, 18, 185, -51, -39, 43, -92, 154, 157, -306, -63, -18, -118, 80, -293, -105, -109, -1, 104, 24, 65, -104, 108, 120, 166, 60, -48, 285, 82, -33, -299, -98, 101, 26, -48, 40, 177, -6, 19, 161, 19, -54, -13, 1, 9, -202, -46, 4, -61, 101, 75, -119, 42, -107, 125, 75, 130, 7, -137, 34, 61, -129, -107, -55, 14, 6, 191, -212, -9, -117, -78, -23, 220, -292, -54, 139, -163, 49, 44, -25, 61, -89, -28, -83, 29, 187, -76, -153, -42, 22, -35, 18, 69, 66, -68, 59, -281, 31, -235, -142, 180, 228, -98, -49, 237, 54, 188, 79, 111, 146, -40, 101, -166, -81, -215, 108, -200, -165, 92]
7401I2M2n6rl6j00j69J28l7L68j45q6l0j29K25l1k80O4K61q4P9j60L04j65K6q4
7426a2J73m64J27J56L52m23K04k89K06J3k00J18J99k51N5K52j07mq9J85j87j83
7448a69J15j22J42j31L24j08k54J90K7K4m4j66L26n1m4j91K33j09R0%J85k94q1
7471a08J83j42P2qk75L03j33p9K26j58K0K26k91K49j33J99r2N1j31j30L46j93
7493Bn0k75L94J83q3k36K13n1k01K24r6N8r6m8K47N3j52m6q0R9j55K91o6j24n
7518@L8j05K03j04k77M26j46l51K97o9K0j03K08O2l9m97L87N8K14j24K2o3j95
7541a38J38j13J50j48N5j1J07j77J23m4K31o9l8K0j34j20L3J38n0j94L80j27N3
7564F5J0l0n4k6N8K0Pk51K11k8J80j47j8O2Q0k6l16N7N4K77o0o4J31n69K50K92
$$ y = [92, 134, 78, 69, 33, -67, -236, -108, -145, 223, 78, -8, -38, -167, 58, 27, -253, -189, 72, -12, 67, -93, 211, 46, 72, -12, 161, -303, -176, -20, 332, -91, 113, -176, 30, 43, -157, -39, 160, -91, -36, 216, 109, 105, 16, 201, 14, -169, -54, -176, -34, -165, 159, 51, -203, -13, 14, 38, -6, -172, 154, 103, 59, -132, 101, -8, 82, 82, 267, -27, -108, 75, -67, 5, -3, -278, 25, -108, -187, 39, -119, -99, 127, -164, 85, -48, 151, 59, 110, -21, -151, 195, 2, -48, -323, 71, 254, 171, -65, 148, 97, -104, 120, 24, 82, -14, -62, 185, 238, 86, 40, -40, 59, -96, 195, 129, 5, 0, 38, -67, 136, 32, -245, 181, 35, -316, -19, -88, -68, -171, 37, 99, 60, -437, -50, 8, 222, 98, 120, 57, -138, 0, -113, 37, -111, -56, -67, 40, -137, -14, -58, 173, 104, 66, 86, -48, -168, -135, 3, -47, -241, 139, 12, 65, 75, 45, -9, -35, 23, 43, 50, -201, 10, -18, 162, 15, -3, 59, 139, 113, -203, -146, -92, 185, 125, 61, 192, -377, -127, 165]
7590A65j97K00J67l64l5K00j71q1k7J15J14m0lr2J36k91J73q9j20J7K31k80L18
7613D6j17J01l93L43k2J50j53P3J94k86k22L90P0j59K2j55k6Q0j2N6K7O2p5j20
7637a26L81r8j19k94K69j3J06k65K63K18j83j65J49m7K1o1q2j15j50L37o7n5L8
7660e8q2K19j33J2L9M5p9j20Q6K46k2l11J4O6J29k12P5M4N9j90J80m5o4K3L8o4
7686a05MK78L3k38N2o8l28M41J17l08r5QJ62J66j93Q0j59L42p1j63L86l98l3K50
7710A60j98J60o8Q1j09J29l45L86l0k53O9K33k13J96l08P8L23l43j6o1J04K00
7732A75J00l36J45k20J87l3k60K26L5K7L5R6k14J28j94K41L9k32m3P7p5K6J19
7755D9j0k7k2J28k18j8j0k0P7J09k7K90m84J03M32l94O5n1Jj51M06l82J70oo4
$$ y = [165, -32, 168, 335, -29, -64, 136, -35, -116, -143, -28, 86, 46, 43, -49, 87, -204, -31, -120, -240, -223, 8, -272, 46, -71, 30, -363, -20, -42, 108, -45, 28, 222, -64, -286, 104, 174, 15, 37, -118, -144, -64, -76, -20, 7, 69, -6, -126, 255, 157, 38, -256, 13, 0, 106, -159, 104, 322, 139, -26, 123, 76, 97, 36, -46, -161, -311, 26, -41, -96, -58, -140, 79, -54, -42, -3, 42, -37, -157, -71, 175, 153, -158, -144, -78, 51, -161, -86, -42, 17, -173, 7, -38, -102, -79, -41, -105, -101, 177, 210, -28, 24, -44, -372, 69, 186, -122, -217, -209, -47, 119, -74, 6, -153, 189, 118, -45, 341, -57, -90, 160, -38, 122, 54, 135, 26, 155, -190, 196, 166, -87, -18, 215, 2, 198, -110, -32, 291, -52, -68, -129, -25, 175, 275, -61, 84, -136, 51, 18, -242, -16, 19, 46, 81, 177, -37, 91, -103, 138, 177, -55, -98, -21, -96, -70, 49, 39, 12, -10, 118, -100, -118, -128, -148, -71, 38, 11, 301, -183, -80, 352, -42, 23, -28, -27, -178, 228, -154, 16, 10, -54]
7780e4L9oJ55l00L22j10J37k73J71J04j76l4J44j17J5M1m8r0J59J32r8j68R2j1
7804B6m8l5m6L08j50J12j99K35o3p7m3k79L75l64K86k36J20N3J15j24J25k78J52
7827c5j11J15j0N7k5P8n3J5K5k27L33j84lj86K34q0k35K34K15l34K21P3k5j78
7851h6K44k57P0J23j9j45J62J43r5q7k4j19J3j14K53j08K18l95L04nj36J86M1
7874A67o5j85K64l17J92k37L18m33K38j6R0L8r1RP5j29J41k2k6k35K04P5P5Pj01
7899C6L6l59Q2J6k1J35p0J12L0j69J42Q0J1L7l2N9k18m1mK85l72N7l1K32M3p9
7925cr3L33l39l8K19p0l38J55N5K30n6K9J41k98K09j07N1P0m0l84M53l00L3Q0
7949hj51J18J20j86J19K7j37j10M76j52k97L9L7O0o2J21O4O9l9r7K01m14K53j61
$$ y = [-54, -15, -21, 134, -166, 156, 46, 183, -90, 81, 185, 9, -25, 119, 2, 17, 58, 10, -80, 79, 211, 113, -55, 37, 26, -22, -57, -103, 205, 55, 167, -32, 203, 140, 63, 20, -259, 116, -248, 38, -198, -78, -25, 90, -34, 91, -187, -35, -146, -31, -41, 16, -9, 69, 16, 31, 56, -171, 162, -22, -25, -211, 23, -57, -292, -58, 157, -177, 44, 117, 92, -86, 158, -99, -29, 94, 75, -70, 92, 235, 140, 53, 29, -90, -77, -191, 62, -46, 172, -223, 81, 76, -60, 126, 167, 102, -83, 181, -136, 56, -181, 137, -296, -58, -74, 16, 54, -37, -28, 47, -82, 59, 37, 11, -224, -20, 55, 130, 137, 36, 72, -287, -205, -189, -210, -75, -145, -33, -3, -172, -30, 50, 61, 98, 66, 125, -93, -134, -138, 147, -225, -168, -199, 33, 76, -3, -96, 237, -102, -140, 79, 9, -329, -174, -119, 111, 55, 84, 225, -73, 136, 29, 80, 150, 110, -274, 179, -121, -88, -8, -159, -41, 79, -107, 12, 39, -98, -208, 268, 116, -181, -142, -105, -45, -107, 14, 78, 147, 108, 11, 212, -202, 51, -110]
7973a10k36L87r6J40l2J02k07%M5j43K82p0k1j33K75k59L60m67R4J45o6j47J35
7996b2L7o4o9K69j24Q7n7J55p0o5k00J06J7p7o6K48P3L7l23O9O7l1j67L04o5k27
8022a58K19j62oj1j0L90r8j66o2o4J2J10j9J54j4k30qj30n5M07P4p9j09P1R1r5
8048E2n1r7QK31mk52K62k82P6j10K32j8k95L86q7L8L7m59L99m4J3J86j01J86k79
8073B7k9J08j50j43q3P8R3O7n2J52k66O5K99j10L6l27P3K79k08M1J4Kjr4K02J5
8099H8j97K89k01p3R5j13R9m4J7J81j28p9q0J48l00L34k02J9o1J09R9K7K2j13
8123f4nL35mk87J11j24p2J13J21k19J86N2j17J43j63m0L1q6L2j45K86n1J8j22
8147g1pJ3J48J2k47N7J20o4L04l47M5P2m4p8m0QJ26J36p9J42l46J5J57O5j88J35
$$ y = [-110, -346, 41, -55, 85, 53, 155, -52, -52, -7, -150, 132, 62, 41, -92, 183, -76, 284, -183, -89, 56, -10, -157, -22, 15, -49, -118, 151, 27, 114, 57, 212, 142, 77, -123, -17, 0, -77, -143, 105, 178, 215, -108, -39, 28, -3, -170, 134, 69, -158, 61, -101, -107, -118, -128, 262, 164, -2, -64, -128, -116, -6, -25, 129, 115, -115, -123, -253, -308, 99, 173, 94, -15, 56, 147, 52, 1, -96, -88, 143, 139, -113, 149, -133, -57, -167, 65, 47, -248, 138, 51, 89, 126, -333, 66, 22, 35, 221, 120, 306, 27, -2, 106, -44, -187, -270, -192, -99, -32, -84, 68, -198, -133, 166, 56, 92, -235, -162, 117, -91, -50, -36, -34, -35, -129, 73, 88, -109, 180, -21, -94, 1, -112, -13, -57, -40, 141, 13, -66, -146, 2, -298, 36, -166, -147, -208, -99, 0, 27, 49, -64, -69, 266, 262, -25, 86, -38, -110, 3, 124, -95, 91, 143, 26, 169, 6, -34, -3, -89, -57, -202, 84, 33, 51, -71, -78, -65, 83, 95, -152, -95, 25, -39, 265, -82, -37, 35, -9, -87, -127, -119, 7, 143, 64, 206, -140, -125, 32, 97, -91, 44]
8173D4j85J35M4j04j87J39K62l04l1L51k81k6K16j78K4N7p0R5
$$ y = [44, -141, -6, 38, -66, -253, -114, 148, -156, -187, 164, -117, -143, 73, -105, -81, -24, -94, 1]
8191A
$$ Imaginary data points
##PAGE= N=2
##DATA TABLE= (X++(I..I)), XYDATA
0@%%%%%%qJ6j6J6k4L2m0N6p2Q8j04J28j55J87k25K66l19L77m44N18o00O95q00
29d28R20j054J202j365J544j741J960k204K471k762L081l431L811m224M678n174
45b716N715o308O955p662Q439r294J0237j1282J2444j3744J5209j6873J8781k0990
59a1089K3586k6692L0478l5208M1313m9516O1159p9034J10069j78299N65751j57475
71B95043p93132P91902p01991N98079K84891j147633P20765J42434m65934P43699
81D68123p70537K5988P37456p23954L78584J39419o52976O71323k38601j87673
91a52848N50665o66574O4941M47484l68322L23821k42574l29734O34507j47893
101A13473k13142P6229k41573M30262J04934m60913Q1991L6899J30809J46610
$$ y = [0, 0, 0, 0, 0, 0, 0, -8, 8, -8, 8, -16, 16, -24, 32, -40, 48, -56, 72, -83, 104, -121, 145, -174, 203, -241, 277, -323, 372, -428, 492, -562, 640, -725, 819, -922, 1038, -1166, 1305, -1457, 1624, -1807, 2004, -2220, 2458, -2716, 2999, -3309, 3646, -4016, 4423, -4871, 5366, -5916, 6528, -7216, 7993, -8880, 9901, -11089, 12497, -14195, 16283, -18925, 22388, -27128, 34031, -45003, 65066, -113233, 452518, 295043, -498089, 293813, -408178, 189901, 474792, -672841, 47924, 190358, -275576, 468123, -302414, -276426, 461030, -262924, 115660, 255079, -397897, 273426, 34825, -152848, 397817, -268757, -203816, 243668, -124654, 199167, -43407, -373141, 261366, 113473, -99669, -23440, -265013, 165249, 270183, -190730, -108739, -71840, 58969, 205579]
111B05579l41258J3411J95471k5818K6854j26395k5699J37418l4524k5107j6808
122a6876k5457Q300n913N2750m962m9583k2490K6227J40816k3475j19882R051
134c1494K3871J14913l9104j67180R7525M9190M488k4091j94622J20842J19415
145G3753j00906O9059j00120K3183J77136j88068M6193O3814j35158J82186r9099
156A1973q4322K05404k03959M9367J11153k24806J90665n3723j33517K96272j85015
167b0508l4293J61295k51418K00538L3116k47140K70526j09257p5867K09630k75072
178a38450J15237J47389k51255K02234n8351j28315K53509k01857Q94J66682k27559
189a19842J39590J3296j64427K20130j05387n9044J64499j66600P8618P2237j47184
$$ y = [205579, -135679, -122268, 73203, 47385, 74239, -52156, -77855, 59563, 25039, -68, -16876, -42333, -34033, -39946, 12804, 7842, -41741, -64231, -38004, 102812, 79337, -40545, -31494, -7623, 107290, 68186, -98994, -1469, 47721, 52209, 28118, -166504, -45662, 73753, -27153, 41906, -58214, -35031, 142105, -45963, 230, 64044, -71114, 111072, 11973, -72349, 133055, -70904, -21537, 89616, -135190, 55475, 1752, -131765, 164507, -20508, -54801, 106494, -144924, 55614, 88730, -158410, 112116, 2859, -73008, 136622, -138450, -23213, 124176, -127079, 75155, 16804, -111511, 141998, -59859, -58965, 107717, -119842, 19748, 33044, -131383, 88747, -16640, -75684, 88815, -77785, 833, 73070, -74114]
200g4114J50467m2724q9255J22186j13088K8374P5465j22332Q3702j0784p6310
211f8413R3468o1362J6055P7895q0970M7648Q059n1980O9188m4077j3801M9330
223D1040n7529K3757Q409m1375M7692k7465k2047L5491l1812K4990K7903k8024
235A030K7444j4520l2310K2411j4785N287K7822k0056K570M052k6136R595Q138
248E42r072J9448k224j6264J7672r155j2797J5611k3660n144K0773k0660J9940
261d990J9130k7270K1883q921k4683L9262j2965J048L5309m2998J199R614m4484
274c8866L4222L700k8329M1353k5260j3286M1788l1775J7793L0317m0812K7115
286A7960K666l3496M0504j8062k2538L2788l6491K155L3168l5593K2934J1164
$$ y = [-74114, 76353, 33629, -55626, 66560, -46528, -18154, 57311, -65021, 18681, 7897, -68413, 25055, -36307, -20252, 57643, -23327, 24321, 32380, -19600, 49588, 5511, -8290, 41040, -16489, 7268, 15677, -25698, 21994, -5471, -27518, 7973, -23839, 1151, 29054, 1030, 28474, 13954, -18356, 4055, -10730, -5443, 22379, 2323, 4893, 8945, -17191, -7596, 542, -8530, 10918, 8694, -7570, 10102, 947, -11850, 3761, -19899, -25043, -4270, -24930, -4990, 14140, -13130, 8753, -168, -24851, 14411, 1446, 2494, 37803, -5195, -3996, 5618, -38866, -4644, -944, -29273, 12080, -13180, -26466, 15322, -16453, 1340, 31657, -9155, 17960, 20626, -12870, 27634, 9572, -12966, 19822, -16669, -14514, 18654, -16939, 5995, 17159]
298A7159m1187L2861k683k0195M8075j9951j5019K7866m5464N171K9875l3465
310a6957L1494Q225m0465L2877j4766k2539M4901k5325k245L2750m3075J3449
322a676J7480m4076K9641m740l5519M5930j2224r201M7045l7369l677K8324m5739
335b5801K4986K4298l7956L6333j1355m5396L5988k5585j0038N0089l5374Q566
347a1245L1816m5477L1130J2620m0901M6388j4109k8160M9020l5655m180L8528
359B9775n3237J4247J7966m4268M6528N170l0784L9314k9066j2864M1279l1100
371g040R328K5635l3390J5420j933l1179L0302N150j3410J8566j5636j0218K4490
384A6085j2845r657K0311j6682m225K1484k9043M193K4406l5960J9883J0696m0139
$$ y = [17159, -24028, 8833, 6150, -14045, 34030, 14079, -940, 26926, -18538, -13367, 16508, -16957, 14537, 22762, -17703, 15174, 408, -22131, 22770, -2555, -4800, 27950, -15125, -1676, 15804, -28272, 1369, -3371, -38890, 7040, -5184, -14385, 32660, -4709, -8386, 19938, -25801, -815, 23483, -14473, 21860, 10505, -34891, 1097, -24488, -34526, 15563, -19811, -11245, 20571, -24906, 6224, 18844, -22057, 24331, 10222, -17938, 31082, -4573, -8753, 29775, -23462, -9215, 8751, -35517, 11011, 16181, -14603, 24711, -4355, -17219, 24060, -7040, 2288, 27923, -5467, 9953, 8020, -23159, 7143, 12293, -1117, 17449, 1813, -8405, 16085, 3240, -6417, 13894, -2788, -7013, 14471, -14572, -10379, 14027, -21933, -2050, 8646, -31493]
397c1493M8407K571k9388M7873m8245j5414N7712n4945K2780K6544o6389N8007
409A8020j4669o3301P0040l4723M605O8689q3431K7629M1202o5567O4566k4298
421H762n4114Q5877m4981r733N0264p7590M1248K8531p2511M8002j5633j5821
433b7699P9392m8274j8566K8216m0675M5292P731n1183L8062j424o408K0116m6632
446b2052M616L7049r082N742j6714j9082K8441J1163j2515j3537j3108R864K4898
459A5683p39k6165l137J4387J5907O040l6687p586M1059J2955m823m0743l0474
472d4323N1263J5571j9364j3958l1354M4482K4621m9854N141o705K1694N2774
484D9988n5548r554J9451k3074N7487k4188n2309M4559l2267L1890M0113r2779
$$ y = [-31493, 16914, 19485, -9903, 37970, -10275, -25689, 32023, -22922, -142, 26402, -39987, 18020, 3351, -59950, 10090, -24633, -20028, 48661, -34770, -7141, 34061, -31506, 33060, 8762, -45352, 40525, -4456, -14189, 36075, -41515, -267, 28264, -44247, 3755, -11878, -27699, 51693, 3419, -15147, 13069, -27606, 17686, 25417, -25766, 12296, 10872, 4464, 24580, -22052, -17436, 19613, 10531, 16273, -441, -19523, 8918, 20081, 7566, -5971, -19079, -9215, 15683, 14944, -11221, -14358, 29, 15936, 21976, -14711, -22297, 18762, 31717, 26894, -13849, -44323, 6940, 22511, 3147, -10811, -42165, 2317, 26938, -22916, -17775, -24480, -2786, 49988, -5560, -15114, 4337, -18737, 38750, 14562, -37747, 6812, -25455, 6435, 46548, -46231]
496d6231K7801J5335k3050P7748p6590l0239J01613m0799K4870j9035j01349J18212
508B8286J9416o1453M4944q2185M2498Q8221j16762K5580J4892m1398J08486o6144
520D381n4837Q6194o1499L9628L1924j05396O5600M452l1578Q6392p5003k3038
532c2780O2246m7892N0208q289p4284P4889k784j9321J2147p2822M6209N0281
544C7808m4369R615l5136J1827O1226m6575j494M906j0198N1911l7742j9834L0778
557A2723l1371L3776p584m6126M8412k5272J561M4540o1452K2786J4104m2489
569c6392O9444k4571l4340O0150n0559J4704L0734p5247N5473J6447m8947N4155
581C1051m7685j4752P0082n9433J4115L0916n7868N5195l816m9804O0325l0984
$$ y = [-46231, -18430, -3095, -26145, 51603, -24987, -55226, 46387, 5588, 30458, 11423, -89926, 28286, 47702, -13751, 31193, -50992, -8494, 79727, -37035, -11455, 3437, -37961, 70525, 4381, -50456, 35738, -25761, 13867, 45791, -59605, 5995, 10447, -21131, 65261, -9742, -32780, 29466, -18426, 31782, 23493, -50791, 24098, 21314, 1993, 14140, -58682, -12473, 37808, -6561, 3054, -32082, -20255, 40971, -5604, -7098, -2192, -12390, 39521, 1779, -18055, 12723, -18648, 15128, 7544, -38582, 9830, -15442, -13881, 30659, -30793, -8007, 6097, -36392, 33052, 8481, -25859, 34291, -16268, -1564, 29170, -46077, 9396, 25843, -23104, 31051, -16634, -31386, 38696, -20737, -6622, 24294, -33574, 21621, 17805, -31999, 28326, -2658]
593b658j7672M9143m9314J9282L6952n1896L0612M665m3242M0127j4874j8269
605a7144M8526k9042j3525K5430l7688J6445K3851l9765K6910R773l0492L5772
617A9051j5644k2065M5409k7257p492L1370m3461K1074K2056m8732L0805p838
629b724l3017N1164k4016p682M1004m6613J7550K2586m5076L9878l864k5386M7047
642C0851l9187j1219L4494l7122K9029Q112m3670L8907j0543j5239L2886l5496
654a8197J3680K4727l4696K2171n449j3621L3805k7439l334J7795k2083K6367
666A3726j527j8581K4462k2226k178J5701k2629K2808M86j8962K2212k1605l032
679a1345J9123k0562K2264K924k2230K5103j2498l102J8806k9733J3993R702k5424
$$ y = [-2658, -20330, 28813, -20501, -1219, 35733, -16163, 14449, 19114, -24128, 15999, 1125, -17144, 31382, 2340, -11185, 14245, -23443, -6998, 16853, -22912, 3998, 13771, -16721, 19051, 3407, -18658, 26751, -506, -7998, 23372, -20089, 985, 23041, -25691, 5114, -2724, -35741, 15423, -8593, -16275, 24729, -21884, -4334, 18252, -26824, 13054, 9190, -16196, 30851, -8336, -19555, 14939, -22183, 6846, 14958, -28712, 10195, -348, -15587, 17299, -18197, -4517, 20210, -14486, 7685, 2236, -11385, 22420, -5019, -8353, 9442, -12641, 13726, 12199, -6382, 18080, -4146, -6324, 9377, -13252, 9556, 10042, -8920, 13292, -8313, -11345, 7778, -12784, 9480, 12404, -9826, 15277, 2779, -323, 18483, -11250, 2743, 12445, -12979]
692a2979K1401r981r182K4621k8455q60J6818j7405K4381k94j8580K3135j5168
705b548n119J6030j7549J4874O238k1264J2327q256p878J7198j2625L395R541
718D364j5224R685K704p672J1552p269l244R380p144L767L915n653M763m838m732
733e646P403K64L840J174p461N37k000k294M707J023J642Q74n511p59j11J755
749e63N073n95J974J505l784J872l44l812K973m948l081N006l479J669L274q905
765f165J405N41l739J0386K480j236N752q256l959M218o897O317M362q897N270
780A582m334q458J0179n076j532J0816r694L250Q391j0711P738J868j2704J0387
794A702l322n891J6421q872k712J0331j7775N858R670j2909J4970n74j5427J5370
$$ y = [-12979, 8422, -1559, -10741, 13880, -14575, -15435, 1383, -16022, 8359, 8065, -10515, 12620, -2548, -7667, 8363, -9186, 5688, 11926, -9338, 2989, -5267, -13145, 4053, -8572, -5177, 4364, -10860, -1175, 1529, -6143, 5409, -1860, -5104, 4276, -2868, 899, 4814, -839, 3924, -914, -5646, 1757, 2021, 5861, 7035, -426, 111, -1889, -4183, 524, 1547, 3189, 4063, -1448, -2207, -2318, -563, 4510, 3915, 5889, 7394, 3610, 5482, 5138, 1326, 4299, -649, -3730, 1276, -2203, -534, 2740, -6165, -4760, -4219, -7958, 2428, 4908, 3672, 9424, 1168, -2791, 1427, -5470, 847, 5209, -3688, 1582, -2752, -11210, -1031, -6107, -7639, 3177, -6517, -3267, 5124, -5587, 2151, 4019, -8685, 1702, -1620, -7511, 8910, 38, -2674, 7657, -10118, -4260, 5410, -7499, 7471, 6897, -8530, 6840]
808F840j1079o225K0155j4548M354J2377k2545J2545O058j6823K1057n652j2097
821e583K1054j5950j494J6829k2131P358O754k1526J8033L1j3512K0998j2417
834a556q469J8017j4619Q120J6187j9926Q545J754j8429J5005m992j0304J9866
847I199r942p524J1863j5614N455J3541j6750Q756N568j2789J5331k508j2828
860h242J4673j0148n440J4993j2226M143J1580j5560O573n52j4292J6000K709
873D211n905Q406j1179k383J1523q822j304O819k070M448J474r232K807J0022
887H815n194j601L119j0142Q781O645j7336J0627k294j6471K4031j1536p731K7660
901A7373k5639R291J9312m0007K6480Q370k8298M2376k9796k2547M9194m1242
$$ y = [6840, -4239, -10464, 9691, -4857, -503, 11874, -10671, 1874, 7932, -8891, 12166, 6514, -5583, 15471, -479, -1973, 14856, -7275, 83, 6837, -14689, 3344, 3375, -10137, 10861, -1556, -10025, 7992, -6627, 1493, 17680, -2246, 6299, 8053, -10376, 4629, -363, -10667, 9199, -743, -8267, 3596, -12018, -6563, 6978, -9772, -1016, 4552, -8237, 7094, 4586, -8242, 6431, -3717, -9157, 5836, -6390, -2247, 9333, -6227, 346, -206, -14498, 1502, 4211, -1694, 6712, -4467, -6850, 4673, -4149, -5453, 1366, -704, 3744, 5218, -4014, -1207, 8815, 3621, 2020, 5139, -5003, 3778, 10423, -6913, 3714, 1420, -15051, 8980, -2556, -10287, 17373, -8266, 1025, 20337, -19670, 6810, 15180, -13118, 29258, -538, -23085, 26109, -15133]
913a5133Q981K7583n5435M6659M267n1977N6092k8168j3004N8492o2271J6273
925g641L8701o1768M8912n227m9767O4858l9120j4173N9616n8308K2380K7000
937B5463o1429N0205q701m0320O3502l2963r654L9927n5798K7465K4598n0082
949b7787L8741n737k2375M4974l5935o265L9161l4632J1968P422l2181L6410l780
962I984k7099K6561j6022j944K1974k7294J3529J9568k4651J3499j983j6809K5331
975A4644j1208j0029K3876k1586j727J4707k2929J8194K806k5179K9147o654j4246
988a0184K3460k4310J2492K1195m0447J9056O293j8586L3986l2149j1993M1605
1000B0418l3993J2094J1484l7076M8085j1742l6325M2868l1548R129L5168n5866
$$ y = [-15133, -6152, 21431, -34004, 12655, 16922, -35055, 21037, -7131, -20135, 38357, -23914, -7641, 31060, -30708, 18204, 12977, -36790, 28068, -11052, -25225, 34391, -23917, -1537, 25463, -35966, 14239, 5538, -34782, 28720, -4243, -13897, 26030, -29768, -2303, 22295, -27787, 10954, 5217, -17158, 27816, -8119, -14384, 24777, -9855, 2113, 9535, -22646, 13764, 9984, -17115, 9446, -6576, -8520, 13454, -13840, -311, 19257, -5394, 8105, 6122, -10687, 14644, 3436, -6593, 17283, -4303, -6030, 8677, -14252, 3942, 6748, -18431, 10716, 4062, -10184, 13276, -11034, 1458, 22653, -17794, 1262, 7555, -11031, 22955, -9194, -21187, 20418, -13575, -1481, 10003, -27073, 21012, 9270, -27055, 15813, -15735, -6606, 28562, -27304]
1012b7304L2132Q990m4247N1614k6103j6681N2372n1302J8936L1091o0051M2778
1024A2225l336l4700N6578m5817r734N5010m7366K2550P952n1705N8710r414l3036
1037b2083M6716l4234J0985L2476n8901K5402J5241l2636L9115k4465j8534M2872
1049B1954l2677L091K2943l3666K6032M106k7227L1168j3219j1694K7465k3064
1061d788J475J3094k3833K0589N687k5087J4863o322l573K0985k0572j029K0316
1074A1805j4714M457k487j6176K5043J97j6864J1946j1149M572J6098k2914O883
1087c303R330j3347J7551r984j2334K0843j3645J831J0339k4817J6319P312j3829
1100g734J9756j8372o366K6264j7742P750O326k1639K6507o815k0491J9734j7664
$$ y = [-27304, 4828, 13818, -30429, 21185, -4918, -21599, 30773, -20529, -1593, 29498, -30553, 12225, 8889, -25811, 30767, -15050, -24784, 30226, -17140, 5410, 13362, -38343, 20367, 10953, -22083, 24633, -9601, 1384, 33860, -25041, 361, 15602, -17034, 22081, -2384, -20918, 21954, -10723, -7632, 15311, -18355, 7677, 11783, -15444, 15724, 2505, -9189, 18276, -4788, -3313, 9781, -14052, 6537, 12224, -12863, 2000, -4322, -7895, 13090, -7482, -8511, 11805, -2909, 1548, -939, -17115, 7928, 8125, -8739, 3207, -7942, -3370, 12728, -10186, -3303, 6027, -7320, 10231, 247, -12087, 8756, -4889, -3058, 7281, -17536, -1217, 6095, -7734, 12022, -6350, -12716, 13548, -4194, 3556, 9882, -11757, 14750, 7935, -12556, 7178, -10486]
1113a0486R693J8350l2234J4465L987j6450K9081j9052q514K7310k2829J2541
1125E862R903l0775K5293l507j7582K5113k4842J261K7656k6646J1718Q70k4640
1138b0316L2219p788j5122K4503k0820O643J6002l2012J6016P121j7808K3589
1150A2227j4454j1205K5949j8595L309J3610k4170J5379M035j8261K0670j0245
1162a751j0655K1137j7128J508J3938j8795J5790O116k0574J5057m546p340K1362
1175A4119j5871l016J5071j7770O260M774j6874J7914p56j2648J5717j0174j152
1188d406J5965j5635N233Q420j5444J2312j28j1755J3710q962o125J2767j1133
1201e181L918R001j2083P572L76j0964J0845k008l096R301q602r70O314r443L729
$$ y = [-10486, -793, 17557, -14677, -212, 3775, -12675, 16406, -2646, -11160, 16150, -6679, 5862, 15765, -15010, 10283, 6776, -10806, 14307, -10535, -9274, 18382, -8264, 3454, 4324, -20316, 11903, 4115, -11007, 13496, -7324, -681, 15321, -16691, -675, 6446, -11362, 12227, -2227, -13432, 12517, -6078, -2769, 10841, -13329, 2050, 6085, -12176, 8494, -1751, -12406, 8731, -8397, -6889, 7049, -11746, 4044, 10160, -10414, 4643, 97, -7243, 14119, -1752, -4768, 10303, -7467, -1207, 3567, -13307, 4607, 3851, -8797, 6920, -3254, -4406, 11559, -4076, 1157, 9577, -5867, 6445, 6317, -5438, 8272, -690, -6815, 5952, -5181, -1263, 7738, -4345, 3227, 3603, -7361, 3484, 1476, -1620, 7681, -921, -1891, 4423, -5020, -1291]
1216a291M113o357N922p19n864P204k522k905M994n183p06M772m820J945K662
1231A245n326J739M28l714O136J439k520M286l707k387L940l066R41L623n411
1246b354J272Q4m667M387p2j604M414j977n06M307k632J269K307m520K001M19
1262B128k774L193r64k586K019l310j14L238p44K544P40k973K53k57o77K320L54
1279B390m58m5j811j047P42m6Q08M39m05k24N17k23P6l31j377o15K05m96J254
1298f47L77m80j6j631j83J614J147J954j28j322l79k208K58O13j380K587k306
1315b130j177K051k796K201K243l139M938j565k612O582m044M46L675q967M714
1330D20K106p525R211m427m341J0177j0345J324R237j0172R671Q30j2344J2347
$$ y = [-1291, 2822, -3535, 2387, 1668, -4196, 3008, 486, -2419, 2575, -2608, -3314, 1458, -3362, -1417, 1245, -4081, -2342, -1914, -5628, 508, 1947, -573, 3713, 6, -2381, 1559, -1507, -566, 3057, -2354, -1082, -998, -5665, -1278, -1350, -2954, 1460, -517, -1023, 3284, 652, 1921, 4228, -292, 1709, 2128, -646, 2547, 1583, -1003, 1016, -2294, -2408, 830, 86, 2630, 3370, 397, 650, 393, -284, 2036, 2390, 1932, 1887, 76, -971, -229, -275, 533, 972, 567, 343, 860, 637, 713, 382, -995, -1610, -1405, -1901, -647, -270, -750, -766, -2397, -2580, -966, 181, 2135, 2007, 685, 306, -1902, -1644, -1031, -2411, 176, -2130, -3307, -1256, -4052, -1851, 392, -2747, 2191, 626, -1986, 4596, 552, 998, 4673, -4294, 420, 2526, -4999, 4212, -215, -4556, 5621, -4724, -3400, 5837, -4335, 5336, 6166, -6178, 6169]
1344F169n830m601J3506j2491K766Q847j5509R829J267j1590J5242o821n837J3849
1358H796j2856K476R739j4494P635J260j1622J4145l571p416J2312r474o03R788
1372F115j2296O444P553j1652O751j706j0295J2852n042o530J2305q769L04R113
1386E147j3135P170P053j2684J0376k061q600J5656r239m274J1672j4508N526
1399a901P316j4748J3229j168j0271J4361j0829o14J2690j2962R178K739j3920
1412f900J2279n414l460J1986j3554M970O321j1277J0226n694l819J3125j1217
1425b428K794K845r339J4359o699p128J0768j1930Q984M105j5498J6341n407o270
1439d503J4287j9055Q772J0962j9561J5809o559j1970K2475j8537J923J5389k2708
$$ y = [6169, 339, -4262, 9244, -3247, -481, 8366, -7143, 2686, 3953, -7637, 7605, 784, -5053, 8796, -4060, -1584, 8155, -6339, 1296, 2556, -9066, 5079, 1508, -5908, 6404, -3070, -3673, 6115, -6181, 263, 7816, -3836, 2915, 1209, -9086, 3766, -1276, -7806, 4499, -4270, -3966, 5147, -7988, -818, 6235, -6449, 3927, 1866, -6734, 8922, -317, -4591, 7081, -7427, -1901, 5415, -9333, 3896, 2728, -7543, 6818, -4011, -4625, 8065, -4897, 4281, 7020, -6900, 5379, -35, -3495, 8491, -5063, -93, 6228, -5049, 5177, -517, -4336, 8789, -2428, 366, 3211, -6128, 8231, 1532, -5596, 5172, -6758, 2226, 6331, -9167, 7174, 1767, -4503, 9784, -9271, -499, 10463, -9098, 6711, 152, -11818, 10657, -7880, -5957, 9432, -13276]
1452a3276J7698O54j8646K4081j3571l537K0992k4304R674Q310j9677K1740r344
1465G94j4623K1524j4644M620J1459k2306J6442L592j4393J3609j2412K217J8080
1478A3959j6635K029K064p693J4987p502q778J0510m093N198N54j1202P387K416
1492C201j179J469q184K586N373m85J088p138n2M679J171J935o339o05N879J4
1508C413J057q141k796J0532L04j194o827p032J3329K024n130j594p149J2226
1522C022N895j1165P26m048N784J1515j5171j555K668j608J4329j1213j0081R933
1536i69m625J0985J045j7828J2224O0j015J0013k0129M576J3795r484R903j1965
1550c414j0571K3040p966l59K924j8163J9565M806j5050J0144j2546M061J8138
$$ y = [-13276, 4422, 5076, -13570, 10511, -3060, -6597, 14395, -9909, -235, 8075, -11602, 10138, 794, -13829, 7695, -6949, -2329, 9130, -13176, 3266, 6858, -7535, 6074, -6338, -4121, 13959, -2676, -647, 1417, -6276, 8711, 1209, -7569, 2941, -1152, 4046, 4600, -6602, 785, 3201, 2022, 3491, -4693, -2107, 3266, 2781, 3869, -3269, -3321, 1358, 2529, 4464, -1875, -2480, 3399, 3413, 4470, -3671, -6467, 4065, 4369, 3175, -3652, -10684, 2645, 4669, -461, -2055, -9204, 3022, 8917, -2248, -1522, -5570, 214, 11729, -3442, -4997, -2329, -3937, 10392, -821, -10902, -969, -5594, 5391, 6436, -11392, 832, 892, -123, 9890, -10239, -5663, 8132, -1352, 8551, -3414, -13985, 9055, 1089, 730, 3654, -14509, 5056, 9862, -5188, 4956, -7590, -3529, 14609]
1563A4609j9975L702K908p852J9821j1176j1503J3261q559J0858M467j9607J0846
1576A800J83l305J0290j5757J635J1517q559O533o418p213J5040m011j391K085
1590B429r757J0311K601p248M510p611K870O643q104K987k066j583Q863o967j616
1605c738K781l629R405j940o787N283m482L667L653r259N230R25l025N376p505
1620d045K83P339n785L712p13n438Q312k659k579M311n342K027L518n137M117
1635A921Ml702M404k370j521L540k038J301J942l781j97J157j886K010L16k597
1651a497K625M9k639K685n74j772M477l187j679N322m558J309K267o930M618j56
1667C60n235P244l104j968N994p471K033N473p183N993J12o414P555m254l212
$$ y = [14609, -5366, -1664, 1244, -6608, 13213, 2037, -9466, 3795, -4764, 6094, 10561, -9046, 1800, 1983, -1322, 8968, -6789, -5154, 6363, -2196, 4337, -2081, -9294, 5746, 1735, 344, 2429, -7328, 2983, 5584, -1664, 2846, -4765, -1895, 4748, -3356, -369, -2435, -4018, 4845, -2122, -3738, -957, -4586, 4819, 2879, -3908, 1375, -3107, 560, 4213, -5046, 184, 1109, -1916, 3460, -4045, -3762, 3577, -2208, 1504, 791, -4647, 3665, 1006, -1573, 2738, -2604, -577, 2941, -2196, 1921, 1925, -1777, 2627, 257, -1264, 2276, 238, 1539, 3481, -300, -497, 660, -1226, 784, 1100, -1497, 1128, 1177, -1462, 1223, 649, -1123, 3354, 167, -1512, 3810, -748, 561, 2828, -4102, 516, 360, -4875, 2369, -735, -2703, 3291, -4180, -2147, 3326, -3857, 2136, 2248, -4166, 3389, -865, -4077]
1682d077P825o907J921M469q193N139J335o184P139k630l569P230n635P19N364
1697C946o594K699J907n865N491k84l633N587k996k014M344m057J152L976m600
1712i41J956J431n206L705q6l383M997j839k184M752l530j53M465m726J375K062
1728B695m569L756J49m180M033k489k638M707l118L06M369m786J797J682m802
1743c088M406j5l154M504k770k230M260m282R76L097m467J720J617l497L516m9
1759E44k775L402j875j172L043k060N63J718l151J155R17k082K670L05j813J896
1775A285j111j887K731q43l50J987k309j86K149k723J118J758k791K518K58k499
1791h95L306j221j683L159l074K71K578l707J992J152l962K768j212j732M494
$$ y = [-4077, 3748, -3159, -1238, 3231, -4962, 177, 1512, -4672, 2467, -163, -3732, 3498, -2137, -1418, 3946, -2648, 51, 1958, -3907, 1584, 1300, -2333, 3254, 258, -1756, 2588, -1469, -317, 3659, -941, 1015, 2446, -2760, 945, 859, -2524, 2473, 634, -1550, 3202, -328, -481, 3984, -742, 633, 2695, -1874, 1882, 2031, -2149, 1884, -605, -3243, 1464, -1654, -1348, 3021, -1765, 32, 1714, -3088, 1318, 1303, -1851, 2653, -117, -2347, 1913, -2369, -1393, 1704, -2763, -1043, 574, -2923, 593, 544, -2231, 1171, -704, -1876, 1167, -893, -330, 1388, -1763, -608, 309, -1773, 897, 1202, -611, 1285, 174, -1713, 1018, 175, -175, 1812, -497, -683, 1466, -1257, -139, 1619, -1172, 1346, 1604, -895, 2411, 1190, -493, 2666, -408, -137, 2441, -1266, 726, 1878, -2084, 684, -528, -2260, 2234]
1806B234k220m56L110l848J490J136l591L898p55k455L102l294L12K472l641K182
1822c24P69k685K875j030n93K606l001N23J045j826K450p74j768K759j850j81
1838a005R66k272L074Q96k652J288j069Q7K078k786R10J638k073J453o43j549
1854a659L309j356j201L078k562Q02K060l292K785j28m847M566j62k303L614m854
1870b150R37N686o680J528K437l976P820l772o737Q213l270k79N081j0600N745
1885a7N392j0482P057k801m816J2945r081k434R672j0923P200L710j3214J1292
1899C500m197o000J5225j1831p56R424j2990J1325N63j5261J5503l821l471J1481
1913H694j8237N143J3370j4076Q431m216r121K0540j0056o212J0479j2088J1725
$$ y = [2234, 14, -442, 2668, -1180, 310, 1446, -2145, 1753, 998, -1457, 1645, -1649, -1337, 1135, -2506, -324, 445, -2240, 635, -395, -988, 1618, -1383, -860, 185, -1641, 809, 35, -1733, 1026, -824, -1005, -39, -2311, 763, 1659, -993, 295, -774, -687, 1391, -1395, -485, 1153, -920, 533, -110, -1659, 1650, 294, -907, 2171, -391, 411, 2471, -821, 1964, 1836, -3011, 1555, 1393, -910, 2704, -2150, -1213, 4473, -2207, -679, 1758, -2218, 5602, 1830, -4907, 3306, 36, -243, 4838, -5762, -17, 5375, -5107, 1950, -851, -5667, 7278, -1803, -4237, 5435, -5488, 1712, 5422, -7792, 3500, -697, -6697, 8528, -3303, -4059, 5365, -7625, 3700, 4263, -10998, 4505, 684, -2787, 8694, -9543, -4400, 8970, -5106, 3325, -891, -10012, 10528, 472, -5740, 4739, -7349, 4376]
1926D376L768j8020J2831j748m353J3127j5933J101J1518j2109J0328j273j2845
1939i232J4726n205k159R901j5070N953R441j0941P562p039o245J7653p187m944
1953b786L760q927J2982K900j5454O542o30K007R231j5160m59J0301n082N787
1967E012n755q917J3306j146k972L756j0523N392P804q486L698l096m038J2190
1981F225m043n687L389n917P840O085j2936J984K169j72J0062j0281p314J1432
1995B836j981K414p1j3160J0728N376q138M665p919M69J4577j0518p85L705r317
2010g119J3475p28j1377J0123p006J200J1896j6040L090O012r527J4304o689j1586
2024i972J5759p524K437P460j8403J0835O337j1679J1649j0271l871J7540j4294
$$ y = [4376, 8144, -9876, 2955, 1207, -3146, 9981, -5952, -4851, 6667, -5442, 4886, 3613, -9232, 5494, 289, -1870, 8031, -7039, -1086, 8355, -2586, 4976, -2063, -8308, 9345, 2158, -2786, 974, -7953, 5029, 7929, -7525, -983, -1613, 394, 9625, -5535, -5994, 4307, -775, 5012, -743, -9660, 3646, 2500, -472, 3284, -7239, -1847, 5957, -2529, 1169, -1927, -5965, 6225, 2182, -3505, -116, -6033, 1807, 7892, -5044, -3060, -891, -1063, 8999, -1282, -8596, 2836, 855, 3269, 3198, -9962, 766, 6142, -1996, 2669, -5250, -4781, 9796, -722, -1507, 2198, -7119, 6356, 5628, -5749, 4374, -2632, -1432, 10464, -5576, -2486, 3526, -6001, 8303, 1614, -9972, 5787, -1737, 700, 8160, -10243, 592, 6929, -4750, 6899, -3372, -7243, 10297, -3997]
2037c997K098O631j4317J5384j238j2843J3761r559M95J2724j5674N898M661j1884
2051g860J3851n620q107J3516r288K405P653j4451Q928K865r056J0888q170l171
2065e617J2034r357K342L909r559R120j162o375Q535n700O15O376q509L722K413
2080B787n982O643k597l272N526m716R02L761n244L058L70k870L870j728j487
2095i79L373k409k03K083l183K085J135k961J922p02j813K641j602l45K821k409
2111e46P4J428k644J693O88k479K815j258j559L014k934Q58K430l870K173N66
2127D49k531L842j921j673L688l406N97K340l694K813n7k624L319j728r30L627
2143B111l224J359J320l064K555m62j816K831j783n15J834k235J031P89j528J702
$$ y = [-3997, -1899, 4732, -9585, 5799, 4561, -8282, 5479, -4080, -3585, 9139, -6535, -637, 4024, -7860, 5991, 371, -7736, 5780, -3508, -1103, 6550, -7901, 1027, 3892, -5164, 5724, -2446, -5617, 6417, -2940, -598, 3311, -6248, 2872, 1710, -4665, 3870, -1830, -1215, 5161, -3348, 374, 2787, -3195, 3448, 851, -2421, 3105, -1611, -709, 3052, -2192, 866, 1236, -1634, 2236, 508, -979, 2394, -15, -218, 1865, -1318, 767, 1902, -1059, 863, 161, -1652, 989, -613, -958, 1863, -546, -472, 956, -1688, 5, 693, -1786, 1029, -229, -1788, 1226, -1708, -850, 1580, -2290, -117, 449, -2082, 1760, -161, -1834, 1854, -1552, -955, 1385, -2309, 504, 447, -2177, 1142, -586, -1516, 2111, -1113, 246, 1566, -1498, 1057, 595, -1221, 1610, -173, -688, 1146, -1089, -58, 731, -797, 905]
2159I05l45j251J901n87j37P50j184L3L60k49J43J27j23j22j81j4k88Q64k84k92
2179B6P51j119M66L20j121R23k0j042J275q36n47J478j599P61J053k053J314M67
2197D97j550J483j027p56J896j828Q1J702j663R42N51j924J882j73j094K261j585
2214c05l75J723j851O13R23j608J051Q8j504J562Nq91J539r02k78J231j089M02
2232C34J229j734N29K34j281J275J61j221J613j035r15J997j587L32J677k182
2248e74R71P28k485K129m99j465K472j507l90J647j950J236M95k024J679m59j183
2265a179K263j654l53J392j552O12N89j389J640k82j176J512j361O49R71j243
2281e61P57o9o91Q46o13K80J63q87R20m13j78N94j038J450M1j194J180q89P68
$$ y = [905, 560, -691, 1210, 623, 486, 1236, 52, 85, 445, 196, 339, 466, 343, 221, 40, 26, -262, 602, 318, 26, 777, -342, 124, 444, -677, 246, 226, -816, 459, -377, -924, 554, -1045, -284, 769, -1284, 30, 497, -1053, 430, -597, -1353, 543, -1285, -1204, 498, -1165, -223, 328, -1596, 286, 113, -981, 1280, -305, -680, 1043, -808, -195, 728, -880, 171, 259, -1245, 317, 322, -569, 970, 68, -210, 1021, -68, 334, 1563, -171, 358, 592, -689, 586, 747, -474, 1139, 104, -811, 1186, -401, -69, 1608, -574, 397, 1125, -1360, 769, 270, -1195, 1277, -230, -620, 1027, -923, 313, 808, -1216, 463, 4, -1179, 1084, -570, -923, 469, -1083, -471, 118, -1271, 369, 87, -1089, 423, -938, -289, 682, -561, 196, 127, -564, 282, -331, -51, 112, -775, 145, -268, -446, 148, -890, 560, 601, -593, 587, -302, 466]
2300D66J070k010M72J89n57J495j449l99J965j064O56l82j400J565L20o25M93
2317H05j187J06J209p29P2n82O8J208n12n75n95P93N36j75k66j058K73J839j039
2336A91p89o3j049L016j084j463J685j512J406J160l842K023P44j334L517l911
2352a305o72L508l032K050j73m260N438j243j242K472m568L013L037m820K615
2367H18j567j439O345m701j072K577l815M786j72m750M548j921M11L211n855K675
2383G9J564k838M305m098j274M861l570K603n09m391N215o60j372K241n262L079
2399b7L402m704K126k300Q6N280m961l74J898k115M778k457l488L958j637J057
2415E22R93m456L137M52j803K554l001j76K644j767J684r15k047K714m8j87M32
$$ y = [466, 1536, -474, -2, 187, -370, 1125, -324, -723, 1242, 178, 834, 452, -948, 617, 937, 312, 805, -382, -276, 933, 204, 276, -306, -238, 970, 458, -117, -712, 81, 617, 442, 176, -882, -609, 1230, 191, -598, -661, -1710, 1306, 222, -1241, 444, -1068, 338, 1498, -2344, -321, 423, -911, 2606, -1305, -1977, 1531, -1501, 549, 376, -3884, 1554, 311, -931, 1541, -3027, -14, 3023, -1797, 818, -749, -2188, 4157, -544, -1616, 961, -2854, 1932, 1760, -2990, 1558, -363, 48, 3259, -2596, 79, 1643, -1195, 3110, -988, -2262, 2599, -971, 1632, 1123, -3268, 1947, 1287, -85, 2156, -3106, -27, 3375, -1329, 797, -1503, -1417, 3863, -1098, -1472, 426, -1689, 3089, 632, -2856, 1102, -535, 522, 1515, -2941, 196, 648, -1155, 1399, -1602, -1778, 866, -901, 783, -132, -2179, 535, 487, 300, 732]
2432G32l061K111J369j149j86j592J709J806j550r98j164K544J492k173m46n23
2448a079J854J409l333Q35R34j074K522l085j67L126l146J839M83l146M031k296
2464b93q56M379m534J079J726l681N171k590l389N744l424N81J950n608N461R69
2480B685n137M371l439O33M423o538K572K251m186M404l356j520N769m447O01
2495i14K208l404L737j374l031M696k724J18J445l487L893k89l117K928j253M27
2511a41R32l087K612Q04j664J377k204J581J550l298J668J07o71J800k741J270
2527a05J760k265J623j632J01K936l447M28K231k435K063j576j295L957j666j289
2543f11J500k087K669o0l232K788n30o81J535k591J084J653k456J458l75j045
$$ y = [732, -2329, -218, 1151, 2, -184, -1776, -67, 1739, 189, -809, -1973, 571, 2063, -110, -556, -1079, 775, 2184, -1149, -314, 620, -454, 2068, -1017, -1184, 1942, -1204, 635, 1118, -2028, 2003, -293, -1149, 3230, -1304, -225, 1501, -2180, 2991, 401, -2988, 2756, -668, -87, 1863, -3745, 1716, 2685, -2452, 1919, -1520, -887, 3536, -3002, -430, 1821, -2365, 2039, -1317, -2837, 2932, -1515, -914, 1294, -2110, 1627, 253, -2778, 1918, -806, -688, 757, -2730, 1163, 874, -2243, 685, -568, -141, 791, -2296, 316, 1120, -544, 833, -1371, 210, 1760, -1538, 130, 237, -434, 1366, -1375, -105, 1655, -610, 1013, -619, -518, 2418, -1029, -601, 1630, -805, 1258, -318, -1613, 2344, 678, -611, 889, -1198, 1471, 1411, -1821, 967, 437, -244, 1291, -1300, -216, 1437, -1019, 439, 64, -981]
2559i81J837j519J18J548j483J71J86k15J307j167j120J328K17q16j59o9O20Q99
2577G02r79q68R45M71k37J21r03P26P81j631P92K76q48J206o78n49J218j033N81
2596I3Q45j210M09K00p35J270o38p38Q85o24N47J28j447J321L34m21K75r96P67
2615B65L05l82J48k73j11O12m71m32O51m38M75l56l23O17n86O09L5o32M74k18
2635c1k19O05o04r8M77o52N75k01o61J029l87k20N11o56M41L85q85O49k28m55
2655f25R36o27k03O01n27O26K83j108O76J58n08M08j04m66O99k45P5J99m32K10
2675B6K75k71L6N19j59j2M0m24K20Q4k33M70m91n0J75ll38P06n39J96K45m58N80
2698E94m75j78M71k13n10M79j76j95M54n29J40K72p43M19K7k5K26k27m2L75l45
$$ y = [-981, 856, -663, -545, 1003, -480, -309, -123, -338, 969, -198, -1318, 10, 227, -589, -748, -817, -197, 702, -277, -1145, -200, 271, 34, 155, -748, -22, 759, -872, -80, 196, -652, 554, -124, -673, 545, -488, 93, 938, -272, 137, 337, -398, 872, 234, -504, 381, -243, 304, 432, -1015, 306, 640, 219, 494, -502, 265, 570, 188, 336, 63, -48, 564, 93, -339, 312, -126, 349, -7, -330, 287, -299, 310, 345, -287, 187, -31, -250, 355, -249, -347, 130, -522, 53, -148, -809, 220, -167, -387, 124, -532, -91, 294, -591, 58, -170, -625, 311, -316, -519, 82, -445, 181, 464, -644, 32, 190, -318, 90, -14, -480, 219, -26, 49, 248, -184, 26, 301, 30, 66, 585, 426, 414, 454, 30, 250, 334, 101, 571, 80, 30, 205, 202, -136, 570, 31, 227, 472, 14, 594, 119, -59, 412, 199, -311, 168, -8, -203, 251, -278, -138, 134, -609, -190, -163, -188, 38, -189, -231, 144, -201]
2719b01k66N78p49L45L06o44K86K21l69L75k32j51O51j78j81M65o37Q4M77l89
2739b09L17L54q22N49J85q54Q70l84j15P02n25j79O58r18Q14J68j344J264l59
2758A72m23Q82q90J16J109j074P16j72q10J076m88n78J143j174L36Q01j418Q33
2776A57j5q06J263q75l48J154j083O61L28j264J210l77n22J312j583j24J408j226
2794g30N02J49j007J488k30j084J284p57K22Q45j441O46K81q60J409j029n67J333
2812D54r33K71R75j490J031J62j100J316j049j62J646j277K94N08j554J617M19
2829A128j724J545j111n6J470j665M93P61j546J506m53j282J820r67k16J177j612
2846g32M99J067j660J381k30j265K014j388j0J258j956J067O06j743J867q42j025
$$ y = [-201, -467, 111, -638, -293, 13, -631, -345, -124, -493, -118, -350, -501, 150, -28, -209, 256, -381, -297, 180, -209, 108, 462, -360, 189, 374, -480, 390, 6, -109, 593, 68, -111, 547, -371, 443, 611, -733, 531, 172, -251, 631, -259, -143, 966, -108, 608, 436, -374, 702, 214, -364, 779, -395, -59, 742, -676, 157, 142, -664, 599, -276, -624, 530, -553, 108, 436, -828, 382, 5, -517, 795, -788, -912, 496, -730, -228, -79, -1086, 402, 172, -912, 372, -385, -163, 682, -759, -113, 168, -692, 717, -312, -879, 454, -479, -208, 767, -723, 308, 470, -630, 686, -363, -525, 1121, -156, 138, 646, -908, 709, 1128, -596, 949, -162, -218, 1252, -413, 80, 841, -705, 801, 348, -934, 886, -81, -297, 880, -732, -233, 834, -826, 555, 325, -940, 1074, -314, -324, 934, -1022, 45, 651, -1092, 775, -67, -1092]
2863a092K257j684Q4J252k142J766J13j634J956j055p07K073k060N48J054k133
2879a404J896q4j843K399j625n2K312k630J022N78k253K874o63k270K853j736
2895f26P11J743l480J922J130k431K626j922j029L641k818L99J455k946K943j27
2911A191k587K559j455k04K757l228P03J640k727K478m02k400K743j682M7K394
2927A827l637J072J900k087K073j675j631L879j432q02R02k100K566N00k877J477
2943d5k64l00K232k699j49K382k058J225J55k038K298n09j315K262j929j74K332
2960A406k192R02L14k136K795m46j305J368k015J180K368l286N73R03q94K105
2976A640j577j777K816p49oP02k756K532Q08k640J865r57m80K567k557j29J749
$$ y = [-1092, 1165, -519, -435, 817, -1325, 441, 554, -1080, 876, -179, -886, 1187, -873, -325, 729, -1404, 492, 408, -1435, 964, -661, -713, 1599, -1031, -9, 569, -1684, 1190, 527, -1743, 1110, -626, 85, 1828, -1652, 270, 1400, -1031, 1595, -327, -1356, 2285, -533, -134, 1321, -1625, 1318, 1191, -1396, 1163, -292, -496, 2261, -967, -264, 1376, -1351, 1127, 725, -1675, 1068, -614, -567, 1827, -1810, -738, 1162, -925, 1148, -527, -2158, 1721, 289, -513, 389, -1711, 855, 1355, -1522, -45, -309, -609, 1623, -1076, -1225, 1157, -901, 324, 479, -1559, 739, 230, -1085, 1177, -752, -926, 1406, -786, 116, 430, -1706, 1089, 643, -662, 706, -1309, -129, 2239, -1047, -474, 429, -465, 1640, 63, -1714, 1102, 353, 347, 1049, -1707, 825, 1633, -1007, 858, -99, -579, 1988, -569, -698, 1051]
2993A051k371K264L28l064K558j028n98K867k990J25J720j980K594j254k331L108
3009I99p77n97J399l301K043J938k870J360p13o33K901k222o62J704j619J534
3025D84J50j933J465l50q5J342k177N98J185j223J404o45j437J691k55r5L15j284
3043h50R60R26j480N55l01R0J229j282k00P42n48Q44k54q69M39O2K18L39r76J91
3063a65M37j46M99o85p49J326k33l19K54n30K78N70o55l03J30P4O11m17l96P72
3083C53m80N8P69j261N74M1n96R35o48j85P78o94J72K53p02P51n3o27P79n11j78
3104d72P95n60k4L73m36L85P6o71P67l03j88R23q00K07N82q47L16J99o15O90j97
3125B00j40K15l18p1K09r6R2M55n15J28J54l07K08l25J54K92l74n6OrN68n35l8
$$ y = [1051, -1320, 944, 1272, -1792, 766, -262, -860, 2007, -983, -858, 862, -1118, 1476, 222, -2109, 999, 222, -375, 1024, -2277, -234, 1704, -1166, 194, -519, -1152, 1749, -473, -1135, 569, -1050, 484, 634, -1299, 166, -184, -269, 1073, -1104, -506, 679, -544, 860, 215, -1222, 469, 214, 119, 434, -850, 110, 1036, -444, 111, -190, -100, 1129, -153, -353, 389, -159, 685, 431, -438, 1, 63, 281, 620, -356, -165, 272, 126, 625, -60, -809, 517, 284, -35, 219, -311, -33, 537, -118, -421, -291, -217, 394, -23, -419, 353, -127, -69, 700, -561, 13, 54, -542, 393, -255, -440, 338, -356, -184, 69, -633, 118, 65, -562, 217, -294, -472, 323, -237, -261, 112, -324, 61, 137, -534, 233, -70, -258, 665, -135, 72, 654, -193, 123, 322, -293, 397, 200, 60, 275, -43, -114, 95, -1, 91, 546, 31, 159, 313, 6, 214, -111, 43, 335, -39, -95, -89, -98, 470, -65, -103]
3148a03N4L1K90k98L92l45j02L9n4r1N3o2K46j89RJ12j78j08N33n53K52J00j22
3171i4M8k23pO2l8j94J78J16J4J45j94N6P2m21M60J48j70O8o4j27L47o5j50O8
3195C5l20J81L43l03l5L99k72J24K56k72J10j2l24N75l62j93L71m75L95r0n09
3216c78O84j49k62L60n59K48L60o16L51J14n66O56l60J07L05l54j60L55l49K69
3236E6j96k4L53m96K2J66k02J34K33l57J44J17l0J36k77J1M27o13L70J24k81M93
3258C10p74L22M6j51J43L77l90M80l27k56K46m8J29j41j15L15P2k92M69l87K6
3279E4K02m22N00j49k90L86m21J58M34k77j8l4l70M12j97j80N25j78r2J51k53
3300e9j64N63o36J99N43p63K69J56l24O18o48l47R94m43K62l26o66J001on06L16
$$ y = [-103, -49, -18, 272, -26, 366, 21, -81, -42, -96, -187, -134, -196, 50, -139, -130, -18, -196, -304, 229, -324, -72, 28, -94, -46, -269, -276, -214, -252, -446, -268, -152, -138, 7, -187, -131, -59, -480, -20, 128, -42, 26, -38, -165, 182, 117, -33, 35, -285, -104, 239, -64, -99, 300, 28, 152, 408, 136, 246, 234, -90, 485, 123, -70, 301, -174, 221, 131, -378, 306, 157, -105, 255, -304, -56, 304, -312, 39, 153, -413, 243, -117, -10, 295, -59, -219, 136, -213, 56, -140, -164, 189, -307, -285, -119, -321, -187, 46, -311, -167, -50, -80, 56, -221, -210, 217, -396, -26, 98, -183, 310, -464, -142, -96, -247, -104, 273, -117, 363, 36, -220, 26, -22, 107, -34, -149, 166, 238, -54, 415, 28, 54, 256, -166, 334, 185, -105, 281, -140, 18, 452, 175, 157, 123, -247, 165, -32, -212, 313, 135, 43, 194, -59, -223, 340, -296, -97, 446, -317, -48, 108, -216, 402, -246, -593, 401, -42, 220, -106, -772, 229, 223, -283, 33]
3321C3m32J94O48q24Q2M04n42P02m01m42Q43n46J65Q50j211P56j6n26J138j187
3341c12m63J357n75K07m6r95J211M10r34L75p36N26J067j221l4K78l51J146k70
3360F40j342R70k89N78R0j130L07P30n37P18q88p83J469m14J09k02p96P43O79
3379F52n64l64m67O58P95o79q45M20K92N69l26q58L80O52Ql55m00j85O22K21n01
3400b75l10j4P40M23n96k73j83M64N70l50p94K20N91L75j06j398M70O65L99m15
3420B03r79M05P70L89m51q59K29J006J6p24n41J32Q67L19q67q7j77Q49j2k73n43
3441c28K4P73J73m53o09O5L74L26j27j059M58O49L01j15j420M11J022n9n55n82
3461g31P4J107K27r48n20N27O01J98n27p23N49N39Ll66n73L65O30k22k98l76J50
$$ y = [33, -399, -205, 443, -381, -299, 105, -437, 265, -136, -578, 265, -281, -116, 734, -477, 279, 263, -263, 875, -312, -775, 582, 7, 214, 168, -827, 384, 794, -140, 235, -501, 25, 1092, -129, -163, 115, -236, 910, 640, -702, 268, -21, 557, 647, -483, -176, 554, 17, 735, -153, -936, 533, 119, 228, 26, -770, -27, 652, 88, -276, -743, -85, 710, 31, -814, -394, -102, 467, 141, -717, -337, 315, 323, -32, -432, -617, 5, 226, -275, -585, -599, 141, 564, -32, -305, -488, -24, 546, 196, -598, -378, 213, 588, 482, -916, -446, 219, 618, 203, -776, -371, 399, 788, 337, -522, -293, 713, 729, 5, -536, -404, 463, 782, -85, -172, -349, 500, 488, 215, -328, -304, 469, 642, 189, -420, -355, 19, 345, 218, -841, -383, 266, 567, 452, -968, -557, 465, 406, -149, -731, -657, 450, 677, -271, -791, -264, 337, 535, 8, -715, -166, 373, 376, 10, -563, -198, 432, 210, -88, -464, -314]
3482c14P90L7l94m81K03M46L00m18n56L93J07J33j47n55N40J60L7j74m21L07M41
3503D34pk78j71j95N68J2k39j12k59L64K9k87J36J8K07j33j85N9K55Q9j77ll43
3526b18k27N43k02N2k9k57N16P9m97J85k85J94J78j97K79l63J36L76k53l84K24
3547a50j03O7K37k22k8J31M7O9K8o7P4L7P2L3k58K78j66r7M46m42q2J64j03M7
3571A2R4j03J54N6k25L02j84M1o5k83L78j34K08J30l70MM7J9L3K4j51J1K44l54
3595a12K83j60p1%LM7K4j2p5Qkk1l2M7m6J52j01o8j1L05k43k22L62k13n0L3q1
3622b56J74J00j39j06R8j45J50J65k16Q3Q2k06J70O9K4q1J19O6j37l0J74j41M5
3645F2j1r4J68J39j57nQr9K03j37N9j91j2Q3Q6j83K61l6J8p7m36M19j47J80O2
$$ y = [-314, 476, 513, 119, -362, -159, 287, 587, 169, -387, 6, 113, 246, 99, -456, 84, 244, 281, 107, -314, -7, 434, 427, 149, -22, -217, 351, 363, 124, 12, -247, 117, 146, -141, -5, 13, 220, 87, -98, -39, 216, 305, 128, 125, -218, -445, 98, -104, -52, -81, -338, 178, 257, -240, -55, -340, -146, 32, -165, 114, -249, -113, 263, 10, -374, -150, -253, -186, 51, -171, -199, -68, -21, 48, 76, 9, 83, 120, 192, 225, -33, 245, 79, -18, 428, -14, -96, 68, -35, 12, 106, 3, 157, 213, -12, 290, 106, 147, 82, -201, 177, 43, 251, 381, 11, 15, 62, 81, 114, 138, -13, -2, 242, -112, 171, 11, -60, -60, -57, -10, 14, 2, -73, -65, -67, -88, -120, -73, -119, 33, -68, -136, -147, 158, -85, -307, 55, -158, -208, -175, -256, -82, 18, -121, -227, -129, -274, -124, 41, -175, -92, -10, -216, -46, 23, 47, -34, 85, 151, 14, -16, 158, 17, 62, 51, -43, 125, 264, 107, 102, 110, 11, 214, 77, 136, -55, -67, 16, 102, -81, 180, 144, 162, 85, -351, 68, -79, 101, 163]
3670A63j93j65K41j96M7Q6o3L9k95P5L22j27j42M03k62k9O1k97L85k14j97L89
3692C1j54k6J54p9O0Jk85J98o6%J2Oj09J66P3K1J7p7j12K24k18K20k73J99K47
3717B30k04j71L69pp6M2k41J83K32j15k61j66K03K30k42J91k31k33K54K56k08
3738C5J06j73J46J2pj64m9j59O34l76q1N7l32N71j44o17O51l04O5N87p28j30K70
3761a30k88O51l20k89M08l09M01j01p46P67J90o08N91n31J61N16o02M64j61m96
3781d32R57n86k31N95o13K20M22q16N31q5l63J018q82j23Q10n97L73J84q08O09
3801A83J14l07N72r94M63L12k97l8L0k90P04j50o91K73J26J31K86q92K24K18o
3822b9M49n63l75Q94k93j15J2p25O42M94n92L0q0O6P86m66n21L50k13L45M05j086
$$ y = [163, -30, -195, 46, -150, -103, -17, -80, -41, -336, -261, 61, -66, -208, 195, -67, -96, -35, -332, 53, -161, -358, 31, -123, -149, 5, -74, -14, -13, -298, -100, -166, -166, -154, -148, -257, -91, -18, 3, 20, -57, -169, 55, -163, 57, -216, -17, 230, 26, -145, 224, 217, 141, 183, -58, 125, 357, 242, -19, -185, 18, 248, 6, 197, -34, -267, -13, 243, 35, 141, -32, 114, 126, 119, -45, -94, -253, 381, 5, -76, -19, -351, 220, 76, -541, 110, -194, -129, 458, -270, -400, -130, -418, 233, -87, -376, 32, -277, 124, 23, -723, 44, 234, -374, 217, -314, -153, 363, -239, 225, 64, -432, 525, -61, -292, 303, -310, -90, 332, -484, 47, -38, -401, 617, -265, -388, 422, -175, 198, 382, -426, 183, 297, -10, 562, -432, 31, 343, 46, 8, 38, -252, 452, 302, -389, -116, 10, 141, 427, -465, -241, -23, -29, 420, -143, -518, 376, 83, -32, -20, -745, -103, 391, -201, -171, -251, -185, 601, 135, -386, -36, -249, 96, 501, -585]
3844e85M88J82n88R70o53k06N94k3R9j08r47J205M7r12Q38q94K3J315j203J67
3864a91K85l46J178r22p14J102m96K56M25j200N30M01o29R24r45l81J397m30o4
3883A80O2j016J466q3j083Q66j078N51R79j381L63K49m65J011n51n74O69m51M52
3902A66J50r97O56L31q79Q80m92n9N28m59K95k56n06J155l96n71M08o71O71O35
3922E89p81Q5l5k31Q49m67m93M24O5J58K47r50N53R4k01J70J3n87Q97l05k63L21
3944A52l14K23N82p45L39K4m61O54m79l61Q04o25M35J91j037Q18K79o45N37p14
3964c43P9R02p62O8J94n80O00Q5p66O84l08j84N68o25K57K35l92K47m1k2K98n05
3986c11J03L99p63M97J38n30Q12n43j23N27p31M66jl29M22J74o99O09m0o0J13
$$ y = [-585, -97, 85, -503, 467, -186, -392, 202, 179, 278, 170, -777, 428, 475, -437, 401, -493, -470, 845, -358, -191, 94, -252, 926, 4, -710, 392, -104, 152, 577, -623, -93, 308, -321, 603, -342, -723, 674, 244, 180, 242, -774, 692, 609, -474, 392, -686, -135, 844, -537, -174, 75, -390, 621, 70, -504, 165, -286, 166, 316, -681, -25, 306, -573, 307, -185, -244, 284, -175, 120, -136, -642, 513, 117, -454, -46, -717, -46, 589, -192, -107, -142, -373, 476, 9, -484, -60, 5, 163, 410, -540, 13, 107, -94, 76, 89, -498, 399, 94, -169, 152, -162, 61, 643, -102, 237, 261, -200, 454, -25, -386, 418, -207, 228, 419, -618, 200, 479, -166, 371, -343, -264, 638, -124, -56, 138, -442, 158, 243, -523, 161, -147, -331, 237, -388, -131, 104, -288, -41, -82, -104, 194, -311, -208, 191, -572, -75, 63, -467, 345, -198, -321, 206, -525, -59, -60, -389, 33, 207, -492, 117, 77, 17, 130]
4007A30m30N79j17k79J58M0j71K19l15K81q3j33J26K04o4J04Rl29J72k62L54J80
4029C73n66K80o8Mj3Q7P3j51lm4J20N2k75J66Q3Q8j16o0J9j83L8J31M5k45K32
4054F7j38J12j37J18oJ7k92L03j22p0q7K8J96k04N5K52j67j65N12l24j6K14j92
4077d6J17j76J45J01k13J38K81l48n9J61O4j60Q3l2J67J2p7N6j30j15J05r8k6
4100e0K07o3R7r1R6m6L2j97K06j22nn3j16K68j27j33J52q6k4K42k74p1K16O5m9
4125G4j13J31o1j47K42l46O7J65qj55K69j94k29K05M3L18k08o0j22R9j25J60k65
4148b60K4K1O8j14M3L6J89l5pK9J53m5P0l63K36q1m9R2N3j61Q7N%J47o3l1n2n
4176a3J88j44q4K04l63M83k33K17m26K26J57P6m47j96M85l5j82n5K42n6j10J21
$$ y = [130, -300, 279, 162, -117, 41, 81, -90, 129, -186, 95, 12, -121, 5, 209, 145, 249, 258, -71, 101, -161, 193, 373, -193, 87, 19, 23, 10, 97, 170, 19, 16, -28, 92, 144, -131, 35, 118, 206, 90, 30, 49, -134, -96, 35, 80, -165, 67, -71, 41, -96, 22, 16, 33, -259, 44, -78, -148, -235, -207, -11, -215, -160, 92, -75, -240, 272, -52, -68, 146, -46, 71, -105, 40, 141, -72, 66, 347, -1, -60, 101, 165, 5, 88, 56, 223, 235, 158, 214, 84, -31, 74, -24, -50, 157, 94, 191, 100, 196, 150, 182, -15, 191, 69, 64, 11, -105, 163, 36, -97, 55, -31, -55, 187, -87, -158, 58, 123, 74, -39, 92, 31, -116, 126, -220, -153, 12, 4, -151, 118, -76, -305, -100, -57, 261, 53, -7, -129, -30, -155, 5, -260, -236, -215, -147, -261, -218, -182, 7, -28, -35, -6, 147, 102, 172, -191, 45, -36, -85, 7, 60, -101, -14, -9, -9, 138, 75, 44, -8, -13, 175, 31, -53, 151, -212, 271, 38, 255, -171, 55, 212, 288, -159, -355, 130, 95, -87, -142, 100, 44, -66, 55]
4198E5J06k27K00j50k50L79o6p8J03j32k46M03k91LJ45m74N21o0J40k52N7L12
4220A98j51k99L70k75O2L92o77N64j87k34J44J39j80L28j72KK01k15o7M26k96
4241G3K3l7j67M05K5l16K10k49j57K65j89N3K35k31M60l76j11J30l2J62j42o3
4263b9Q1J48k13M4J98l02L4k9o0J57j34j56M49j68j33o2q5M57k3j81pr1L32j02
4287A25l48K04j83L78j95l10M03k68K76l2j21R1N6l05K01p3J0K04j01j57J82K7
4309F4j31K06l79L63l08L60N8l19j68K16J15%J38l63K06J10j50m1M2j69M95j70
4331A75l14K2j42N20J76m99K21l17J33K61l97Q4J47p7o7L21k99M0J32l27J95m7
4353e9k28L77l66K78j28l6Q8K44l75J95n8k80N00l05Q7K42q3l20K62j69M44k10
$$ y = [55, 161, -66, 134, -16, -266, 113, 47, -31, 72, -60, -306, 97, -194, -191, -46, -520, 1, -59, 81, -171, -114, 198, 47, -252, 118, -157, -95, 297, -380, 184, -3, -237, -93, 46, -134, 194, 22, 24, 225, 10, -57, 369, 73, 96, 59, -108, 297, 322, 6, 216, -33, -190, 75, -114, -61, 174, -57, 403, 27, -84, 46, 14, 176, 34, -29, 52, 200, -13, 31, 229, -73, -39, -68, -128, 29, -105, -261, 188, 20, -113, -175, -260, 197, 174, -7, -14, -105, 227, 125, -223, -19, -202, 176, -19, -329, 74, -194, 82, 50, -71, 20, 76, -229, -28, -101, -91, 113, 12, -145, 37, 64, -67, 139, -240, 123, -185, 175, 233, -86, -254, -38, 77, 77, 215, -148, 58, 168, 18, -23, 19, -150, 345, 175, -139, -117, -259, 261, 437, -62, 159, -158, -25, 236, -161, -77, 70, -7, -74, 247, -52, -12, 120, -207, -12, -59, -287, 90, -276, 2, -126, -162, -74, 170, -205, -10, -68, -348, 152, -153, -66, 176, 93, -227, 35, -134, 310, 100]
4375A00k61M6l3J04l8k54J36K84qj45j1R8n1J02qK25m1k69P4k01N05j95k00K37
4399A96q2j07L8j07KJ40j43L28j34kK04m96P1K55j1n3k21J49n7J05j99K96j35
4422C7r5J07p3OO1j70M06l29j23L08L2l86M07j25l00K62o7N9k8k20K37k15R1M9
4446f9q1J68O5L2j45L01l38QJ10K6pJ19P8l32n6J64j2q8j71L3L60j61l8J00M1
4471A07Q9n3k89J81J33j83k2J92j62J5J13P4j87j43J26J08J31k08J49l50N79l14
4493H6j99K22O6o0k35J22q8K68k01r2Q5k84J58L1Q1r2LJ74j24lo5O0j15M92k02
4518H8k15K27j54J91j02J6j02Jk19O25n53J15J74l15K84K2k66M37j82j85J85m2
4540C0l1K19j73J18j05j49K14P1r8j1pL1J07j17k50J16JJ05n1K9j3j05J27J19
$$ y = [100, -161, -115, -148, -44, -82, -336, -200, 84, 76, -69, -80, 18, -33, 69, 61, 286, 245, -24, 50, -151, 354, 159, -41, 196, 114, 7, 45, -62, -60, 80, -63, 265, 131, 129, 333, -163, -92, 163, 152, 99, -122, 27, -30, 75, -124, 172, 37, -58, 49, -24, -18, 43, -127, 279, -50, -173, 135, 167, -219, 188, 63, -237, 25, -42, 17, -11, -231, 6, -209, -118, -69, -150, 18, 83, 115, -30, 271, -67, -59, 51, 77, 70, 189, 267, -65, -121, 43, 31, -57, -228, -195, 165, 4, -34, 66, 107, 196, 143, -146, 35, 168, -15, -37, 155, -7, 8, 121, 195, 8, -135, -9, 99, 230, 22, 171, -179, 400, 86, -113, 109, 175, 115, -120, 2, -86, 182, -19, -111, -26, -310, -152, -121, -40, -132, -129, 45, -79, -82, -147, -87, -202, 290, 88, -127, 100, -54, 137, 35, 51, -51, -50, -269, 356, -197, -82, 92, -223, 61, 83, -183, 254, 72, -113, 72, 30, -1, 218, 45, 163, 58, -91, 123, 194, 96, 85, 78, 109, 216, 99, -151, -35, -34, 71, 20, 49, 36, -69, 58, 177]
4564A77k62J14P6j77l5R4k49L00kM4k8n9J60k15J5j8L1J18k73K0L19l46n4J24
4588a26K51l44J34k5J05R3o9l79L13J4J79q3Ql2J00k65K89m64N50j77j6r9R7j99
4612a45J00k1j7J1k3M1P9j67J90l00L30R2l29%N2J87k15K17j14M0j12M4L1K7P0
4637F8M5j5r4k1L6J03J54k50L0k54L21p9j7n3j13p4K25M5l17K67k28L18j01j02
4661a06q1K08m1j06N2j17L19k01K18l40k8J28K18Q6j52j44n7J13J47l22J01K77
4683A72p8P4n0n9j83k56L62K8K48l26K39l17J17J1J95k29k7J50j45L58j16j72
4705dj26J06J31k9p9lK7k14L20o2L7k75K34j32K00Oj32kO5j68J47K13l53jQ9k
4731gk74K22j29L17j85K34l24O1Q5l34M18j08J91k15j10K40l8j4J97k30j05k8
$$ y = [177, -85, 29, 105, -72, -107, -13, -262, 38, 36, 80, 52, -7, 153, -62, -47, -65, -34, 84, -189, -169, 150, -196, -250, -126, 125, -219, -85, -110, -5, 88, 19, -360, -47, -33, 146, 63, 71, 39, 139, -126, 163, -301, 249, 72, 56, -43, 54, -145, -45, -66, -83, -72, -95, -54, 25, -142, 48, -252, 78, 170, -159, -159, -107, 80, -135, 82, -32, 8, -104, -60, -29, -2, 68, 113, 98, 4, -17, 19, 122, 276, 26, 56, -198, 123, 44, 27, -26, -139, -213, 12, 57, -260, 7, -221, 97, -4, -106, -187, 21, -20, -126, -74, -191, 128, -73, 145, -195, -223, -95, 123, 209, 57, -87, -144, -31, 116, -206, -105, 172, 94, 168, 118, 59, -124, -380, -18, 10, 258, -68, 171, -146, -29, -18, 177, -52, -79, 71, -74, 284, 168, -4, -130, -24, 107, 78, -1, -4, 23, -191, 129, 67, 104, -171, 63, -69, 131, 137, 5, 3, 68, -100, 47, 260, -93, -94, -5, -7, -281, -59, -188, 129, -56, 178, -146, -85, 0, -334, 84, -24, 167, -48, -158, 82, 44, 30, 227, -3, -108, -136]
4753a36J55k11K10J58M5r5j83k0O3O8Qj35PL53l18J34L0j94q4L07k2p2J09J27
4777C04l05M6k26M95k76J9k6K7J00m04n5J95lo1J55O7R8M6j24m2k36K37Kj39J62
4802E6J37n26M28Q9l21m3LR1J85k16J63j71J31J20K5p1k55L0j76M69j21O9j10
4825a4k7J11l4j37MJ54J91j24m67K13L84k91K29k56k45N97j18k91L05r6J71j69
4847I0j95K49j38K77j58k36J64r7LL54m75k1K86l07M16k7l04K51J19k17J41k47
4869g2j5M10m67Q7j57K58J42r4j09P1p9J8R1l89L81Rj23J51j80j20R9K94j65K01
4893B42m52J24M01k38O7n13J68J13J00k33K34j74M74j11l39k9J5J28K22k62N3
4914a0n4K36J2j23j32J83J0l09J5L80J36kl58J17r0j07K58J53l72l2K05k20J96
$$ y = [-136, 19, -192, 18, 176, 221, 126, -57, -77, -14, 54, 62, -73, -66, 287, -31, 103, 133, -61, -145, 162, 140, 68, 177, 304, -1, 45, -181, 314, 38, 57, 31, 58, 158, -246, -301, -106, -109, -170, -15, 52, 150, 196, 72, 30, -206, 31, 33, -106, 56, 193, -333, 95, 184, -137, -180, -177, -86, 99, -117, 46, -125, 6, 126, 151, 80, -175, -145, -321, 148, 27, 96, -14, -41, 70, 36, -101, -97, 57, 248, 124, -343, -130, 254, -37, 192, -64, -309, 288, 170, -121, 184, 88, 259, 90, -105, 144, 6, 283, 125, -111, 53, -44, -41, 313, -162, -183, 103, -204, 212, 185, -119, 132, 251, 34, 175, -72, -87, 323, -144, -57, -214, 44, 186, 92, -17, 54, -25, -7, 84, -305, 76, 85, -38, 113, -67, -187, -88, 206, 41, 242, -210, -86, 315, 77, 144, -369, -201, -88, 12, -221, 13, -161, 313, 202, -137, -166, -151, -23, 199, -63, -10, -64, 172, 184, 61, -71, 112, 122, -187, -172, 208, 344, 342, -16, 101, 11, -96, 162, 315, -57, -89, 116, -104, 92]
$$ [...]
8191b9
##END NTUPLES=NMR FID
##END=
