##TITLE=1H_LR-721-R3-KUB
 CDCl3
 8 sc, 
 9.10.2024
##JCAMPDX= 6.0         $$ Bruker NMR JCAMP-DX V2.0
##DATA TYPE= NMR FID
##DATA CLASS= NTUPLES
##ORIGIN= UXNMR, Bruker Analytische Messtechnik GmbH
##OWNER= root
$$ XWIN-NMR		Version 3.5
$$ Wed Oct  9 16:32:09 2024 Russian Standard Time (UT+4h)  she@DPX200
##.OBSERVE FREQUENCY= 200.1318
##.OBSERVE NUCLEUS= ^1H
##.DELAY= (6, 6)
##.ACQUISITION MODE= SIMULTANEOUS
##.ACQUISITION SCHEME= undefined
##.AVERAGES= 8
##.DIGITISER RES= 18
##SPECTROMETER/DATA SYSTEM= spect
##.PULSE SEQUENCE= zg30
##.SOLVENT NAME= CDCl3
##.SHIFT REFERENCE= (INTERNAL, CDCl3, 0, 15.7039)
##AUDIT TRAIL= $$ (NUMBER, WHEN, WHO, WHERE, WHAT)
$$ ##TITLE= Audit trail, XWIN-NMR		Version 3.5
$$ ##JCAMPDX= 5.01
$$ ##ORIGIN= Bruker BioSpin GmbH
$$ ##OWNER= she
$$ F:/spectra/data/she/nmr/H-F/1/audita.txt
$$ ##AUDIT TRAIL=  $$ (NUMBER, WHEN, WHO, WHERE, WHAT)
(   1,<2024-10-09 16:30:56.35 +0400>,<she>,<DPX200>,
      <created by zg, POWCHK disabled, PULCHK disabled
       configuration hash MD5:
       00 E9 B6 7A A2 85 ED C7 34 08 36 98 17 FE 4E 26
       data hash MD5: 16K
       BE 62 C3 78 B6 28 76 30 49 62 09 E7 A4 F9 F0 2B>)
$$ ##END=
$$ 
$$ hash MD5
$$ 0C 0D 63 90 7F 7F 5F AA C1 04 A5 D9 9E 28 38 E9
##$RELAX= 
##$RELAX= 
##$RELAX= 
##$RELAX= 
##$RELAX= 
##$RELAX= 
$$ Bruker specific parameters
$$ --------------------------
##$DU= <F:/spectra>
##$EXPNO= 1
##$NAME= <H-F>
##$PROCNO= 1
##$TYPE= <nmr>
##$USER= <she>
##$AMP= (0..31)
100 100 100 100 100 100 100 100 100 100 100 100 100 100 100 100 100 100 
100 100 100 100 100 100 100 100 100 100 100 100 100 100 
##$AQSEQ= 0
##$AQ_mod= 1
##$AUNM= <au_zg>
##$AUTOPOS= <>
##$BF1= 200.13
##$BF2= 200.13
##$BF3= 200.13
##$BF4= 200.13
##$BF5= 200.13
##$BF6= 200.13
##$BF7= 200.13
##$BF8= 200.13
##$BYTORDA= 1
##$CFDGTYP= 0
##$CFRGTYP= 5
##$CHEMSTR= <none>
##$CNST= (0..31)
1 1 145 1 1 1 1 1 1 1 1 1 1 1 1 1 1 1 1 1 1 1 1 1 1 1 1 1 1 1 1 1 
##$CPDPRG= <>
##$CPDPRG1= <>
##$CPDPRG2= <>
##$CPDPRG3= <>
##$CPDPRG4= <mlev>
##$CPDPRG5= <mlev>
##$CPDPRG6= <mlev>
##$CPDPRG7= <mlev>
##$CPDPRG8= <mlev>
##$CPDPRGB= <>
##$CPDPRGT= <>
##$D= (0..31)
0 1.2 0 0 0 0 0 0 0 0.06 0 0.03 0 0 0 0 0.0002 0 0 0 0 0 0 0 0 0 0 0 0 
0 0 0 
##$DATE= 1728477055
##$DBL= (0..7)
120 120 120 120 120 120 120 120 
##$DBP= (0..7)
150 150 150 150 150 150 150 150 
##$DBP07= 0
##$DBPNAM0= <>
##$DBPNAM1= <>
##$DBPNAM2= <>
##$DBPNAM3= <>
##$DBPNAM4= <>
##$DBPNAM5= <>
##$DBPNAM6= <>
##$DBPNAM7= <>
##$DBPOAL= (0..7)
0.5 0.5 0.5 0.5 0.5 0.5 0.5 0.5 
##$DBPOFFS= (0..7)
0 0 0 0 0 0 0 0 
##$DE= 6
##$DECBNUC= <off>
##$DECIM= 24
##$DECNUC= <off>
##$DECSTAT= 4
##$DIGMOD= 1
##$DIGTYP= 9
##$DL= (0..7)
0 120 120 120 120 120 120 120 
##$DP= (0..7)
150 150 150 150 150 150 150 150 
##$DP07= 0
##$DPNAME0= <>
##$DPNAME1= <>
##$DPNAME2= <>
##$DPNAME3= <>
##$DPNAME4= <>
##$DPNAME5= <>
##$DPNAME6= <>
##$DPNAME7= <>
##$DPOAL= (0..7)
0.5 0.5 0.5 0.5 0.5 0.5 0.5 0.5 
##$DPOFFS= (0..7)
0 0 0 0 0 0 0 0 
##$DQDMODE= 0
##$DR= 18
##$DS= 0
##$DSLIST= <SSSSSSSSSSSSSSS>
$$ [...]
##$SUBNAM2= <"">
##$SUBNAM3= <"">
##$SUBNAM4= <"">
##$SUBNAM5= <"">
##$SUBNAM6= <"">
##$SUBNAM7= <"">
##$SUBNAM8= <"">
##$SUBNAM9= <"">
##$SW= 24.0689170037331
##$SWIBOX= (0..15)
0 0 2 0 0 0 0 0 0 0 0 0 0 0 0 0 
##$SW_h= 4816.95568400771
##$TD= 16384
##$TD0= 1
##$TE= 0
##$TE2= 300
##$TE3= 300
##$TEG= 300
##$TL= (0..7)
0 120 120 120 120 120 120 120 
##$TP= (0..7)
150 150 150 150 150 150 150 150 
##$TP07= 0
##$TPNAME0= <>
##$TPNAME1= <>
##$TPNAME2= <>
##$TPNAME3= <>
##$TPNAME4= <>
##$TPNAME5= <>
##$TPNAME6= <>
##$TPNAME7= <>
##$TPOAL= (0..7)
0.5 0.5 0.5 0.5 0.5 0.5 0.5 0.5 
##$TPOFFS= (0..7)
0 0 0 0 0 0 0 0 
##$TUNHIN= 0
##$TUNHOUT= 0
##$TUNXOUT= 0
##$USERA1= <user>
##$USERA2= <user>
##$USERA3= <user>
##$USERA4= <user>
##$USERA5= <user>
##$V9= 5
##$VALIST= <valist>
##$VCLIST= <CCCCCCCCCCCCCCC>
##$VD= 0
##$VDLIST= <DDDDDDDDDDDDDDD>
##$VPLIST= <PPPPPPPPPPPPPPP>
##$VTLIST= <TTTTTTTTTTTTTTT>
##$WBST= 1024
##$WBSW= 4
##$XGAIN= (0..3)
0 0 0 0 
##$XL= 0
##$YL= 0
##$YMAX_a= 668021
##$YMIN_a= -705795
##$ZGOPTNS= <>
##$ZL1= 120
##$ZL2= 120
##$ZL3= 120
##$ZL4= 120
##$ABSF1= 10
##$ABSF2= 0
##$ABSG= 5
##$ABSL= 3
##$ALPHA= 0
##$AQORDER= 0
##$ASSFAC= 0
##$ASSFACI= 0
##$ASSFACX= 0
##$ASSWID= 0
##$AUNMP= <proc_1d>
##$AZFE= 0.1
##$AZFW= 0.1
##$BCFW= 1
##$BC_mod= 2
##$BYTORDP= 1
##$COROFFS= 0
##$CY= 11.3945322036743
##$DATMOD= 1
##$DC= 2
##$DFILT= <>
##$DTYPP= 0
##$F1P= 15.6554695791079
##$F2P= 12.8336369535428
##$FCOR= 0.5
##$FTSIZE= 0
##$FT_mod= 4
##$GAMMA= 1
##$GB= 0.15
##$INTBC= 1
##$INTSCL= 1
##$ISEN= 128
##$LB= 0.24
##$LEV0= 0
##$LPBIN= 0
##$MAXI= 10000
##$MC2= 0
##$MEAN= 0
##$ME_mod= 0
##$MI= 1.114404
##$NCOEF= 0
##$NC_proc= 0
##$NLEV= 6
##$NOISF1= 3.799351
##$NOISF2= 2.8
##$NSP= 1
##$NTH_PI= 0
##$NZP= 0
##$OFFSET= 15.70392
##$PC= 1
##$PHC0= -26347.26
##$PHC1= 17.98743
##$PH_mod= 1
##$PKNL= yes
##$PPARMOD= 0
##$PSCAL= 0
##$PSIGN= 0
##$REVERSE= no
##$SF= 200.130013532006
##$SI= 16384
##$SIGF1= 3
##$SIGF2= 2
##$SINO= 400
##$SIOLD= 16384
##$SREGLST= <1H.CDCl3>
##$SSB= 0
##$STSI= 0
##$STSR= 0
##$SW_p= 3612.71676300578
##$SYMM= 0
##$S_DEV= 0
##$TDeff= 0
##$TDoff= 0
##$TI= <>
##$TILT= no
##$TM1= 0
##$TM2= 0
##$TOPLEV= 0
##$USERP1= <user>
##$USERP2= <user>
##$USERP3= <user>
##$USERP4= <user>
##$USERP5= <user>
##$WDW= 1
##$XDIM= 8192
##$YMAX_p= 0
##$YMIN_p= 0
$$ End of Bruker specific parameters
$$ ---------------------------------
##NTUPLES= NMR FID
##VAR_NAME=  TIME,          FID/REAL,        FID/IMAG
##SYMBOL=    X,             R,               I
##VAR_TYPE=  INDEPENDENT,   DEPENDENT,       DEPENDENT
##VAR_FORM=  AFFN,          ASDF,            ASDF
##VAR_DIM=   8192,          8192,            8192
##UNITS=     SECONDS,       ARBITRARY UNITS, ARBITRARY UNITS
##FACTOR=    0.0002076,     1,               1
##FIRST=     0,             0,               0
##LAST=      1.7004516,     0,               0
##MIN=       0,             -705795,         0
##MAX=       1.7004516,     668021,          0
$$ Real data points
##PAGE= N=1
##DATA TABLE= (X++(R..R)), XYDATA
$$ [...]
2372b70J67L65Mn32k48L88P08j130k72J929o13j838J656R97j727m08J213m28m52
2391d91J282o13j039J421K21j534N24P76p13O3L29m87Q0M70l79j27P8N09l48o39
2411f17O79J042p42j319J198R20j919j27J315o04n56J556k58j716J198J138j606
2428d18k11J187l19r60P15Q67q43m26J86Q14j77m31m0j8J25R02m55j786J201J174
2448A087j595m12J612p19p20J218L08j164K17N47j085R02P35j542l58J145M19
2465E95k74m65n06R27M05j013K50R2l90L43N11j210O41J170k164J41L031j664
2483D20k376K284J014k217P74Q88k088R06J591j040q14N06K54M02j95q95J240
2500F54j62k314K103J548l248o05L514r18j392J696j361p27K883p16l105K246
$$ plain form
2372 -270 -103 262 266 -266 -514 -126 582 -548 -820 1109 496 -1342 314 1311 -416 -824 389 -39 -491
2391 -491 791 178 -861 560 781 -753 -229 547 -166 -103 226 -261 -181 289 -90 -217 -139 370 22 -617
2411 -617 62 1104 362 -957 241 1161 -758 -885 430 -174 -730 826 568 -1148 50 1188 -418
2428 -418 -629 558 239 -721 -6 861 18 -408 -222 592 415 -16 -56 -74 51 953 498 -1288 -87 1087
2448 1087 -508 -920 692 -27 -747 471 779 -385 -168 379 -706 196 931 -611 -969 176 595
2465 595 321 -144 -650 277 682 -331 -81 11 -379 -36 475 -735 -94 1076 -1088 -947 2084 420
2483 420 -1956 328 1342 -875 -101 787 -1301 -395 1196 156 -658 -152 102 504 309 -586 654
2500 654 492 -1822 281 1829 -1419 -2024 1490 572 -820 876 -485 -1212 1671 955 -2150 96
2516I6J118k433J662N40k487J490J526k768N29K504k337r18K513m76r95N23j293
2533a206J331J559l167j96M101k552k021M038j067l187L726j02m334L714K458
2548C095n011J94L632j804n0R04k603J395K681l363n30L254k547o45L510k210
2564i8j981L806j779j884M331j688m255M710J235m776K601P56m275M605K399p190
2580c483J338N964l949j419L599l574j60M852l413k582M490j367k016L972k177
2595G5k993N280j557l792N155r37n569N952K211p687K528N002n729J407L882o123
2611b895P94O838n038l188N226j947j472M687m351k417O793j588m828N026o88
2626I52m431N778K99o885M680K530o151M298K120p477L064O551p255q71O408n414
$$ plain form
2516 96 1214 -1219 443 983 -1504 -14 1512 -1256 -727 1777 -560 -1478 1035 559 -436 87 -1206
2533 -1206 125 1684 -1483 -1679 2422 -130 -2151 1887 820 -2367 1359 1257 -3077 637 3095
2548 3095 -1916 -1722 1910 106 56 960 -1643 -248 2433 -930 -1460 1794 -753 -1398 2112 -98
2564 -98 -2079 1727 -52 -1936 2395 707 -3548 1162 2397 -2379 222 978 -3297 1308 3707 -3483
2580 -3483 -2145 3819 -130 -1549 2050 -1524 -1684 3168 -245 -2827 1663 296 -1720 2252 75
2595 75 -2918 2362 805 -2987 2168 1231 -4338 1614 3825 -3862 -1334 3668 -2061 -654 3228 -2895
2611 -2895 -2101 4737 -301 -3489 1737 -210 -1682 3005 -1346 -3763 3030 1442 -3386 1640 952
2626 952 -3479 2299 2598 -4287 393 2923 -3228 1070 3190 -4287 -1223 5328 -1927 -2798 3610 -1804
2642a804k96P325o105m654Q974r03o103M816j112l207O743j797o787N944J741
2657B775n967M780O31p444N594N052q799J338O286o725P21P560p803l039R276
2672D236l097m190N811l778l276R087k111q462O358K141n297M795j32p726O362
2687G21M279q103J883L806o605M411N277r522J40Q929o225j502P102o601l276
2702e286J0959l323q099P205J84n170O831r86q535P012M018p643K011K884n955
2717c893M930L699r253K139P320o891L71O136p715o27R990n627n991Q261k172
2732F77m803Q464k522q565Q534K870p934L367J922o359O156L578r755J270P192
2747D092n253M96M153p527J593Q704o804l712P186l910j983Q218n083p086J0092
$$ plain form
2642 -1804 -2100 5225 -880 -5534 3440 2537 -3566 1250 138 -3069 3674 1877 -4910 1034 2775
2657 2775 -3192 1588 2219 -5225 369 5421 -3378 -2040 4246 -2479 -1758 5802 -2001 -5040 4236
2672 4236 1139 -3051 2760 -1018 -4294 4793 2682 -5780 578 2719 -2578 2217 2085 -5641 721
2687 721 5000 -3103 -1220 2586 -4019 392 5669 -3853 -3713 5216 -1009 -2511 4591 -2010 -5286
2702 -5286 5673 2350 -5749 1456 1640 -3530 3301 2315 -6220 792 4810 -2833 -822 2062 -3893
2717 -3893 1037 4736 -4517 -2378 4942 -1949 -1578 4558 -3157 -3784 6206 579 -5412 2849 677
2732 677 -4126 4338 1816 -6749 1785 4655 -3279 88 2010 -4349 1807 5385 -4370 -3100 4092
2747 4092 -1161 -665 3488 -4039 -2446 6258 -546 -4258 2928 -982 -2965 5253 170 -6916 3176
2762C176L85p093N596m81p390P656L874r689J490N566m772K314K907p953J895
2777b519P836n947k058N319m659K10P573o611m561Q500j450n050O359k106o032
2792e196Q081J161q809M082L877o293L907L095q173K208P157n897j518M751m667
2807b234Q23O180n630l396O914j559k921M669l943l146Q109j073p295N079J593
2822B170n176M990J561q488L809N852n862n42M131m982J425N826n392l065N654
2837A911j476j521L864l851k534O728j022n065L624n09k874N674p00o740M809
2852C18L241n610J744K620n505K521N260o041j775N664k719j159M508l759k348
2867c040N493p91l827K984q91j879M705j411m871M047J630l868K454P01m704L500
$$ plain form
2762 3176 3561 -3532 2064 1583 -5807 1849 5723 -3966 -2476 3090 -1682 632 3539 -4414 -2519
2777 -2519 5317 -630 -2688 2631 -2028 -1818 5755 -856 -5417 3083 1633 -3417 2942 836 -5196
2792 -5196 2885 4046 -4763 -681 3196 -3097 810 3905 -4268 -2060 5097 -800 -2318 2433 -2234
2807 -2234 -1411 4769 -861 -4257 2657 1098 -1823 2846 -1097 -4243 3866 2793 -4502 577 2170
2822 2170 -3006 1984 3545 -4943 -1134 4718 -1144 -1686 2445 -2537 -1112 4714 -678 -3743 1911
2837 1911 435 -1086 2778 -1073 -3607 3121 2099 -2966 658 149 -2725 2949 2249 -4491 318
2852 318 3559 -2051 -307 2313 -3192 -671 4589 -1452 -3227 2437 -282 -1441 3067 -692 -3040
2867 -3040 2453 1662 -2165 819 -72 -1951 2754 1343 -3528 519 2149 -1719 735 1436 -3268 232
2883B32L545n811J85M230l500L99L386l861j649N537j429l275K852p27k303M020
2899A831p38l600K539J137k573K299k93l155L319J750m462J575K210l352J113
2914d00K883m433O1M592k776j797L192j318j746L632j112l021K619Q10k025J334
2930D95n2k062K177Q44k221N59J029j588J594O28l246J066K418k199k94K177k180
2947h55l22L341j888k277K737J28k032J804K2k114J378J442j713J9O55j103J167
2964C89O05j762L46J076j114N22P98j910N05J968j984k48J960j245q67K044p52
2981C31j558K143p9k157J235J023j590K18R58o76K5M02m25l6M20n16N70j36p51
3000e99K67P87r18K57Q55j143k22J598j65j670J218M6r44R35K58j498L41J097
$$ plain form
2883 232 3777 -2034 -1849 2381 -1119 -720 2666 -1195 -2844 2693 1264 -2011 841 114 -2189 1831
2899 1831 1093 -2507 32 1169 -1404 895 602 -2553 766 2516 -1946 -371 1839 -1513 -400
2914 -400 2483 -1950 -1889 2703 -73 -1870 1322 4 -1742 1890 778 -2243 376 1186 -839 495
2930 495 443 -1619 558 1402 -819 -260 769 -819 775 1403 -1843 -777 1641 -558 -852 1325 -855
2947 -855 -1177 2164 276 -2001 736 864 -1168 636 658 -1456 -78 1364 -349 -330 325 -778 389
2964 389 994 -768 -422 654 -460 62 860 -1050 -545 1423 -561 -809 1151 -94 -961 1083 331
2981 331 -1227 916 837 -1320 -85 938 -652 -434 524 -152 -127 275 -150 -186 234 -282 288 152 -599
3000 -599 -332 455 -463 -206 649 -494 -716 882 717 -953 265 311 -633 302 560 -938 -597 500
3018E00n42m74O77J85o44O86j96j58m60J94L53k5k38r6M29l76K93N31j011k78
3038f50J113k17r52P60M37q60L15O77j149K22P89o31m69J092j61n49m70J148K4
3057D69q53J32K13J61n01N37K86n96j94J172j167l03R47qq77L44R13p94l07O22
3077A96n3m04M57l66m01P85N3o21K56L95M4o13L26K42l67N7J68M9n84M45L11p57
3099c82j35Q69j83q88Q97O23j264p2J294m76q03M57M78o55j38N19j05m89O41Q9
3119B77n32k12P77k02k66j24P89k17n97L84K23o71K65L35o53M92L51n70k48R36
3139E37m78m38K23N62o63J96P1j89o8N55l01k39M20J1l33m19M13N40m21o15O77
3160D1L96q37K16P71q44K94O52r44l85J232k10j320O91Q72j005j00P04R0k96j44
$$ plain form
3018 500 -42 -516 161 346 -298 388 192 34 -426 -232 121 96 -142 -238 191 -185 108 639 -372 -650
3038 -650 463 246 -706 54 491 -369 -54 623 -526 -304 485 -146 -615 477 316 -233 -703 445 469
3057 469 -384 -252 -39 122 -379 158 444 -152 -346 826 -341 -644 303 295 -582 -238 675 -119 -426 196
3077 196 143 -261 196 -170 -571 214 267 -354 -98 297 341 -272 54 296 -71 -14 154 203 -381 64 375 -382
3099 -382 -517 352 169 -719 178 801 -463 -535 759 283 -520 -63 415 -240 -378 141 36 -453 188 277
3119 277 -255 -467 310 108 -158 -282 507 290 -307 77 300 -371 -106 229 -424 68 419 -151 -399 537
3139 537 59 -379 -156 406 -257 -61 10 -179 -247 308 7 -232 188 199 -134 -553 -140 400 -21 -636 41
3160 41 437 -400 -184 587 -257 37 689 -255 -640 592 382 -938 -247 625 -380 -480 224 314 18 -126
3180a26o3J56K25n58L54j44RN81l3j180O49J082j061n04J025j57p74J040m98n15
3200d92Q07k94r62J328K38j394L23J178o69L1L62m67j17O29m35m72M55j78R8L01
3220B70r09P48J211j825l77J981o82j629J444M58j507J041K88j221K75J563j345
3237b16k73R49o28l43R64l33l54P45r56j35J611q24j107J145P5n77J039q73j171
3256a262J905K12j814J150M51j688J084J253k186J52J893j521l45J493j054o10
3272h87J447r3q57N77o3m02J274q73j031J244n2o73Q18k63j501J947O39k816J316
3291b49J525k015J54J778j564o67K217j352r63J790p18r02J729l80j488J487K9
3308D11j121J010Q8j613J857L28k286J030J162j365Q05N87k373J126K214k504
$$ plain form
3180 -126 -189 -33 192 -366 -12 -156 -147 434 401 -779 -130 952 -109 -613 412 255 -519 521 23 -492
3200 -492 315 21 -941 387 625 -769 -446 732 63 94 456 -11 -128 501 66 -406 49 -129 -31 270
3220 270 -639 109 1320 -505 -882 1099 417 -1212 232 690 -817 224 512 -709 -434 1129 -216
3237 -216 -489 460 -168 -511 453 120 -234 511 -445 -580 1031 207 -900 245 320 -257 782 -91 -1262
3256 -1262 643 855 -959 191 642 -1046 38 1291 -895 -743 1150 -371 -716 777 -277 -887
3272 -887 560 467 -390 187 124 -278 996 123 -908 336 284 -389 429 166 -1335 612 1251 -1565 -249
3291 -249 1276 -739 -585 1193 -371 -1038 1179 -173 -1136 654 -64 -966 763 383 -1105 382 411
3308 411 -710 300 388 -1225 632 960 -1326 -296 866 -499 306 893 -1480 -354 1860 -644
3324f44n44K509j768o72K598j319j855K431K51j914J251J70j720J702N32j966
3340i58P56N71j084J422J76k879J624J879k191k02J913j737P2K341j901j398K578
3357I82o29j416J938l54k217K317O80k410J292O29j811J401P92k395Q75J336j453
3374d43K27P92j737J017J969k725m63K749j500q58K257j463j461K872j32k641
3390a540J684R58k218J256R54k352O82J613j648N19R86j738O21J743k174l34J809
3407H21r90K5J660k287p06K925j054k041K178k14j802K459j30k760J729J971k515
3424g31K19J344j872P69J885k420m57K071r20mJ459k005m57K506r04j448J569
3441F04j036n35K265o79k596K226J088k347J509M50k355J515J847k712j83J770
$$ plain form
3324 -644 -1188 1321 -447 -1119 1479 160 -1695 736 987 -927 324 494 -1226 476 1008 -958
3340 -958 -202 369 -715 707 883 -1996 -372 1507 -684 -886 1027 -710 -638 1703 -198 -1596 982
3357 982 353 -1063 875 521 -1696 621 1301 -1109 183 812 -999 402 1194 -1201 -326 1010 -443
3374 -443 -216 576 -1161 -144 1825 -900 -1363 1386 -114 -972 1285 -178 -1639 1233 1101 -1540
3390 -1540 144 1102 -1116 140 1094 -1258 -576 1037 -611 -92 894 -844 -223 1520 -654 -988 821
3407 821 -169 -144 1516 -771 -1477 1448 394 -1647 531 317 -1485 974 844 -1916 -187 1784 -731
3424 -731 -512 832 -1040 -271 1614 -806 -1263 808 -112 -116 1343 -662 -1119 1387 483 -965 604
3441 604 -432 -967 1298 619 -1977 249 1337 -1010 499 949 -1406 109 1956 -756 -939 831
3457H31j270N1J407j618m50K285q27j063J206q70o52K357p93k120J869K82j537
3474i12J679k94k161J890J585l015O05J562j753P32J717k548l82K735r04j395
3490h59J450n05p25J824q65j670J601K43j118J149n45j313K075N82k231Q65P58
3507G16j607J198R45k580L50K517j407q79J463j142l56J960q34j971K003L72j188
3524d40J009n94j226J768M45j692N35L16p83J362J92k187J011J173j137r9J086
3541G39j485K26K112j699j300K007j93j055J305m51j415J705L58j546P45M32j038
3558e53J119p0j409P33J116j007K9L59j162M65J449j458o43J498m55o35J263q06
3576a67q02J743q5j507Q59N45j293R64M01j332K70J142o46j07L21p44L93R13j221
$$ plain form
3457 831 -439 -388 1019 -599 -1049 1236 409 -654 552 -318 -970 1387 594 -1526 343 625 -912
3474 -912 767 473 -1688 202 1787 -1228 -623 939 -814 -82 1635 -913 -1295 1440 536 -859
3490 -859 591 86 -639 1185 320 -1350 251 494 -624 525 -20 -1333 742 1324 -907 -42 716
3507 716 -891 307 1252 -1328 -978 1539 132 -747 716 -426 -782 1178 344 -1627 376 748 -440
3524 -440 569 -25 -1251 517 962 -730 -195 121 -662 700 892 -1295 -284 889 -248 -347 739
3541 739 -746 -520 1592 -107 -1407 600 407 -648 657 206 -1209 496 854 -692 53 485 -553
3558 -553 566 496 -913 -180 936 -71 -42 317 -845 -380 1069 -389 -1032 466 11 -624 639 -167
3576 -167 -969 774 689 -818 41 586 -707 257 658 -674 -404 738 92 -15 306 -438 -45 868 -353
3595c53k82P89k48j52J112j104k46J136j35j129Q22O2q92J123K3j361O99Q44q10
3614a02p4N70p56K23N79k89j31o8k36N73k6o74q7R88m83r8L44l05l43J083l65
3635C23j013P25L28p66O90K40r36K69P04p95j59N66j28k72M55j42l47N55m20J1
3655a12L40l26j7M45l53k56P11j91n81O93K21r96N49L49r48K56N74m68K02m1L7
3676H8n20P18p5n62N04j70J4J38j36k94K90J0r8K44k77O7K56q7l13M53k05k74
3698b29P5O60q25j47P40j59j0l3j57o9M29J69o55l3L22l0J30k06n5R9N1l3L1j24
3722e9j25K87m0m30M18J17l62J48L54L2m52J64nm01L10K98n58R6M10r9l35K0J21
3745i1j79J88L53k72j03o0J75J24k72M6R8N3J40k25jj72N33k77q8Q6J74l51n7
$$ plain form
3595 -353 -635 154 -94 -246 866 -238 -484 652 517 -612 210 272 -620 503 526 -835 -136 708 -102
3614 -102 -176 394 -362 -139 440 151 20 -48 -284 289 263 -411 -498 490 7 -91 253 -52 -395 688 323
3635 323 -690 35 363 -403 287 527 -409 -140 564 -231 -390 176 48 -224 231 89 -258 297 -123 -112
3655 -112 228 -98 -115 330 -23 -279 432 241 -340 353 574 -422 127 476 -472 -216 358 -110 92 51 88
3676 88 -432 286 211 -351 153 -17 -3 135 -1 -295 -5 5 -93 151 -126 -59 197 110 -203 250 45 -229
3698 -229 -154 506 -319 -466 274 115 105 72 -85 -154 275 444 -211 -244 78 48 178 -28 -83 16 67 34 65 -59
3722 -59 -184 103 63 -367 51 168 -194 -46 308 340 -112 52 47 -354 -44 254 -304 -208 202 103 -232 -212 -91
3745 -91 -270 -82 271 -1 -104 -164 11 135 -137 -91 7 60 200 -25 -26 -198 335 58 -30 56 230 -121 -178
3768a78M04r4j89N4n11P20j14j84NK17K44n32J02n4L73l89K17k86M65n17L12J36
3790B01l74M7K62k52j73L98Nl86k7N69m9k82j83P9J45rp8K7j09K03j9nj84q8L64
3815H2k01J0K22k90J50K68m68L10L9q0l53M82J17m94J04J52%o7N5J86l74K47j84
3838h7PL49l36m8n4J80J02O5p13N29L9P4l73M28N5n05O05k97j28K05J45o11K76
3861i3L09j21m05N07l5m33L37j89J6L4J78k38M59j02l18K07j32j51L42k04k06
3882b38M51J99n95k10P14l34J9K82n96K58O31r50J09M95j61l29J24L51m03M87
3902C04k04k00L26l46k16M37j66J57n4J97p77O31J65o83L81M43n54j75N55j64
3922E7m14L95m8k95M81l44j79N95j66k89K70J50m77K51K30m97K73L68o39K50N90
$$ plain form
3768 -178 226 132 -57 -3 -514 206 92 -92 -87 130 374 -158 -56 -110 263 -126 91 -195 270 -247 65 201
3790 201 -173 -126 136 -116 -289 109 114 -272 -299 270 221 -61 -244 -165 -20 -29 -107 -80 -189 14 -5 -10 -194 -282 82
3815 82 -119 -109 113 -177 -27 241 -227 83 122 42 -311 171 288 -206 -102 50 50 -17 38 224 -150 97 -87
3838 -87 -80 269 -67 -115 -169 11 113 178 -535 -6 33 107 -266 162 217 -288 317 20 -108 97 242 -369 -93
3861 -93 216 95 -310 197 162 -271 66 -123 -107 -73 105 -133 326 224 -94 113 -19 -170 172 -32 -238
3882 -238 213 412 -183 -393 321 -13 6 288 -308 -50 581 -369 -260 235 74 -255 -131 220 -183 304
3902 304 100 -100 226 -120 -336 101 -65 92 38 235 -542 89 254 -429 -48 395 -159 -334 221 57
3922 57 -357 38 -10 -305 176 -168 -347 248 82 -207 63 213 -264 -13 217 -280 -7 361 -278 -28 562
3943E62q04K13L52n42L18L82m18m86O50j31k15J70q2l31O14J84o54L80J04n23
3963b57J52L81o07K74J69l58K13M14p74M50J79k21k91O04n12N0M45l67m87J056
3983E13k48q48O81J19o41P71J14j078O76L87o16q3M72n30J76M61n10j74O94l32
4003Dj86P53q38m5Q57k76p40Q22m98n49Q56K47j030N83N65q40L39K33o03J77L76
4024B07l28q7M50m16R3N63o43j54Q67n09o21Q53m81l83J087j43p69O34Q0q69R39
4045C70N1j167O80O45j084Q6R51r87M40L57q10j05J179p02j37O60n93j86M78O8
4065A94n48O80k51n26Q46j24r37P68N50j117K20N45o96L84P05j336K70Q79k86
4084B20n31P54q66P0P54l97m74P78j26l81N89j59r25P19L53q24M12M13o50L58
$$ plain form
3943 562 -242 -29 323 -219 99 481 63 -423 227 96 -119 51 -31 -362 252 436 -218 162 266 -257
3963 -257 -105 276 -331 -57 112 -246 -33 381 -393 57 236 15 -276 328 -184 -134 311 -56 -543 513
3983 513 265 -583 98 217 -424 347 461 -617 59 446 -170 -253 219 -311 -135 326 -184 -358 336 4
4003 4 -182 571 -267 -312 545 269 -471 351 -147 -696 160 407 -623 -40 525 -315 24 257 -346 -169 207
4024 207 -121 -208 242 -174 -81 482 -161 -315 552 43 -578 275 -206 -589 498 355 -414 220 300 -569 370
4045 370 421 -746 -66 579 -505 -419 532 -455 -15 342 -468 -573 606 -96 -233 427 -166 -352 126 194
4065 194 -354 326 75 -451 395 271 -666 102 652 -465 -245 300 -396 -12 693 -643 -373 506 220
4084 220 -311 443 -423 -353 401 4 -470 308 182 -199 390 231 -694 25 378 -446 -34 379 -271 87
4104H7N86r47qN20l92M4N84p67j07J092n59p28Q75P8q54Q19l66l90M41M20q94
4125d66M74J73n55M39K83n47K6O09p73K87M82q19J43Q38o93o43J113m27m64P40
4145B20l80k97P18J89r76P20j12m33N15n9l73m6O24o38M03J89m09K22M88q02L4
4166b03N01j94k22N30p46O1N20jm93N11n4k30L40k10n18K57L02l39K00K11m06
4187a83J41K65n75m2Q71o49K81Q2o46J87M21k67M2M63m79l56N92l9n24L35L51
4208B71m21J92N4l87L16K20m27l6L64l94L48K10m02j4J48j38J31J54l41j31O82
4229C99j92o62O21j32l00M68k3m43L31L47m78L3K19l34J23K91m80k6M11J0j80
4250CpK7k74L18k87j7K84L41n35L16J4m80L21K69m61J16O1j68M3M04m64J68J58
$$ plain form
4104 87 673 -274 -282 238 -154 -110 474 -293 -400 692 133 -595 280 358 -496 323 -43 -433 8 428 -466
4125 -466 8 181 -374 65 348 -199 -173 436 -337 -50 432 -387 -244 594 -99 -742 371 -56 -520 220
4145 220 -160 -457 261 450 -526 194 82 -351 164 105 -268 -314 310 -328 75 264 -145 77 565 -237 -203
4166 -203 298 104 -118 412 -334 -273 247 246 -247 264 210 -20 320 110 -408 -151 151 -188 12 223 -183
4187 -183 -42 223 -352 -394 477 -172 109 191 -455 -268 153 -114 -72 391 -88 -444 148 109 -415 -80 271
4208 271 -150 42 96 -291 25 245 -182 -218 146 -248 100 310 -92 -106 42 -96 35 189 -152 -283 399
4229 399 207 -455 166 34 -266 202 179 -264 67 414 -64 -31 188 -146 -23 268 -212 -238 173 183 3
4250 3 -4 23 -251 67 -220 -237 47 388 -147 169 183 -297 24 293 -168 -52 9 -159 -116 288 -176 -8 150
4273A50o3j36N0P8m38M37l4k59J91J76k34L27k72J08r1K9j27l9L31m29L23q3j67
4296a72O5J17k04J99J77j32%L5M9k14Q1q3l4N8J64j18j39Q3m6J07Lj9k3K76k21
4321Ik88N45l90j26M24m25J23K16k49J17N0k37K33O4OK7j91L63k35P6k91J78J26
4344A25l4j59K13j99j2J82J3k32J89N7k39j6J37L2p6%L6O6J5n1k70R2OO6Q5p9
4370e3J53m5J28Lk45J20pM7p5j86k12M52j29N8N6j62N2l5L61k89m7J33j69K42
4394A51j24l68KN12l29k5J62Q0J8j45J17j08o0R8J70m41K47j15K29O5mk80J57
4417Ik1j04K73p7l05K84p1r4P6n1o0M8P1J16o1o1J18k61J00r1K14l45J93K52j07
4442D5j92L44j5j41o9j9J99j54k34K31J12o6J26q1K71m27m6J74J51m15K92q5k11
$$ plain form
4273 150 87 -49 1 79 -359 78 44 -215 -24 152 -82 245 -27 81 -10 19 -108 -147 184 -245 78 -5 -172
4296 -172 -107 10 -194 5 182 50 50 85 134 -80 1 -82 -116 -58 106 -12 -151 -68 -114 -7 -4 -23 -46 230 9
4321 9 -279 266 -124 -250 174 -251 -128 88 -161 -44 6 -231 2 66 72 99 -92 271 36 112 -179 -1 125
4344 125 91 -68 145 -54 -66 116 129 -103 86 143 -96 -112 25 57 -19 -19 17 83 98 47 -223 -131 -125 -59 26 -53
4370 -53 100 55 183 186 -59 61 54 101 26 -160 -372 80 -49 9 65 -97 -45 -80 281 -8 -55 78 -91 151
4394 151 27 -341 -339 173 -156 -181 -19 61 79 -66 51 -57 -117 -19 151 -290 -43 -158 71 136 132 -148 9
4417 9 -12 -116 157 80 -225 59 -12 -106 -30 -81 -141 -93 -22 94 33 -28 90 -171 -71 -162 52 -293 -100 152 45
4442 45 -147 197 182 41 -28 -47 152 -2 -236 -5 107 41 167 86 357 -70 -116 58 209 -206 86 1 -210
4465b10J21M08m13n2K48J9q2l08K05J13K0k32L21q0j60l1K74k55M9J19j54j02
4487a82J59J16j42l8j03J57J30R6k13j44J08j05K34j51K97j97p2R9p3L4m8j08
4509a46J59P8j58qj27J26j32K19K3J32j66j04j3K78j97N6q7R3o0R5j37J87L05
4532D16l59o6o8N0J60j30L1o2J87k78p3L44l2k82j1J3K53j36j00LJ66j25j17K69
4556E3l15L82j2p3r2M6J9J15l4kJ5k22J28L5R8j08JJ1K81l11j78M4M8K14m02J25
4582a34k31K33L35l40K28j25p8K20k79J96J15R4k36J30j52J13j66J6N1p2j45L40
4604A13m6O3m1j40P7J42l41O5K03k17J40J56l80K03m0J16n3J78j88R3l06p2J92
4627h3M1J72m28L46J56m7r9r0l00N44m0l70J22K68r3l31K21K08j89J94n3k49K68
$$ plain form
4465 -210 -89 319 -94 -146 102 121 39 -269 -64 49 69 -163 158 78 -82 -113 161 -94 -45 74 -80 -182
4487 -182 -23 93 -49 -87 -190 -33 97 193 -20 -164 -56 -161 73 -78 219 22 -50 49 -24 10 -38 -146
4509 -146 13 91 -67 -75 -202 -76 -208 11 34 166 0 -104 -117 161 -36 20 -67 26 -34 61 -76 111 416
4532 416 57 -9 -77 -27 133 3 34 -28 159 -119 -192 152 120 -162 -173 -160 93 -43 -143 -140 26 -99 -216 53
4556 53 -262 120 108 35 -57 -11 8 123 89 87 102 -120 8 43 141 33 34 45 326 15 -163 -119 -71 143 -259 -134
4582 -134 -365 -132 203 -137 91 -34 -112 108 -171 25 140 234 -2 128 -24 89 -77 -61 -10 -82 -227 113
4604 113 67 130 89 -51 26 168 -173 -108 95 -122 18 174 -206 -3 -43 73 20 198 10 103 -203 -275 -83
4627 -83 -42 130 -298 48 204 157 58 -32 -332 212 172 -198 -76 192 99 -232 -11 197 8 202 149 -100 168
4650A68M9m74K09M9k52J93J49o4J51Q3l36M1J63j62p1K25j60O6M17m25k56K10
4672b7J04l06N65k00l00J59k1r9M19k97j08l8M88l09p9n1q4J02K1N0j51K32p3
4695cj71L8J55k70L72k54nJ89p1l7K34j49J5p3N2J07j69K9j8j8K04r4K6M2j91
4720f0o0P2Pj30J02J39N8l9k14m5M28j78j62K17j52r0P3L08l35j0L92n11J11K58
4744A79P6m08K99q8l06K86o2J58j02r5jK23j73l8j14L42k58k60L84j96K74n4k04
4767a38n6K80K8k14J43l06L16M5J09k47K6n9K9k7Pq7J89K12l15j97K49k2nK29
4791A89m00P0L00k24P1M6k32m6K22J25k30K07k23j80M09m0k56N4K71k42j58K59
4813hk07P4N16n72J80M06l00j25K11k96j08K15r1l7Q0m7p2K67j82j47L43m0k41
$$ plain form
4650 168 217 -257 -48 1 -251 -58 91 27 178 261 -75 -34 129 -33 -104 121 -39 27 444 19 -237 -27
4672 -27 77 -229 336 136 -164 -5 -26 -125 294 -3 -111 -149 339 30 -49 -100 -184 -82 -61 -11 -162 70 -3
4695 -3 -174 -136 19 -251 121 -133 -138 51 -20 -57 177 28 43 -30 22 129 -40 -11 -29 -47 157 63 89 131 -60
4720 -60 -120 -48 -41 -171 -69 70 128 89 -125 -170 258 80 -82 135 -17 -107 -34 274 -61 -71 321 -190 -79 179
4744 179 255 -153 146 58 -248 38 -24 134 32 -63 -64 159 -14 -52 -166 176 -82 -342 42 -154 120 66 -138
4767 -138 -194 86 114 -100 43 -263 53 98 207 -40 -14 -73 -44 -71 -64 -151 38 250 -65 -262 -13 -35 -40 189
4791 189 -211 -141 159 -65 6 52 -180 -226 -4 121 -109 98 -125 -305 104 64 -192 -138 133 -109 -267 -8
4813 -8 -215 -141 375 -197 -17 389 89 -36 175 -121 -229 -14 -105 -142 -62 -109 -181 86 -96 -243 100 60 -181
4836a81J93J59m27K75K66l03j40K38K65j09R0l24k06N86l18k43R1K32k36Q6M1
4857C5l01M94o0l17J5L56l82K57J90m14k19O13j83m12N33l31K7J67P6k77K26j96
4879a03P0K78k3n97N33J45n04K70k08l6K04J28k20J62N6m4j81K72l70O1L51l19
4901g5Q9J07r9j2K66m35lK45o7j89L68r0k93K66J23k45N2P8j49L3j8j05J62K43
4925B52j37j79J18l0n1L5J49l84K48j02np8O7j48J90K46k38J07L04n94J12M09
4947B91o15M22J27m63K08J46k56R2K81k09j39L6Lk3L26o7j98M07m11NJ9J41j74
4970e1J47R0k58J66j03qL2J47l01OJ55j23K0J66k49J12K97l13j14J97O4k13J02
4993c2j9R2j98K32l81%M95l40j48M00J77j96K29j35l22L12j42k46J31k18J49M38
$$ plain form
4836 -181 12 171 -256 19 285 -18 -158 80 345 236 326 2 -204 382 64 -179 -88 144 -92 -6 35
4857 35 -266 228 168 -149 -134 222 -160 97 287 -127 -346 267 84 -328 205 -126 -99 68 144 -133 93 -103
4879 -103 -33 245 222 -375 158 303 -201 69 -139 -175 29 157 -63 99 155 111 -70 202 -168 -107 244 -75
4901 -75 14 121 22 10 276 -159 -162 83 16 -173 195 105 -188 78 201 -44 8 86 -63 -30 -48 -153 9 252
4925 252 115 -64 54 24 -27 8 157 -227 21 -81 -86 -164 -97 -245 -55 191 -47 60 364 -230 -118 291
4947 291 -324 98 225 -238 -30 116 -140 -48 233 24 -115 -79 -76 -99 227 160 -38 369 -42 -37 -18 123 -51
4970 -51 96 186 -72 94 -9 -17 15 162 -139 -133 22 -101 -81 85 -164 -52 245 -68 -182 15 79 -134 -32
4993 -32 -51 41 -157 75 -306 -306 189 -151 -299 101 278 82 311 176 -146 166 24 -222 -91 -309 -160 278
5015B78k37k40M53k84q5J88J34n35J72L65k40K32l08K3J11K8m6k4J84o6q7j65
5037a49M05m05J00K50k34L9q4n0J47j93R6Q5j8N9o8J23j29P7J27k08j77K61J2
5060F6k74K77Rj48L18j18j07mK00n12K28P9k7J98j78j5k4P5P3k4M9k30J77j75
5084h7Q3j45N6O7j56K79j95p9K59j04J6m4J60j35q4P3k2K46M7l92J37M1j71K03
5108E3J55l32pL12j50l97O01j57j7k39L38k14K62k23q0J93r1o5L1L9o7R2m9M7
5132C5O7o5j09j00R1M5Q4j91J06j44L13l99L7K76O2j40KK48k25o4J00j12o7N6
5156i4K33l36P6J02q0J17K31l36L63j44l15J91p1J93m3j98J49J31r1j57K02j91
5178f8K65k05J89p9PR8l73K84j05L2j93M14k45j52M09k97j72K61k96K35J04k04
$$ plain form
5015 278 41 -199 254 -30 -115 73 207 -328 -156 209 -31 201 -107 -84 27 55 9 -15 169 103 16 -149
5037 -149 256 -149 -49 201 -33 6 -78 -128 19 -174 -78 7 -11 48 -20 103 -26 51 178 -30 -207 54 66
5060 66 -208 69 78 -70 248 130 23 19 219 -293 -65 14 -13 185 7 -8 -32 43 116 92 141 -89 88 -87
5084 -87 -4 -149 -93 -26 -182 97 -98 -177 82 -22 -6 -50 110 -25 -109 -36 -58 188 235 -157 -20 21 -150 53
5108 53 208 -124 -131 181 31 -366 235 78 61 -178 160 -54 208 -15 -95 98 7 -58 -27 12 -55 37 -12 35
5132 35 102 37 -72 -172 -81 -36 48 -143 -37 -181 132 -267 -230 46 108 -32 -30 218 -7 -71 29 -83 -150 -94
5156 -94 139 -197 -121 -19 -99 18 249 -87 276 132 -183 8 -63 130 87 -111 38 169 78 -79 123 -68
5178 -68 197 -8 181 102 109 207 -166 118 13 45 -148 266 21 -131 278 -19 -191 70 -226 9 113 -91
5200i1J14r4J07j2j7k1p4Q2J81l63K34k11KL13N6l03J56J86l39q2L86l10j4m2
5224a56J24O4J60j69j80L32j20j65J26J26k88J71j9j87M25k77nK97l57K6n0oJ72
5247D4o7l5J67j49ON8j72J12J71q0KR7j23K0N1k97M08m5m14K71k31J76P0M1q5
5272dJ92Jj46j04K63j17l05O26m66k8pK12l97K28L46n15L17P9k73L30l80l4N30
5295C48l33j57L64j16k44J75J71l18j8L02l03j00L70J04n24M17j54l44M94J1m57
5316c12N30k26M9J17k5j56J53M9m78L38L43m20J9K69m24P3M79m65NL90l38Q9K28
5339B87k18k33L69J03m94K73R8m08N40j77n02M50k9k54O7N42o19O7J37k09K91
5360H1n8j72j2M14m34l8N30l89n2M20k17k13L08q4m84O42mm98K03L18n63J8L89
$$ plain form
5200 -91 23 -71 36 24 7 -14 -88 -6 175 -188 46 -165 -163 150 206 -97 59 245 -94 -176 210 -100 -114 -156
5224 -156 -32 32 192 23 -157 175 55 -110 16 142 -146 25 6 -181 244 -33 -38 259 -98 -72 -122 -128 44
5247 44 -23 -58 109 -40 -34 24 -148 -36 135 55 57 154 31 51 102 -195 213 168 -246 25 -206 -30 40 81 -4
5272 -4 188 189 43 -61 202 85 -220 406 -60 -88 -95 117 -280 -52 294 -221 96 175 -98 232 -148 -182 348
5295 348 15 -142 222 106 -138 37 208 -110 -128 174 -129 -229 141 245 -279 138 -16 -360 134 145 -312
5316 -312 218 -8 41 158 133 -23 130 179 -299 39 382 -38 -19 250 -174 -101 378 -87 -82 308 -30 59 287
5339 287 69 -164 205 308 -186 87 185 -223 317 140 -362 88 59 -195 -128 414 -205 -138 -1 -210 81
5360 81 23 -149 -161 253 -181 -219 311 -78 -130 290 73 -140 168 84 -400 242 238 -260 -57 261 -302 -284 105
5383A05j64j51M90o79L75P0l20j8N24j58m65Q57m89l52L78j08k60P82n25k5N8
5404g5L44n24L59lk15l5K90j15k84M08m69K80L38k43k92O84p77L18R3l50J33O21
5426D86l99k25K39q1m67N02L7k67K12K06o33K62L46l56J59L78n57J30M32n26j71
5447b93O73m30j40N55m71k18N12j99l65O29r9n95N93K90o94L24K52n52K72J49
5467A93m13J9K17j21L0L32n23N4L99j28l74M84j83k18M97k64l30M83J67n86K66
5488AK90m41J87P2n73K70M52p81M74M10l12k42N55l09m03K27j0J4K26k39k16M04
5510E6K00n19L42o7k56M21J4m27K25L60n34K30K92m82J56M38p44n4N54k03j13
5531a11K75R0n01N1K89j65p0M59m44N17l01k78L72k16K1K50j06k64j00N75p54
$$ plain form
5383 105 -59 -210 280 -399 -24 46 -274 -292 232 74 -391 466 -23 -375 3 -105 -365 417 -108 -133 -75
5404 -75 269 -255 104 101 -114 -149 141 26 -258 150 -319 -39 299 56 -236 448 -329 -11 82 -268 -135 486
5426 486 87 -138 101 20 -447 55 92 -175 37 243 -390 -128 218 -138 21 399 -158 -28 404 -122 -293
5447 -293 380 -50 -190 365 -106 -324 188 -11 -376 253 154 -441 152 442 -252 72 324 -228 44 193
5467 193 -220 -201 16 -105 -75 257 -266 -212 187 59 -315 169 -14 -232 265 1 -329 154 321 -265 1
5488 1 291 -150 37 109 -464 -194 258 -523 -49 361 49 -193 362 53 -350 -123 -133 -119 107 -132 -348 56
5510 56 256 -263 79 12 -244 177 191 -236 -11 349 -185 45 337 -145 11 449 -295 -349 205 2 -111
5531 -111 164 254 -247 -196 93 -72 -142 317 -127 390 89 -189 183 -33 -12 238 132 -132 -232 343 -411
5552d11J36M01l27J07K87j2m23M24j54k21L47j80n2M38j17n69K12M68m92J3m4
5573a69J94l5M30r24L38L77l03K41k47l96L24M91n51K15J36j78j94L97j22k92
5593b68K13L40k51K07j53l29J83J91n6k21L74n14J68J90j64R0J28n08L43K48l45
5614a34K2M25l08j29J76l8k50L05k36k12L23Q0n5o8j5R6K35j08k91L3L96m40m5
5637b38R8P5J00qQn0O5L5k10K67N8l47L01j02k49L22r3j11L4J14n18L79K69k46
5661d7j59J72J38k32Q8L6J38lP3k88K34j50Mn1K78n98K60m2K44J2k29M4p8K05
5685D9k38J01L05l05p4M28l25N4l9J19J92m42l3J98J8j9K80l11R2m22L77K9j69
5708a35MP0K14l09J79J2j95J85Np7Q2r7rR8mm9O4M3j1J14n5k14K39j61k42J15
$$ plain form
5552 -411 -275 126 -201 -94 193 181 -242 182 28 -193 154 -26 -78 360 243 -326 -114 354 -138 -125 -169
5573 -169 25 -10 420 -504 -166 211 -92 149 -98 -494 -170 321 -230 -15 121 -57 -251 146 24 -268
5593 -268 -55 285 34 241 88 -241 -58 133 77 -144 230 -284 -116 74 -90 0 128 -380 -37 211 -134
5614 -134 -112 313 5 -124 52 14 -236 69 -167 -379 -56 24 -31 -99 -114 -18 217 109 -182 -149 247 -193 -238
5637 -238 -140 -65 35 27 35 -15 50 85 -125 142 200 -147 154 52 -197 125 32 -79 -45 69 -449 -70 199 -47
5661 -47 -206 -34 104 -128 -40 -4 134 131 204 -84 150 0 4 -47 231 -367 -107 -149 95 107 -122 -78 -156 49
5685 49 -189 -88 217 -88 -162 266 -59 -5 -44 75 267 -175 -208 -10 8 -11 269 -42 50 -372 5 34 -135
5708 -135 -131 -61 153 -156 23 35 -160 25 30 -47 35 -62 -71 27 23 -26 38 81 70 184 129 -85 154 -7 -249 -134
5734a34K49L1r9Mm8k83M03Rk89J91m4M6J58k64r1K67J07k91K80k16R4Jo2j26k94
5759d01K57l2M49j98k05K19k22j23J46l9L2J11K34j86j47J36j82n8K49K12l82
5780a30l00M55K9p1K11k30O6mn0K1R2L4r3J60k83R1p2J6n1l2J19M3K80j44m5j86
5806g4oj0L89l7l37J23K26n21J06P4M46m67r2M08l64K30J3m5n2j50J58K1p7M5
5830GJ33p3j68J38K6r8K3J36j54K72k43pQ5K3o4%Q7k52J82l4K47k95j22J12k2
5855f1J33j68J96j26l3J57j44mj6J45Mj81K0L6J33j49J68n7k98K87J47k23J25
5878I1L3l40Q2K37j71j01j18J71J40K11l33k9L56m47K60O8k56J3L57l79P4L34
5900B53j81j60J24J7k05K70k65J53K03j05k14J49k0Q9p6J22k24O3l7J43k01K76
$$ plain form
5734 -134 115 146 47 51 3 -280 123 132 -157 34 -10 36 194 -70 -161 106 213 -78 202 -14 80 81 19 -107 -401
5759 -401 -144 -176 273 75 -130 89 -133 -256 -110 -149 -117 -6 228 42 -105 31 -151 -209 40 252 -130
5780 -130 -430 25 54 -17 194 -36 30 26 -24 -3 89 123 30 190 -93 -2 -74 -58 -109 -141 -22 21 301 157 112 -74
5806 -74 -80 -90 299 262 -75 48 274 -247 -141 -67 379 -88 -180 228 -136 94 107 62 10 -140 18 39 -38 7
5830 7 140 67 -101 37 63 -35 -12 124 -30 242 -1 -8 77 100 36 36 123 -129 53 19 266 -29 -151 -39 -61
5855 -61 72 -96 100 -26 -59 98 -46 -50 -66 79 83 -98 -78 -42 91 -58 110 53 -245 42 189 -34 91
5878 91 124 -216 -134 103 -68 -169 -287 -116 24 235 -98 -127 229 -218 42 110 -146 -133 224 -155 -81 253
5900 253 72 -88 36 53 -152 118 -147 6 209 104 -110 39 19 108 32 154 -70 -7 -44 99 -102 174
5922A74l68L02o7o2J4J01o6j78M34k94oO1j21j73L39j04l18M17q6m0K18j08k06
5945a37m5M36k99L4J77k90J20j33K4K89J56m18m7L98l34Q3K02j02l08L62P6l06
5967f2K07J25l23Q1P4j38J41p9j76K9J31j07LJ94J29j51j93j06R3L88l90QM91
5990C69m21k85M87l4n10M46J37l82Q3M0j40K19K87m23j17M50k95k12N78n67L07
6011A7J7j28k88N39j48n8L61m70r6N09k04j46K61J48l89J08L72q00N65K09m89
6032a10q6L57l22j9J48j98J10M40l10j62L32M6m12M86j04l73K68k7m35N11J35
6053B75p45L34M23o45K48N39p10K1N50n05n6O24m33q8M91r6m75O53m11m15P00
6074B79l23m27N16j7k17J91J21l96K01M34n85N3M46o07J79J97r3k61P05m22j15
$$ plain form
5922 174 -194 108 41 -21 -7 94 28 -150 284 -10 -16 45 -76 -249 90 -14 -332 85 -1 -41 177 69 -137
5945 -137 -182 254 -45 -11 166 -124 -4 -137 -113 176 332 -86 -133 265 -69 14 216 114 -194 168 244 -62
5967 -62 145 270 -53 28 102 -36 105 26 -150 -121 10 -97 -94 100 229 78 -115 -221 -128 260 -130 -122 369
5990 369 -52 -337 150 116 -394 52 189 -193 -110 -70 -210 9 296 -127 -244 206 -89 -301 277 -290 17
6011 17 34 -94 -382 157 9 -49 312 -158 -254 255 51 -95 166 314 -75 33 405 -395 170 379 -110
6032 -110 -196 161 -161 -180 -32 -230 -120 320 10 -152 180 226 -186 300 196 -177 91 64 -371 140 275
6053 275 -470 -136 287 -358 -110 429 -281 -260 290 -215 -271 353 -80 -168 323 227 -248 405 -6 -421 279
6074 279 -44 -471 45 28 -189 2 123 -273 -72 362 -223 -170 276 -331 -152 45 -48 -309 396 -26 -141
6095a41K68k08j8J49K57m72J88K96m17p6J69m44M58l3l28N32R7m63Q7J80l99J97
6117a21N96o27k6M50k44k15L50k21k15M20O7n92M04L83n36J28L31p91M00L01n02
6138b60L31ql53J29M07k29j41L47l64j95O89k64o08P89j22m86N44qn97O63po35
6160c78K07N51n88J90L72o07K39J87k56j14K44L1k54M58j24m39N85k20o65O58
6180G7q2m32P08m8n37M38p6l83N05R7l51Q1L32o69OO30m34k07O78n31p3N59k49
6203C9q8N00k08p78P62m79k11P39O5m74J79J54o12N43J57n39J05K36k54J3N72
6224D21n31j20L68j29k65N33l03k81J95J58m31O09k1o91M92L02o10L05Q8n38K34
6245b15L82l94L2L91k04j13K68j18k52L53j52j29N12l77l17P18l71k58M94j09
$$ plain form
6095 -141 127 -81 -99 50 307 -165 23 319 -98 -174 -5 -449 9 -24 -352 180 277 -186 -99 81 -318 -121
6117 -121 475 -152 -178 272 28 -187 163 -58 -273 147 214 -378 26 409 -127 1 332 -459 -59 242 -260
6138 -260 71 63 -290 -161 246 17 -124 223 -141 -336 353 89 -519 270 148 -338 206 198 -399 264 257 -378
6160 -378 -171 380 -208 -18 354 -253 -14 173 -83 -197 47 78 -176 282 158 -281 304 84 -581 77
6180 77 -5 -437 271 223 -314 124 48 -335 170 267 -84 -3 329 -340 -334 296 -138 -345 333 -198 -271 288 39
6203 39 -49 451 243 -535 227 -252 -463 276 341 -133 46 200 -412 131 288 -251 -146 90 -164 -151 421
6224 421 -110 -230 138 9 -256 277 -26 -307 -112 46 -385 224 203 -488 4 306 -304 1 89 -449 -215
6245 -215 167 -227 -195 196 -8 -121 147 29 -223 130 -22 -151 361 -16 -333 385 14 -244 250 141
6265A41l98J40L25l02L14k6k62l7K66l46K60K77n22PL70j58m23O13l32k22J62
6286a53J41l91N85m8l57R7K69k86M09q5m15J78K93r3R6Ko38K94M01n85j0N01l7
6309A68j35J91k02j39P2J39l05R8Q8j30J86N8j92K66l17j5J3K60k14rK73l14m
6332a64L24n11L98L21n60Q7K65j51j56N59m25k00L50q8k02K13Pk05N0L69k76n0
6354d5K45j16j12K1j06j2K52n5m16N56m8j88J32r7l19O87n54Q3r4K49o4j64K13
6377D8k8j53K37k05RJ19j66K61p2m7K8p3l26K32O8L5l4m0O7O1q0J2L9J97j13k21
6403a45J85K22n52M04j11L15n92M28k10k3K54k81k1K17n8m4j11O5q4R0J77nl7
6426H3j05p3M9K84k11K78j37l18J70J82k48j03J58J34m82M23l0m3K0J60l05L45
$$ plain form
6265 141 -257 -117 208 -94 220 194 -68 -105 161 -185 75 352 -170 -163 207 49 -374 239 -93 -315 -153
6286 -153 -12 -403 182 134 -223 -126 143 -143 266 181 -234 -56 237 144 240 242 -396 -102 299 -286 -296 205 168
6309 168 33 224 22 -117 -45 94 -211 -113 -25 -155 31 89 -103 163 -154 -169 -156 104 -110 -119 154 -160 -164
6332 -164 160 -351 47 368 -192 -105 160 9 -147 412 -13 -213 137 49 -153 60 67 -138 -88 281 5 -45
6354 -45 200 84 -28 -7 -113 -125 127 72 -344 212 164 -24 108 11 -308 379 -175 -92 -186 63 -1 -165 48
6377 48 20 -133 104 -101 -92 27 -139 122 50 3 31 -42 -368 -136 -68 -33 -67 -107 -40 21 -59 -47 -8 189 76 -145
6403 -145 40 262 -290 114 3 318 -274 154 -56 -79 175 -106 -127 90 32 -12 -123 -58 -142 -52 125 120 83
6426 83 -22 -95 -46 238 27 305 168 -150 20 202 -46 -149 9 143 -339 84 54 11 31 191 -114 231
6448B31l01K06k7j93J52Q0j52j40K31r0J1j0K31l97J45Q4l02Q0O4K4l2J51j44
6471i8J03J90k27m9N9k08Q5Q9N4O0P1k74P6J50p3J46k22J05k02J21n6O0pL50l32
6496b9P2O7k88N1L97k05k96K55R0k59P2J71l8j6J62j15K8k8k40K47N6j79J59j64
6520c0q5J53L4m7j80N30m49r7L78k15l8O9J57n25K88P7l28L27n8k09K5J42j39
6543b20l6K75j78K07J35m56M09j44o8j44K51J25j91K27j80m27M62K87m07L0J16
6564G3j52K8K31l25J04M73m28p0J48j26K3J53l07k2J64J9K4J6k24j60N82k00k22
6587a98L19j57j28J14J06k09L79j38p6j29J96l40K12Q5q0j19M7J1l8L03j50k58
6609b48M79l19Q2K87l16j38N68l41k46K46P7k93K40M3m07J56M75k97p0J68k81
$$ plain form
6448 231 -70 136 109 -84 68 148 -4 -144 87 -3 8 -2 229 -168 -23 61 -241 -161 -97 -73 -105 46 -98
6471 -98 5 195 -32 -81 -22 -230 -145 -56 -2 58 129 -145 -69 81 8 154 -68 37 -165 -44 -100 -40 -47 303 -29
6496 -29 43 110 -178 -127 270 65 -231 24 114 -145 -73 98 60 44 206 91 119 91 -149 98 154 -25 134 -30
6520 -30 -115 38 72 25 -155 375 -74 -171 207 -8 -46 23 180 -345 -57 20 -308 19 -39 -248 -223 -81 -220
6543 -220 -256 19 -159 48 183 -273 136 -8 -76 -220 31 156 -35 192 12 -415 47 334 -73 -43 73
6564 73 -79 -51 180 -145 -41 432 4 -66 82 -44 -21 132 -175 -197 -33 -14 10 26 -198 -358 224 24 -198
6587 -198 121 -36 -164 -50 56 -153 226 88 12 -117 79 -261 -49 36 -44 -163 -116 -105 -143 160 10 -248
6609 -248 231 -88 -6 281 -35 -173 395 54 -192 54 131 -162 78 121 -286 -130 345 48 -22 146 -135
6630a35J6L00k87o8K09m4l8K02k08j93L73J88o25O58l10k29K39j71l04N43J25
6651B41l87J8O57r94N63N6l63J44M58m16l34N69k46j24L87k52k14L41j83j38L60
6672A43ro85P77j28m60M53J30n85N63J30o18L22L02n62J37L59l63l23P32n06k49
6693d40J011l15o10O21l11l86O15M8m26M14m6o01M60m9j14L22K85r37M26M90q16
6714c59K08N48o12M2O72n26k34M37l15k33O07j87j50K9J98j84R7J76n27M43J03
6735B33n18L12K92o27L58L42q28J78N97m34o3N01l52m58P15k65j98O34j78m70
6755b29N20k9m18J75M3l62M32N8p14M88J72j23l7M70p63J13O02o01r7M64j28k52
6777b16N66k88m59O45j04m46K84k2l61M55L82o20O8M17q84O66J82q06K75P80p89
$$ plain form
6630 -135 -119 181 -106 -174 35 -9 -47 155 -53 -246 127 315 -310 348 38 -191 48 -123 -427 116 241
6651 241 -146 -128 529 -465 98 154 -209 -65 393 -23 -357 212 -34 -158 229 -23 -237 104 -79 -217 143
6672 143 134 -551 226 98 -362 91 221 -364 199 329 -289 33 335 -227 -90 269 -94 -417 315 -191 -440
6693 -440 571 256 -354 267 -44 -430 185 233 -193 221 175 -426 34 -15 -129 193 478 -459 -33 457 -359
6714 -359 -151 397 -215 -173 499 -27 -261 176 -139 -372 235 48 -102 -73 125 -59 38 214 -313 130 233
6735 233 -285 27 319 -308 50 392 -436 -258 339 -95 -158 343 -9 -467 248 -17 -215 419 241 -229
6755 -229 291 262 -156 19 62 -300 132 190 -524 -36 136 13 -24 446 -317 -204 398 -203 -300 164 36 -216
6777 -216 350 62 -397 248 144 -302 -18 -40 -401 54 436 -184 -116 301 -583 83 265 -541 -266 514 -275
6798b75j21P77n94k2Q65n73l23O46n26j22N41j69n01O90j01p01N37K93o84L40
6818b3L28k88J08M8l24J35M07n89j10N11m94JQ05o94m57J152n30m25Q13k16o26
6839d68L51L67o60M99J72o87L88L88p78L93J06k96J08J97l98P7O18m90j12N15
6859B90n54K0N63l07m06Q36k23n00L38K77p76M21J98m32J34O48o53j54M30m40
6879b90R6M81l54k40O16m58l2M93o49r0Q66m08k00M40r2l82N17l23l08L92L93
6900D68q25J72N59p32J45L82l97j49O61l51k13N28k55n18Q29l07k38O20l27k73
6920b21L00R7m03N80N7p14L93L8n54M09K42m93J32L97m81J28K48l36Q4N01o04
6941b00qJ70K01m95O36k44k82K98j6k88L09K14m03L7K73m00J43K60k81l8M34l59
$$ plain form
6798 -275 -396 381 -213 -235 630 57 -266 380 -146 -268 273 104 -397 293 192 -509 28 321 -363 -23
6818 -23 305 17 125 173 -151 -16 391 -198 -308 203 -291 -290 515 -179 -636 516 -14 -439 374 158 -468
6839 -468 -117 250 -410 89 261 -426 -38 350 -428 -35 71 -225 -117 80 -318 -241 377 -113 -225 290
6859 290 -264 -244 319 12 -394 442 219 -281 57 334 -442 -21 177 -255 -121 527 -126 -280 150 -290
6879 -290 -194 287 -67 -307 309 -149 -181 312 -337 -427 439 31 -169 271 179 -203 314 -9 -317 75 468
6900 468 -357 -185 374 -358 -213 169 -228 -377 284 -67 -280 248 -7 -525 304 -3 -241 379 52 -221
6920 -221 79 176 -227 353 410 -304 89 127 -427 -18 224 -269 -137 260 -221 -93 155 -181 -97 404 -200
6941 -200 -208 -38 163 -332 304 60 -222 76 60 -228 81 295 -108 -71 202 -198 -55 205 -76 -114 320 -39
6963c9m41O52k85j9K71j50k96P69m10l08M09Q2l89J88R0n55N02J43m59M13q9j80
6985a01k61Q15n99J24J53k10j9K15k30j35M05q5k81K28Q4j77J35r7l71L03P8o
7007c2j0Q9k5j42L78l02J00j5j07K88K48n50qL57k53r1j12K83k87K03j20R7J47
7030A36o7j39Q3J37k08K49J5l37O8J87k99L19j36K05j58o6q8N1L97j16k11P4j7
7053G9J1J63j93k61J51M06m02n4K56l01R7O7N7k25J06M6j43L38j96J46O2l08K63
7076A65j99j9J63m9J9l74K37J78n50M95k6l50J96L57m56K93K78n04J0M42m93M4
7098a43K95k01q0J31J55k05MK0l22K62L08k46K98l15N2M6j34j56J83J68j50M0
7120A0K31l12KK96j63k10K57J52m28L43j21J47l28K30j70o1L13p5QO2k93K62k22
$$ plain form
6963 -39 -480 172 -113 -132 139 -11 -307 462 52 -256 153 235 -154 34 124 -431 71 214 -245 168 79 -101
6985 -101 -362 453 -146 -22 131 -79 -98 117 -113 -248 157 72 -209 19 103 -74 61 -36 -407 -104 -26 -32
7007 -32 -42 47 22 -120 258 -44 56 41 -66 222 470 -80 -88 269 16 -75 -187 96 -191 12 -108 -11 136
7030 136 69 -70 13 150 -58 191 206 -131 -63 124 -175 144 8 213 55 -11 -99 -48 349 233 22 96 79
7053 79 90 253 60 -201 -50 356 -46 -100 156 -145 -48 19 76 -149 -43 3 -140 198 2 148 210 -98 165
7076 165 -34 -53 110 61 80 -294 -57 121 -429 66 40 -310 -114 243 -213 80 358 -146 -136 306 -187 -143
7098 -143 152 -49 -129 2 157 -48 -44 -24 -346 -84 224 -22 276 -39 13 59 -75 -231 -48 120 -30 10
7120 10 241 -71 -69 227 64 -146 111 263 -165 178 57 204 -124 106 -64 -125 188 113 121 183 -110 152 -70
7143g0j43M89j13l27P4K26n02K21K19k82K73q8J60kl4J01l61J83J77j57j29J98
7165A13k88N9J01j41J77N0q0k44J65K6K5J29j03k1R1Om6L6ol6J26j57j99M39q2
7190A40k13Q1J53k69o7M44k99J29J69m11K34k6j18l1M8J85l65L43k4K8l0rp9K11
7214B24j93j42J57N0m0p0RK6k11K91j92lK41l17J49J84l00k1L68k75o2L3L22o0
7238A68j71k35M19J45k39j25k9L54k90J6p6l2N9J87l14K93J07j76k06L60l80K02
7260C7m8l7k59M05P2k53K48l05J79J14k2m26K92K24m37K51j06qJ14k8j75J92K10
7283B34l51r6M02k72J75j04J11m17M54J8l25M20k79L28m50K48l39M40m0m02L61
7304A16j80j2J22p0o6k83O64k51o6K38k96L4K10o5k06J19k17J42M02k48l03M45
$$ plain form
7143 -70 -213 276 163 -164 -90 136 -366 -145 74 -208 65 -23 137 135 101 202 -159 24 201 44 -85 113
7165 113 -175 -116 -15 -156 21 71 -9 -253 -88 -62 -37 92 -11 -32 59 65 19 55 49 13 139 -18 -217 222 140
7190 140 -73 8 161 -108 -175 269 -30 99 268 -143 91 65 -53 -84 -36 149 -216 127 103 131 101 92 13 224
7214 224 31 -111 46 96 56 -14 -5 21 -190 101 -91 -94 147 -170 -21 163 -137 -158 210 -65 -127 -94 228 168
7238 168 -3 -238 181 326 87 -38 -67 287 -3 13 -63 -95 -36 151 -163 130 237 61 -145 215 -165 37
7260 37 -11 -48 -307 98 170 -83 165 -140 39 153 131 -295 -3 221 -216 35 -71 -79 35 7 -168 24 234
7283 234 -117 -213 189 -83 92 -12 99 -318 136 154 -171 249 -30 298 -152 96 -243 197 157 -245 116
7304 116 -64 -76 46 -24 -90 -373 291 40 -26 212 -84 -50 160 95 -111 8 -209 -67 335 87 -216 229
7326B29q7j89J43p4j51j1J84m29L53K42l28MK76j58k44N93m39k25N10j82l26N73
7348B64k41k26K63k4k69M81k12m06N85l2o30L55M79m42J35P5l05q5M58j86l06
7369b69M28k45l4M63m00l29O97j95m97O32q2m33M66J80n06j4K80n78M13K30o54
7390d47K93N75n72L24J07m05O7K06k22m18Q27l21j32L68p0n15O11O1o71M09J99
7411B74p99O84J14n49L60J05l74N0N01n39R5L60m36r5M16j71k21K99k08l01P73
7432C38k34m96N70K53p67O10J0n48M34M77q60L5M93o67M42K08n93J06M20m25N7
7453a37N89m64k34O53m33m59P25j60m45P02J38j190P24K25m75J06L80n96M49L9
7473A37m17K53N68p47M04K11o23l8N14l34l18P66k62m68N20Ln81N77J01o78N43
$$ plain form
7326 229 142 -47 96 22 -129 -140 44 -385 -32 210 -118 -114 162 4 -240 353 -86 -311 199 17 -309 264
7348 264 23 -203 60 36 -233 248 36 -370 215 183 -447 -92 387 -55 80 155 -150 -235 223 37 -269
7369 -269 159 -86 -120 343 -57 -386 311 116 -381 251 169 -264 202 382 -124 -138 142 -436 -23 207 -447
7390 -447 -154 421 -151 173 280 -125 -58 148 -74 -492 335 14 -118 250 180 -335 276 337 -334 75 274
7411 274 -525 159 273 -276 84 189 -185 -135 366 -173 -78 282 -154 -249 167 -4 -225 74 -134 -435 338
7432 338 104 -392 178 431 -336 274 284 -264 170 647 -213 -178 315 -352 90 298 -295 -189 231 -194 -137
7453 -137 452 -12 -246 407 -26 -485 240 80 -365 337 475 -715 9 234 -241 -135 245 -351 98 137
7473 137 -280 -27 541 -206 198 409 -214 -252 262 -72 -390 376 114 -354 166 169 -412 165 266 -412 131
7494A31K55o56N23k2o41P1P24n96J2L47l36j62Q01n36m45R64l52l08M59j53n14
7515d34Q24m07m57N81j36r6M32P1n75K36M18r77M56J72l42J09N57m79q1M90k57
7536A05m13O82j79m04L16L8n06N19J64o17M42j08k76M04Q5o72J77M13j46k45P65
7557E44p72J67M22n22j20O78n19j43N72m11l2L37p7m82M62J88m09J54J13l89Q7
7578a52K77l21J68M01p00K68K67k79r5N05n66O6N97l30m05N28j74n43O39k67k09
7599c25M15Q1m15L31M8m07J86K84j83R0J09p46M14K41k50M5M15l94j52M83l87
7620a17j2L51J19p23M27O7l29M78k12m9J88J36n69K67L06n80K39J51j33j32L89
7641B62m43L5N17m71j12K22n1j47L16N7k95J51K61n85L02r1N7K21l4l33P8K89
$$ plain form
7494 131 386 -270 253 231 -410 -339 385 -211 -199 148 -188 -350 451 -85 -530 434 82 -226 233 80 -434
7515 -434 390 -17 -474 107 -29 -125 307 378 -197 39 457 -520 -64 108 -234 -125 432 -47 -128 362 105
7536 105 -308 374 195 -209 107 145 -361 158 322 -295 147 39 -237 167 252 -420 -243 170 24 -221 544
7557 544 -228 -61 361 -161 -281 397 -122 -265 307 -104 -136 201 124 -358 104 292 -117 37 150 -239 -152
7578 -152 125 -196 -28 373 -327 -59 208 -71 -166 339 -227 -161 436 106 -299 229 55 -488 151 -116 -325
7599 -325 90 171 -244 87 135 -272 -86 198 15 105 214 -532 -118 123 -127 -82 333 -61 -213 270 -117
7620 -117 -129 222 341 -382 45 112 -217 261 49 0 188 324 -245 22 328 -252 -13 138 5 -127 262
7641 262 -181 -146 371 -100 -212 10 -41 -188 128 185 -110 41 302 -283 19 -72 -15 206 172 -161 -83 206
7663B06m17Q8K24k53M2J63m88J28N21l15l26N03j56j29L41K8k03J19j93j81L19
7684B1K40o76L10N42n89Q8K89l21k2J57k63J46L04k63k01M29k21m1K26j13q2M58
7706D18j79l16j69K97l76M32nk50N7L55k85o1j4k42L6K48k03J42L24k36lK9N5
7729E4k9J73Q9j5j66r7j59L22l8n7n4J07k32K4L6Qm1N65n47L8J50n5k06r6K43
7754A7J35l3j70j31L68j68k06J57n3j15K18k50L42j96J11j04l5O4l3J57J25j27
7776G3k20J28O7k1J00j79j65O4o6P4J24L3k46K32N8r2M0J59k41R0K56k61o0J88
7800A35J09k34j36J79l1k6Q0M5r8J8Q4k1rl48L04j65P9R1J80k34Q0M5n8j64L20
7825B25k99j51N28m28K24k24J52o9K7j25K30p0J6O9J8k8k91K18kj26J16J83k23
$$ plain form
7663 206 -211 -123 101 -152 -110 53 -435 -307 214 -101 -427 76 -80 -209 132 160 -43 76 -117 -298 21
7684 21 261 -415 -105 437 -152 -64 225 -96 -118 39 -224 -78 226 -37 -238 191 -30 -71 155 42 -40 418
7706 418 239 -77 -246 51 -325 107 102 -148 -91 264 -21 -82 -96 -338 -302 -54 -257 -115 209 -27 -30 -1 54
7729 54 25 198 287 272 106 9 -150 172 134 77 23 130 -102 -78 -42 -34 -75 490 -57 -19 131 76 -130 -226 17
7754 17 152 119 -51 -182 186 18 -188 -31 -84 -199 19 -231 111 -85 26 -78 -113 -49 -82 75 200 73
7776 73 -147 -19 48 27 127 -52 -217 -153 -219 -145 -21 12 -234 -2 56 -36 4 163 -78 12 268 7 -53 135
7800 135 244 10 -126 53 22 -4 76 121 23 41 125 104 95 -253 51 -114 -35 56 236 2 82 127 69 -95 225
7825 225 -74 -225 303 -125 99 -125 27 -42 -15 -140 90 20 36 105 123 95 -196 22 20 -106 10 193 -30
7848c0p6K12j20j37J49j46Q1N6J50j26oK80k48PjmJ70l88lK23M3k18N00l95J33
7873A06J41j8m57J27J90q7j72K15J25j33K33j71j02O9j1pK74k72q6JJ17k10K49
7896A21m0j66K74l33lj3K98k11j1J23j06p0Q9p6l8K24j59J93j93J9nL9O9j35J91
7921H1r9J72j00Q7l10J79j8k30J75K65l38K93n2q6J35J58l33p6J93Oj92L06l70
7944a54N8K83j41k12L51j06j37M9L8j55J37j08J80J79j65l37J00L16j49K7k14
7965a60N5O2K29l77o0L38k88K8L67k29p8L68M6n52L50k7j63K82j17l36K93J59
7987A90k22J58q1j14K37j92j32J41mJ4J28J06l60lK77M5k28J53k43j94N12q8k91
8010a91L11J18m73O9K75n27M53J35k47J13K88l53Q0K29n58J25K81k55k31O21j88
$$ plain form
7848 -30 -106 106 -14 -151 -2 -148 -67 -11 139 13 7 287 39 46 45 41 211 -177 -180 43 86 -132 368 -27 106
7873 106 247 229 -228 -101 89 2 -170 45 170 37 270 99 -3 66 55 48 322 50 -36 -35 82 -128 121
7896 121 81 -85 189 -144 -147 -160 138 -73 -84 39 -67 -137 -48 -124 -162 62 -97 96 -97 -78 -83 -44 25 -110 81
7921 81 -18 154 54 141 -169 10 -8 -238 -63 202 -136 157 105 19 154 312 -21 -97 96 102 -90 216 -154
7944 -154 -96 187 46 -166 185 79 -58 -9 29 -126 11 -97 83 262 97 -240 -140 176 27 54 -160
7965 -160 -105 -43 186 -191 -251 87 -201 -173 194 -35 -113 255 301 -251 99 72 -91 191 74 -262 31 190
7987 190 -32 126 45 -69 168 -24 -156 -15 -19 -5 123 229 -131 -134 143 188 -40 113 -130 -324 188 100 -191
8010 -191 120 238 -235 -166 109 -418 35 170 -77 36 324 -29 51 280 -278 -153 128 -127 -358 263 75
8031G5k87L22j00j37K36O0l54M89j11m78M15j49j87M21l20k21K58K19O4l61L77
8052B31p7J01j02k13j34L02k16j05M61j97O1J06l0m64J55J77j02K60j27j38n1
8073a02K84l57J54P6k07J2N16n14p9K85J40l81K03Rj33K45j96k39L66m3k02K50
8095H7K0k39L29L3k73J88J17k82oK50j76K4N0j12k5K48j01n17N10P2m05L45j8
8118A19l71K36J73m82K49J48k14j9K58j83K35J7l02j10N23n86O0N77l78j73L55
8139A32k8k90L46m68J42L41l8j94J80J47n22K28Q4n55M21O29p17R6M5k69L94R9
8161B03k38j59M39j08m43N89l14m3lL22m17M42j70l31J68R0k26L11l7k27P0P8
8183dr0J62O9m36qN07j51j38
$$ plain form
8031 75 -212 110 10 -127 109 169 -185 304 193 -285 130 -19 -206 215 -105 -326 -68 151 215 -146 231
8052 231 154 255 153 -60 -194 108 -108 -213 248 51 112 218 188 -276 -121 56 -46 214 87 -51 -102
8073 -102 182 -175 -21 55 -152 -140 376 -138 -217 68 208 -173 30 39 -94 151 -45 -284 82 39 -163 87
8095 87 107 -132 197 230 -43 145 262 -20 -26 224 48 72 122 10 -15 233 132 -385 125 197 -208 137 119
8118 119 -252 -16 157 -325 -76 72 -142 -161 97 -86 149 166 -136 -246 277 -309 -249 328 -50 -223 132
8139 132 104 -186 160 -308 -166 175 137 -57 123 270 -252 -24 60 -495 -74 555 -162 -66 -21 -290 104 203
8161 203 -35 -194 245 137 -306 283 -31 -74 -77 245 -172 270 100 -231 -63 27 -199 112 75 -152 -82 -4
8183 -4 -94 68 137 -299 -307 200 49 -89
8191h9
$$ Imaginary data points
##PAGE= N=2
##DATA TABLE= (X++(I..I)), XYDATA
0@%%%qK4k4K4m0N6p2R6j20J36j64K04k48L00l57M17m89N81o81P86r05J039j190
26f35J363j554J755j978K233k513K817l153L518l914M354m843N377n956O593p297
42c833Q080q952R919j0994J2207j3596J5188j7032J9205k1801K4974k8966L4146
55A8545m1158N1236o7007R5239j60497N50812J87327j340292N61938L52737l57172
66a48292M55577m6321r42903N60331O64327n63175o0099J40071m83921N49256
76A24851M96603r26710j19964P38966l66263k3646N17852p02866k62493J000728
86D77058j88401o47643M06706q9247k09265P31746k91018q59033O95689M59772
96D86364o68648J50767J65167n38642M82320M81689q38327j04464O55480k33472
$$ plain form
0 0 0 0 0 -8 16 -8 16 -24 32 -40 56 -64 72 -92 112 -136 164 -193 224 -265 316 -365 421 -484 555 -635
26 -635 728 -826 929 -1049 1184 -1329 1488 -1665 1853 -2061 2293 -2550 2827 -3129 3464 -3833
42 -3833 4247 -4705 5214 -5780 6427 -7169 8019 -9013 10192 -11609 13365 -15601 18545
55 18545 -22613 28623 -38384 56855 -103642 447170 634497 -705795 -143857 208880 -148292
66 -148292 307285 260964 -681939 -121608 542719 -20456 -80555 59516 -424405 124851
76 124851 621454 -305256 -425220 313746 -52517 -76163 441689 -261177 -523670 477058
86 477058 288657 -358986 47720 -41527 -250792 480954 189936 -669097 26592 486364
96 486364 -182284 -31517 133650 -404992 77328 559017 -279310 -383774 271706 38234
106C8234n8537K58239n33833L0839P09671l68644l68837M30564k36429j12938
116b11671O83263l74425o71729O70138K47629n21242K65864j2014n21498N74492
126A28807L84281p84002k1414M98126k48592R1077K21182n81896N1866O56589
136C96024l14595l01604L15479k07764j9991N10280l58046m18608N20190M1813
146A63178l14706L21806j38476m10693N30195J88871n84113J42686K53976l19465
156a66741K41294K15373n75630P0456N43624l00616j96398K87989k07291l8479
166a26419M00399k50987k87796L48456m546j71117K29330j60473k19418M07668
176A65097M438l76523K35736Q0353l05937K79440J43898m68622J21962L66737
$$ plain form
106 38234 -20303 237936 -295897 -265058 444613 75969 -292868 137696 -98733 -211671
116 -211671 471592 97167 -574562 95576 343205 -178037 87827 75813 -445685 128807
126 128807 513088 -270914 -292328 205798 -42794 48283 269465 -312431 -260565 396024
136 396024 81429 -220175 95304 -112460 -132451 377829 19783 -398825 121365 163178
146 163178 -151528 170278 31802 -378891 151304 340175 -243938 -101252 152724 -166741
156 -166741 74553 289926 -285704 -215248 328376 27760 -168638 119351 -87940 -126419
166 -126419 273980 22993 -264803 83653 79107 -92010 137320 -23153 -242571 165097
176 165097 169535 -206988 28748 109101 -196836 82604 226502 -242120 -120158 246579
186B46579k87997n5713K33435k41209K876L36237k40852j96646K96912m8306j32002
197h6686K05820j31240j72251L01191j070k54289J59081K9332j66306K08406J8011
208A09999k86760J65689J51938k37840R0992J29543k73256Q9087K77386k57343
218d0565j11343K61298r4898j00566J95833j14522j46200K32015Q509j79558R9462
229I465J4122r0419J38186j7571j70437J25988O5927j38988Q7150L7848j71726
240a10455J08247J27262j90495Q947J43189j39640M099J77750j50962j02733K02642
251G7851j8906j31650R7551q813r0419J15820J7700j24071N3777M7363n9308N0470
263B7365k312r2267P6509M5497j04759M3906N8301j03528L4532R0328j03734r838
$$ plain form
186 246579 -41418 -97131 136304 -104905 -102029 234208 -6644 -203290 93622 45316 -86686
197 -86686 119134 -12106 -184357 116834 115764 -138525 20556 49888 -116418 91988 109999
208 109999 -176761 -11072 140866 -96974 -5982 123561 -149695 -60608 216778 -40565
218 -40565 -151908 109390 14492 -86074 109759 -4763 -150963 81052 89561 -89997 9465
229 9465 23587 -66832 71354 53783 -116654 9334 75261 -63727 23423 61271 -110455
240 -110455 -2208 125054 -65441 -56494 86695 -52945 -48846 128904 -22058 -124791 77851
251 77851 58945 -72705 24846 16033 -74386 41434 59134 -64937 -11160 36203 -23105 27365
263 27365 25053 -67214 9295 54792 -49967 -6061 52240 -51288 -16756 73572 -30162 -40000
275d0000J00585q0805k9114J16247o3946p7369J16985l992r8446P3134L0265q7156
287d3612L5178M5996n8994R488L7818l4453J064J6372j6483K4035q911n2889N2243
300F852M0168p8291R272O4084n8101j0087P7444n0008n7124P6061Q698n9242L5575
313E301J3990n0836K9973L8317m4541j1949K7340q126R64J3468j8121j0486J1664
326c042R107R080j7887k3178L1302J7808l5419R161K4969m0468j850N4594k6006
339H171m4976M1095J6047l8059J8733K3707l8851o596M0811n784l0189R781J3286
352G176j0889p35J5056n727k0450R644K2639j3615j7198J8491L443k0374J6044
365C505J6936l2149q527L4652n728k5526J9047J0183k5681Q152K8433k0751k3646
$$ plain form
275 -40000 60585 -20220 -49334 66913 2967 -74402 42583 38591 -59855 13279 43544 -43612
287 -43612 -8434 37562 -21432 -11944 25874 -8579 -7515 8857 -7626 16409 7498 -45391 6852
300 6852 47020 -31271 -21999 42085 -16016 -26103 51341 1333 -55791 20270 28968 -30274 5301
313 5301 19291 -31545 -1572 36745 -7796 -19745 7595 -531 433 13901 -4220 -14706 -3042
326 -3042 6065 15145 -2742 -25920 5382 23190 -12229 -3068 21901 -18567 -20417 34177 8171
339 8171 -36805 4290 20337 -17722 1011 24718 -14133 -20729 20082 14298 -15891 -6110 7176
352 7176 -3713 -4448 10608 4881 -15569 -5925 16714 3099 -14099 4392 7835 -12539 3505
365 3505 20441 -11708 -20235 14417 8689 -16837 2210 12393 -13288 -5136 23297 2546 -21100
378b1100K4532J0765k4399K174J9402j5109j0751K5823M319k8732M813K3562j4736
391E63j3400K1038j782k3818J5411K1585k3257j2235K6668j181k3724J2983J5401
404A4252k3275m459K8312m922k4962J3397J5090j9267l748J9680q345j7121J8028
417B660J2685j9955l677J8653o887j4587J5465M029k3573O796K6498j5624j8476
430a5993K3432M894k4380J0666J7620k5109p437K9101m934k1490J4515R007j7774
443g882M755J6239j3475j3911J4916J2689j2932j0022J2029K946j4285Q308J5185
456A4560k3191r566L4400k783l1678K0092J4636l3622J0314L3697l1952k1679
468b6772L7755L002k5314J2611M502j8084J2330J5158j4937r530N669Q432M398
$$ plain form
378 -21100 3432 14197 -10202 -8028 11374 -3735 -14486 11337 15656 -13076 -8263 15299 563
391 563 -12837 8201 6419 -17399 -1988 19597 -3660 -15895 10773 9592 -14132 -1149 14252
404 14252 -9023 -13482 14830 9908 -15054 -1657 13433 -5834 -9582 10098 1753 -15368 2660
417 2660 15345 -4610 -8287 10366 3479 -11108 4357 8386 -15187 -8391 18107 2483 -15993
430 -15993 7439 12333 -12047 -1381 16239 -8870 -16307 12794 7860 -13630 885 9892 -7882
443 -7882 -3127 13112 -363 -14274 642 13331 399 -9623 2406 5352 -8933 -625 14560
456 14560 -8631 -18197 16203 13420 -18258 1834 16470 -17152 -6838 26859 -5093 -26772
468 -26772 10983 13985 -11329 1282 5784 -12300 30 15188 251 -9279 -3610 4822 9220
481I220j3742n741J6594p823r967K6786n509l3031K4946J9971l2985Q269K0141
494A7129l7746O199M6397l3361k8310M5106k666l1456K9830L780l6734J8644J8998
507A5810k3392L666J0618j3800O830N324p925J4318j2099k5474L9154J3784n2909
520b6095J6198L8184m4370Q13N1063m2555k8119N8239j1714l8515M3685k329m6381
533c1896L6667K2750l9547P829R032k5069K9219J6837m6813N830L1229j8731Q748
546F085R658m1154J6526L8273m0404j379L8282m5743o064P0029l5605m9918N8759
559A7345l975m5459N6669K034p5519M2321N2887n7172p852L1376k6260J2723K6806
572B5924m2513J930L6050k8574L777K6631m5179N951N3032m9949j8749O8996l5712
$$ plain form
481 9220 -4522 -10263 6331 -1492 -11459 15327 9818 -23213 1733 21704 -11281 -3012 17129
494 17129 -20617 -14418 31979 -1382 -29692 15414 12748 -18708 11122 14902 -21832 -3188 15810
507 15810 -7582 -3916 6702 -7098 -268 5056 -2869 11449 -650 -26124 13030 26814 -26095
520 -26095 -9897 28287 -16083 -15270 35793 -6762 -34881 23358 11644 -26871 16814 14485 -31896
533 -31896 4771 27521 -12026 -4197 4835 -20234 8985 25822 -20991 -15161 16068 -2663 6085
546 6085 15743 -25411 -8885 29388 -11016 -12395 25887 -19856 -25920 44109 8504 -41414 17345
559 17345 13370 -32089 24580 26614 -48905 -6584 46303 -10869 -18721 12655 -13605 -882 25924
572 25924 -16589 -14659 21391 -7183 -3406 23225 -21954 -16003 37029 -12920 -31669 37327 1615
585A615m3502P5745j0953p0415N8866K3294o8127L1511K9326n7302K9553L9837
597C9448o7421M547N8584l8093j1879L3338l9072O712N8535m8419l4585N7189
609A8884j0982k2504L9043l5698k8228P4683j3100o0742N6162K75o4486O8022
621B1329K9497j00508K1733P2686n4431l875M7410o0311o395Q2434l2244n3408
633c6083L4667o31L488L5494n5761k8443Q0793r982n2967M5931j2748m7074P5009
646C1693Q333r0868M0741M7856o2541K4985L9204p9466J2845Q0259n4040k8750
658b9749N1963l7241n745P5002n2814o2831P8044J7574m9906K0595j3174k3700
670c1982O8962p153p5937M1449K9364m3537L7239M228p7278N1421O2588q4244
$$ plain form
585 1615 -41887 33858 22905 -47510 11356 34650 -33477 -1966 27360 -29942 -389 39448
597 39448 -27973 -23426 35158 -2935 -14814 18524 -20548 -13836 44699 -3720 -38305 18884
609 18884 7902 -14602 24441 -11257 -39485 35198 22098 -38644 17518 17793 -46693 21329
621 21329 50826 -49682 -27949 44737 -9694 -13569 33841 -26470 -32865 49569 17325 -36083
633 -36083 -1416 -2047 1441 36935 -18826 -47269 33524 23542 -29425 16506 3758 -43316 31693
646 31693 40026 -50842 -10101 37755 -24786 199 39403 -40063 -27218 53041 -999 -29749
658 -29749 22214 -15027 -20772 54230 1416 -61415 16629 34203 -15703 4892 -8282 -31982
670 -31982 36980 29827 -46110 -4661 24703 -18834 18405 22633 -54645 -3224 59364 -24880
682b4880l733O6029n8613n376Q3479n6095n7629P7975M397m4795L6685k1192m0274
695d4022P0790J1621p0891J9214K2274j8266M1615j6546p6037N9506N6944p5385
707a9183l166M3706m5958K0745N7511p5383k4398Q3271k5844l7886N3486l1850
719d949l9859P9453j278p2220L6754J5985l8643M8413O543q1882L3021O4639m0909
732E068j4155Q054k9704M5215L5551q0620o587O4731l0880j194M5197o9424k1351
745e0099J04622k2190q2300N2382J4940m8180N0216J5242p3727J9309M6708k4753
757B170P140m122m8096M5545M8843o5882j4501M4081k4957J0037L8556o2535j8645
770d2366P7664j5056m4961L3728j3239j8579N8006k0529o1430N3571K2413n5052
$$ plain form
682 -24880 -28613 37416 -21197 -26573 56906 811 -56818 21157 25554 -19241 17444 -3748 -44022
695 -44022 26768 38389 -32502 -13288 8986 -9280 32335 15789 -60248 -742 56202 -19183
707 -19183 -22349 21357 -24601 -3856 53655 -21728 -46126 37145 11301 -26585 26901 -4949
719 -4949 -44808 34645 33367 -38853 -2099 13886 -24757 23656 30199 -51683 -18662 45977 5068
732 5068 -9087 -1033 -30737 14478 50029 -30591 -37178 27553 -3327 -4521 40676 -28748 -50099
745 -50099 54523 32333 -49967 2415 17355 -30825 19391 34633 -39094 -19785 26923 2170
757 2170 9310 5188 -42908 2637 51480 -14402 -28903 15178 -9779 258 38814 -23721 -42366
770 -42366 35298 20242 -24719 9009 -4230 -22809 35197 14668 -46762 6809 29222 -25830
782b5830L0580K0737o1303K6601N4936n3193k0670M1071j4162N07K2986m0973
794a8713n642M9800j7068j9256K1537k9688K065O3241l8271n9018N8968J9858
806B7813m5027K7733J405n2883M3272M2288n8875q900L5430k1236J2741K8876
818C2637n1147j4193N3718p015k0200J2584k6021J838N4299k2628m4690K9640
830a178Q118j2519K8309k1097m1613M8054K3626m6557J0068J5291l3825K7062
842C739L1766n3693q643M7904j6817j3539K6879k5875j6650M4815k744l4966J1829
855e995O946j304J8360k0300k1662L5315M497k9906J6747K081k6044L1722J4363
868B4820m8863J0198L9812k8032j0572K6836k0664p933L3681j4294k2630K2304
$$ plain form
782 -25830 4750 25487 -35816 -9215 45721 -7472 -28142 12929 -1233 -726 22260 -18713
794 -18713 -24355 25445 8377 -10879 10658 -19030 -16965 46276 8005 -51013 7955 27813
806 27813 -17214 10519 11924 -40959 2313 44601 -14274 -23174 12256 -8980 3761 32637
818 32637 -18510 -32703 21015 14000 -6200 6384 -19637 -17799 36500 13872 -30818 -1178
830 -1178 6940 -5579 22730 1633 -39980 8074 31700 -14857 -4789 10502 -23323 3739
842 3739 35505 -18188 -26831 21073 4256 -9283 17596 -8279 -24929 19886 17142 -17824 -5995
855 -5995 951 -353 18007 -2293 -23955 11360 15857 -14049 2698 4779 -21265 10457 24820
868 24820 -24043 -13845 25967 -2065 -12637 14199 -6465 -14398 19283 4989 -17641 4663
880D663j679j1200K1714j0338k5326K4851J4485k0135R61j054p462K3667J138
893A4285l2261R458J8354j3082R058L426l0955J5553L5418l0431j9971L0362n012
906D202j5655K2157m793k3599J7674J2119j4483K533L98r228J3546N214j6692
919f607K465O326o292J0104J625k0998P741J8823j3734l918R003j1602M951J8950
933A6837j9887j3985K5883l25j9602J2908M588j6474R740J2256j4352m032R605
946C160k163r15Q85m755L116K850m913N231K394j2420N070J2759j2342m961J2872
961E868n823n239J1300m619r260J2164K92j3379R049P521j2675J516R595p201
975h91k487Q366l876p290M767N228j956m748p23O745R11p420L616M287r992J007
$$ plain form
880 4663 2984 -8216 13498 3160 -22166 2685 17170 -2965 -2004 -3058 -10520 13147 14285
893 14285 -17976 -8518 9836 -3246 5812 9238 -21717 -6164 29254 -1177 -21148 9214 4202
906 4202 -11453 10704 5911 -17688 -14 12105 -2378 155 553 -8675 4871 10085 -6607
919 -6607 -4142 2184 -4108 5996 7621 -13377 -5636 13187 -547 -4465 4538 -7064 -2113 16837
933 16837 -3050 -17035 8848 8523 -11079 1829 6417 -10057 -317 11939 -2413 -6445 3160
946 3160 997 82 967 -3788 -672 2178 -2735 2496 4890 -7530 -2460 10299 -2043 -7004 5868
961 5868 45 -5194 6106 1487 -7773 4391 4683 -8696 353 7874 -4801 -3285 6310 -891
975 -891 -3378 4988 1112 -6178 -1411 3817 1861 -2887 -3610 3135 4046 -3374 242 4529 -5463 -4456
991d456J2832o320j0820R135M492p515L550K797q940K140R119m207m613K761q96
1006i41l25N182k038o955J720O244K39m098RK422j713j362M967o08q780K029R567
1023E559l343o372N495P89o171N162N423q997l682Q718J214n778J539J486l767
1038b725J619M946k404n050K408L557j719m47J551l160k120N669J590o695n39
1053c519N083j125j858M799q64p106L398P143n100n895M310J890l100K780K767
1068C603n436j758O786J012o311n4L113k025K53L704k300m668L950L613l849p36
1084a103L092l434k181P055J796r074l13Q155j640n470K960J151m307K484N532
1099D703m417l896M327K247m362K71L063l168k425M222L139l700k931K885J557
$$ plain form
991 -4456 8376 2056 -8764 371 4863 -2652 898 3695 -5245 -3105 6014 1807 -2806 -45 -941
1006 -941 -1266 3916 1878 -5077 -3357 2887 3126 -972 -963 1459 -254 -1616 3351 2743 -6037 -4008 5559
1023 5559 2216 -4156 1339 2128 -4043 1119 6542 -2455 -6137 2581 3795 -1983 -444 1042 -2725
1038 -2725 -1106 3840 1436 -3614 -1206 2351 632 185 1736 -1424 -3544 2125 3715 -2980 -3519
1053 -3519 1564 439 -1419 3380 2516 -4590 -1192 5951 851 -5044 -734 1156 -1944 836 3603
1068 3603 -1833 -3591 3195 4207 -2104 -2158 955 -1070 -817 2887 587 -4081 -131 3482 -367 -1103
1084 -1103 1989 -1445 -3626 3429 5225 -3849 -4162 3993 2353 -3117 -157 994 -3313 -829 4703
1099 4703 286 -3610 717 2964 -1398 -1127 1936 -1232 -3657 565 3704 4 -2927 -42 1515
1114A515j101Q11j866l110M853L264o492j120N516j888l438N474n1o464L302M995
1130D200m463j927M592k281l704M082L416n002l619N280M718n268m960O403J866
1145C333n912J961L919o048k69P791l914n896O909Q80o622M053L454o159M51N060
1161B991k449j497J247k777J785L967l812l130L579K211j20j674l741L500M520
1176D600o212k061N912l232j741P307m569n596J0219q5j0873O631N736j1155J270
1191c849R803o175m566P051p89k540L002l040j414N336j951k557K064k467K983
1206H91N232j0330l831J5320j997j3649P604N352p818N828K922j2912M012J1047
1220G671q516l613O989n295J64J0055o402o592O743j222r59Q095p739j0002J2187
$$ plain form
1114 1515 414 1225 -641 -3751 1102 4366 -2126 -3246 2270 382 -3056 2418 2367 -4097 -795 4200
1130 4200 -263 -2190 2402 121 -3583 499 3915 -1087 -4706 574 5292 24 -4936 1467 3333
1145 3333 -2579 -618 3301 -2747 -3016 4775 861 -5035 1874 2754 -3868 185 3639 -2520 -2069 2991
1161 2991 542 -955 292 -2485 -700 3267 -545 -3675 -96 2115 1995 321 -3420 80 4600
1176 4600 -1612 -3673 2239 -993 -2734 4573 4 -5592 4627 4542 -6331 300 6036 -5119 -3849
1191 -3849 5954 -221 -4787 2264 1475 -1065 1937 -1103 -2517 2819 868 -1689 375 -2092 891
1206 891 6123 -4207 -8038 7282 5285 -8364 -760 4592 -3226 2602 5524 -7388 -3376 7671
1220 7671 -845 -4458 2531 -2764 -2600 7455 1053 -5539 1204 -18 -977 7118 -621 -10623 1564
1235A564O494p905j473l492J86J4546l567j7485Q035J0183q831L975L587j6460
1249a0643N456J8410j2968j0014J3858k932o474J2584k646j3066P189M692l097
1262C49L205p382n305J6596J151j7029O233O631p970P764J522j8226R331J7964
1276A4834j6819q101J4496m006k150R717j2604n399J9299l860j2915J0686k233
1289I45r489J5784J402j9666N595J1135o353M774p26j5910J0078J6526j2367p079
1303e351L051n803J3938J1376k8120p207K9730j986j5316Q876o358q568K2828
1316A1090J220k4555N404J2034o166O748j172j7566R544J4131j0443J22J080j4359
1330a2888J3696J9658k4447j3314K1571Q64n234O451j4875l845K6673l915k2217
$$ plain form
1235 1564 8058 153 -1320 -4812 -4626 9920 6353 -11132 -3097 7086 -1745 2230 5817 -10643
1249 -10643 -5187 13223 255 -9759 4099 1167 -5307 7277 4631 -8435 -1246 3446 349
1262 349 3554 -3828 -9133 7463 8614 -8415 -2182 4449 -3521 4243 5765 -12461 -3130 14834
1276 14834 -1985 -10086 4410 404 -1746 7971 -4633 -10032 9267 5407 -7508 3178 945
1289 945 -8544 7240 8642 -11024 -5429 5706 -647 4127 3401 -12509 -2431 14095 1728 -5351
1303 -5351 -2300 -8103 5835 17211 -10909 -18116 11614 9628 -5688 3188 -3170 -11738 11090
1316 11090 12310 -12245 -6841 5193 -973 5775 4603 -12963 -3419 10712 269 391 1471 -12888
1330 -12888 808 20466 -3981 -17295 4276 5140 -94 6357 -8518 -12363 14310 10395 -11822
1343a1822R512M764p074J4664m970k3513J6968J7876j9991j838J0530j2063N477
1356a480J5277j6498q680J4134j181J582N102j9869j080K8512p041k0527J0219
1369a530P77l434J9966r778k8937K0511K1154j9682n041N800r243J3388J2794
1382A6745k3519n981J8738l715o85O742j8812k541K6760n268j6797P782l077j696
1396e324K1087r686k5703J6287J5652j1164J640m969j3849K2611J3822k9908m625
1409a4129K0067m925J598P440k1649j150K8306o795j8293P917j389r52J7022r802
1423C266j8689J4362Q699p016O688j0084j5406K5276J2637k8696k184J5298o419
1436b268P212P402k5459j018K8229n155j5367N283m917L377J8021j3795j7496
$$ plain form
1343 -11822 -2310 2454 -4620 10044 5074 -18439 -1471 16405 -3586 -5424 5106 -6957 -1480
1356 -1480 13797 -2701 -11381 2753 1572 3154 8256 -11613 -12693 15819 8778 -11749 -1530
1369 -1530 -753 -4187 15779 6001 -22936 -2425 18729 -953 -5994 -194 -9437 3951 16745
1382 16745 -6774 -12755 5983 2268 1583 8325 -10487 -13028 13732 8464 -8333 -551 -3628 -5324
1396 -5324 15763 6077 -19626 -3339 12313 1149 2789 -2180 -16029 6582 20404 -9504 -14129
1409 -14129 5938 1013 2611 10051 -11598 -12748 15558 8763 -9530 -1613 -3002 -3954 13068 3266
1423 3266 -15423 -1061 7638 622 7310 -2774 -18180 7096 19733 -8963 -11147 4151 -2268
1436 -2268 4944 12346 -13113 -14131 14098 8943 -6424 -1141 -6058 -2681 15340 1545 -15951
1449a5951J7082N836r667Q469n787j4927J9206J1414k0695j751P459m270J0369
1462F787K400k2981M936K1983r706p172O257j0919M837K1650j6883j9504J9533
1475A218Q269j0947M087m951q809J7169N671j7598J157N053l719J1671L44k1928
1489a3313N903J8222q922l743M016j2328O594K0801j4554j6453J3470M202k961
1502I34O263j1942r760K1112N061j7197J961M014m574J0508J497j7805M343J2723
1516G138p120K53L400j1321M131J4389j0385p598Q400l007R12J0213j1491r349
1530a1435J6523K037j1953M797j07o397J1896J980j6052M573J1642o719j918K486
1544A353o046M527P096r935j946Q334m153j90P109q871m577J3334j918q851N452
$$ plain form
1449 -15951 1131 6967 -2700 5769 -18 -14945 4261 15675 -5020 -6771 688 -3582 6787
1462 6787 9187 -13794 -8858 13125 3419 -3753 2504 -8415 -3578 18072 1189 -18315 1218
1475 1218 9487 -1460 2627 -2324 -11133 6036 11707 -5891 -4734 319 -3400 8271 8615 -13313
1489 -13313 -7410 10812 1890 -1853 2163 -10165 -3571 17230 2676 -13777 -307 3895 934
1502 934 7197 -4745 -14505 6607 11668 -5529 -3568 446 -4128 6380 7877 -9928 -5585 7138
1516 7138 18 271 3671 -7650 -3519 10870 485 -7113 1287 -1720 -808 9405 -2086 -11435
1530 -11435 5088 7125 -4828 -31 -138 -6535 5361 7341 -8711 -4138 7504 785 -1133 1353
1544 1353 -4693 -166 6930 -3005 -4951 3383 -770 -960 6149 -2722 -7299 6035 4117 -4734 718
1559G18q08m582R656k78j1922M926O605m617K385p15r060P745R485j0541n035
1574f038P302j522L44M514p406l053Q805l66l099K125m152q67Q824k783q058N774
1590C44J627n643N831J841r210K743P323m529j773K334l376K356M419n624k132
1605c469N753k121k173M525l028k466N403j19m958K953R18k604K312r89k797M181
1621A321J010n344L414K791n177J376M117m838j795N144j241k365K450j021j368
1636a526L255j292j867K100p69j252L382r73m038L316J658l072K21J210j313P04
1652b56J706k305N42J802k073O25J881l262l24L589j761k516L148M56k157R72
1668F7R96j503J93M76l75L86l87o61J467J48k069J052J024j097P9J149j154p22
$$ plain form
1559 718 -90 -4672 4984 4706 -7216 -2290 4315 -302 2083 1368 -7692 53 9538 -1003 -6038
1574 -6038 1264 -258 86 4600 -2806 -5859 2946 2580 -519 1606 -2546 -3413 5411 2628 -5430 344
1590 344 1971 -3672 2159 4000 -5210 -2467 4856 327 -1446 888 -2488 -132 4287 -1337 -3469
1605 -3469 2284 163 -2010 2515 -513 -2979 2424 2305 -2653 300 1218 -1386 926 -63 -2860 1321
1621 1321 2331 -3013 401 3192 -1985 -609 3508 -1330 -3125 2019 778 -1587 863 -158 -1526
1636 -1526 1729 437 -1430 670 -99 -1351 2031 1058 -2980 336 1994 -1078 -857 353 -960 -256
1652 -256 1450 -855 -313 1489 -584 41 1922 -1340 -1664 1925 164 -2352 796 1252 -905 67
1668 67 1063 -440 -247 229 -146 240 -147 -808 659 807 -1262 -210 814 -283 -204 945 -209 -931
1686i31J618l7p49l81p92J014J798j472j561K029O27j308L48M85j314M0Q85Pq32
1705e26l3K92j7N75K53j52r40l90J642J082k022j301J398R84l74l64q67j09J142
1724B73N10j011K31J03l49O07N35o64j176J15M68M97N15o36q48N12J810N4k285
1743g39q71J383J052r33o96O58n5M08P62n79o14R6o7l8Q49Q2j641l96K070O49
1763A380j878r9L74K96L55L71j227n09R09J472q63j657L51J193p04l80J526j12
1781G98k040N80K254m33j727n15P95J313n95j022K79K75j22P15N49j651r14K568
1799A107r1j974R77P03j570k35K096J06j866j384K318K475k631j989K063J641
1815A746k572mK082k129p06K863j98k136R51Q29q39R5K25Q0l57j480J168K795
$$ plain form
1686 -931 687 650 -99 -480 -1272 -258 1540 68 -1493 536 1163 -145 203 688 -626 -586 299 306 -526
1705 -526 -559 -267 -284 291 544 392 -548 -938 704 1786 -236 -1537 -139 845 471 107 -760 -869 273
1724 273 783 -228 3 106 -243 364 899 235 -941 -826 -358 139 654 18 -830 -318 1492 1546 -739
1743 -739 -1610 -227 825 -108 -804 -146 -201 207 969 390 -224 -128 -195 -233 616 698 -943 -1339 731 1380
1763 1380 -498 -597 -223 73 428 799 -428 -937 -28 1444 581 -1076 -725 468 -236 -616 910 798
1781 798 -1242 -662 1592 1159 -568 -1083 -288 1025 430 -592 -313 -38 -160 555 1104 -547 -1461 1107
1799 1107 1016 -958 19 722 -848 -1083 1013 1119 -747 -2131 187 2662 31 -1958 105 1746
1815 1746 -826 -830 1252 -877 -1583 1280 1082 -1054 -103 726 -113 -18 207 287 -70 -1550 -382 2413
1833B413k234l126L201K672l498j134K224j23n84O52m23k08N56q42M99O71k034
1850a318J095J912k434n54L912j893l511L544J588m305L84K718q84p52K5jK151
1867A677l72l258J689J925j816l88Q46k167J794L389m194k110M602K04k893R05
1883a67O2o99K188q79k425K862r4l385K862K079m031J56L157j603M64J128l895
1900b220L04N169k343l955J899J687P53M74m075J0N585j405m937L256Q25k820
1916a793L450L05n298K804L802m198k40L598l686p52M671j114k846M87q46K664
1932A008L159o004l105P456R52m553O58m56j358N635l92p687K376N281k576l79
1948A5M53l272K836L539n175k84M388m237l93O618l959n381N272K477l629J075
$$ plain form
1833 2413 179 -2947 254 2926 -572 -1706 518 395 -189 463 40 -168 388 -454 45 716 -1318
1850 -1318 -223 1689 -745 -1299 2613 720 -2791 753 2341 -1964 -1580 1138 254 -498 -473 -474 1677
1867 1677 1305 -1953 -264 1661 -155 -543 303 -1864 -70 3319 -875 -2985 1617 1821 -1072 -167
1883 -167 -105 -804 1384 505 -1920 942 848 -2537 325 2404 -1627 -1471 1686 83 547 1675 -2220
1900 -2220 -1916 3253 910 -3045 -1146 541 1294 1768 -2307 -2297 3288 1883 -3054 202 1027 -1793
1916 -1793 1657 1962 -3336 -532 3270 -928 -1168 2430 -1256 -2008 2663 1549 -1297 -810 -1656 1008
1932 1008 4167 -1837 -4942 2514 3466 -1087 -429 -885 -2243 3392 3000 -4687 -2311 2970 394 15
1948 15 468 -2804 32 3571 -1604 -1888 2500 -1737 -2130 4488 529 -4852 420 2897 -732 343
1964C43j301j894N845M36o589J662L052j344K077k278n773O514N900r097k302
1979d749P498j689j960M077m809k734P250j06n204K169p68r89N852p21p614K951
1995a546L601j960K759j923p764N646Q828o984m943K886M05L657K622r584j955
2010f255J0516n32m728J859l482j160R734k353j0292N193M833m227K813P50p732
2025e063L256P236m529l045J146k234N557M000j0140j748R785j749l610L042n334
2040c430r55J1495l243j1195N943N411m252J869j445o404P087N852q449r84L786
2055A086l475L830M355j0086k009J0111q82l746J481m585R80J0476m108j0083
2069f655M606L686p80L969o011q380J1949O637j1286j799M890l588M786M806j1445
$$ plain form
1964 343 -958 -2852 2993 3429 -3160 -1498 1554 210 2287 9 -5764 750 6650 -2447 -4749
1979 -4749 2749 1060 -900 3177 -1632 -4366 2884 2778 -2426 -257 -1025 -2014 3838 3117 -4497 -1546
1995 -1546 2055 95 2854 931 -6833 -1187 7641 657 -4286 -1400 -995 2662 5284 -4300 -6255
2010 -6255 4261 3729 -999 860 -2622 -3782 5952 3599 -6693 -1500 3333 -894 1919 2669 -5063
2025 -5063 -1807 5429 900 -2145 -999 -3233 2324 6324 -3816 -5564 4221 2472 -1138 1904 -3430
2040 -3430 -4385 7110 3867 -7328 -1385 4026 -226 1643 198 -6206 881 6733 -1716 -2700 1086
2055 1086 -2389 1441 5796 -4290 -6299 3812 2930 -816 665 -3920 -2940 7536 3428 -6655
2069 -6655 -2049 1637 857 4826 -1185 -9565 2384 9021 -2265 -4064 826 -2762 2024 6830 -4615
2084d615j935J0540r17l500J764n659O46J0550m122p706M439N75n29O777o129
2099A79r854J0873O371r530j35J883l885P525M191j3051m30J0813l085k786L096
2114B175o822J280J0621n367p997O388N59k162O229m449p946Q784M669p160Q97
2129c01r08l694Q925K630j2728J304R185l765J37K543r540K517J2410o620r030
2144f935P236R11k213N866n047o699Q867K927o885K147n74m361Q610K165j1097
2159e082J899O367m298K284K331r985L204J1437o949n750N467j911K34P320p996
2174a428p200J1302K144p110K518k85m411Q341J606j0328J761N443l100K560R68
2189B781q375L545Q239o125k506L935m846K302Q200p902o226R372P28m693L996
$$ plain form
2084 -4615 -6550 3990 3073 -427 1337 -4322 -3676 6874 2752 -4954 -515 60 -469 6308 179
2099 179 -9675 1198 7569 -1961 -2096 -213 -4098 3427 7618 -5433 -5863 4950 1865 -921 2175
2114 2175 -4647 -3367 7254 1887 -6110 278 837 -1325 4904 455 -7491 1293 5962 -1198 -301
2129 -301 -1209 -4903 4022 6652 -6076 -4772 4413 648 785 3328 -6212 -3695 8715 2095 -6935
2144 -6935 301 1212 -1001 4865 -182 -6881 1986 4913 -1972 175 -399 -4760 3850 6015 -5082
2159 -5082 -3183 3184 -1114 1170 3501 -6484 -3280 8157 1208 -4542 925 -986 -752 6568 -1428
2174 -1428 -8628 2674 4818 -2292 226 -59 -4470 3871 5477 -4851 -3090 2353 -747 1813 2781
2189 2781 -5594 -2049 6190 65 -2441 1494 -3352 -1050 7150 -752 -6978 2394 3122 -1571 2425
2204B425l064m955R180J759r735K287M710l911K558J594p257K616O115m593j625
2219a896L373l863K000N625o608k728P091j772l405M874l304m017P953J03p734
2234d308L850K748m641L869J087p170L435N621n279j002L078k974J068M660n179
2249a137k313N195r11j361K660m086j079P091k369n508M420P7l388N193k8p126
2265d670L981M815n140l0K157l454J488M445m283k013M007j339n22K847l656j360
2281b727M941o82l010K490j197j654L962r33m156L513J156l422K541J169m457
2296b466K268L478m825p05M316k176j665K984r48j483K509p22j835J900m46j040
2312h56J842r52k029K994J48k560J920J34k472K617J315l475Q37J913k027K46
$$ plain form
2204 2425 -639 -5594 3586 5345 -4390 -2103 2607 -1304 1254 2848 -4409 -1793 4322 -271 -1896
2219 -1896 1477 -2386 -386 5239 -1369 -4097 2994 1222 -2183 2691 -613 -4630 3323 3426 -4308
2234 -4308 -458 2290 -2351 1518 2605 -4565 -1130 4491 -788 -1790 1288 -1686 -618 4042 -1137
2249 -1137 -3450 1745 834 -527 2133 -1953 -3032 4059 1690 -3818 602 679 -2709 2484 2456 -4670
2265 -4670 -689 4126 -1014 -1044 1113 -2341 -853 3592 -691 -2704 1303 -36 -558 2289 -1367 -2727
2281 -2727 2214 1532 -1478 1012 -185 -1839 2123 1190 -2966 547 1703 -1719 822 1991 -2466
2296 -2466 -198 3280 -1545 -2250 2066 -110 -1775 1209 261 -1222 1287 565 -1270 630 184 -856
2312 -856 986 34 -1995 999 1147 -1413 507 641 -1831 786 2101 -1374 -537 1376 -651 -405
2328d05K068l215k46L472p74k299J727K71j326J571k9j797P15R65q92K72m17m11
2346g50J594k82j442J497Lj804J135J449k118mJ623j178j91J544j358j128K451
2363A041l17j799J127Q60j404K47O02o07k55J033m61o93K14O35M92p87n28J566
2381I66k30j738O26J534j573o06J552k04q49J213m86j027J259M84j323k76J088
2398D10j04n42M50j09m15N17n33J36J95J97k35k74K15Q74q03j206J236J360j878
2417e09q67K089m94r16J245l8j426Q58J048j380j047J939j06j203Q17P33q08m58
2435e23R0J281l93j012L75L13k58N75l53j038N12J635j438r55J762O9j412J053
2453B83P45j759L73P95q74K01Q90r23m64J204k5m56j59k25N91J10o65M6N12n05
$$ plain form
2328 -405 1663 -1552 -1798 1674 900 -1399 328 599 -727 844 815 -982 -267 698 -194 78 -339 -750
2346 -750 844 562 -880 617 620 -1184 -49 1400 -718 -722 901 -277 -468 1076 -282 -1410 1041
2363 1041 724 -1075 52 912 -492 -245 357 -250 -505 528 67 -626 -412 223 715 -72 -600 966
2381 966 736 -1002 -376 1158 -415 -1021 531 327 -522 691 205 -822 437 921 -402 -678 410
2398 410 306 -236 214 105 -310 207 -326 -190 5 202 -33 -307 -92 782 -21 -1227 9 1369 -509
2417 -509 -1376 713 219 -697 548 510 -916 -58 990 -390 -1437 502 396 -807 10 743 -65 -523
2435 -523 -433 848 455 -557 -182 131 -127 448 95 -943 -431 1204 -234 -1189 573 642 -770 283
2453 283 1028 -731 -358 437 -437 -236 654 -269 -733 471 446 -10 -169 -394 197 307 -358 -312 200 -305
2473c05N6P65p50k8R47j390k33K762j309k536K223J680k595kJ487j585J65K286
2491A638j490j305J227N77m87Q9r27O41M10j386P06K069k705r93L439L1k638J190
2509H6J74j495K235kk941J461K299k710M13J855k515N46K312k282o14L086j817
2526I1j974L037j56j975Q88k10L00J505k219j133M078j198l609L642O66m216K805
2543C22J422m305K107L859m809q45M208j341j666J687j555J60K892k384j968L819
2559A603j212k242L543j219k981L664J57l361L449L45m973L614K819n397J311
2574h80K911l919J976L634o368l39O909l021l902M087j031k201M618j931l793
2589c250M318N43l640L358j93l956M175O34n229L888J534n771L892M234p650O85
$$ plain form
2473 -305 -249 516 -234 -262 685 -705 -938 1824 515 -2021 202 1882 -713 -715 772 -813 -648 1638
2491 1638 148 -1157 70 647 160 249 -678 -37 373 -1013 -307 1762 -943 -1936 1503 1534 -1104 86
2509 86 260 -1235 1000 998 -1943 -482 1817 -893 -480 1375 -1140 -594 1718 -564 -1178 1908 91
2526 91 -1883 1154 998 -977 -89 -299 1 1506 -713 -1846 2232 1034 -2575 1067 1733 -2483 322
2543 322 1744 -2561 -454 3405 -1404 -2249 1959 618 -1048 639 -916 -756 2136 -248 -2216 1603
2559 1603 391 -1851 1692 473 -2508 1156 1313 -2048 1401 1746 -3227 387 3206 -2191 -880
2574 -880 2031 -1888 88 3722 -2646 -2985 3924 903 -2999 1088 57 -2144 2474 543 -3250
2589 -3250 1068 1611 -2029 1329 1136 -2820 1355 1989 -3240 648 2182 -3589 303 4537 -3113 -2428
2605b428O711m930j458M974m205k014P485l086n668N794N40l716L951j729l871
2620c650O273L32o704L863K550n697L656K865p269K468N293o019Q11N044o493
2635b677J52P998n992l811P478k526m050P221k929o650Q336J775q082L122K724
2650B089m712M307J291p451L924M435o584J933L882o946K485P311p885j959Q232
2665D352m592k877P823n071n830R518R2p469N195J05n251P115P50r807M937N700
2681D690o785K086K585o803L436O604p891j263O730m787k78O957p320l061J0080
2696D980l472n889P569l127n650R705k0j0285N764M631o775L320K466q402M278
2711i07P081q485q13O175m735Q79N543p762q76R051m871l827O988l960m219R736
$$ plain form
2605 -2428 4283 -647 -2105 2869 -1336 -3350 4135 1049 -4619 1175 1715 -2001 1950 221 -3650
2620 -3650 2623 2955 -3749 114 2664 -3033 623 3488 -3781 -1313 3980 -2039 -1228 3816 -2677
2635 -2677 -2525 5473 -519 -4330 3148 622 -3428 3793 864 -5786 2550 4325 -3757 -635 2089
2650 2089 -2623 1684 2975 -4476 -552 3883 -2701 -768 3114 -3832 -1347 5964 -1921 -3880 4352
2665 4352 -240 -3117 4706 -365 -6195 3323 3415 -4054 1141 1246 -4005 3110 3860 -5947 -1010 4690
2681 4690 -2095 -9 2576 -4227 -791 5813 -2078 -3341 3389 -1398 -1676 5281 -2039 -5100 4980
2696 4980 1508 -4381 3188 61 -5589 4116 4096 -6189 -425 4206 -2569 751 3217 -5185 -907
2711 -907 6174 -2311 -3124 3051 -1684 -805 4738 -3024 -3900 5151 280 -3547 3441 -519 -4738 4998
2727D998k710q876Q054J844p051N814R71q961N984O333q995J43N394n377K321
2742a14N363r025o43R272l758l542N376m946j320Q791m284o901P355J25m893O709
2758C565j795q376Q107M336r535K760M057p180M133O263r588j231Q503l851j640
2773a472M580n851o65Q682l973n715O607j823k738O698l876o563Q324J751p830
2788c864M377J834o836N677L979r222J539O729n931N58N148o849m49Q575m745
2803E20m562N772j540k213O029l600n416O753J005n465L510l22m683O954J416
2818D158q799L495N048n835J961L890p594J050Q092n564l348N977k941j564O166
2833D192l661n053O050O68m126L292j200l738N927Q11o735K924K618l926L468
$$ plain form
2727 4998 2288 -6588 1466 3310 -3741 2073 3044 -5917 67 6400 -2595 -2452 2942 -2435 -114
2742 -114 5249 -3776 -4419 4853 1095 -2447 2929 -2017 -3337 5454 1170 -5731 1624 1749 -3144 3565
2758 3565 1770 -6606 1501 5837 -3698 -938 3119 -4061 72 6335 -3253 -4484 4019 168 -1472
2773 -1472 3108 -2743 -3408 5274 1301 -4414 2193 370 -2368 4330 454 -6109 2215 3966 -3864
2788 -3864 513 2347 -4489 1188 5167 -4055 -2516 4213 -1718 -1160 3988 -2861 -3310 5265 520
2803 520 -4042 1730 190 -2023 4006 406 -5010 1743 2748 -2717 793 471 -4212 2742 4158
2818 4158 -4641 -1146 3902 -1933 28 3918 -3676 -2626 5466 -98 -3446 2531 -410 -1974 4192
2833 4192 531 -4522 1528 2196 -1930 1362 162 -3576 2351 3162 -3573 -649 1969 -1957 1511
2848A511J460p043L154N249n476r24M208l937k0O197m945l567O183l22l764M002
2864A966j710l586N023R24n099J807J920k590K865M39n251L003L501m458O20K310
2880A684m079J820M551n171j757N558k172k237L969k158l089N162N3m740K655
2895D9J337l168K827P10m019J853K395k833Q77R63k634J750K157l561qL289k703
2912g19j47L087l137j385M846j659l241L304N2k755K764M53l687K087K038k770
2928h69L64R69j787J426J850k796n3J932j498O27J208k779K14L207k178j202K388
2945A023j066j262L064p61l320K637J420k789J189J004k338R02J802k078o5J248
2961F10o85K42J017j436k98J218o10n19J273j330n37K292j296j286K150l29j767
$$ plain form
2848 1511 2971 -4072 -918 4331 -1145 -2069 2139 -1798 -1818 4379 -566 -4133 2050 1728 -2036 1966
2864 1966 256 -3330 1693 2617 -2482 -675 1245 -1345 1520 1959 -3292 -289 3212 -1246 -626 1684
2880 1684 -2395 -575 3976 -1195 -2952 2606 434 -1803 2166 8 -3081 2081 2134 -2606 49
2895 49 1386 -1782 1045 1755 -2264 -411 1984 -849 28 991 -1643 107 2264 -1297 -1305 1984 -719
2912 -719 -866 2221 -916 -2301 2545 886 -2355 949 1001 -1754 1010 1463 -2224 -137 1901 -869
2928 -869 -505 464 -1323 103 1953 -843 -896 1036 -462 165 1373 -1406 -1192 2015 -163 -1365 1023
2945 1023 -43 -1305 1759 998 -2322 315 1735 -1054 135 1139 -1199 -297 1505 -573 -638 610
2961 610 -75 167 1184 -252 -550 668 58 -461 812 -518 -1055 1237 -59 -1345 805 476 -1291
2978a291J815L61k283J426R22j961L33J759j046q50J428n40n66Q97m21j66N89
2995D06m45J33K52p35J53P02j35p92J105p53o03J471j41j615J032N64r56M17O94
3014G54j518m1J750p10o36P14j27m52L26km39K55O7J40M31p10K91J0j14J1N92
3035E92r57l61R99K45j101J41Q77q29L9Q95o55o56J128l1r64P94L46r35k34Q38
3055A71k3o81P1R25k0o81J81M02o01J59O72o28n75O92L86p95J51Q10m88n15O72
3076B85K70p86J85O1k63L08K80n30k35R02j46p28M02J77j54j72J47K40n44K82
3096a9M54p79j41Q37p4n95J98Q03o93o82J182m5q95L03R20r54l33R29k68m54L87
3117H1K75p10L00L68k82m22J04O09j15q27L95M36m64p2O39n06L7P76o66n65J040
$$ plain form
2978 -1291 524 885 -1398 28 950 -1011 -678 1081 35 -815 613 73 -493 404 -17 -183 406
2995 406 -39 94 346 -389 -236 466 331 -461 644 -109 -712 759 618 -997 35 599 -357 60 754
3014 754 -764 -805 945 235 -401 313 186 -266 60 58 -381 -126 -59 81 512 -198 93 103 -11 0 592
3035 592 -365 -726 273 518 -583 -442 435 -394 -355 540 -115 -771 357 326 -638 156 502 -433 -667 171
3055 171 148 -533 -462 463 443 -238 -57 345 -256 -97 575 -53 -628 64 450 -345 -194 616 128 -387 285
3076 285 555 -231 -46 15 -248 60 340 -190 -425 477 331 -397 5 182 28 -144 3 243 -301 -19
3096 -19 435 -344 -485 352 278 -317 -119 684 -9 -691 491 446 -449 -146 774 -180 -513 416 148 -306 81
3117 81 356 -354 -54 314 32 -390 -286 323 208 -619 -224 212 -252 -324 315 -191 -154 622 -44 -609 431
3138D31l2r68K64N09k38k35O22l66k6L17R1o29K06J32p6k98K81L85j94p39P03
3159A40J68n90k25R53m64k48N39n36m87R15K77j402O80R26q07m38J123r2o15l3
3179b16K36j83M30l60k43K75J01L51j3r82K65J085p67p79J113j28p84O74K46p09
3199c88M45J31q10P59R63j458l88J414o07l69L93j40l64Q99m14l96R4M85j82M
3219G1m64K8J314j215q67J749L7j939J249J272j780J56J456j775M4J489p28q36
3237g39J219l09o57P85j62m70P71n36n56J576l90j463Q95P70r78N50l32j012J529
3256D91P77k203Q08J070j522K31J587j832k84K173j155j168J722l95j534J740
3272E06L39j513M25O86p58P63J6j386J044O23j651J031O72j544R44R42k197L17
$$ plain form
3138 431 399 -569 -305 204 -34 -269 353 -13 -39 278 369 -260 -54 78 2 -296 -15 370 176 -563 140
3159 140 308 -282 -507 446 -18 -266 273 -263 -750 165 442 -960 -280 646 -161 -599 524 432 -183 -216
3179 -216 20 -163 267 -93 -336 -61 40 391 378 -604 -339 746 -21 -800 313 185 -599 75 321 -388
3199 -388 57 188 -622 137 1100 -358 -746 668 61 -308 85 -55 -419 480 66 -330 -236 249 67 71
3219 71 -393 -365 949 -266 -1133 616 653 -1286 -37 1235 -545 -389 1067 -708 -664 825 97 -739
3237 -739 480 171 -486 299 137 -333 438 -98 -654 922 532 -931 -36 734 -244 306 -26 -1038 491
3256 491 1268 -935 -127 943 -579 -348 1239 -593 -877 1296 141 -1027 695 300 -1234 506
3272 506 845 -668 -243 443 -315 448 464 -922 122 745 -906 125 797 -747 197 1139 -1058 -741
3290g41K190j595p82J971j036j257J794l49j514J699K64j541J385M5j406J158
3306B85P01j773Q07M93j179Q61J009k216N50J475j229l12J551j713J38K261j710
3323aj579K554p16j621K212k40k413J983J207k409J121O75j329O93R66j910Q0
3340g27J444r44K73R83k228N73K730k447r59K264r85j031K180r37j806K568J5
3357I66k140J408L58j833J514J211k455K53J723j721L43J655k175n5K055j062
3373D5q31J405j223p5K131j594j701L037o56j851J997j13k211K517P08l175J176
3390d14K084k565O77J525k250J09K424j784n49J684j488o6J994j429j386K327
3406H93n17r98J400q80j435K866k1l013J813J073k100J557O65k953J081K320k160
$$ plain form
3290 -741 1449 -146 -928 1043 7 -1250 544 195 -1319 380 644 -897 488 533 -873 285
3306 285 986 -787 20 513 -666 195 1204 -1012 -462 1013 -216 -528 1023 -690 -552 1709 -1
3323 -1 -1580 974 258 -1363 849 609 -1804 179 1386 -1023 98 773 -556 137 1103 -807 -727
3340 -727 717 -227 46 1029 -1199 -626 2104 -343 -1302 962 -23 -1054 1126 189 -1617 951 966
3357 966 -1174 234 592 -1241 273 1484 -971 -718 1005 -716 -373 1282 -893 -948 1107 45
3373 45 -786 619 -604 -679 1452 -142 -1843 1194 538 -1313 684 571 -1640 877 1585 -1590 -414
3390 -414 1670 -895 -218 1307 -943 -834 1590 -194 -743 941 -547 -613 1381 -48 -1434 893
3406 893 376 -622 778 -102 -1537 1329 1308 -1705 108 1181 -919 638 1303 -1650 -569 1751 -409
3423d09p08K020j433m33K434j765r88K028l53j041J398r39j080K424j81k203J401
3440A72K48j170J726r1k904J809J751k270MJ578j886N51K595k606j302K753n17
3457D41j350J870j294r39K412m59j746J193k6r38J602j57j959J162J393j968R31
3474A68P01k203J200K270l044p4K140j281o94K032j756q25K614o07j976J723l6
3491C52j019J528k25j958J572P70j526M13N34j400J250J004k267M99J596j582
3507d59K66J375k011l59K802j335j701K020l35j008J773l72k264J657J142j508
3523c17K32M97j282R68J047j851L29J105j138N65R00j810k0K255j663p19J467
3540E65n27q00J923o81j850J899L28j399O69N06j560R75J021j854L00J420j255
$$ plain form
3423 -409 -1117 903 -530 -963 1471 -294 -1282 746 393 -648 750 -189 -1269 1155 974 -1229 172
3440 172 420 -750 976 885 -2019 -210 1541 -729 -725 853 -1033 -482 2113 -493 -1795 958 441
3457 441 -909 961 -333 -1272 1140 681 -1065 128 102 -836 766 609 -1350 -188 1205 -763 168
3474 168 869 -1334 -134 2136 -908 -982 1158 -123 -817 1215 -541 -1366 1248 641 -1335 388 352
3491 352 -667 861 636 -1322 250 1020 -506 -93 441 -959 291 1295 -972 -473 1123 -459
3507 -459 -193 1182 -829 -1188 1614 279 -1422 598 263 -745 1028 656 -1608 49 1191 -317
3523 -317 -85 412 -870 98 1145 -706 -377 728 -410 155 1055 -755 -775 1480 -183 -902 565
3540 565 38 -762 1161 480 -1370 529 857 -542 127 633 -927 48 1069 -785 -485 935 -320
3557c20L95R7p42K07J251j109m06J195p08J0J349j366q31J595j27j036J219j0
3575F63j596J207N85j615Q5J363q84Q8P84j186O8J256p79m79Q80p07q0J136r12
3594a23n68J065k40m74J061o02j066J396k7j357Q76Q12j220L95O20j112J83J229
3612H48q91m95P76l06j97P82n17m68O09j83m8L57k86k53Q40j8p37J47L29o62N72
3633A99K2q52N06Q19r78J36O13p76j22J057m45o25O43j32l37L90k34l83P31j29
3653A03k87M5L51n63L52J17k31L65j08n11L75P2n23M18O51n28m75O87k84l00M61
3674A87p3n21O69N0p22L80j7j11J65k01p2K84K10j92K43k52m54R78o18l88L59
3695i6M23l15K2J98m66l3K83J99n64L50o8k84M38K40p03K53K23J72m22J34r1O6
$$ plain form
3557 -320 75 172 -570 -363 888 -221 -627 568 -140 -130 1219 -147 -978 617 490 -546 673 663
3575 663 -933 274 859 -756 -671 692 -192 -104 680 -506 -438 818 39 -440 440 -267 -347 789 -123
3594 -123 -691 374 134 -340 721 119 -947 449 422 -935 -59 753 -467 -72 548 -564 -381 848
3612 848 -43 -538 238 -68 -265 517 0 -468 141 -42 -90 267 -19 -272 568 550 -187 -40 289 -373 199
3633 199 221 -631 -125 694 -284 -148 465 -311 -433 624 179 -446 197 65 -272 118 -116 -499 232 103
3653 103 -184 -139 212 -351 1 118 -113 252 144 -367 8 80 -443 -25 626 98 -377 310 26 -274 187
3674 187 114 -407 262 312 -410 -30 -47 -158 7 -194 -266 18 228 36 279 27 -427 551 -67 -455 -96
3695 -96 327 12 34 232 -234 -267 16 215 -349 1 -67 -351 87 327 -376 -123 100 272 -150 -16 -107 -41
3717d1P1J26r1n1k0q4L43m75J98J55l61J58N04l58m77M11J81k80K83j66l13J55
3739a32L63l68l29N83J06l58k9K52o0l93QK58N2j73J45Q8oK15j68j80p1L44K6
3762A73m11L83p2k34j7L56l38J93P5j13K66m6k38j08J56K46m08j30M16k8l9j38
3784e6J11J22p6R5k9l6k86j6qq4N73j11l02n5L25K4k01K68k75J86j03l08K94l3
3808A9n6j11K13j08J31l9J5l23M89j30m44K12K67l81L77M4m72L88M0l26j49M79
3830A35j36k81M87j3l41L28O7l77K29J13r2r4J56l31J10p3nJ68o6n21P22J89p30
3853c56L01J46k04K69N3m43j22O26l09k21M91j75k86K57K3J17j69p4l3J27J14
3874A32k85K63Kj84J34K5n67L43J84n77K81L96j95j43K87l45j48P50l58j92K12
$$ plain form
3717 -41 30 156 65 14 -6 -90 253 -222 -24 131 -230 -72 432 74 -403 8 189 -91 192 26 -287 -132
3739 -132 231 -137 -466 117 223 -135 -164 88 28 -365 -357 -99 -47 -220 -75 13 7 222 54 -126 -197 147 173
3762 173 -238 145 73 -161 -178 178 -160 33 108 -5 261 215 -23 -131 25 271 -137 -267 149 121 82 -56
3784 -56 55 177 101 196 167 131 -155 -171 -179 -263 310 199 -103 -158 167 191 -10 258 -17 169 66 -242 52 19
3808 19 -37 -148 65 -43 88 49 64 -259 230 100 -344 -132 135 -246 131 175 -297 91 131 -195 -344 135
3830 135 -1 -282 205 192 -149 179 246 -131 98 211 119 25 181 -150 -40 -113 -118 50 -16 -537 185 374 -356
3853 -356 -55 91 -113 156 209 -234 -356 270 -39 -260 231 56 -230 27 50 167 -2 -76 -109 18 132
3874 132 -153 110 112 -72 62 87 -480 -137 47 -530 -249 147 -48 -191 96 -249 -397 353 -5 -197 15
3895A5J90o28M44J23k42q6N36m01n2J61p3J45k68KL7J92l13K3M95o94r0R25l71
3918G0n46Q24k81k24K52j17j28J69K64l86K1K70l01q1L50m88L39K51m29K85J53
3939B67m54p7P90n20l55O31l17q9N78k05r13J017m9q81O23K42o98L41N30q04K26
3960a17L50l96o6O28o94K61J99k34J6L84o35J36P69k98p00N94J4n91P99m68m03
3981d52P56J56q50M11L30p36L73L84q45J03P61m47j64O53m61k90M82m20j4O32
4001C62l47m34O08k68k73N63R0q20P96K27j278J132J24j173M88R60r04k31O25
4020B47n33p0P74n11l80P63l11k56P53o98p6O30j81n80P55j38o53N79L22p72L34
4041bN78q46K83L61q73K90J104j127l60J097o72k8N36l00n99R50k17n90M77L45
$$ plain form
3895 15 205 -423 21 144 -98 -184 352 -49 -101 60 -13 132 -136 -134 -97 95 -218 -195 300 -394 -484 441 70
3918 70 -476 348 67 -157 95 -22 -150 19 283 -103 -82 188 -113 -194 156 -332 7 258 -171 114 267
3939 267 -187 -264 526 6 -349 282 -35 -124 454 249 -664 353 304 -577 46 288 -410 -69 461 -343 -117
3960 -117 233 -163 -229 399 -295 -34 165 -69 -53 331 -304 -168 601 303 -397 197 211 -380 419 -49 -452
3981 -452 304 460 -390 21 351 -385 -12 372 -473 -370 391 -56 -220 433 -28 -318 164 -256 -270 362
4001 362 15 -419 189 -79 -352 211 301 -519 277 504 -774 358 482 -691 -203 757 -147 -378 247
4020 247 -286 -356 418 -93 -473 290 -21 -277 476 -222 -298 332 151 -429 326 188 -465 114 436 -336 -2
4041 -2 576 -270 13 374 -499 -209 895 -232 -592 505 -167 -195 341 41 -558 392 175 -415 62 407
4061D07p13N50j07n66N32L58p28N04K48r78L45P75p07m14R49n06k5N42o49l39
4081e22J067k69o64M41o6l34O09j27p40N96M06r59O22L17q35L97M72m94j02N82
4101C97n83K22L84p88n0Q97m72k59N49l70k92R93l03p56N36L10n45J63L02m56
4121a21J19M27p50K33L27m10L84O1n36jP63m83k03O25n74j55N43q3n69N81O1l54
4143a15L69j79m26L76L68p45L29K92m81J03N90n39k92P04k63k78N99o41r6O98
4163C73n50m8O01k72n55O32j33p38Q08M49r55L56M61p05R8M28m17k8N44l38R6
4184A07Q1k96J54M61p42j8M54k64o5M88k41k83K62O7n81N54K65j066J130k42l94
4205a69K80O8q6KK18m09k08L74j20q4L41l06m9M33n06p7M42j49k28L47j01m13
$$ plain form
4061 407 -306 244 137 -429 103 461 -267 237 485 -493 -148 627 -80 -494 455 -51 -76 466 -183 -522
4081 -522 545 276 -388 53 -13 -347 262 135 -605 -9 397 -562 60 377 -458 -61 411 -83 -185 397
4101 397 -186 36 420 -368 -418 479 7 -252 297 -73 -365 628 325 -431 105 415 -130 33 335 -121
4121 -121 -2 425 -325 -92 235 -175 209 270 -266 -267 496 13 -190 435 -139 -294 249 166 -403 178 239 -115
4143 -115 254 75 -351 25 393 -352 -23 269 -212 -109 481 -58 -350 354 91 -187 412 -229 -325 373
4163 373 -177 -225 376 104 -451 181 48 -690 118 567 -388 -32 429 -276 -178 250 -167 -195 349 11 107
4184 107 188 -108 46 507 -235 -253 201 -63 -128 360 119 -164 98 165 -416 138 403 -663 467 225 -169
4205 -169 111 179 93 95 313 -96 -304 70 -50 -134 207 -99 -148 285 -221 -298 144 -5 -233 114 13 -400
4227d00O86j8o07M39J08m36K57M38o00j15M42j11m51N41l8k62L19j73k79L29J12
4248A81n74J65K17O6J50l0o67M64M0k07K82N2k18q1L21m25K32Q8p7p4J21J58l19
4271a35K79j99k92L67j43o2K96kj36p3K33m8R9j92j66L81J75k20J46j68l45p5
4293b80M51l2n5K75l89Q8J91k06k03K3L61l49j1J88l26K93J30p7r4J12k70K23
4315D3J97m21M52j15k14LJ36j60PJ24L1j05k7K25N1r4r0j19O9L1j53J50J45L5
4339B01p5m9j43j6J71j40J01J86j84j01l9R8J5L6j83Q9J47j05j76K4L29J17k91
4362A2j11P7j31o8J17J08J45j72J7p2R4n3K86j56l03J38K08j48J03k24R5M9O7
4385G8M7k73J90o0K11j43l17K95N0m5j17N4l9j32K24K36k89Q9J42l76J76J9M9
$$ plain form
4227 -400 286 268 -339 100 208 -228 29 467 -133 -248 194 83 -368 173 135 -127 192 19 -260 69 181
4248 181 -393 -228 -11 55 205 175 -492 -28 12 -195 87 139 -79 -160 161 -264 -32 56 -21 -95 26 184 -135
4271 -135 144 -55 -347 20 -123 -185 111 109 -27 -100 133 85 184 -8 -174 207 382 162 308 140 -205 -280
4293 -280 171 139 84 359 -30 58 249 43 -160 -137 224 -125 -136 52 -274 19 149 72 -22 90 -180 43
4315 43 240 -181 271 156 -58 -55 81 -79 -72 52 83 -22 -49 176 227 133 43 -76 -7 24 -129 21 166 201
4339 201 126 77 -66 -82 89 -51 50 236 52 -49 -88 10 25 61 -122 -33 114 9 -167 -143 186 303 12
4362 12 -99 -22 -153 -221 -104 4 149 -23 -6 -78 16 -37 249 93 -210 -72 136 -12 91 -133 -38 11 78
4385 78 125 -148 42 -18 193 50 -267 28 78 33 -84 -30 -69 -201 23 259 -30 59 201 -175 1 20 69
4408F9P5p5j11K36j33J45p2l15K12j58L08j81j39K64j67o2qJ77L0j21j59k6N5
4431a56M2M48k92J7L1J38k79J02ro6L96l07k79K47mj84J74j35K35r3nJ18Pl16
4455a70K07j43j17J42J6J10J7j17M4j40L22j27p7K79l39J73k42j6K53j3m0J46
4477A68Qj09j41Q8p0j34K23Q5k87K40Rj74K0J29k37L35j84L2K3k6mj1L5j53L22
4502A87k29J58n6K01l63O3k2p6o1J09K80l4k22Q6j08P8N7mj24P0O1j81PK00j45
4527f8K22r2P2j71NR4k5K7j30Q3k55L95o0p1l1q0J79k85l9J40K52j98J72k37j26
4552b27K19l00K83p8P3p7O4o5j72K59r5K70n6j86J01n9J74j37j3J42L7k96K77
4575A38l02J29K57k21k3K08J48l90k50J55K9O0L97m50M0n8N1Q0j07Q3K46k76N6
$$ plain form
4408 69 144 69 -42 194 61 206 134 -181 31 -127 181 0 -139 125 -42 -104 -112 65 95 -26 -185 -211 -156
4431 -156 -114 334 42 59 90 228 -51 51 42 -24 372 65 -214 33 29 -155 19 -116 119 26 21 139 146 -170
4455 -170 37 -106 -223 -81 -65 45 62 -55 -11 -151 171 44 -33 246 -93 80 -162 -178 75 62 22 168
4477 168 176 67 -74 14 -56 -190 33 118 -169 71 80 -94 -74 55 -182 153 -31 1 24 -2 -6 -17 18 -135 187
4502 187 -42 116 60 261 -102 -39 -61 -137 -198 -89 191 157 -65 21 -87 -9 48 44 -80 -10 51 -130 -123 77 -68
4527 -68 154 62 134 -37 -32 62 37 64 -66 17 -238 157 97 26 -5 -85 94 -191 -230 -90 162 -36 136 -101 -227
4552 -227 -8 -308 -25 -103 -30 -107 -43 -108 -280 -21 -116 154 98 -88 13 -46 128 -9 -22 120 157 -139 138
4575 138 -164 -35 222 1 -22 186 334 -56 -306 -151 -122 -62 335 -115 -75 -133 -82 -2 -109 -26 220 -56 0
4598@N8j35R4l00L66l35R2K44j08j3N1K30n10M52L9o58M60j12J9q8J99r0J4n5
4622h6L6K67k77n6m5L09j99nQ6j45K85j28p5M0K81j87k27J82M4l07J44J53l52
4645b62R0L11m54L07M9n0j33L25l21J44Q4j02J3M6j35M5K36J04m48J89R7Jk61
4668a25K46l18K26j41o5K55J72l67j08M84k97k04L55k86Q0K86k11p8J69J31l86
4689a82L48k37k80M17qj04l1kJ46L4l2k65J32K88n12J57j9J73j55J3L75k65lR4
4713H2j82L05j63n8p6J58n0j44L34k82l9K37j97P7J90k01J07j20j60RL77l76j24
4736b96K18N2J56k12K10j89J82p6p2J00n7j01j21K59k37J74J5k53M27j03l00Q1
4758a43M22k07j96K81l58j36N39l38j02K92j05n1K31j11o7K0J52l67L83J7m21
$$ plain form
4598 0 58 -77 17 -283 83 -252 -160 84 -24 -37 14 244 -266 186 225 -433 27 -85 -66 -154 45 -45 -31 -86
4622 -86 -50 217 -60 -116 -161 148 -51 -56 30 -115 170 42 -33 7 288 101 -126 56 100 -207 -63 90 -262
4645 -262 -172 139 -315 -8 41 -9 -142 183 -138 6 90 -12 1 47 -88 -43 193 297 -151 38 135 136 -125
4668 -125 121 -197 29 -112 -177 78 250 -117 -225 259 -38 -242 113 -173 -93 193 -18 -96 73 204 -182
4689 -182 166 -71 -351 66 58 -46 -77 -79 67 101 69 -196 -64 224 -288 -131 -150 23 -132 -119 256 -9 -12 82
4713 82 -100 205 42 -16 -92 66 16 -128 206 -76 -115 122 -75 2 192 -9 98 -22 -182 -173 204 -172 -296
4736 -296 -78 -26 130 -82 128 -61 121 45 -27 73 16 -85 -206 53 -184 -10 5 -248 179 76 -224 -143
4758 -143 279 72 -124 157 -201 -337 202 -136 -238 54 -51 -102 129 18 -49 -29 123 -244 139 156 -265
4779b65J96K85m62L55n7q4J04L5j91O4K66j96m07L55M9k61N25k51j92LK9r1Q8
4802a03N56o96K82M3m49K31L29k00m6J86k12P5L57n29J36r4k40K62K44m8k76L80
4824A88Q8n36L55nk87L96p7m69L33J73k86K6L06l93J24j5j12J17K93k43o1K67
$$ plain form
4779 -265 -69 216 -246 109 52 -32 72 107 -84 -20 246 50 -357 -2 47 -214 311 60 -132 -129 -100 -191 -103
4802 -103 453 -243 39 82 -367 -136 193 -7 -53 133 -79 -4 353 -176 -40 -134 -374 -112 132 84 -192 188
4824 188 276 -260 95 90 -197 199 122 -347 -14 159 -127 -101 205 -188 -64 -79 -191 -74 219 -24 -85 182
$$ [...]
8191C6
##END NTUPLES=NMR FID
##END=
