##TITLE=1H_LR-721-R3-F3
 D2O
 8 sc, 
 9.10.2024
##JCAMPDX= 6.0         $$ Bruker NMR JCAMP-DX V2.0
##DATA TYPE= NMR FID
##DATA CLASS= NTUPLES
##ORIGIN= UXNMR, Bruker Analytische Messtechnik GmbH
##OWNER= root
$$ XWIN-NMR		Version 3.5
$$ Wed Oct  9 16:24:26 2024 Russian Standard Time (UT+4h)  she@DPX200
##.OBSERVE FREQUENCY= 200.1318
##.OBSERVE NUCLEUS= ^1H
##.DELAY= (6, 6)
##.ACQUISITION MODE= SIMULTANEOUS
##.ACQUISITION SCHEME= undefined
##.AVERAGES= 8
##.DIGITISER RES= 18
##SPECTROMETER/DATA SYSTEM= spect
##.PULSE SEQUENCE= zg30
##.SOLVENT NAME= CDCl3
##.SHIFT REFERENCE= (INTERNAL, CDCl3, 0, 15.7039)
##AUDIT TRAIL= $$ (NUMBER, WHEN, WHO, WHERE, WHAT)
$$ ##TITLE= Audit trail, XWIN-NMR		Version 3.5
$$ ##JCAMPDX= 5.01
$$ ##ORIGIN= Bruker BioSpin GmbH
$$ ##OWNER= she
$$ F:/spectra/data/she/nmr/H-F/1/audita.txt
$$ ##AUDIT TRAIL=  $$ (NUMBER, WHEN, WHO, WHERE, WHAT)
(   1,<2024-10-09 16:23:16.84 +0400>,<she>,<DPX200>,
      <created by zg, POWCHK disabled, PULCHK disabled
       configuration hash MD5:
       00 E9 B6 7A A2 85 ED C7 34 08 36 98 17 FE 4E 26
       data hash MD5: 16K
       00 1F 75 81 27 98 DB 0A 72 89 52 06 B2 53 33 62>)
$$ ##END=
$$ 
$$ hash MD5
$$ F2 1D A9 BF A1 D8 E5 A7 D6 70 24 75 89 71 E2 A8
##$RELAX= 
##$RELAX= 
##$RELAX= 
##$RELAX= 
##$RELAX= 
##$RELAX= 
$$ Bruker specific parameters
$$ --------------------------
##$DU= <F:/spectra>
##$EXPNO= 1
##$NAME= <H-F>
##$PROCNO= 1
##$TYPE= <nmr>
##$USER= <she>
##$AMP= (0..31)
100 100 100 100 100 100 100 100 100 100 100 100 100 100 100 100 100 100 
100 100 100 100 100 100 100 100 100 100 100 100 100 100 
##$AQSEQ= 0
##$AQ_mod= 1
##$AUNM= <au_zg>
##$AUTOPOS= <>
##$BF1= 200.13
##$BF2= 200.13
##$BF3= 200.13
##$BF4= 200.13
##$BF5= 200.13
##$BF6= 200.13
##$BF7= 200.13
##$BF8= 200.13
##$BYTORDA= 1
##$CFDGTYP= 0
##$CFRGTYP= 5
##$CHEMSTR= <none>
##$CNST= (0..31)
1 1 145 1 1 1 1 1 1 1 1 1 1 1 1 1 1 1 1 1 1 1 1 1 1 1 1 1 1 1 1 1 
##$CPDPRG= <>
##$CPDPRG1= <>
##$CPDPRG2= <>
##$CPDPRG3= <>
##$CPDPRG4= <mlev>
##$CPDPRG5= <mlev>
##$CPDPRG6= <mlev>
##$CPDPRG7= <mlev>
##$CPDPRG8= <mlev>
##$CPDPRGB= <>
##$CPDPRGT= <>
##$D= (0..31)
0 1.2 0 0 0 0 0 0 0 0.06 0 0.03 0 0 0 0 0.0002 0 0 0 0 0 0 0 0 0 0 0 0 
0 0 0 
##$DATE= 1728476596
##$DBL= (0..7)
120 120 120 120 120 120 120 120 
##$DBP= (0..7)
150 150 150 150 150 150 150 150 
##$DBP07= 0
##$DBPNAM0= <>
##$DBPNAM1= <>
##$DBPNAM2= <>
##$DBPNAM3= <>
##$DBPNAM4= <>
##$DBPNAM5= <>
##$DBPNAM6= <>
##$DBPNAM7= <>
##$DBPOAL= (0..7)
0.5 0.5 0.5 0.5 0.5 0.5 0.5 0.5 
##$DBPOFFS= (0..7)
0 0 0 0 0 0 0 0 
##$DE= 6
##$DECBNUC= <off>
##$DECIM= 24
##$DECNUC= <off>
##$DECSTAT= 4
##$DIGMOD= 1
##$DIGTYP= 9
##$DL= (0..7)
0 120 120 120 120 120 120 120 
##$DP= (0..7)
150 150 150 150 150 150 150 150 
##$DP07= 0
##$DPNAME0= <>
##$DPNAME1= <>
##$DPNAME2= <>
##$DPNAME3= <>
##$DPNAME4= <>
##$DPNAME5= <>
##$DPNAME6= <>
##$DPNAME7= <>
##$DPOAL= (0..7)
0.5 0.5 0.5 0.5 0.5 0.5 0.5 0.5 
##$DPOFFS= (0..7)
0 0 0 0 0 0 0 0 
##$DQDMODE= 0
##$DR= 18
##$DS= 0
##$DSLIST= <SSSSSSSSSSSSSSS>
$$ [...]
##$SUBNAM2= <"">
##$SUBNAM3= <"">
##$SUBNAM4= <"">
##$SUBNAM5= <"">
##$SUBNAM6= <"">
##$SUBNAM7= <"">
##$SUBNAM8= <"">
##$SUBNAM9= <"">
##$SW= 24.0689170037331
##$SWIBOX= (0..15)
0 0 2 0 0 0 0 0 0 0 0 0 0 0 0 0 
##$SW_h= 4816.95568400771
##$TD= 16384
##$TD0= 1
##$TE= 0
##$TE2= 300
##$TE3= 300
##$TEG= 300
##$TL= (0..7)
0 120 120 120 120 120 120 120 
##$TP= (0..7)
150 150 150 150 150 150 150 150 
##$TP07= 0
##$TPNAME0= <>
##$TPNAME1= <>
##$TPNAME2= <>
##$TPNAME3= <>
##$TPNAME4= <>
##$TPNAME5= <>
##$TPNAME6= <>
##$TPNAME7= <>
##$TPOAL= (0..7)
0.5 0.5 0.5 0.5 0.5 0.5 0.5 0.5 
##$TPOFFS= (0..7)
0 0 0 0 0 0 0 0 
##$TUNHIN= 0
##$TUNHOUT= 0
##$TUNXOUT= 0
##$USERA1= <user>
##$USERA2= <user>
##$USERA3= <user>
##$USERA4= <user>
##$USERA5= <user>
##$V9= 5
##$VALIST= <valist>
##$VCLIST= <CCCCCCCCCCCCCCC>
##$VD= 0
##$VDLIST= <DDDDDDDDDDDDDDD>
##$VPLIST= <PPPPPPPPPPPPPPP>
##$VTLIST= <TTTTTTTTTTTTTTT>
##$WBST= 1024
##$WBSW= 4
##$XGAIN= (0..3)
0 0 0 0 
##$XL= 0
##$YL= 0
##$YMAX_a= 708078
##$YMIN_a= -836375
##$ZGOPTNS= <>
##$ZL1= 120
##$ZL2= 120
##$ZL3= 120
##$ZL4= 120
##$ABSF1= 10
##$ABSF2= 0
##$ABSG= 5
##$ABSL= 3
##$ALPHA= 0
##$AQORDER= 0
##$ASSFAC= 0
##$ASSFACI= 0
##$ASSFACX= 0
##$ASSWID= 0
##$AUNMP= <proc_1d>
##$AZFE= 0.1
##$AZFW= 0.1
##$BCFW= 1
##$BC_mod= 2
##$BYTORDP= 1
##$COROFFS= 0
##$CY= 11.3945322036743
##$DATMOD= 1
##$DC= 2
##$DFILT= <>
##$DTYPP= 0
##$F1P= 15.6554695791079
##$F2P= 12.8336369535428
##$FCOR= 0.5
##$FTSIZE= 0
##$FT_mod= 4
##$GAMMA= 1
##$GB= 0.15
##$INTBC= 1
##$INTSCL= 1
##$ISEN= 128
##$LB= 0.24
##$LEV0= 0
##$LPBIN= 0
##$MAXI= 10000
##$MC2= 0
##$MEAN= 0
##$ME_mod= 0
##$MI= 1.114404
##$NCOEF= 0
##$NC_proc= 0
##$NLEV= 6
##$NOISF1= 3.799351
##$NOISF2= 2.8
##$NSP= 1
##$NTH_PI= 0
##$NZP= 0
##$OFFSET= 15.70392
##$PC= 1
##$PHC0= -26341.21
##$PHC1= 10.38743
##$PH_mod= 1
##$PKNL= yes
##$PPARMOD= 0
##$PSCAL= 0
##$PSIGN= 0
##$REVERSE= no
##$SF= 200.130013532006
##$SI= 16384
##$SIGF1= 3
##$SIGF2= 2
##$SINO= 400
##$SIOLD= 16384
##$SREGLST= <1H.CDCl3>
##$SSB= 0
##$STSI= 0
##$STSR= 0
##$SW_p= 3612.71676300578
##$SYMM= 0
##$S_DEV= 0
##$TDeff= 0
##$TDoff= 0
##$TI= <>
##$TILT= no
##$TM1= 0
##$TM2= 0
##$TOPLEV= 0
##$USERP1= <user>
##$USERP2= <user>
##$USERP3= <user>
##$USERP4= <user>
##$USERP5= <user>
##$WDW= 1
##$XDIM= 8192
##$YMAX_p= 0
##$YMIN_p= 0
$$ End of Bruker specific parameters
$$ ---------------------------------
##NTUPLES= NMR FID
##VAR_NAME=  TIME,          FID/REAL,        FID/IMAG
##SYMBOL=    X,             R,               I
##VAR_TYPE=  INDEPENDENT,   DEPENDENT,       DEPENDENT
##VAR_FORM=  AFFN,          ASDF,            ASDF
##VAR_DIM=   8192,          8192,            8192
##UNITS=     SECONDS,       ARBITRARY UNITS, ARBITRARY UNITS
##FACTOR=    0.0002076,     1,               1
##FIRST=     0,             0,               0
##LAST=      1.7004516,     0,               0
##MIN=       0,             -836375,         0
##MAX=       1.7004516,     708078,          0
$$ Real data points
##PAGE= N=1
##DATA TABLE= (X++(R..R)), XYDATA
0@%%%%qJ6j6K4l2M0n6P3r0J06j30J62j98K44k90L35l94M69n49O32p29Q36r54J095
28E86j250J410j588J793k018K265k537K829l146L502l896M323m792N303n865O496
44C415p199P976q839R816j0931J2208j3692J5431j7506K0048k3245K7388l2999
57a8129M1098n3937P8180j90328O65087j24437o58724N20286l39677k20666P91533
68D90286l67694r58967P52954M77520m34941L51351n0176q41494N71403N72529
78E62771q78070j10168N71074l04423L10815N56079r01160l70320Q77317j93029
88A20886m47023M26307k65983j90523R59584j03439r48108L28251K64569m32298
98b87777L99238Q9612p34183M78102P28998o09791k26862K61727m65267J73799
$$ y = [0, 0, 0, 0, 0, -8, 8, -8, 16, -16, 24, -32, 41, -49, 57, -73, 89, -109, 135, -155, 180, -214, 255, -294, 338, -391, 445, -509, 586, -664, 746, -842, 951, -1067, 1198, -1339, 1490, -1656, 1846, -2050, 2273, -2519, 2784, -3081, 3415, -3784, 4192, -4647, 5169, -5762, 6446, -7246, 8185, -9321, 10727, -12518, 14870, -18129, 22969, -30968, 47212, -143116, 521971, 397534, -261190, 259096, -80581, -301247, 490286, 122592, -836375, -83421, 394099, -40842, 310509, 260333, -581161, -9758, 562771, -315299, -425467, 145607, -158816, 151999, 708078, -193082, -563402, 313915, 120886, -326137, 100170, -165813, -356336, 603248, 499809, -448299, -120048, 144521, -287777, 111461, 201073, -533110, -55008, 673990, 64199, -162663, 99064, -366203, -192404]
108a92404O66183n88308l54468P61707l264l18115K95027m31898m34425P89317
118A89352J45219o64229L01434K64186l41660L70362P1425q42837J51933O43433
128B88618l32893l5344L41314m14799N4402O15159m84993n23782M57749K8901
138e668j27083M63655k20512m63362N49882J66023n92965Q0687J19753k86800
148c16390M33681L14989n89227R375M41637l11791j01887K33775m03997j4726
158c04561O56885j38049l68005K82288q3880k25578L45625j42760m57292M03762
168c1565L26680k89649R6553M7733l84678J91164K72845m35452n3012L89475j01931
179B8163L1321K56156l70682k16398L94818q2329k72913K43193q11j18998L80963
$$ y = [-192404, 473779, -114529, -468997, 292710, 289446, -28669, 266358, -165540, -599965, 189352, 334571, -329658, -28224, 235962, -105698, 264664, 336089, -506748, -354815, 288618, -44275, -79619, 261695, -153104, -98702, 516457, 31464, -492318, -34569, -5668, -132751, 330904, 110392, -352970, 196912, 362935, -230030, -149343, -29590, -316390, 117291, 432280, -156947, -147572, 294065, -17726, -119613, 114162, -289835, -304561, 352324, 214275, -153730, 128558, 44678, -180900, 164725, 21965, -435327, -31565, 295115, 5466, 102019, 149752, -234926, -43762, 229083, -206369, -259381, 130094, 28163, 59484, 315640, -55042, -271440, 123378, 41049, -231864, 11329, 10518, -108480, 272483]
190B72483j8064m71607J21528J82577k36972J07463J35179k53514J74429L20697
200C34199k99177j66842J69118j66753j9796K89094j53481j40424L26029L226
210A75193k18703J05719j10593k18808K77727J23733k49378J19977J66619j68929
220B557N2756M8876l08877K0601K82013j02969m5148J90702j00091o7947J72973
231A45446j53766k14029J72975N8965o7971J73547J363j79743J22974N4674k29678
242a15243l162R3009p1707J26718J49428j71074l7002J41603j22241j03736R4061
253a9346o3497j2372K14652m289j30535P6777k2542j34227O6696J1889j13994
264a30788J16736J39797p5111j390K0758j32591l334P8976r9315q571J55721O342
$$ y = [272483, 254419, -217188, -95660, 86917, -150055, -42592, 92587, -160927, 13502, 334199, 35022, -131820, 37298, -129455, -149251, 139843, -13638, -154062, 171967, 175193, -43510, 62209, -48384, -267192, 10535, 134268, -115110, 4867, 171486, 2557, 55313, 104189, -204688, -184087, 97926, -5043, -50191, 140511, 40420, -27527, 145446, -8320, -222349, -49374, 9591, -58380, 115167, 116530, -63213, 59761, 114435, -115243, -118405, -25396, -97103, 29615, 179043, 7969, -29033, 112570, -9671, -113407, -19346, -82843, -95215, 119437, 115148, -15387, 61390, 38848, -95379, -28683, -16794, -130788, -14052, 125745, 50634, 49244, 70002, -62589, -65923, 13053, -86262, -94833, 60888, 67230]
276F7230k2625N7964r2941r7653P3713j8845p1486J01958O0058l9180O8412Q257
288I4862j39637j8018M0015n5797L1614Q4091k3465K9092P3163q0519q8783J7519
300c5863k7010j2686P7624J7970m392P1636q634q8021j1716j9269n2645M9605
312d3401O2420q479L7865L6035n6056l2771p174o3964q215P5639K3938O300M6677
325F8814p662m5450j5637m2505m1924L6232M1794J3666M2863K3022l2847k6752
337A3614k9069m5708k187K8841J7383M3359M6388j5657l2951j6290l9480l3383
349f5140J1953K1532L1669N1065J4839k4000j7671k8310m6423j6438K0819K8844
361a7261L6492L1760O772j2432k8208m3808k9633P11J7834L0129L6105K4401M667
$$ y = [67230, 44605, 102569, 9628, -88025, -14312, -33157, -104643, -2685, 57373, 18193, 86605, 94862, -44775, -62793, -22778, -78575, -46961, 37130, 13665, 42757, 115920, 35401, -53382, -35863, -62873, -75559, 2065, 20035, 15643, 87279, 78645, -9376, -21092, -40361, -93006, -43401, 19019, 10540, 48405, 84440, 28384, -4387, -11561, -75525, -83740, -8101, 15837, 22137, 68814, 61152, 15702, 65, -42440, -84364, -48132, -6338, 7328, 50191, 73213, 40366, 13614, -15455, -61163, -63350, -34509, -17126, 26233, 72621, 56964, 24013, 7723, -31757, -65140, -53187, -31655, 14, 51079, 65918, 41918, 24247, -4063, -50486, -66924, -46105, -17261, 19231, 50991, 57763, 45331, 17123, -26685, -56318, -55607, -37773, -7644, 28461, 52862, 57529]
374E7529k0970m1544l3332j1116P35J5620L8323L9432J3090j1945k5767l3468
386a3413k9348j3025P818L0273M0685K6785K992j4010k4368l5743l2614l556K4163
399c3361L0744K9876K2322M145k0561l5157l4406j7652O807K4376K8890K9017
411C5040K2270o171l4918l5440k0834j0723M767K9442L8091K5925P204j6524l2084
424F045k8213k2853j0504J9518L5771K9385J8767K66k0452k7391l1391k4430R750
437d5732L0968K0350K4253K5230j0444l0757k4880l2214j2984K6568K0670J5836
449F864L9912J2850l1711k2334k1805l5523L61K7663J6333L3361L1665j8893j9891
462A8852p302m3451k9053K4114J7187K2319M5798k231k4506P600l1047n7328J1141
$$ y = [57529, 36559, -4985, -38317, -49433, -48698, -33078, 5245, 44677, 57767, 45822, 20055, -13413, -42761, -55786, -47968, -17695, 22990, 49775, 52767, 38757, 14389, -21354, -53968, -57524, -33361, -2617, 27259, 49581, 53726, 33165, -1992, -36398, -54050, -47243, -22867, 6023, 35040, 57310, 51139, 16221, -19219, -40053, -50776, -46009, -16567, 21524, 47449, 54653, 38129, 6045, -22168, -45021, -55525, -36007, -236, 29149, 47916, 48182, 27730, 339, -31052, -55482, -45732, -14764, 5586, 29839, 55069, 44625, 13868, -11012, -43226, -56210, -29642, -8972, 6864, 46776, 59626, 27915, 5581, -16224, -51747, -51386, -23723, -7390, 25971, 57636, 38743, 18852, 11550, -31901, -60954, -36840, -19653, 2666, 48464, 46233, 21727, 29327, -1720, -59048, -47907]
475d7907K4105j035M6825L8169k9737m048J459o1385k1041K9455j5437J9896P4262
488E3581l628l0354J5561l4411m6758K1931j0698k0883P6359M1641l9628J2377
500C5090m578o9787P138K1052n0817L4030Q0540k3751K47L6979p6367m9288N4884
513d628k5572l2214P8299J6099k1138O4949k7983j06962K9751K6456n9417M4022
525a8338N1869m1971N0645N0965j06039l6220M8301n5062M548R4442l9411j9997
537a6268J03194l4254q9122L6885l8428n8955J14701L2207q8951O8135N6105r0083
549d834P155Q552j13845M4722J20081o5112r619R0496o3592k9813P3445r9077
561d1441p7658J27599J7054m6623R4483k6911j01139R7800Q879j56303M1440Q1816
$$ y = [-47907, -23802, -24837, 21988, 60157, 30420, 26372, 27831, -33554, -54595, -25140, -40577, -20681, 53581, 49953, 19599, 35160, 749, -46009, -24078, -34776, -55659, 20700, 62341, 22713, 35090, 30512, -39275, -32137, -11085, -61902, -27872, 52668, 28917, 29164, 66143, -10224, -59512, -4628, -30200, -62414, 15885, 31984, 10846, 75795, 47812, -59150, -29399, -2943, -62360, -18338, 33531, -8440, 42205, 93170, -12869, -49089, -788, -55850, -51302, 43140, 3729, -16268, 86926, 52672, -36450, 435, -37993, -96948, 17753, 49960, -38991, 29144, 85249, -4834, 2321, 10873, -102972, -58250, 61831, -3281, -12900, 77596, 14004, -15809, 57636, -41441, -119099, 8500, 25554, -21069, 73414, 46503, -54636, 43164, 52043, -104260, -62820, 18996]
573A8996n5773Q1028O5812j48459O199J16985j12602n8583R4079n5945R425J65780
585A26942o9223j22993J00395j5600r6415R0768k1680j08537J57945R4407j46456
596a0447J0121L5543j19951O5275Q9139j63847J2034J91015n6604n1077P4015
607G5216j27560n8075J77373n0239j31814J35767L7982p3646J13658l9058k01748
618a42144R9161J12888j26039L4047P6412j05853Q6561J25560k03218q5191J48857
629B1041m5703j7722J29839j06502o4271K12353l1437j90349O8790r00q2945J75372
641F7566L3823k01941R1243J37471j36444n470L4225j67056Q0829K19121j37145
652A6222r1419J44790n3295m0098J18373j52393j30878K33759N6679j37229Q5604
$$ y = [18996, -36777, 44251, 110063, -38396, -32197, 84788, -27814, -86397, 7682, -48263, -38838, 126942, 57719, -65274, 35121, 19521, -76894, 13874, -7806, -116343, 41602, 136009, -10447, -326, 35217, -84734, -19459, 69680, -94167, -82133, 108882, 52278, 1201, 75216, -52344, -110419, 66954, 16715, -115099, 20668, 58650, -14996, 98662, 59604, -142144, -42983, 69905, -56134, -22087, 54325, -51528, 35033, 160593, -42625, -127816, 21041, -24662, -42384, 87455, -19047, -83318, 129035, 97598, -92751, -23961, -24861, -107806, 67566, 101389, -100552, -9309, 128162, -8282, -13752, 20473, -146583, -65754, 153367, 16222, -75197, 69593, 16298, -23800, 94573, -57820, -188698, 45061, 101740, -35489, 50115]
663E0115j3840j28733J57560L5973k49228M7985J65770p7573N8952P5655k11418
674h8782R107K14717j31523j28139J25873l5111N204J99639j15272j99917J62774
685A8570N2319j41208P2035r668j23906J98273J21051k29012k1255J03757j05860
696f4904N2636J03299j99110l420K58008n6699j22965P1882j01753m8969K16153
707A04158n7331j99197J53702J01082r9545P2657m1487k07034J35069J61697j69456
718d5685j4134J15265q2987O5039J21719k25689j00775K07479j3735o8458J09280
729F7319q7568o6198K25521k8299k42344P0235P2173p5297J29598K6110k03755
740a12505R5202J69489j57582n8124O8561j11113O2959J98808j39881j14799J62285
$$ y = [50115, 36275, -92458, 65102, 101075, -148153, -100168, 65602, -11971, 46981, 122636, -88782, -79675, 135042, 3519, -124620, 1253, -33858, -28654, 170985, 55713, -144204, 18570, 70889, -70319, 1716, -7952, -131858, 66415, 187466, -41546, -62801, 40956, -64904, -12268, 91031, -108079, -111499, 146509, 89810, -33155, 38727, -63026, -111995, 104158, 46827, -152370, 1332, 102414, 2869, 75526, 34039, -172995, -37926, 123771, -45685, -59819, 55446, -27541, 37498, 159217, -66472, -167247, 40232, 26497, -41961, 67319, -20249, -86447, 139074, 110775, -131569, -61334, 10839, -64458, 65140, 91250, -112505, -17303, 152186, -5396, -63520, 5041, -106072, -43113, 155695, 15814, -98985, 63300]
751F3300j7154p9554Q7577j08217j12874K24293P0815j70137M6443L6928j01864
762f0444J05125L3273k21014M4238J95507o9221j6717O9542j41978n180J79070
773A12201j09494j37355J31633K2268k7516J29472p8494j70716J35327P2772j44277
784f4179K8729M0896p7593J30041R4579j98097l4075J26363p2170j1107Q8096
795E1483j14247j0334J99566m7764j36211O7547l2119o2785J41121j4934j51279
806a09956J14464J02946j02428J4519P07j36272P9718J29495j25409k7913J20982
817F0853m3683n810P5183j34468p6000J55769J138q0094Q5020j4372o7768J19581
829G5349o256j70039M2860Q1712n7811N9347M5378j21224L7765J14999j08088
$$ y = [63300, 46146, -33408, 54169, -54048, -166922, 57371, 128186, -41951, 4492, 41420, -60444, 44681, 77954, -143060, -98822, 96685, 27464, 10747, 80289, -61689, -66869, 112201, 2707, -134648, -3015, 19253, -8263, 121209, 42715, -128001, 7326, 80098, -64179, -35450, 5446, -72147, 57894, 152473, -45624, -79699, 46664, -25506, -36613, 51483, -62764, -73098, 126468, 78704, -57507, 10040, -22079, -84864, 56257, 41323, -109956, 4508, 107454, 5026, 19545, 20252, -116020, -36302, 93193, -32216, -60129, 60853, 17170, 11360, 86543, -47925, -123925, 31844, 32982, -47112, 37908, 23536, -44232, 75349, 69093, -100946, -58086, 23626, -34185, 25162, 70540, -50684, -12919, 102080, -6008]
840f008o8369O8394l8381J5939J20187o8304q1521J03382j975q4905M2931k5601
852b4231o5724J20690N6344j06774J8889M2584p4048K8684L6366j11435J7608
863f1047J29508l4981l5985M9823o2707l1405Q7207m7059p8544Q7223L5299l6851
875D81N5723j9222r7901M9430M2836p8478J5649N0903l6578M5902N5876r8891
887a4270l7468O7527l2286k2014N7433l0511j1650R4035k0125q7841K7812K712
899f646m4042N4430J9315n8435M7769N4366n8988j4546J1430n7770J7593O7984
911C2460l7454j5991O1449j2786k6246K2511m8909m0030O7129J5716l6887L9118
923B0080J4974l8614K3585j559o9549J1992M7077j8886J7582L7561l8596q461
$$ y = [-6008, -74377, -5983, -44364, -28425, 91762, 23458, -58063, 45319, 43344, -41561, 1370, -24231, -89955, 30735, 87079, -19695, -806, 41778, -32270, -3586, 32780, -78655, -61047, 68461, 33480, -2505, 47318, -15389, -46794, 40413, -6646, -85190, 2033, 37332, 481, 56204, 36982, -60919, -11489, 31347, -47131, -31482, 19421, -17157, 28745, 84621, -14270, -51738, 15789, -16497, -38511, 18922, -11589, -23239, 70796, 50671, -37170, -9358, -6646, -50688, 3742, 23057, -35378, 12391, 66757, 7769, -6777, 4653, -53117, -35524, 32460, -4994, -20985, 40464, 27678, 1432, 23943, -24966, -64996, 2133, 17849, -19038, 20080, 35054, -3560, 20025, 18466, -51083, -39091, 7986, -10900, 6682, 44243, 5647, -2814]
935b814L5264m1109l8794L1404K838L042M8332r904l6527K7235k952m6958P833
948b3110R586j3615M0519K8390l4130K24J4122l8543r649K1205k1786O044N1151
961C0408k088j8909J3052k2151k7610J9437n355j9562L4458K6971j2385N429m919
974A6776l3519k48Q707j8461J1454L1972j895L429J0789k7604k1398Q115q572
987b0455k286K7460P556j536J9322p454l3365n846J364r907J3595J9316J100J1900
1001B0764Q155k1928j7120k084j0915Q35J9635J0373P038J0218q190j5877o438
1014e534j3470r222J5962J5312N567J1422L188j2599r785j1305j5629M374J6254
1027e465P649Q908J2527k753j3682j1511j1895o063O032J0168J1263J3386M448
$$ y = [-2814, 32450, -8659, -47453, -16049, -13211, -10169, 38163, 28259, -8268, 18967, 16015, -30943, -23110, -13524, -27139, 13380, 41770, 7640, 7864, 21986, -16557, -26206, -5001, -26787, -20743, 30408, 28320, 9411, 22463, 312, -27298, -7861, -13216, -32778, 1680, 28651, 16266, 21695, 16776, -16743, -16991, -8284, -26745, -15291, 16681, 14786, 18215, 29004, 1400, -19998, -11883, -20455, -22741, 4719, 12275, 10739, 30061, 22607, -10758, -16604, -15240, -25147, -11552, 7764, 8864, 20764, 28919, 6991, -10129, -12213, -23128, -22293, -2658, 7715, 14753, 24971, 16781, 904, -5534, -19004, -28226, -12264, 3048, 8615, 20037, 23225, 10626, 841, -10464, -26093, -21719, -5465, 2184, 11092, 23619, 20866, 7184, -4327, -16222, -22285, -16253, -6085, 5178, 18564, 23012]
1040B3012q656j1577j2128r210j720N470J2521J5696Q412l614p101j0144j4379
1053a3418r211K738J0031J3438J1936M907k748p880j3857j4265l826O970J0172
1066e013J0543J1158N634o669j3548j1948q118j383N968J1459J3185R116k64r818
1080A0302j2700r396o472j807Q708J5953J1459K441k042p315j3498j1655m304
1093b0326L549J1887J3322P382K303k109j1637j4695q169j91O954J1325J0659
1106A0254Q168K495j0299j4609q243n751j583J0589J2784R136Q553k586j5689
1119C219q789n506j1061L973J6638Q382P192P755p781j3685o667j1340n118J4816
1133g972R891L553J3112L312j4009q339j1060j2588R200J2906n94J3268J5051
$$ y = [23012, 14356, 2779, -9349, -18559, -20279, -14809, -2288, 13408, 21820, 18206, 11105, 961, -13418, -22629, -19891, -9860, 3578, 15514, 20421, 17673, 9793, -4064, -18329, -22155, -15185, -5013, 5530, 16688, 22322, 15653, 2105, -9843, -17961, -19344, -13376, -1917, 11268, 20384, 20120, 10302, -2398, -11794, -18266, -20073, -11365, 4588, 16047, 18488, 16446, 9131, -4367, -16022, -20326, -16777, -4890, 8432, 15814, 18117, 16008, 4371, -10324, -18493, -18684, -11730, -405, 10254, 18422, 20917, 10618, -3991, -12234, -17985, -19568, -8979, 3805, 12941, 21494, 18908, 3219, -5570, -11076, -22137, -18164, -1526, 6856, 14048, 21803, 14022, 337, -6330, -17670, -22788, -7972, 1919, 5472, 18584, 21896, 7887, -452, -11512, -24100, -14900, -1994, -2588, 10680, 25731]
1146B5731j1393j0451l102j8611o740J7183L363M083K1463j911j5360M682j1453
1159b516k4255Q656J3545n12J7459J0700j6001J671K012k9001p589J7226k072
1172a0677J0671K5322j1341r884J3275k0027k3048J5569j890o945L5227J1248
1184B7500k3606P308M20k9892N295Q882k3151J9850L7925j6605q288J3119k6420
1197g663j2012K1117j8784r941M2020N965j5436J9675j5277l6754K1562O357l0265
1210b9436K2341K4914j7314K1299J2698n2104p070L2040k3396n463L4618j2974
1222A53J035M1587k8306m4201K4874k138k1945L6743M770k9185L8496J8485m9572
1235i204j265P700l5421K7428M0849m0308K65M8317k5043k0200J8769m1666j4335
$$ y = [25731, 14338, 3887, 785, -17826, -24566, -7383, -4020, 63, 21526, 19615, 4255, 8937, -2516, -26771, -18115, -4570, -5082, 12377, 23077, 7076, 8747, 10759, -18242, -25831, -8605, -10677, -6, 25316, 13975, 4091, 17366, -2661, -25709, -10140, -12030, -18975, 16252, 27500, 3894, 11202, 11622, -18270, -12975, -4093, -27244, -7394, 30531, 13926, 5638, 18757, -7663, -19675, 1442, -17342, -27283, 14737, 20702, 5266, 24941, 9664, -27090, -5528, 829, -29436, -7095, 17819, 505, 21804, 34502, -17602, -24672, 7368, -16028, -21491, 13127, 153, 1188, 42775, 14469, -29732, -4858, -6996, -28941, 7802, 12572, -16613, 21883, 40368, -9204, -10469, -2769, -38190, -10762, 30087, -10221, -9956, 38361, 13318, -6882, 11887, -29779, -44114]
1248d4114O5917m668l7075M0170K924l4299L0055j1878o2303L6326M4092l1835
1260f688J7140K1454m8024J5164L9520o2283k4900N3332q494K748M7734m3094
1272C609l5679O2380j1676o0216K9942O476k2807O3888J2106p5656K0247L6954
1284B9568n0666O056K5006n2083K7432P8749m5823l8942L7117k8598j3814N2965
1296B6967m0829m3281Q1549K3121n0332K0421j4923n2358N7081K5123p7292K1245
1308b3508N8855l1437J5576K3286q3647n579Q0096l3174l3839M9397j7479o559
1320h012P1175m3560q4499N3626K6646l9544L7780Q65n4273O4649M2776q9534
1332b1905j3576L8820l5707K9126N3410p1525j2379Q6325k7336m7831L0182m0826
$$ y = [-44114, 21803, 17135, -19940, 20230, 23154, -11145, 18910, 7032, -55271, -18945, 25147, -6688, 10452, 31906, -16118, -954, 38566, -23717, -48617, 4715, -3779, -1031, 46703, 3609, -32070, 30310, 18634, -41582, -11640, -5164, -27971, 35917, 48023, -27633, -7386, 29568, -21098, -15042, 9964, -42119, -14687, 64062, 18239, -20703, 16414, -12184, -25998, 26967, -13862, -57143, 24406, 47527, -2805, 17616, 2693, -49665, 7416, 32539, -44753, -23508, 35347, 3910, 19486, 42772, -40875, -46454, 33642, 468, -33371, 16026, -1453, -8012, 63163, 19603, -64896, -11270, 15376, -24168, 13612, 14477, -39796, 24853, 67629, -21905, -35481, 3339, -32368, -3242, 50168, -21357, -33736, 52589, 25253, -22578, 7604, -33222]
1344c3222j9224R7570p035p9269M7505K7849m5125L0212j2002q2714N5946P7887
1356E8378n8644r485L7682m4909J5578N2365q1189l9226Q6415K516k2757M5257
1368D1981m3073m6260Q2999n08q8625K8344L2401k5580N8264J2826r7918K0458
1380b4691P0247n5199j9040L5079m2077K4436Q7308n7716o2945N5606p491k9412
1392b5895M9035l2499n1460Q8839L5756p4490P846O568m9005N2999L4223q8683
1404d6766J2146Q3511l0730j3119K4857p0847o958R0741l2639n6025N8124M648
1416A6943k3103N6060l4208q6662N7504M5355n1760K1012J7851m9737M9996M7243
1428F6494r2036k5681N9606k1013P099M8837n8369k0286Q7343k0607o8469L0330
$$ y = [-33222, -52446, 45124, 38089, -41180, 6325, 34174, -10951, 19261, 7259, -75455, -19509, 58378, -266, -9751, 27931, -16978, -1400, 50965, -30224, -69450, 16965, 19481, -3276, 41981, -1092, -47352, 35647, 35139, -53486, -25142, 7259, -18321, 39943, 52769, -45149, -24691, 45556, -9643, -28683, 6396, -35681, -11245, 76063, 18347, -44598, 11008, 3517, -25895, 23140, -9359, -60819, 28020, 63776, -10714, -2868, 3700, -45305, 7694, 41917, -46766, -34620, 48891, 18161, 5042, 29899, -40948, -47906, 42835, 10196, -45829, 12295, 16943, -6160, 49900, 15692, -70970, -13466, 31889, -19871, 1141, 18992, -30745, 19251, 66494, -25542, -51223, 8383, -12630, -5531, 43306, -15063, -35349, 51994, 31387, -37082, -6752]
1440f752q939k4026P6840K356p8846L8701M2526n0991Q331O975o4496L9241P7531
1453E8451n2127k6983M4794k7565o213M4034n7694l9606Q1537J4145m0349L1587
1465B4011j6431m4779N7103R080p7586K2204M7030k6181K8402K1234p5333L280
1477b7966O4732m1826l0221L9853j7818O351O5051l9641o1434M7135P856l7188
1489b5116L0632n063l8581O0440L1901o5747j734K1717l8563K3694L6371n6328
1501b6377K23O7974k0257k7437K1438l9289j6162O5063j1792m8568M2779J8893
1513B6488k8555K5009j2229n9562L3434M1093l7999O429K8031k9971J4468L2451
1525C9087n5936k5398M6273n773o787L6231k4727k3236N0685p492n5148J7040
$$ y = [-6752, -15691, -39717, 37123, 39479, -39367, -666, 41860, -9131, -800, 6175, -58321, -19080, 58451, 6324, -20659, 24135, -3430, -9643, 34391, -23303, -62909, 18628, 32773, -7576, 24011, 7580, -37199, 19904, 28984, -48602, -26398, 20632, -5549, 22853, 44087, -31246, -27966, 36766, -5060, -35281, 4572, -13246, -6895, 58156, 18515, -42919, 4216, 12072, -25116, 5516, 453, -38128, 22312, 54213, -11534, -13268, 8449, -30114, -6420, 29951, -26377, -26154, 41820, 21563, -5874, 15564, -23725, -39887, 25176, 13384, -35184, 7595, 26488, -2067, 22942, 10713, -48849, -15415, 25678, -12321, -5892, 22139, -7832, 6636, 39087, -16849, -42247, 4026, -1747, -8534, 27697, 2970, -20266, 30419, 22927, -32221, -15181]
1537a5181J1416j7999L9419J2492m8376J7457L1974l8343q813J6550k8865J4235
1549a4034N0086k5330k3187K9679j3248j8085K3738k2255k5383M8742J7550l0204
1561a931J2839l2l0094K1695Q872m2968J2541L9218j4636L096J6747l5057r025
1574a8735L2515k0379j9705K9965Q49n167K9734j4235l7008J8535Q060k3281J3779
1587e073J0301j4874K4114J6898l5875p824J4970j8147K272K2574j5255J0L2161
1600B6252j1202k1979R760j2380j4282K6684M280j8274J9272J2648j8211J257
1612C825k960k4372J0590K1223j1868K103J8311r230m652O729k0900j0997K0215
1625a983R37l512J8424j963j2752J0570m695k3323N717R511m657J4511J0308j4786
$$ y = [-15181, -3765, -21764, 17655, 30147, -18229, -772, 31202, -7141, -15954, 596, -28269, -14034, 36052, 10722, -12465, 17214, 3966, -14119, 9619, -12636, -38019, 10723, 28273, -1931, 10908, 10876, -19218, 2477, 11349, -31619, -19078, 20140, 5504, 8600, 25347, -9710, -18735, 13780, -6599, -26304, 3661, 4510, -657, 29077, 14842, -22166, -3631, 4429, -18852, -5073, 5228, -9646, 14468, 31366, -4509, -12333, 2637, -15510, -13238, 9336, -5919, -5909, 26252, 15050, -6929, 2831, -9549, -23831, 2853, 7133, -11141, 8131, 20779, 2568, 3825, 865, -23507, -12917, 8306, -3562, -1459, 16852, 7622, 2970, 9699, -11201, -22198, -1983, -1046, -4558, 13866, 11903, -849, 9721, 5026, -18297, -12580, -3069, -7726, 6785, 17093, 2307]
1639B307Q75P970j7590r004Q910j665N251J7117l942p424O746q264j3641M884
1653g470l70k940J5688Q310o429K288k928j4280j17L285p485O319J5989k62k210
1668G388K401j0049q376L172l729j697J2929O791j750L022l205j1043l282r36
1682h364k316O664Q429J626M029J412r496p577j616l366J837Q308M177L789N367
1697A2903n220r712k734l129l015M702P716M450L755M13o207o095l998m643R67
1712i847P028O368M474K046k129m729o204o508j414M436N106M921N448J386l654
1727F728n931o130m586R58M270M310O099M948j612n664n161m709l201P04N478
1742c499O595N094J699k369n345n593m719k333K864O593O400K674P93j707o062
$$ y = [2307, 3182, 11152, -6438, -15442, -6532, -8197, -2946, 14171, 10229, 2805, 9551, 1287, -12354, -7470, -7840, -10780, 4908, 13218, 6789, 9077, 6149, -8131, -8248, -4963, -12448, -6129, 9860, 9598, 7388, 9789, -260, -8636, -5464, -9193, -10890, 2039, 8830, 7080, 10102, 6897, -4146, -7428, -8364, -10680, -4016, 4413, 6039, 10068, 11480, 1984, -5593, -7209, -10575, -8738, -430, 3747, 7536, 12903, 7683, -2029, -4763, -7892, -10907, -6205, 1511, 5961, 9716, 10129, 3922, -2173, -6171, -10814, -9847, -2819, 3549, 8023, 10069, 7940, 3211, -2993, -9501, -10915, -6479, -1373, 3548, 8996, 10382, 6728, 797, -5333, -9919, -8961, -4691, -381, 5718, 10666, 9054, 3390, -1771, -6480, -9681, -8977, -3499, 3096, 8190, 9889, 7520, 2175, -3418, -8137, -10470, -7606, -1013, 5387, 8061, 8854, 7147, 1085]
1757A085p350l433J201L557N422N742L172p43l777p160o046p54J981K860O891
1772B648O233J330l377m623o173l803j767J487O627O927L167Nk420o330n141k507
1788g717k230M147Q384L586P27K558m314q731k734j872j127O543O754K132L454
1803I560j33q980n461m28m131J891P609L939M267L610p085p333J46n282l443P992
1819c262M710J829P545q99r942j185k784q449N443Q708j966N237Q635p312o727
1834d19o29q804j815J0709O3k69J1988J52q753M62o586j0103P983N932m007J0024
1850E928O445r801J409J149j6256k080J2228k516L578J2392p342m973R683j0796
1864i52j5199R610L618k664J4956K183j2733P309J991j8148N55O410q127J1599
$$ y = [1085, -6265, -9698, -8497, -4940, 482, 6224, 9396, 8653, 4876, -2284, -8330, -9084, -7103, -4243, 2648, 8881, 10211, 6834, 2211, -3962, -7765, -9532, -8045, -1418, 5509, 8676, 8681, 6261, -69, -5210, -7717, -9947, -5800, 2584, 6170, 6897, 9455, 5141, -3590, -6324, -8196, -9323, -2780, 3974, 6106, 9560, 9427, 447, -5014, -5442, -9573, -7682, -73, 3866, 8133, 11743, 4658, -2675, -2529, -7811, -11254, -3262, 1448, 3277, 10822, 9923, -19, -1204, -3988, -12437, -6994, 1714, -252, 4985, 13620, 6308, -419, -1048, -9852, -11667, -958, -895, -1164, 10824, 10976, 2223, 2685, -3901, -14004, -6021, -89, -4096, 5928, 12373, 2572, 3981, 5130, -11126, -13206, -978, -3494, 84, 12476, 5134, 161, 9844, -952, -16151, -6541, -2923, -5587, 9369, 11552, -1181, 6128, 8119, -10029, -9474, -3064, -11191, 408]
1878D08J6061j2680l702R804j2768o714J0069j1059k788K5710R94j4431Q981m234
1892C651j5286J1159m61j7755J5608J8302j1604L134M976k1238N18J5608j6184
1905i572m511K0779k617j30J5281j7993j8715J8728K14j5630J4025M045r009K1686
1919A6581K732l2258K653J3953j5483O902J4434j7347O754K6306j8965j7740J1996
1932E18j1301l306K6439q667j7969K6152O242k1567O034p238k0554K5398J7158
1945A7339k6210N843J9400j5970K611Q081l1711j817L5156q060j0541J9609j1090
1958B640j0701K6371j3775l3363K0964J4692j1753J8181L52k9308J8379J8683
1970B1362l3072o354J8310j0372J3501K4459k9949j3770L0356j0029j8926J6054
$$ y = [408, 16469, 3789, 87, 9891, -2877, -9591, 478, -10581, -13369, 12341, 13335, -1096, 7885, 3651, -11635, -476, -937, -18692, -3084, 15218, 3614, 6748, 11724, -9514, -8996, 6612, -9572, -14083, 6696, 4079, 3949, 19230, 1237, -17478, 1250, 1464, -14166, -141, 3904, -5105, 16581, 19313, -12945, -10292, 3661, -11822, -4920, 9514, -7833, -1079, 25227, 6262, -11478, 518, -10783, -14089, 12350, 3683, -14286, 11866, 18108, -3459, 2575, -4663, -25217, 181, 17339, -8871, -3028, 16372, 402, 3013, 11094, -20617, -22434, 12722, 4662, -5879, 13730, 2640, -8061, 18310, 4535, -28828, -7864, 6828, -4925, 13256, 13608, -15700, 2679, 21362, -11710, -18064, 246, -10126, 3375, 27834, -2115, -15885, 14471, 4442, -14484, 1570]
1982A570j1649r113M0648K646l6230J1272Q304k0220J5748L529l3851J9295L7675
1995B9624k2031j0532J1630k2475L133K9347k6287j9020L6677M593j3751J7041
2007A7949j9453k7192L3877R540l3123J2781J4912j5141K2707Q621m7511O15L4580
2020A3162j6972m682J9722k0921L716L9721k4218l5659K3159J367j1400K8450
2032A5445q756k9744L3582J7684l5926J121N298k3513K5899K6909l8100l588L4047
2045B0358j5029q179J3904l2157p150M9364n930k8992K1449k38j7044K6108r314
2058G150m2772K5934K9167k1638Q338Q607l1990J4891K8834l8142j5225L1035
2070D189n682L049K6167k9962k2075L9684k947l2520J6762l4j3237L8636N108
$$ y = [1570, -10079, -19192, 21456, 24102, -12128, -856, 7448, -12772, 2976, 6505, -27346, -8051, 29624, 7593, -2939, 8691, -13784, -10651, 18696, -7591, -26611, 10066, 14659, 908, 17949, -1504, -28696, 5181, 14721, -18402, -5621, 9291, -5850, 16857, 25478, -22033, -21418, 13162, -3810, -8492, 11230, -9691, -5975, 33746, 9528, -26131, -2972, -1605, -13005, 15445, 6689, -23055, 10527, 28211, -7715, -6594, -1296, -24809, 1090, 27999, -10101, -13689, 20358, 5329, -2850, 11054, -21103, -28253, 21111, 15181, -13811, 7638, 7400, -9644, 16464, 7150, -35622, -9688, 19479, -2159, 6179, 14786, -17204, -2313, 26521, -11621, -26846, 4189, -1493, 1556, 27723, -2239, -24314, 15370, 12423, -20097, -3335, -3369, -16606, 22030, 27138]
2083B7138m5556J0744K1621k4602P561J1993l2271J4296M2661k5007k0454J8800
2095F924j6725l422L2469k2400k5799M0010J0600k3608J2018j0733k7896L2555
2107C993J5371l8297R253K5298j6646J0431J2455m2802k957L9454j4477j3077
2119a2001K2607j3075n034L5401j8058l8895K3085J1304j5681K0838n65k9218
2131a9292K6266K1153l6872n707J5433j6936J4420K6569l0979q963L4047j0864
2143H275j7369J4517j8799j0850M1889O24l2067J6650Q157j9340J6429j715l5712
2156b9311J9698L1584k0618j613J2914k2725M831K4275k7988j5750L0492l03n762
2169b76K0307j8117k2299K9672J926k9411J2228Q300j1771K4247P630l6959M473
$$ y = [27138, -18418, -7674, 13947, -10655, -3094, 8899, -23372, -9076, 33585, 8578, -11876, 6924, -9801, -13223, 19246, -3154, -28953, 11057, 21657, -1951, 10067, -666, -28562, 3993, 19364, -18933, -9680, 15618, -1028, 9403, 21858, -20944, -23901, 15553, 1076, -12001, 10606, -2469, -7503, 27898, 9840, -29055, -5970, 5334, -10347, 10491, 9926, -19292, 6974, 28127, -8745, -14452, 981, -15955, -1535, 25034, -5945, -14908, 19139, 8275, -9094, 5423, -13376, -24226, 17663, 18287, -13780, 2870, 11027, -8313, 8116, 6401, -29311, -9613, 21971, 1353, -260, 12654, -10071, -5240, 19035, -8953, -24703, 5789, 5486, -276, 20031, 1914, -20385, 9287, 11213, -18198, -5970, 2330, -9441, 14806, 22436, -14523, -10050]
2182a0050K2500j9316j857J5060j8371O533L1949j8468k1353J6916o660r536K1869
2195I216q776j9301K8208J0680k2454M422j149j9754J8156J4587k6304M456K3583
2208A5570j1774j452R052k4514m519K7947q145j3249J8524j961r306J7898q457
2221E614k6389J4769J1588j2305J0818N694j7325J1838J2785k4446o764J4478
2233C55p387N057J6895j5468o223K0318q071j6216R528m561o678K1675K738j8046
2247f084R341N893j5248M597K804j6368R727J9062j0799l106Q749j1201k244J0442
2261E565j2843o854J8544K373o682R256o006j1980J0409K05j4095Q042R029o205
2275a242Q054M771j6224j183R573r084k458J0227l779K015J2417q103j1509O619
$$ y = [-10050, 12450, -6866, -8723, 6337, -12034, -5501, 26448, 7980, -13373, 3543, -3117, -12653, 9216, 440, -18861, 9347, 20027, -2427, 1995, 846, -18908, -752, 13835, -12469, -8013, 15570, 3796, 2344, 11396, -13118, -17637, 10310, 2165, -11084, 7440, 5479, -3827, 14071, 5614, -20775, -6006, 5582, -6723, 4095, 9789, -7536, 4302, 17087, -7359, -14123, 355, -7032, -1975, 14920, -548, -6771, 13547, 5476, -10740, -1212, -5773, -12451, 9224, 11962, -6084, 3257, 9150, -6098, -1501, 1303, -15065, -5338, 13724, 2925, -181, 8568, -2633, -4877, 5565, -7278, -14132, 4412, 6785, 103, 9359, 3353, -8627, 1782, 1987, -12108, -4066, 4963, -1242, 6812, 11583, -4641, -5824, 3749, -5335, -7793, 2434, -1345, 670, 13087, 4984, -6525, 94]
2289I4k015o547P929J329m245J0326L323j1205N7Q51q934M467P761o012K718R516
2305I413n250l876K149q580l114J0152n16l353Q378J517n426J630l531q493M393
2320d507M419k308M330N194m583q6Q09p838k492M866j117K535P355k551k686L403
2336D743m496o705J958J031N26O064K951l621R88j73p056j652K088r43K992N764
2352D459J41r61M69m520l609P48j232M85N488K721j14L91k251m444p10q71j581
2369e391L858M903P1P10L53l777l512r56j146R88M455K250Q42J482j662m091k674
2386c297j307K54K267K565K429K168n02l165l123j902j292J014K710K870K408
2401D097R06j728l280j782k305j212K067L614K366J600L40k050k678k835j842
$$ y = [94, -1921, -8468, -539, 790, -3455, 6871, 10194, -1011, -954, -103, -9037, -4570, 3191, -2821, -103, 9413, 4163, 287, 2436, -6144, -9258, 894, 378, -2975, 5403, 6920, 1494, 3124, -407, -8900, -4507, -88, -2396, 1934, 7128, 2545, 2459, 3268, -4570, -7062, -2196, -3313, -778, 6577, 4026, 1340, 4743, 247, -6458, -4500, -3469, -2943, 3121, 6072, 2451, 3439, 3266, -3790, -5442, -3354, -4297, -1305, 4459, 4600, 3639, 4108, -412, -4021, -3273, -4505, -4020, 1468, 4189, 4075, 4466, 2215, -2229, -2939, -3810, -5391, -1533, 3370, 3441, 4151, 4504, 727, -2785, -3741, -4887, -3899, 556, 2806, 3648, 5130, 3468, -623, -3297, -4604, -4350, -2083, 482, 2911, 5079, 4577, 1412, -1711, -3613, -4905, -3891, -1181, 1689, 4097, 5003, 3275, -5, -1787, -4092, -5304, -3237, 377, 2743, 4343, 4683, 2633, -45, -2880, -4722]
2416d722K50K455K840K216J282j77k248l394k275l78P46J844K985K778O89j556
2432C335k781k644k032j02J271K326L417K218r44j878j930k903k028K43K568K592
2448G28K299J542p01j870l014k886n12J303K176K611K127mj38k498m055j033M42
2465c483J44K683L717Q89k70n90l734k609l31n53Q86M972K269o12M06j591l587
2482a394j469j155o09M132L416%R57J81m433j671n50k483J713M727Q80O05K956
2499E803l736m337J134j999k489L953K905N31L600m71n673o16L52l783J087M016
2515B77O1K508L687m630l167P40l516j399N097J07k81O257K40n628l45k235m631
2532f858M851L214l838M091N977m624k306N69o687j58O693k125l27O894j588k851
$$ y = [-4722, -4472, -2017, 823, 3039, 4321, 4144, 1896, -1498, -3773, -4151, -3405, -1561, 1424, 4202, 4891, 3335, 554, -2090, -4122, -4224, -2953, -627, 2790, 5008, 4064, 2186, 256, -2647, -4675, -4432, -1864, 728, 3027, 4569, 3868, 1998, -1016, -3902, -4414, -3111, -935, 1676, 3803, 3799, 3661, 1163, -2892, -3925, -3483, -3339, -656, 3061, 3950, 3680, 3090, -644, -3253, -3584, -4137, -3251, 1721, 3990, 3378, 3784, 2193, -1394, -2863, -4018, -4627, -495, 2921, 2921, 3878, 4059, -374, -2045, -2595, -5078, -3365, 1362, 2242, 2847, 5803, 2067, -2270, -1136, -3135, -5624, -1671, 1234, 1765, 5365, 4894, -779, -1395, -1043, -4826, -3739, 277, 338, 2846, 6533, 1903, -1264, -524, -4040, -5439, -342, -235, -516, 5741, 5981, 353, 8, -2227, -6858, -2007, 1207, -2631, 1460, 7437, 2813, 507, 1076, -5611, -5769, 924, -1201, -1528, 5366, 3778, 927]
2548I27K796n007o833N676K956k753N578J691n567M432R37j0965o27O284k348
2563b823L048O625o078j396P341o480p418M996j185q21J0224k13p909M727J409
2578D047q212J736P84o775Q403R561q060j711M968o757q68N280q952j640J4330
2593F134p4n990N341m546p605Q627q23j1148Q041P600m648M771J230j3659J946
2608d803R746r028k422Q850k959K709J0063j1558j0087J0481p94o767Q287j123
2622E95n931J4062K292j6248J709M106q478P693O808j3025L685J4854q861o163
2636b902M695r697k13J6393o043j0183J3077J928q361N717o033j3150J4134R134
2650H496j2296M033O705r924O014O318j9096k446J6943l786j918R923j0302m716
$$ y = [927, 3723, -1284, -8117, -2441, 515, -2238, 3340, 5031, -536, 3896, 4833, -6132, -6759, -475, -2823, 225, 6850, 772, -624, 6717, 237, -7181, -2185, -3370, -4191, 6033, 5820, -2089, 2638, 4047, -4165, -2429, -1645, -8420, -17, 9544, 1484, -227, 4741, -2016, -2884, 2396, -6556, -8196, 6134, 6060, 70, 5411, 865, -6740, 1887, 1064, -10084, -2043, 5557, 909, 5680, 6910, -6749, -4803, 4943, -4085, -6507, 2343, -616, 2093, 12156, 598, -9489, 992, 198, -6569, 1718, 595, -5336, 8726, 11018, -5230, -3521, 585, -7893, -200, 6608, -6417, -2732, 12122, 3261, -2902, 1793, -7904, -8117, 8276, 2233, -7950, 5127, 7055, -1306, 4411, -1622, -14772, -638, 8496, -3800, 233, 6938, -2986, 3028, 9346, -9750, -12196, 4747, 961, -957, 8966, -1336, -6052]
2664f052J6994p058j7172R956L692m815J3456r87j7530J0083R685j5540J84N847
2678G43j0140R470J5657j5566p040J3126o735m864J0613j1597o687K2642J799
2691A1421j5682O684j157j0843J3846J574j9854R631J6118j0313J392M373j7544
2704a0354L264J7752j3480p876J5572l191j602J3893j3728j5903J7449L513j2900
2717g591Q889R97r745J6375N626k4138J263J2432r960M946J0069j6519J953K1055
2731A5652j1196j2690R297p008l076J9898n956j6443J5766O007j3137N700l307
2744d93j5955J5931J4189j7718L15J1640j0241L187R427k0536m233K2173l154
2757D532p780J1571r049p911J9088m981k0671J0919Q501p431J1662P95k0642R473
$$ y = [-6052, 10942, 3884, -13288, -3332, 360, -4455, 9001, 8014, -9516, 567, 10252, -5288, -5104, 743, -9397, 73, 15730, 164, -6876, 6250, -485, -5349, 5264, -6333, -13020, 9622, 11421, -4261, 2423, 1266, -9577, 4269, 5843, -14011, -4380, 11738, 1425, 2817, 7190, -10354, -7090, 10662, -2818, -10694, 4878, 1687, 85, 13978, 250, -15653, 1796, 5309, -7591, 1298, 2295, -7450, 8925, 14551, -9587, -8324, 4108, -5852, -906, 9163, -7356, -5403, 15652, 4456, -8234, 1063, -5945, -9021, 10877, 4921, -11522, 4244, 10251, -2886, 2814, -493, -16448, -517, 13672, -4046, -3731, 7909, -2332, 855, 10282, -10254, -14487, 7686, 4532, -3248, 8323, -726, -8637, 10451, 5470, -15201, -4282, 4219, -3212, 8450, 9245, -11397, -1924]
2771a924J4224j7342k974R878r047P772J6230j7444r637J6485m743q354J0877
2784D001p959q228K2292K502j8571N750K863j1573J1748L972j9922Q266J8334
2797A3475j0838k853N951j4742J574J7986j1818j0270J6189On093J0884j0412
2810C9j4816J5956N678j3824O895M055r624J2362O051k1877p12J4031o859J105
2824a540R201j2464J49J8278r128j4361R014j908l838J5005l627j3993J2657O117
2838I562j2923K513L71j1270J1539J1771j4447o06J0343p335l12O779j4117l231
2852a1363J8685k038q505Q053l876o332J1744l848j5114R697Q459o993O243J446
2866F258j3007N200R233j1952l191Q722l650L650R830j1161p176J1247k353p750
$$ y = [-1924, 12300, -5042, -8016, 1862, -7185, 587, 16817, -627, -10264, 6221, 1478, -6876, 4001, -3958, -12186, 10106, 12608, -5963, -213, 2650, -8923, 2825, 6797, -13125, -4859, 13475, 2637, -216, 5735, -9007, -7433, 10553, -1265, -11535, 4654, 4660, -433, 10451, 39, -14777, 1179, 6857, -6967, -72, 3983, -5641, 6721, 12772, -9105, -9817, 4214, -2645, -1540, 7661, -4803, -4654, 13624, 4496, -9865, -851, -2759, -6597, 8408, 4781, -9212, 3445, 9562, -3361, -848, -477, -11747, -208, 11563, -2884, -3490, 6853, -482, -794, 5985, -8132, -11363, 7322, 5284, -3221, 4832, 956, -5376, 6368, 2520, -12594, -2897, 5562, -1431, 4812, 6258, -6749, -1549, 7684, -4268, -7459, 1263, -2387, 1263, 11093, -68, -7244, 4003, 1650, -6100]
2880f100O702k126m292J3541J290j3334L128L523p562M205M000r750M962J1465
2894I652p086m005L680o723n11R667n812n411J0188J657m958L545m588p585Q304
2909A4L149p794L772N342m726L283K412j0737o58P910l365n97O318m177q98P507
2925F755n046q237M614J053k411O433j9n543N220K401p869l46J852l452M138N725
2941E268n279l66M797m202k642K780m189j106P802M94l737L168n84m545K760p50
2957c31n493M145N207k740R67J777m691j36K276m041j116N013j85N36L396l118
2973A466l490K179r74l057L054J521j019L799R94n367k04J369l198L82K604o86
2989f27J320L712k550k556Q57j985j601K837K82k24L013M12k126o2j448k700J346
$$ y = [-6100, 602, -1524, -5816, 7725, 9015, -4319, -1191, 2332, -5230, -1025, 2975, -6775, -1813, 9652, 2566, -1439, 2241, -4482, -4993, 4674, -1138, -6549, 3639, 5296, 338, 3883, -705, -8290, 14, 3163, -4631, -859, 4483, -243, 3040, 5452, -5285, -5943, 1967, -1398, -1995, 4323, 146, -752, 6755, 1709, -6528, -1914, -861, -3272, 3161, 3142, -2401, 2819, 5220, -2649, -2995, -1143, -4595, -457, 5268, -11, -377, 4420, 218, -2424, 356, -3833, -4939, 2863, 3357, -380, 2788, 2204, -2341, 419, -331, -5824, -1679, 3528, 788, 1755, 3532, -1159, -1295, 981, -3060, -4176, 837, 652, 1188, 4584, 1466, -2024, 155, -819, -3876, -822, 699, -320, 3479, 4473, -894, -1098, 271, -2927, -2545, 59, -627, 693, 4405, 1855, -701, 156, -1829, -3430, -593, -311, -535, 2478, 2890, 764, 702, -746, -3446, -2100]
3006b100J835r33J845K476j359q55j3l428n92K091O0O05K612L10j291j22j330
3023a89k303L64O59M07K085J466q14k27o95k155r09L55L95J455J940K42k25j68
3041A683j622k273L68j7O94K011J446k30j19j012j998r05J86K3Q08K250N53K13
3059B059q29j104j297q28k83Q68J755J094M83J76j058j292j188p65j44J546J422
3076F15P04N63K05j413j430r67l35M53J124J522R22K6l53j598j230n61k73N80
3094a446J684J341Q40n18j008r95j271p07Q2J310J247J176L28n35j059r29j531
3111a991k18Q15J188P70J067N26q87j325q82j171J81J095P61J390O39k01q93j447
3129e83j058q5p6P46J457J630j40p26n65j323j590O45M16N63J736J138n61j6r88
$$ y = [-2100, -265, -1198, 647, 3123, 1764, 909, 896, -2532, -3124, -1033, -973, -368, 2244, 2554, 1263, 1141, -189, -2492, -2128, -1469, -1062, 1023, 2489, 1675, 1448, 753, -1402, -2311, -1956, -1561, -106, 1834, 2076, 1851, 1683, 61, -2212, -1844, -1861, -1167, 844, 2290, 2060, 1941, 929, -1069, -1974, -1788, -1765, -957, 1293, 1846, 2059, 1230, 126, -1171, -1999, -2282, -1414, 341, 1435, 1918, 2094, 1036, -256, -1444, -2209, -2353, -807, 615, 1319, 1882, 2087, 674, -756, -1723, -2058, -1605, -481, 1041, 1963, 1989, 1636, 38, -1192, -1753, -2026, -1446, 238, 1579, 2419, 1901, 893, -102, -1373, -2080, -1998, -688, 559, 1735, 2063, 1528, 469, -460, -1991, -2209, -1394, -206, 564, 1631, 2157, 1270, -55, -937, -2108, -1927, -832, -71, 1319, 1958, 1757, 864, -583, -1641, -1726, -1802, -1056, 401, 2031, 1891, 1165, 600, -723, -2313, -1668, -1252, -689, 1047, 2185, 1624, 1608, 620]
3148F20k198n91R91K14O73J672L55l7k38j985j394K85J18M20J985P12k49M70j080
3167G43k022j13l49k16J633J972l56J62N29k107j121k95q27O37L003M53p68R76
3185A934j036j834O5p05j114K367J859p96J373m8k626k92O41k306M66K666j82
3202D32J043J534k358j734J468j708j478K171R46j77K921m78l401M79K76k345
3218b409Q84J971j149J606K958l045j524O39k039j7K951j715n55M385k51k829
3234a39P88j465k583L289Q87k676K694K556l027N75O45m904M56M129j946j88L545
3251B636j684p98L121m007l623L483P14r60L282l58l335L736M33n583N62K074
3267c07k133L263L156m541l79M358l610k607K983k778k75P053j432m395L211K4
$$ y = [620, -1578, -2169, -1178, -964, -291, 1381, 1736, 1699, 1461, -524, -1918, -1633, -1515, -1095, 890, 1602, 1353, 1823, 743, -1279, -1392, -1741, -1957, -324, 1648, 1292, 1454, 1983, -124, -1245, -1540, -2367, -1730, 1273, 1726, 958, 1934, 898, -936, -871, -1576, -2690, -323, 1536, 740, 2113, 2065, -561, -853, -212, -2518, -2052, 614, 432, 1475, 3009, 651, -1083, 385, -1323, -2801, -630, 316, 139, 3060, 2582, -819, -340, -64, -2409, -1525, 446, -703, 903, 3861, 816, -708, -69, -2108, -2125, 826, -889, -1444, 2941, 2690, -139, 649, -816, -3399, -110, 777, -1899, 795, 3351, 324, 899, 1544, -3360, -2904, 1225, -721, -909, 2636, 952, 154, 3275, -732, -4355, -872, -158, -1118, 2164, 1806, -1529, 2207, 2640, -2943, -2381, -307, -2440, 823, 3979, -562, -941, 3417, -193, -2800, 183, -2595, -2870, 4183, 2751, -1644, 1567, 1591]
3283A591l911K716q69m814N618M291m426N07J608m763J418L589n865o44O725j193
3299A578r23L404m841l387O158j276n182M154J657k473N416p67p710K499M038
3314B345m984J088L175m054L229N519o421l477M618k584j448N855l562l187Q135
3329D247J10o489K342r14m175O336K006p083K760N470m262p3J787p198J351Q199
3345D414l985k880N375j962k032N502m822o497P060K210l913L806k95n599N924
3360B306K474q749J5N177k972K880M104p454n79P647m053m656M122k496r25Q607
3376E448k016p620N144J653n481L563j89o536O194O317o786p29L024m888J904
3391i98M907p335k069R543j332k965L603m517m095Q173o85p467M620L176l320
$$ y = [1591, -2320, 396, -473, -5287, 331, 4622, 196, 703, 2311, -2452, -1034, 2555, -3310, -3954, 2771, 1578, 655, 4059, -782, -4169, 1989, 713, -4469, -315, 1342, -1131, 4285, 3518, -4192, -1693, 2345, -2639, -1551, 1624, -2430, 799, 6318, -103, -3580, 1038, -1546, -2994, 2861, -701, -3888, 4247, 4357, -2132, 210, -704, -4879, 1457, 3463, -3620, -860, 4610, 348, 275, 2062, -5136, -3785, 4414, 429, -2451, 2924, 962, -1070, 4432, -390, -6887, 173, 2383, -1530, 2276, 1981, -3618, 2306, 4780, -3969, -3954, 1223, -1749, 1131, 5235, -2219, -2798, 4849, 796, -3860, 262, -2234, -3159, 5448, 3432, -4188, 956, 2609, -2872, 691, 502, -6034, 160, 6477, -309, -1038, 1986, -2902, -998, 3909, -3426, -5495, 4048, 2716, -249, 3354, -1163, -5258, 2915, 2230, -5237, -617, 2559, -761]
3406g61M601l64r093K991O444n537n17M051m207K527O840p114n334O421j057j856
3422a965M886l057m132Q376J031q106J768P12l936O067L010q397K031O923m596
3437F15j316K267o370Q66R354m282m604N600o25k399M354m160o046O817L658n096
3453a367K623P38n062M642K931q643k84O135k143J310L679o615j219P831l439
3468A117n637L842j72j149O994j941p486M586K758n115J852O55m609M986N521
3483F202o243j938L439k965J58M010n301j739Q132k42m122K008k266l098O040
3498B075k01o535L855M100k903J766J80o462J930N278l971j408L810j773L60M723
3514D824n281m410M966O22k451L352j322l016N794Q25o617P78K247k612K970K176
$$ y = [-761, 3840, 3476, -5617, -2626, 3818, -1719, -2236, 1815, -2392, 135, 6975, -139, -5473, 948, -109, -1965, 2921, -136, -4268, 4108, 5139, -2967, -1199, -487, -4423, 1644, 4654, -3743, -1712, 5211, 615, -701, 1566, -4804, -3938, 5416, 1134, -3470, 2130, 1505, -894, 3460, -700, -6746, 71, 3729, -1367, 1256, 1994, -3068, 1574, 4505, -4138, -4422, 1713, -430, 880, 4559, -2056, -3275, 4556, 1117, -4520, -678, -850, -1999, 4995, 3054, -4432, 154, 2912, -2203, -351, 304, -4305, 681, 6202, -41, -1979, 1460, -1505, -1347, 2663, -2638, -4377, 3755, 3513, -609, 1399, -867, -3965, 2075, 1874, -4661, -806, 3294, 391, 2157, 2337, -4125, -2195, 3083, -888, -2296, 1514, -259, 101, 4824, -457, -4867, 99, 721, -1730, 1622, 300, -2716, 3078, 3903, -2714, -1936, 311, -2301, 669, 2845]
3530B845m836J037N178l517k371K022k807M12N300k159l607L951K81k529J930
3545A130k002l686M794K941l837N34K116k951J502J627n212J86M547q63p51K447
3561B522k690j427L793j786l904K639J213r14K951m44l996J807J976l246J89J750
3577D33j937K237K794l412j422K162j524j025K370j595p56M014J95l059P83l97
3593a39j947K200M96k754K040K682j892j39K58k550N21K152j609l75K331m20n00
3610C55J283j707k358K037L79j216J775M81j242J411J99l097R0J477q02Q64J488
3627A417j415L11J397j630j488Q15m13r3K026m9r63J220k78j624k31N59r59R19
3645d79J715r17L42O10j287l76J79j057j05K180j20k71Q40p77j048N52m58j176
$$ y = [2845, -1991, -954, 4224, 707, -1664, 358, -2449, -2037, 3263, 1104, -2503, 1448, 1729, -800, 1130, -872, -4558, 236, 3177, -660, -126, 1990, -961, 541, 2168, -3044, -2858, 1689, 826, 75, 2522, -168, -1595, 2198, 412, -3492, -853, 360, -554, 2397, 1953, -2043, -236, 1740, -1506, -1317, 433, -1504, 733, 3527, 115, -1307, 855, -669, -1694, 676, -919, -1675, 2339, 2534, -525, 258, -139, -2086, 114, 610, -2144, -104, 2578, 686, 547, 805, -1745, -1224, 928, -681, -1056, 1275, 855, 355, 1638, -69, -2427, -390, -11, -1227, 548, 1029, -213, 1198, 1397, -1700, -1610, -133, -935, -71, 1417, 2, 313, 1710, 80, -1408, -593, -1006, -1099, 927, 878, -85, 1135, 857, -767, -998, -439, -1398, -479, 1236, 319, 661, 1271, -16, -392, -213, -1270, -1375, 805, 685, 414, 1254, 477, -571, -19, -477, -1653]
3663a653J313Q63n75J002N51j666l90N24j010J81N74O38K12O36m26r50L12p07
3681e71n26O45L20m9J183J73j021n9n84n42K88P51k26M38Q33m29l90j00r37r9
3701i02L43L90J01J018O0m42k83n78n26K33L10K25L56N39j1k12n22o09j96N6L15
3722c35L39N96j48p9j2m10m92k14L39K50L61L60R3m6k33o57m32J84K11K98M08
3743C81M10j66k06k83p93K35l36J88N62N33L78m87k8o62l42n0j10K70J024J2J70
3764G00j10l34m26m79l6K59L17L41O12L8l27l88n32j42Q5n9O55J41O99l31k99
3785C84o15k98l52K42O98Q2N00k7R1m40p65l12K20J68L28M34L00M2j97n64k7o28
3807g36N3N65R6N10L98l91j72l76m52j19J52L12J42M72K58m23k34k55n49J48L72
$$ y = [-1653, -340, 523, -52, 950, 1501, -165, -555, -31, -1041, -860, -286, 352, 564, 1200, 774, -176, 136, -571, -1097, -452, -132, -181, 1002, 1175, 154, 95, -489, -1031, -743, 8, -218, 220, 1053, 624, 234, 134, -803, -902, -559, -169, -68, 950, 1010, 568, 285, -293, -819, -586, -276, -51, 305, 844, 833, 621, 99, -510, -706, -650, -335, 4, 600, 452, 373, 361, -49, -541, -755, -416, -166, 195, 555, 648, 602, 369, -288, -720, -536, -325, -27, 381, 791, 625, 419, 136, -657, -422, -758, -570, -8, 525, 903, 416, 388, -274, -616, -666, -776, -506, 518, 530, 700, 590, 256, -170, -649, -685, -426, -109, 232, 844, 882, 555, 167, -365, -507, -422, -481, 174, 315, 1014, 683, 384, -231, -529, -881, -639, 59, 141, 641, 614, 705, 265, -500, -812, -592, -424, -96, 338, 638, 680, 483, -81, -108, -736, -683, -118, -22, 488, 886, 495, 323, -53, -505, -624, -472, -160, -18, 454, 712, 289, 55, -200, -749, -601, -229]
3828b29J7P62J24l21j5j66p18j48J09J98J74P06j70K59J36r61m74K17K01J65M85
3849C51J90j15K24j3j030r4o9L4N34N41k05L1L98q13m49L80m41J49P29K6m2L90
3871G06j51q55J0l57j56R59L97n20M52L59q11j76o8q68K84J364j11j83L98k79
3891C94q72M62l25p83Q31O76l29Q10k2j303M60J65r11Q2R92n55L68J038r07o08
3911c37Q04q16o50R92j04l08J442j51j119K18j13o37N22M61j131R26J342j141
3929B00j43L09j130P2J497r14p26J879l02m91L10q60j307J585L26r47P72Q53j481
3948d98J367K42k401K81J231o40P7J281j117J25J322j271j219J107q3o44J712
3965H72l43j550J583O73j893L66M1j080J122J647j731j9J392j541J1R91j600k25
$$ y = [-229, -212, 550, 674, 353, 338, 172, -546, -694, -585, -387, -213, 493, 323, 582, 718, -243, -717, -500, -299, -134, 351, 541, 426, 650, 637, -393, -487, -556, -522, 12, 553, 348, 379, 777, -36, -485, -105, -546, -397, 332, 358, 316, 706, 555, -300, -290, -647, -803, 156, 553, 33, 485, 844, 33, -143, -211, -1079, -795, 569, 458, 275, 673, 394, -478, -16, -341, -1124, -293, 383, 54, 864, 842, -461, -1, 164, -747, -665, 327, -228, 140, 1178, 271, -337, 467, -349, -999, -7, -111, -419, 1023, 872, -247, -29, -142, -779, -257, 204, -927, -1, 1341, 200, 57, 366, -764, -692, 805, -109, -835, 1044, 742, 251, 561, -299, -1606, -21, 305, -642, 130, 983, -498, 869, 1111, -1290, -1009, 222, -418, -341, 940, -177, -52, 1270, -1, -1220, -113, -196, -840, 872, 529, -1021, 562, 1235, -658, -292, -251, -1331, -209, 1438, -293, -312, 1080, -461, -450, 541, -1059, -1284]
3983a284K374l81j012R90k49j154J381m88j990J749Q63r42Q29M06k041N90J397
4000A038j865k78J404m63O25J226j973j001J776j82j467J303k27o60K218K44k981
4017a263P43Q99j397J117N11j729O83K217j341p71P38j182l43K185j329j021J808
4034E25Q24j242O20r55j609J829J174j878N42J056j018N31Q66k501j72K283p39
4051A36m25J307j408l61K539j159k479J265O05p73K050m59k314J669J282j830
4067c55l88Q59j375J326J839k211p37K025q12p84J200j703m73K508K40j845J034
4084C48p5j163J521j93k177J359J731j062q0O11j607J72J939j979r59K130Nn75
4102e4J627j337j924K244K78j975J103L50j188J963M09k480O8J457j231K99J087
$$ y = [-1284, 1090, 709, -303, 687, 438, -716, 665, 177, -1813, -64, 799, -143, 686, 1092, -949, -359, 1038, -827, -1105, 299, -164, 461, 1687, -286, -1287, 489, 307, -1160, 143, -84, -744, 1474, 1718, -1263, -520, 379, -1018, 99, 610, -1119, -436, 1781, 440, -331, 407, -775, -1118, 1067, -262, -1283, 525, 1349, 107, 727, -228, -1837, -8, 1166, -712, -170, 886, -132, 399, 1265, -1236, -1408, 875, 136, -289, 1018, -390, -751, 1788, 629, -1850, -585, 20, -753, 1297, 838, -1476, 193, 1475, -355, -743, 116, -1259, 67, 1906, -305, -1042, 983, 171, -613, 587, -1116, -1589, 919, 1159, -686, 348, 273, -890, 631, 438, -1739, -380, 1351, 289, 209, 820, -787, -615, 1324, -655, -1614, 516, 521, -54, 1573, 236, -1688, 556, 834, -1141, -38, 312, -876, 1087, 1496, -984, -916, 541, -690, -391, 696]
4119F96j497R4K477j176j427R19n73l60J838q21j394J740Q73j391K89j45j879
4136a737J669J337j646k27J551p85J04P66k218m76K265k15j094J086k32o57J497
4153I88n35j853P46J150q70Q98O5j502R22J523k029m19R34o12N12J264j098j038
4171i54J766l08j008N60q11k54J727L60j488K72P73j134L90N67j558M70J553o12
4189C11l74P94j196j93J270o53j230J440K69m64O62n39j366J420N26j071JP93
4207D00l14J60R84j502m99J086l17l51P06o30j8J408n10j407O85O5p00R35q9q09
4227g17R01J119j363k78O24j196N20J079q83l12R93j33n30K72l93m87J045L31
4245E92j008M67J85m46M90J36j349M78R85m88J31L49l14o20J042q66o34O58o3
$$ y = [696, -801, -707, 1770, 594, -833, 86, -487, -847, 991, 170, -1224, 516, 1389, -2, 287, 142, -1737, -68, 1269, -377, -604, 947, 162, 266, 1032, -1186, -1662, 603, 388, -706, 380, 148, -509, 988, 453, -1400, -654, 496, -374, 524, 589, -913, 9, 1532, -497, -916, 18, -594, -82, 1182, 84, -954, 812, 504, -504, 56, -755, -1009, 718, 1078, -410, -138, 635, -499, -109, 458, -1100, -630, 923, 311, -63, 731, -465, -658, 612, -41, -1271, 169, 438, -26, 636, 97, -1269, 151, 677, -394, -393, 400, 86, 246, 1230, -272, -771, 315, -2, -353, 353, -277, -295, 1113, 603, -804, -119, -54, -754, 181, 92, -717, 184, 1303, -60, -338, 286, -910, -390, 689, -194, -506, 487, 354, -176, 96, -297, -784, 261, 592, -416, 51, 236, -210, 280, 416, -933, -455, 530, 42, 173, 522, 208, -412, 630, -236, -870, -212, -275]
4264b75J24Q68l65n37K42M15j104K76J58l18O80P34q77j46N70n85m35M69l65J34
4284c37O92m9l42K97m20j92K95J6l74M20N35m74J32M3m92k16N36j91l01Q08o9
4305C17j46L77o33l21N80l44j38K01M92m56N81M6q91K27J13l66J58M59l54N51
4325D53qm13l99K51m19J84N60J86l55L13M2n33q2J8n25Q92N0j36K29J14k73j0
4347A39k7m63l41P84J6P8K7j25l3j20r0m57L97L85j24K86Q9k04j70m3l27l26N45
4370a04k99M37L19J7k45qp0l71O8J94k30N54K0j3l0p0j71m19R9J03K14L22j06
4393B11o7p9j50m22K18J64M0L3L22j87K73r5m27j39K09j98K93N6M45k37j48j08
4415GK4m90L53J53J80q8J02J05j43j94j62Ql2MM2J93K32n2r7j85k17ko0J43K38
$$ y = [-275, -151, 717, 352, -185, 57, 472, -632, -356, -198, -516, 164, 898, 21, -125, 445, -140, -575, -106, -471, -337, 355, 306, -36, 261, -159, -351, -56, -40, -414, 6, 541, 67, 199, 242, -250, -466, 70, -121, -422, 386, 317, 171, 548, -85, -406, 174, -170, -308, -107, 385, -71, 510, 556, -335, -108, 5, -361, -203, 256, -98, 453, 445, 32, -367, -116, -535, -351, 209, 395, 40, 353, 395, -138, -220, -202, -727, 165, 215, 79, 308, 422, 149, 139, 112, -351, -692, 92, 108, 186, 213, 88, 55, -65, -155, -612, -215, 170, 46, 332, 421, 217, 47, 4, -323, -649, -104, -403, 34, 353, 370, 125, 117, 47, -324, -256, -62, -292, 262, 282, 269, 239, 169, -2, -421, -322, -219, -5, 317, 211, 144, 65, -85, -507, -289, -125, -85, -52, 270, 83, 356, 261, -166, -305, -96, -294, -1, 55, 500, 263, 115, 7, 31, -459, -106, 47, 227, 139, 241, 346, 203, 9, -153, -145, -177, -173, -131, 62, 294, 242, 145, -40, -257, -259, -319, -176, 62]
4440F2K26o2K08l03j3l27m0j8K18K18L07j90k79j77L1j92K07J02L8l4J43o4j54
4463i3m3L1k08K03J1J24R1K20k80k6K1l84J6J73J76J81j53R4k32J73l24j72L39
4486f2j77O4M63K66m01Nq6k09o9L73l64M04K02k18j04j45j85m8LM5J15J52R1N2
4510A67rj55l16J56J6k53M68M8l3R3o1l42j25J71l55M37L75k12M0J77n77K48n2
4533i4n0k30M89J03RM6k06j08N4P7l67L36j61L6M81N5n82NK57n45J76L37l22K87
4557H3L72k51l31J99k06k86M89J34k62L83K0l15n2r0m56N42L46m47L34M06n96
4578A6Q3J99n98j69N32k08R1K96N2l42N73l63p80M52n5Q5M16k8n80L91O22j169
4600d84J47M26n72M85P95q42l31Q76o26j57L51l57o9R14M0p89M25J37p47L37K21
$$ y = [62, 288, 226, 434, 131, 118, -209, -249, -267, -49, 169, 476, 286, 7, -170, -139, -331, -124, -22, 16, -18, 125, 61, -93, -136, -105, -313, -110, -99, 25, 116, 336, 56, 30, 51, -333, -317, -144, 32, 213, 60, 154, -78, 95, -229, -401, -62, -239, -175, 288, 554, 153, 158, 72, -137, -206, 167, -197, 207, 409, 191, 87, -58, -243, -291, -288, -243, -128, 24, 115, 167, 158, 3, -313, -157, -141, -394, 74, 122, 89, 182, 121, -221, -346, -175, -530, -93, 282, 70, 110, 287, -290, -42, -94, -144, -374, 115, 218, 227, 273, 67, -41, 13, 90, -277, 59, -102, -66, 415, 470, -112, -107, 150, -395, -219, 118, -204, 83, 455, 204, -127, 72, -134, -420, 69, 203, -59, 324, 344, 29, -23, -113, -569, -27, 319, -128, 206, 612, 16, 99, 298, -300, -469, 63, -145, -54, 242, 294, -48, 525, 162, -618, -166, -221, -136, 280, 252, -328, 63, 685, -484, -337, 89, -483, 2, 797, -45, -376, 500, -126, -283, 68, -289, -358, 556, 596, -193, 232, 369, -378, -41, 180]
4621A80n61L9R75m30M6K03p64j23Q07p67j0O27j66m1P76o22p18N85J11q55M67
4642b41N30n09O34K85q39m91R04p32K00O17n48j80J262m16r26N93m30j02O28K00
4662D39j014R13N54j079K63o4j050P98Q58j014k8J005m65O0L60j364j29J388k42
4681A89n84R80l28m11P89m25j203O46M76l53P63K16j354N17Q82j336KL25l61N25
4701d5J388j219q26J095J56j099M65l89n85J813O17j825K56N79q81P31Q1j145
4719h33J11J626o51k58O22j302l8J469q92p76R46K48q0N77n14j505J095R08j504
4738g51O33K66n08Q86N78j689n89J863o89l60P64n12n87K006m76j727P34J94o79
4757f43J039j8j460J077J328j449k21Q8q15P90J499j274p49J574m91l04M98j046
$$ y = [180, -381, -342, 633, 203, 249, 452, -312, -435, 372, -395, -405, 222, 56, 15, 791, 169, -549, 36, 147, -708, -241, 289, -220, 414, 699, -140, -631, 273, -459, -259, 358, -190, -370, 892, 476, -450, 143, -287, -389, 239, 439, -575, 338, 892, -187, 76, 12, -1038, -240, 618, -396, -424, 581, 116, 176, 536, -828, -957, 431, 189, -395, 585, 257, -154, 635, 210, -993, -347, 129, -224, 539, 755, -599, -82, 800, -536, -534, -209, -570, -45, 1343, 124, -702, 393, 549, -550, -85, -474, -1059, 754, 1371, -454, -198, 381, -500, 231, 312, -833, -722, 904, 253, -5, 617, -685, -723, 746, -146, -922, 24, 272, 192, 769, 255, -1250, -155, 753, -751, -118, 148, -360, 526, 1104, -585, -1174, 689, 0, -360, 404, -108, -695, 1311, 835, -892, -158, 36, -643, 396, 378, -1082, -5, 1323, -126, -347, -259, -1074, -284, 1215, -59, -808, 766, 275, -29, 469, -577]
4775e77r47K063L48j380N61M45j044J078N16k348K14J884o07q6O58j324l7J792
4793A209j523r09J131j1O1J246q16j573J541M49j470O13l6p72J365J123k127k41
4811g40J301q72O7M87j075K7K312p54j439J125p03m20J318l34j629J567Q80j170
4829e2M41j13j583R29J406j576k32J496o52L3J070j652q86J652K13j233J095l04
4847E2n47J625l3k248L68J154q90O88J70r21M85J447j305o62N56p38J49J562q45
4866F7p58J269K00j204O01n61q89J568O79j430M22P15q47M72K70j623J40J517
4884F08l15k82P56p29l87J137p82j337J067N86m01R53k99j265O33P43j414j04
4902h32J069p42R02P44j095o27Q81l36n00N85l99k75J603j08j498P71j66o43O61
$$ y = [-577, -1524, 539, 887, -493, 68, 513, -531, 547, 1063, -1285, -1071, 813, 206, 120, 778, -546, -583, 1209, -314, -1223, -92, -103, -42, 1204, 388, -1185, 356, 805, -665, -52, -88, -860, 505, 1628, -499, -740, 561, -311, -244, 243, -832, -805, 1507, 753, -686, 439, -264, -684, 634, 300, -1329, 238, 1118, -52, 389, 276, -1307, -378, 1028, -548, -780, 716, 64, 97, 1167, -485, -1371, 281, 494, -739, 356, 52, -495, 1130, 1097, -1151, -783, 371, -519, 169, 339, -582, -97, 1350, 45, -617, -61, -799, -650, 912, 67, -691, 578, 778, -426, 175, -386, -1275, 293, 972, -458, -36, 679, -168, 304, 574, -1049, -909, 608, 293, 11, 767, 38, -349, 788, 6, -1331, -264, 322, -79, 874, 575, -690, -57, 686, -728, -832, 237, -505, 397, 1141, 46, -581, 300, -36, -536, 49, -350, -625, 978, 870, -628, 143, -23, -666, -5]
4921eL21j231P51J311j115J48L12j231M6J081q35k41J281k72l76O15q09r20R71
4940a98M20q69P31O08j064P95L88j547K26P05n32K02P71q59K24P52p09o74M22
4959b08j58l23J344m32m84Q07J76j147J71L60q72P34L84m20J6P30p47k44M45q23
4979f91q5J247k33j78L43N9q47M81j18o95M40M22J25K27R2r74K85K68p39j30O98
5000cP6K09L19m03n63M74j53o48O56L57o45R73m1n79j50N9k83L03L9j79N66K51
5022F35n07O2k74l16j43M73j31J98N38j17o89L61j28p15O80q5M9K66K61j20q7
5043B11L1p45j41L53J74j1N52j63N1Q4m87o87L21J18J72K62K68M8j42J65o04j97
5065c67J75j24J13O90j95j25M01o92j90Kj15J62M25J60k44M03l52l74l10K04j03
$$ y = [-5, 316, -915, -164, 1147, 32, 180, 492, -739, -693, 388, -447, -688, 593, 321, -55, 560, -249, -1169, -198, 222, -647, 84, 692, -372, 423, 811, -736, -510, 195, -337, -135, 636, -223, 1, 753, 44, -630, -208, -366, -689, 655, 223, -261, 546, 722, -425, -254, 106, -766, -32, 352, -68, -52, 678, -69, -313, 132, -691, -776, 471, 238, 60, 403, 462, -385, 96, -22, -717, -277, 145, 270, 497, 589, -385, -100, 168, -571, -701, -3, 73, 282, 601, 198, -365, 109, -44, -692, -36, 321, -324, 649, 608, 29, -121, -62, -345, -42, -3, -182, 384, 635, 128, 190, -84, -400, -543, -70, -201, -3, 535, 418, -271, 90, -38, -753, -73, -158, -109, 157, 418, 298, 211, 242, -503, -644, -291, -117, -128, 424, 261, 312, 396, -91, -778, -457, -339, -167, 95, 363, 411, 269, 434, -170, -367, -192, -316, -203, 487, 292, 167, 568, -124, -314, -312, -427, -265, 160, 320, 76, 479, 127, -247, -557, -353, -456]
5086d56M59J93M0K58l11L2m55k23K26k41M09K04K92p3k94Ok14r3m10L32M40K4
5108A45J72J09j85m55k92j95M15L38k5K87M00j79n08j27j02M3o5L86l8J81K74
5129E79m81k10j08m38L30J10J49M24Kl4l95K1j62k55L07k75O10K95J4j55k66k24
5151a62l51J81J18j94N71M97j99l18R1p16J95K7N1J44M27J90n92L45m04n47O43
5172cj84q5Q56k3j38J18n04l89O2j60L88J63K61k92L98k7l37m17J56j95O2M38
5194A48J87k05L93k25m29k22q8m9K18O27k61J32L89o01r9J02o49N1J050k08k5
5215B36M62n31p7k67j02k89L91N16k86K45J90q11N83k30p26K61N33k91L41O56
5235H04o58j84J67l25n77M81j44L86R15l10n74J47j72o28N11L5m81J153M02r02
$$ y = [-456, 3, 196, 236, 494, 183, 215, -240, -463, -237, -478, -69, 135, 427, 354, 60, 66, -148, -241, -651, -319, 121, 145, 317, 426, 241, -214, -506, -701, -286, 52, 27, 314, 714, 535, 27, -100, -202, -159, -224, 162, 124, 305, 579, 98, -112, -220, -658, -328, -218, -69, 355, 357, 323, -72, -51, -213, -468, -161, -436, 174, 469, 483, 328, 62, -162, -513, -332, -214, -408, 163, 660, 461, 143, 234, -482, -287, -260, -209, -65, 362, 552, -40, 305, -99, -646, -3, -187, -272, 584, 561, 423, 541, 37, -352, -290, -450, -62, 101, 362, 70, 468, 441, 104, -313, -157, -352, -290, 148, 335, 130, 523, 298, -131, -353, -441, -490, -272, 355, 94, 226, 615, 14, -85, 17, -632, -581, 469, 261, 236, 698, 167, 90, -177, -279, -568, -177, 339, 53, 298, 488, -323, 260, 30, -696, -435, 98, -193, 148, 804, 146, -38, 129, -196, -773, -292, -436, -50, 865, 555, -19, 128, -44, -672, -161, -126, -607, 546, 948, 46]
5255D6P8Q6p23J60N67o55k23J377j81l76K61o45o82Q35n9m44Q30K49l41M08k57
5276C11j230L92P60n51J23Q66r00L97M44p59q39R06l69L09P76l18o45Q39J83j202
5296e07LL25n76Q44Q24j125J17Q47q40l45M10q20J82J630n69m70R24q48n98R18
5316C26o94q97R77J247j147N79j0j161P44O73j563M2J427m70K61O67j429l65J369
5335E76q57p98J229k43m05J870n62j515M65J89n50O60J20j253J015J817j682o45
5353e69P01r50L57J265j108o13K066r2j294O29o03q76J497O26k230R27J071q19
5371a5N98J76k161L14K167j073j96J009j068K27J383j643j438J615L72q09J300
5388G58l34j353J675K72k170M6J140p91J259J150k346J4J989j271r58J114j306
$$ y = [46, 124, 210, -513, -353, 214, -441, -664, 713, 532, 156, 417, -228, -910, -75, -134, -578, 252, 501, 160, 568, 311, -919, -527, 233, -318, -195, 671, -229, 168, 612, -147, -986, -80, -449, -140, 636, 318, -327, 512, 695, -507, -504, -179, -755, 89, 913, -212, -95, 752, -88, -433, -23, -843, -661, 969, 400, -70, 854, 6, -592, 326, -368, -1265, -288, 959, -188, 391, 381, -780, -36, 637, -926, -884, 543, 73, 334, 1001, -428, -793, 576, -281, -1079, 150, -93, -498, 1372, 810, -705, -240, -51, -601, 59, 179, -1074, -59, 1758, 76, -569, 132, -818, -461, 804, -304, -917, 1149, 1057, -237, 392, -211, -1087, 410, 1036, -1194, -267, 804, -15, 583, 759, -1402, -1088, 1079, 6, -190, 819, -249, -22, 1361, -282, -1720, -105, 267, -542, 758, 424, -929, 746, 1018, -1152, -1106, 34, -757, 502, 1652, -694, -680, 1309, 38, -920, 194, -1112]
5405a112K73K311o58j588J188o7j089J284n93k159K227J761j704J80L83j745Q73
5422b35J493k536K4J972p7m13R61j895p48K227k17k222J528M12p48K050m61k825
5440a710J118J516j664M33R07j617J247K075k302j475J672n77m31K039j495r28
5456a192K722j22k000P24m99j061K159L71k577J278J866j657K00K62k306Q02K799
5473A769j410j366K142p36q35J853j691k186K467J012j563J173J36j872J887O35
5489A415k965nK037r22O82J506k623P3K378j238j468J127p39n1K451o12k399J478
5507A25O91j711R27K2j629J742J939k240l45J335j559J63J653k342k23K570m4
5524A074j337J272j298j217K228j67k092J318R99j052J520l13k755J186J657j623
$$ y = [-1112, -839, 1472, 814, -774, 414, 347, -742, 542, -51, -2210, 17, 1778, 74, 254, 637, -1108, -235, 1258, -1278, -1254, 718, 641, 228, 1189, -706, -1454, 773, 556, -1666, -138, 274, -474, 1576, 1115, -1710, -592, 924, -740, -307, 600, -1017, 230, 2305, 3, -1472, 200, -377, -808, 1231, -264, -1192, 1530, 1408, -592, 132, -367, -1428, 731, 1102, -1475, -197, 1669, 12, 212, 474, -1832, -1030, 1769, 359, -1007, 1135, 399, -436, 1417, -274, -2460, 7, 1019, -544, 629, 765, -1107, 780, 1415, -1550, -1555, 482, -440, 242, 1748, -875, -802, 1576, 338, -1130, -3, -742, -793, 1658, 1046, -1353, 125, 816, -895, 32, 54, -1575, 167, 2106, -134, -479, 856, -703, -540, 1113, -1229, -1452, 1118, 1074, -263, 1009, -289, -1506, 722, 555, -1537, -219, 780, -272, 1248, 935, -1820, -634, 1023, -600]
5540f00k39J643j271N99K050k251j264J433l02n47J551p94j129K283K14k278N56
5557c46K38q87J007J126k209P99J663j036q37Q60j801L06K631j358r12J733n18
5574D59p09J248j074j520J685R29j485Q56P30j767Q41P95k228Q8J717n85M6J168
5592A194j265o67J837j141j255J303j61m78J980m48j713J120L03j322J96P31j391
5609a177J344J398j617k33J008r90k10Q26o83o05J958P5j122M61m76r79J217j34
5627F1j031R33J030q93M58J51j500J71J075r92J64Q25n00M04O12j016j111J217
5645E8Q0q09J083r1o44J009qj243LN56p00P42P00q31J86P24p38n96M02m92LJ106
5667E00j5n56O34k8o83j3o1q92P83P29l73L51M29q65j75L11p49k88J054K68l36
$$ y = [-600, -839, 804, -467, 132, 2182, -69, -1333, 100, -202, -749, 802, 8, -1121, 1162, 1376, -902, -346, -108, -995, 12, 1138, -1071, -272, 1391, 355, -482, 378, -1423, -1117, 1514, 156, -756, 977, 459, -250, 998, -76, -1596, 89, 1018, -467, 389, 1119, -648, 193, 988, -1240, -1152, 565, -20, 26, 1194, -71, -738, 1099, -42, -1297, 6, -155, -633, 1347, 899, -814, 306, 609, -713, -517, 214, -1177, 167, 1565, -52, -285, 723, -267, -477, 349, -334, -939, 1019, 1094, -28, 433, -43, -1022, 195, 61, -970, -37, 993, 100, 558, 709, -791, -620, 455, -537, -373, 452, -48, 356, 968, -48, -1159, 58, 138, -671, 412, 321, -323, 686, 678, -565, -562, -6, -706, 36, 736, -95, 91, 815, 77, -519, -117, -609, -606, 500, 485, -71, 563, 535, -148, -161, -222, -1114, -331, 398, 25, 376, 805, -60, -235, 76, -673, -961, 93, 361, 25]
5688B5P87o43k99K55m40n00M84M37L1L26N8p76N75k68l86j47N63j97K37O37o02
5709A57j88M36o79l50M62j21K39P28j19o11M1J55o50K21J46l84M13R17m39j58
5729B16k58n17j32M06j6R2N07L1j17N9l95n32J94J30j3P00K09k30K07k35l85n72
5751f51M67j5R5L53L08l22K16m33m74J8J53k43P25K08j31J20k60l26k15J82m16
5772f41M55M03p8K82O7l54n15Q4l82J75O44K75k52K83k4m62k66j46r0K84N34J48
5794D24J72J69n51k96m2l17L4M41R3O62l03q3n51K4k30j77K18K81K39K29J09k68
5816B77j45l51k82L2K80J15L08J24k41L60m22m15j61K6J74P82J19j78m04J30m94
5837c66j62q0K44M4M45O33n12J45j70o15l22N40M9P3O07P7k76r8l82n17L03P1
$$ y = [25, 812, 169, -130, 125, -315, -815, -331, 106, 137, 463, 521, -255, 320, 52, -334, -481, 82, -115, 122, 759, 157, -31, 405, -274, -624, -162, -283, -44, 684, 565, -46, -5, 150, -500, -279, -133, -517, -104, 813, 374, 216, -42, -559, -691, -285, -301, -209, 298, 329, 212, 271, -124, -656, -462, -332, -345, 355, 564, 334, 541, 306, -79, -651, -184, -199, -104, 249, 557, 235, 451, 18, -456, -438, -285, -528, 197, 405, 274, 394, 134, -192, -407, -225, -641, -186, 217, 139, 421, 488, 134, -381, -297, -679, -504, 140, 415, 163, 446, 422, -40, -306, -452, -542, -258, 276, 424, 596, 765, 214, -82, -124, -441, -407, 34, 127, 789, 486, 403, -148, -124, -354, -531, -313, -32, 207, 436, 545, 277, 132, -219, -501, -469, -189, -74, 234, 358, 117, 477, 55, -360, -521, -495, -321, 461, 580, 402, -2, 128, -366, -528, -608, -364, -320, 125, 758, 246, 391, 221, -394, -716, -176, -127, -54, 553, 630, 354, 256, -126, -643, -340, -269]
5859b69JN16K04R8q5j21p49j84L38o0K59M57o8kL5l98p57M21p7J09N64J69l25
5882G6O28n92o88K57j15l83O31O52p29R33J88q85j65P5p07M07P93j80L6N45k69
5903E08o96P0l82l30Q08M46m54O41J41o77l43L67j142K93R87j40K70M61p69k52
5923a93L93m71n51R16ok1Q85l31j087L24K27q16M07L65n54J056M03r66m77O62
5943A65o78n48J295o24j34J723l56r74J94k91q29Q97M12j326J566N60q21J77M0
5962D48j394L33J261r92p3J469p74P8N44j417p38J408q0q42J297k00o93J122M6
5981H03j930K27J002o94O65N45j030N08J104j386p38Q05p40K79J697q52q22J172
5999F15K37j557O58m09j127K158Q42j854N79Q54j412J14Q74k108L66K434r07j73
$$ y = [-269, -268, 248, 452, 550, 465, 344, -405, -589, -251, -311, -52, 405, 337, 335, 370, -28, -785, -364, -441, -332, 232, 401, 76, 704, 112, -576, -319, -434, -817, -186, 466, -263, 670, 858, -27, -192, -117, -824, -417, 376, 196, 232, 777, 508, -188, -118, -500, -830, -22, 424, -30, 611, 752, 75, -268, 99, -1043, -750, 237, 97, 367, 828, 59, -193, 200, -271, -822, 94, 88, 67, 952, 621, -466, -142, 85, -731, -324, 41, -513, 543, 946, -20, -497, 165, -513, -1061, 234, -390, -524, 1199, 843, -131, 63, -228, -1057, -160, 252, -1074, 492, 1052, 231, 408, 448, -946, -613, 648, -344, -417, 1052, 278, 356, 900, -517, -1255, 153, 73, -769, 528, 328, -365, 757, 803, -1127, -900, 102, -592, 73, 618, -412, 96, 1200, -186, -924, -119, -859, -580, 1117, 265, -557, 615, 852, -705, -47, -456, -1583, 575, 1417, -437, 142, 996, -416, -302, 572, -1536, -1170, 1264, 357, 184]
6017A84O93j133l54J658j194j563J772N19q40J510p90j605J352P57j891J45J232
6034D52j039J244J281k517n20J724q18p43J200p59n18K527n69j911R56J10j015
6051i15J510j16k115J644K104k066J60K0j790R40J736j692o65K456o21n05J024
6068A109j814j354K754J19j785J236L37j128J649k9l269J024K006j420M70J060
6084I65j541O03K397k729j357J802o42q6K197j315j634K484M8k348R32j15j351
6101a690K531J193k782M38J606j645J03R48k453O55K981r55j396J288j161q05
6117a144K632j835j926K309J206j524J431l19k524J926J384k908JK040r43Q34
6133F40J194k874p36L036j206j134J432o77n51L004o86l087J339N92j383J506
$$ y = [184, 877, -256, -610, 1048, -146, -1709, 63, 582, -258, 1252, 462, -1143, 209, 966, -925, -780, 452, -587, 657, 1938, -579, -1099, 625, -193, -936, 264, -495, -1013, 1514, 945, -966, -10, 100, -915, 595, 479, -1636, 8, 2112, 46, 206, 226, -1564, -624, 1112, -580, -1245, 1211, 590, 85, 1109, -705, -2059, 695, 814, -971, 265, 602, -526, 1123, 1094, -2175, -1151, 855, -565, -95, 965, -576, 27, 2424, -305, -1662, 140, -502, -588, 1609, 294, -1340, 1144, 1192, -1156, -224, -339, -1690, 841, 2034, -748, -310, 1296, -349, -246, 702, -1751, -1096, 1885, 930, -466, 822, -339, -1144, 1488, -347, -2273, 36, 1242, -282, 1149, 830, -1694, 232, 1616, -1292, -1291, 749, -194, 640, 1834, -1040, -1776, 1260, 54, -1080, 352, -325, -876, 2128, 1442, -1645, -306, 286, -1097, 409]
6149D09L56k284J834J909k344n13J204j841P21K372k322q21K817m52j391J285
6165I39j641j502K927M42k453J395J042j398J037L09l144P64K371j364j88J719
6181A255j692J44K110k009j679K032K0o20J895j081j761K414L1k229N05O71j506
6198a500K174J130k801L93K047j567o27R33j498K27L106j204j489J292o90j006
6214a080J871q67j909K162J441j845O77M0j946J384J233k325j44K075n35o5J207
6231A374k078q18K250n88j423J333M42r95J924j04k634Q18J216j680R87P15j644
6248i05J164J455j946o80J163j182K41J865j080j089K360j05j793N44m86q53J690
6265C63L45j427Q34R02j164O09j31j753K78J756o06m0Q35p37l84J204j282j448
$$ y = [409, 765, -1519, 315, 2224, -120, -633, 571, -1270, -549, 1823, -499, -1320, 1497, 1045, -346, 939, -702, -2204, 723, 1165, -1288, 107, 1149, -249, 788, 1097, -2047, -1283, 1088, -276, -464, 1255, -437, -293, 1817, -192, -1871, 161, 181, -439, 1456, 375, -1386, 1028, 1059, -1170, -665, 6, -1500, 674, 1804, -997, -604, 1443, -124, -751, 182, -1316, -1089, 2017, 813, -676, 616, -74, -1080, 791, -76, -1985, 177, 1618, -227, 450, 490, -1456, -72, 1161, -1164, -1308, 767, 232, 167, 1374, -704, -1522, 728, 140, -1283, 50, 492, -503, 1421, 1317, -1317, -499, 717, -963, 24, 739, -905, 259, 1714, -232, -912, 251, -931, -690, 1175, 95, -994, 1366, 1261, -532, 12, -474, -1327, 363, 708, -719, 115, 1017, -147, 462, 331, -1422, -1144, 612, 6, -34, 801, 64, -320, 884, -398, -1846]
6283a846J816N91o78Q04j81j143J086M39k084O93P79q30J076P48j439j73J003
6300F61q92n35P26j91k10J512n35j010O48np87L82K48r20J141R85j046j83M94
6319D83j120K32P61q62N9J095No36P76j170o61P49K82q59P26P52n93Q81j61j223
6339d84J10M14q13L79P28k47L02N56j021n36N08k67M3O23J35m56P90n9r22Q3j10
6360b44m37O62M00n54L72L52o90K4J94o26k27J076k69Q8O55n76m97M26o05k50
6380g26O10K54OL23K24q66j7K9o31K25O58M1P6P67n50o21L32l59n08L68M91RM54
6403E89o6k70k87P1n52J78K57o5K00O32k97m09L14o46J0J53p3N1R42j40j88k99
6425A05J46n99n6J46J43K72J19P5j21Om98l62K28N2J29L49M64N1k29o04j67J61
$$ y = [-1846, -30, 561, -117, 687, 506, -637, 449, 888, -1196, -503, 276, -554, 522, 1270, -169, -342, 661, -231, -766, -40, -231, -441, 1071, 536, -474, 174, 169, -618, -236, 12, -908, 233, 1218, 172, -11, 483, -637, -405, 356, -506, -447, 648, 653, 17, 793, -377, -1038, -289, -7, -866, -140, 612, 19, 900, 739, -484, -374, 40, -773, -394, 334, 87, 389, 945, -76, -612, -104, -371, -328, 295, 430, -26, 764, 705, -217, -134, -244, -681, -19, 381, -173, 199, 551, -139, -115, 79, -547, -774, 302, 33, 121, 776, 200, -297, 129, -476, -726, -116, 138, 144, 467, 691, -175, -192, -163, -794, -569, 89, 130, 206, 973, 423, -198, 134, -225, -733, -365, 126, 135, 589, 523, 253, -34, 37, -515, -337, -80, -145, 55, 687, 390, -19, 295, -351, -341, -188, -261, -210, 732, 592, 404, 105, 251, -348, -404, -258, -115, 157, 276, 351, 230, 236, -262, -624, -396, -344, -215, 134, 598, 649, 420, -184, -351, -190]
6447a90j17K64Q7M89m9j35j14l02k10k01m2M2P49M76l19kk57n05m4j86K63L08
6469EL49J60J24n18j16l03j25k3N15J4O0J74J47k83m03j17R0k2L57K10J40l9j66
6492B30m79J80l03k16L43M53Q0M8J79l57l09j39k42J36L10J84J6N34k79l46M8
6513G1n35j55O02J82l27N77q4l06J42l85k18k07L41K79L36K13k59l36J91l97j35
6534d10mK23J14Q02j64m77K29l36o40K84k4J06O41J03k56O0r1r70M34K32l26L08
6556a62O84J12k38J81p86m03O74m97N3N46K21P9o8J42j052M8J79m90O67O60l76
6577A74M71K24j090j82J08j21k23J069l86j39Q33l09q68J88k6m68Q95J75k71N56
6597F10K48q31k26J3p31N60J028p11r1P19l82o37Q79j083o61J605M4n80R31j96
$$ y = [-190, -307, -43, 44, 533, 484, 349, 235, -67, -277, -478, -520, -478, 271, 747, 428, 426, 169, -336, -380, -566, -303, 5, 354, 514, 638, 120, 4, -299, -424, -447, 68, 82, 142, 316, 463, 180, -223, -340, -250, -272, 85, 295, 435, 396, 230, -249, -69, -372, -588, -245, 208, 288, 336, 515, 158, -151, -290, -532, -396, -86, 98, 114, 648, 369, 23, 71, -464, -619, -17, 165, -162, 415, 331, 25, 167, -218, -436, -643, -302, -23, 313, 526, 267, -69, 122, -275, -410, -414, -191, -77, 725, 561, 84, 313, -23, -663, -379, -403, -297, 344, 447, 191, 251, 160, -810, -376, -144, -470, -162, 522, 634, 396, 577, -209, -612, 62, -435, -382, 164, 385, 464, 396, 538, -514, -466, -287, -777, -110, 550, 174, 645, 869, -221, -403, -295, -416, -639, 430, 44, -95, 738, 429, -439, -251, -277, -745, 150, 325, 54, 610, 858, 27, -199, -186, -917, -357, 671, -40, -131, 588, 206, -431, 448, -635, -1296, 309, 353, -227, 704, 508]
6617E08p84L81K00j435N48R04m60M47O33j173o8J033j086p68J057j62K13J230
6635A218p16j048P71R6j045M61K09j043J375J080j353k10M99q81J09R43j178K8
6653f85J774o27k47M36j210o02J582k42j010J058M17o34Q47m31j609Q79R34j394
6671g64L37J151r22M32J134j951q17J937n95n45J491o94r79J923j21k242R50M0
6689b35r65J756M58k078J333J296j726k14O50j547P11K208j615n57J276l00r67
6706e16J131j229j280K261P36j300N93L43j633J186K36j963M08J846m80k7R68
6723A280k363K72K090j616j142J653k95j10J920r37k148J618N50j797P39M75j166
6740i77J489J661k545k54J204j188j54J791k255J91K723q33j415Q33q36r47K540
$$ y = [508, -276, 105, 305, -1130, -582, 322, -138, 309, 942, -231, -299, 734, -352, -1120, -63, -225, -12, 1218, 502, -546, 225, 321, -724, -263, -54, -1097, 278, 1358, 5, -205, 294, -587, -478, 465, -713, -685, 1089, 462, 215, 651, -559, -1161, 421, 179, -831, 227, 644, 10, 857, 426, -1183, -304, 630, -764, -427, 724, -198, 234, 1368, -583, -1400, 537, -58, -603, 888, 194, -785, 1138, 1017, -1225, -275, -235, -1200, 556, 1014, -1064, 269, 1565, -161, -375, 275, -1272, -561, 1647, 32, -525, 751, 451, -516, 615, -614, -1894, 367, 1103, -197, 396, 739, -894, 292, 528, -1435, -1027, 819, 339, 312, 1280, -1083, -811, 1279, -337, -1479, 174, -121, -231, 1689, 752, -1396, 222, 772, -1025, -286, 189, -977, 512, 2173, -372, -626, 578, -610, -764, 1027, -1228, -1037, 1686, 853, -562, 271, -565, -1512, 1028]
6757A028o74j689J757R22j599J021l46k450J533J710j625l39J565j158M08J280
6773A344k118j209K440l00j081J735p29j021K270k07k629P80R91j176J598O39
6789A327k486J077J561j535q88J136j141N19K390j610j503K241n87j172J129j083
6805f25j362K613Q79k117P08O18j723J288N82k585L72K568q96j88Q47j632k52
6822i05K367j429j673J877J23n04J704p60k494J869P58k034P77R65j442J415J160
6839A774k279o17J738j267K30J142j461j83K555p60j603R09m62p64K002l21k198
6856a565J753J278j501M25k10j962J211J687j594n18K204r70l40J467k044j369
6872b048K393K29j250J110J34j251J746r5k509P21J252r30Q37O07j611M28J563
$$ y = [1028, 354, -1335, 422, 1344, -255, 766, 420, -2030, -497, 1213, -412, -751, 814, -344, 64, 1344, -774, -1983, 457, 157, -924, 811, 82, -939, 1331, 1124, -1505, -725, 266, -910, 688, 1327, -1159, -82, 1479, -56, -944, 192, -949, -430, 1960, 350, -1153, 1088, 501, -671, 458, -625, -1987, 626, 1505, -612, 96, 714, -1009, 279, 861, -1724, -1352, 1216, 320, 132, 979, -653, -905, 1462, 33, -1640, 237, 360, -144, 1560, 800, -1694, 175, 933, -1101, -324, 641, -801, 614, 1774, -505, -1122, 616, -651, -421, 721, -740, -923, 1632, 872, -731, 178, -284, -1048, 954, 633, -1565, 188, 1466, -35, 390, 180, -1782, -571, 1116, -478, -996, 1208, 238, -102, 1365, -679, -2048, 345, 574, -676, 434, 568, -683, 1063, 968, -1541, -820, 432, -498, 339, 946, -665, -237, 1326]
6889A326j573j036J187m62K47J751j129j387J658K00j575Q79l03j346K108J267
6905A812k177L58P16r70J04N89j837N19K189o16q81Q15p81o62J357n45j377J459
6923G2P56p94Q27k09k011J235O33j351J94J213n41L11R77j612o44J214k77r24
6941i31J450q11k58J650k57j406K05L86r00P54N73j172R65J025j156k06J42j104
6959a051O23J041j062k19J486l00p63O60p21p49J087L96o91L47O43q51K91L28
6977D95j498K42J122m76l0Q58o45r5R89j168r03R52j85J00Q70k84p19O85l8j127
6997h55K33L61j87Q37N37p09k94M33n78l17L36l58O6J233n7p91N00m04o16O70
7017D0j10m51N68O46o15M53q2p96N4L91o33P7Q95O0r8K27n87m93K92N9n60O83
$$ y = [1326, -247, -1283, -96, -558, -311, 1440, 311, -1076, 582, 782, -793, 86, -217, -1563, 545, 1812, -365, -7, 709, -261, -157, 432, -1405, -886, 1303, 687, -194, 621, -160, -822, 535, -10, -1387, 72, 828, 34, 861, 652, -1359, -124, 509, -842, -648, 565, 24, 335, 1312, -300, -944, 270, -7, -931, 519, -292, -550, 1100, 843, -563, -358, 28, -872, -118, 455, -717, 248, 1273, 117, -89, 53, -1051, -428, 613, -449, -668, 818, 518, -245, 415, -306, -1055, 32, 428, -263, 84, 727, -124, 167, 495, -1003, -761, 361, -115, -145, 713, 68, -27, 962, -206, -1109, -157, -342, -242, 628, 344, -375, 310, 272, -855, -622, -261, -448, 389, 926, 217, -77, 356, -222, -539, -203, -561, -495, 738, 681, -110, 390, -14, -630, 40, -70, -521, 47, 693, 78, 531, 449, -347, -293, 98, -535, -458, 437, 497, 399, 626, 39, -454, -162, -103, -663, 20]
7039B0L52j8J92k91m79k76K50m35N28K20R1K53Q7k42l56k3l10j45P30J61j96L79
7061D92j14k91j88J27p25N29L89j42K16L78l17n68j48O1j68M34J75o2L86k5m39
7082@l2l09j29L26K86j54L60N6k40k13J14l98k26L97m5L72K23J69n47J37l74m91
7104g18N61KL62M16n6j29j62l51m00K0l0M93r1N66m5k27l38k66J02M3P7n8N28
7127B99J24k24K50l74n18q4K57q5J90M70J16J7k61L6q41K13J17J65M64J65j26
7148C70J36m74m85J61J05k17L88L78j33K55l25l04Lp8l71M34J61L15k33N7j39
7169Dk54Q7j55LL21J95r9N23k55p14R1L20n54M95J9l3M08l4m96O1m2m08p8N52
7193d3R8P3P59p57j62q2k44k27L42J71J47K17L42n06L0j84o57L55P5K14J35M63
$$ y = [20, 372, 354, 546, 255, -224, -500, -250, -685, -157, 63, 154, 407, 494, 252, -104, -127, -437, -582, 148, 309, 113, 492, 378, 87, -101, 26, -699, -170, 219, 77, 293, 671, 354, -214, -362, -301, -469, -35, 140, 78, 464, 439, 0, -32, -341, -470, -144, 142, -12, 348, 404, 164, -49, 65, -333, -559, -162, -207, 165, 388, 557, 10, 147, -227, -718, -157, -155, 207, 623, 567, 438, 276, -75, -475, -455, -485, 8, -83, 483, 438, 211, -127, -393, -291, -248, -171, -229, 299, 423, 199, 449, 75, -443, -527, -270, -355, -165, 305, 421, 438, 177, 213, -628, -415, -298, -133, 331, 496, 370, 506, 32, -453, -292, -187, -404, -16, 362, 229, 484, 159, -145, -142, -220, -591, -157, 4, 319, 86, 143, 4, -250, -163, -318, -315, 6, 201, 102, 625, 370, -344, -253, 67, -487, 8, 27, -6, 402, 368, -128, -67, -109, -517, -595, -43, 55, 128, 887, 130, -32, -114, -358, -585, -243, -72, 75, 292, 634, 128, 158, -26, -683, -328, -253, -39, 96, 559]
7215E59j18l55J94q18k53Q32r8ML93J71n86M60l41q36J31M07j16O81M35l25k2
7236C99o8m68l37J50K33j36O41r2k31L89o54l60K44L1l93J113K32l97O5l6o98
7257c73j40M99q04M76P36j63J61J58q53k73P48m84k81Q24P3j72P70n10r07L85
7277a30k8m88O10K97m77P37K68j124j09J98m86L28J113o00l77J124m66p80O78
7296B88n54p66J154K79q14O66L13o35K56l60q81N03J270q54J21Q97q10k61R33
7315G45j559k40J253j26j95J111p97o60R40j15j314O45M13m90Q98P62j581J22
7333a88R61j203M9K48n50M79J564q53q18Q08n43q03J232o02q15J617M85j454P70
7352C84k56j353J110N67j431N46J454o34j74O04j726k06J679p53p33J350k43p16
$$ y = [559, 441, 86, 280, -538, -791, 41, -57, -53, 340, 511, -75, 385, 44, -792, -661, -254, -370, 311, 746, 421, 399, 331, -137, -474, -324, -91, -227, 414, 322, 91, 480, -174, -534, -290, -259, -652, 461, 693, 296, 361, 325, -373, -513, -14, -818, -342, 394, 231, 392, 550, -303, -576, 172, -312, -593, 231, 304, 132, 902, 392, -515, -130, -158, -646, -36, 261, -216, 521, 789, -335, -444, -246, -732, -404, 709, 109, -268, 856, 390, -390, 288, -266, -1032, 122, 401, -413, 253, 566, -69, 187, -173, -1054, -551, 719, -135, -14, 883, 73, -188, 745, -814, -1054, 199, 73, -122, 989, 192, -468, 472, 357, -957, -312, 101, -389, 509, 1271, -310, -188, 773, -430, -381, -133, -683, -204, 1360, 507, -311, 497, -46, -849, 383, -219, -1034, 583, 1068, -386, 384, 128, -1225, -115, 452, -979, -433, 1021, 387, 213, 817, -909, -1115, 564, -189, -922, 428, 185, -531]
7370e31J721p32j632O63R31j323R45M87j111R39J150k006k78Q37n76L84J338j540
7388c34k76J732n99j227R84p84m65J648L04j751R77P21j242N05m0j818J050J849
7406A234j195j82J052j166M3J369j703j106K013N4o87J200o98j391J536N14k003
7423a116N11P59o03J082R73k472J53J599j000j035J427r13K45K275j347j454J070
7440A54m8j074J640p35j359K118P85j789Q5N01j464J086J083j817k98K366p17
7457E17o73R46j685m88K354n91j397J433K27p19J236p46k188J303J252j405P58
7474A34N63j533J222J099k039q03J649m99j99J706j451q47K203l21j895N42M5
7491d24q80K073J71j842O54J346j395k49R04j644O07K113j176p58J060l57n62
$$ y = [-531, 1190, 458, -1174, -511, 420, -903, 42, 529, -582, 357, 1507, -499, -777, 60, -516, -132, 1206, -334, -610, 1122, 523, -704, 280, -504, -969, 679, 983, -768, 209, 930, -312, 193, 153, -1665, -615, 1234, 39, -143, 909, -257, -214, 1155, -548, -1654, 359, 413, -274, 926, 228, -1163, 373, 887, -1116, -605, 154, -449, 633, 1606, -866, -713, 886, -114, -1149, 278, -635, -390, 1885, 538, -916, 154, 106, -968, 672, -63, -1422, 696, 1481, -308, -223, 278, -1186, -100, 983, -834, -1132, 1234, 517, -156, 790, -895, -1383, 971, 380, -1017, 416, 643, -76, 1160, 414, -1774, -471, 781, -624, 134, 697, -836, 386, 1485, -554, -1357, 292, -207, -406, 1300, -151, -998, 1205, 884, -1011, -469, -424, -1304, 769, 940, -902, -248, 1098, -297, -546, 358, -1286, -679, 1434, 258, -500, 560, 203, -359]
7508c59J120j235j511K343O05j017P09k45j388J181R14k290K19J321j91N79N04
7525A259j847q5J686j280p94J047j50j16J913q78j796J225K35j268Q33J64j185
7542a037J566J165j641n48P30j038O32Q84j256pJ745l60j078M74r03m08J695l11
7560C04j218J141M81o89O52j92j992J040J301j192MJ215j251M07J155j562j211
7577a607J730q8m88J148n17q77J466K02j999M19P54o36J047L33j291L02J242j186
7595d6k87M08q19M07J300o14r53J213l93n33P06q92p44J658Q35j374L14L82j260
7614f92Q32R8j125K89J529n18j50N22j049n48J310m95j016J076L57m77J073o22
7632C94j222P03L91r03M24P97j025N88O28r92k55O14m81l00R07k40k25J115k97
$$ y = [-359, 761, -474, -1985, 358, 963, -54, 655, 410, -978, 203, 1117, -1173, -954, 367, 176, 755, 1259, -588, -673, 1013, -267, -1061, -14, -164, -280, 1633, 755, -1041, 184, 419, -849, -16, 148, -1037, 529, 1694, 53, -495, 235, -803, -171, 713, -543, -550, 1195, 835, -243, 231, -672, -1080, 615, 304, -914, 227, 708, 19, 671, 479, -1513, -473, 828, -364, -360, 855, -396, 11, 1166, -396, -1607, 123, 35, -453, 695, 178, -699, 767, 969, -1030, -611, 143, -493, 554, 887, -404, -102, 1140, -46, -333, 75, -744, -337, 963, 349, -604, 609, 216, -317, 389, -503, -1247, 411, 1246, -128, 186, 568, -692, 140, 238, -887, -598, 931, 413, 263, 785, -264, -812, 498, 3, -1013, 63, 420, -57, 1016, 394, -828, -125, 266, -637, -213, 584, -441, 147, 775, -217, -472, 142, -339, -639, 268, 28, -197, 918, 621]
7651F21q44Q4j33n35P58K97m58M50O55o50k47L2q27L37P42l09k17Q28q6o14M57
7672C41n83l34L91N94m32L33L90q36L98K53j165J16M71k67M18N34n95J72M24p46
7692a23n84M99j28K55O36Q0r49P77k46p15L04j22l00J154K96p65p4L04l43k14
7712b58K05l13p7J086r7m27M36m00n99J71J77n50P61K12L8m2l2n89k13N69o99
7733f41J30Q07n4K70k4p02l46L64r8k12N00L28l11O91j93p12N7j90j70J38M73
7754A05j80L11L61l47m65K24m68R5L70J28L4L99l01k39j46j16m78M98K25m4L58
7775C24K50k83l31O9n15j04N59J90JJ42L0j01k60j36m88J51M22J0N65j2j55k15
7797A13k52l11k25O64j15K16L60j27k9k03k67j85q9L59M4J81M79m40L3k85k75
$$ y = [621, -223, -139, -272, -807, -49, 248, -210, 240, 895, 245, -2, 30, -797, -460, 282, -27, -244, 584, 498, -116, 341, -242, -576, -185, 409, -23, 310, 700, -136, 262, 515, -650, -534, -63, -330, 88, 622, 27, 199, 623, -123, -707, -208, -336, -81, 555, 635, -314, 463, 217, -498, -194, -316, -616, 538, 834, 69, -5, 299, -44, -258, -53, -366, -443, 643, 546, 119, 555, 155, -444, -273, -96, -646, 115, 327, 365, 323, 291, -298, -511, 58, -641, -511, 296, 242, 512, 488, -214, -560, -196, -294, -506, -6, 322, 11, 702, 509, -203, -146, -336, -506, -368, 105, -75, 236, 597, 250, -215, 9, -459, -364, 6, 134, 168, 567, 266, 27, -119, -235, -713, -215, 10, -34, 324, 574, 291, -40, 29, -486, -590, -31, 159, 160, 302, 332, 231, -29, -165, -653, -502, -80, -70, 495, 483, 328, 113, -139, -450, -675, -11, -126, 90, 450, 323, 294, 91, -176, -361, -450, -91, -47, 134, 613, 173, 206, -79, -354]
7818c54p6K66J70j85O23m06L83j23n86j25J33JL0N59R0k05R7l31l71K86Lm92O27
7841A4L03j07N2j9j23m54J45j43P5Q32k78k23K13m15J77k77k54L6N48L9m0L55
7863D56m00j82r7R7l89K89M90j17J10L58m59m60L33j95j36J07J74o8N37j62m64
7884a78oO4k91L33J51k17N93J56o26PK23r31J91N47J40j36P20n58o1J39n35l05
7906e80L88J63J1M94j72m46K85k31m72J95L72l00M75M32n20M7K50n07m47J85k03
7927e81N31P40n76j77L36k65o56N45k04k02O71L31m32K11K23p10m9J47m76K65
7947c28Q32k53K91M4p06j95M69n84n8N44K00l2N46m14o99L93K13q57M84M08l43
7968d5N47J66q85k33N02o05kP95m56K9J197n96p42J60k41j88Q88J8n53P60M20
$$ y = [-354, -430, -164, 6, -179, 444, 38, 421, 298, -288, -413, -280, -279, -249, 310, 400, 195, 292, -39, -410, -124, -121, -613, 14, 317, 210, 262, 243, 120, -334, -189, -332, -257, 575, 297, 74, 287, -128, 49, -228, -482, -446, 102, 141, 101, 456, 56, -126, -223, -126, -515, -226, 264, 147, 257, 615, 156, -304, 29, -166, -302, -195, -21, -89, 448, 286, -178, -184, -120, -411, -78, 73, -144, 449, 605, -21, -14, 209, -722, -531, 16, 156, 20, 740, 182, 121, 260, -275, -580, -192, -29, -18, 476, 304, -142, 143, -88, -560, -365, 7, -293, 182, 614, 94, 141, 391, -116, -563, -378, -581, -50, 690, 114, -63, 273, 8, -648, -103, -307, -509, 162, 493, 61, 272, 495, -215, -264, -117, -593, -328, 504, 251, 542, 586, -120, -315, 154, -430, -488, 56, 256, 224, 770, 356, -343, 50, 263, -594, -110, 298, -45, 502, 668, -217, -450, 52, -553, -555, 240, -216, -187, 1010, 414, -328, -168, -409, -597, 291, 309, -244, 516, 936]
7989I36j023j34k3o36L03J106n76q1R02n72k95L41q45j83J078k2n87M31O5l23
8009a38N67j96j101L04J151q15N24L83r80M22O43j218l19O25l34O26R82r03o83
8028d60Q84k31j025P98j44m16J107L37j130K61K63o82o3M67p40L01J583o73n27
8047i0P12r58j85J095o12r82J411L88p41O11l46j444J130P55j586N97R89n90L37
8066D91N10j455n13J349n16l57J050m97l10J276l62j479O02L12q17J300j86j112
8084g14R10Q63j145n36P43j070O83J483j347l68J284r9j198R83r09n98J443L98
8102H06j344Q59K22r01P99j45j494O25J302p23P0N35j356L37J553j303j181J443
8120A04j12j31J130q07j020J244K93j326J42N32m40O45J300j979m8J198j203K48
$$ y = [936, -87, -221, -244, -880, -577, 529, -47, -128, 774, 202, -93, 248, -597, -780, 298, 276, -311, 120, 185, -138, 429, 233, -868, -564, 587, -228, 296, 679, -301, 121, 764, -454, -773, -148, -482, 144, 1126, 223, -460, 424, 193, -832, -34, -178, -594, 513, 850, -280, -19, 244, -438, -501, -34, -774, -473, 1110, 437, -90, 622, -336, -521, 574, -38, -1020, 391, 779, 38, 649, 303, -1141, -11, 744, -842, -245, 744, 154, 491, 1001, -454, -967, 382, -134, -491, 559, 62, -248, 1028, 666, -813, -211, 101, -716, 584, 398, -714, 196, 1059, -86, -622, 121, -949, -266, 1217, -130, -498, 786, 687, -511, 472, -437, -1035, 408, 806, -538, 321, 543, -358, 441, 296, -1198, -573, 729, 6, 76, 611, -745, -408, 1145, -158, -1339, 104, -8, -139, 991, 184, -836, 408, 701, -625, -483, 49, -391, 254, 1554, -425, -473, 725, -478, -230]
8138b30N36j182M78J679o99q69N41l16p22J701q47j370J500J056j368P13k89j602
8156a290J167J099j343l02J049j17R1O47j657p83K237k75j129P34R8o54J397l15
8174F54j880L31J242p83Q48J10j272P79J310j626m56P34n06J2J752j264m87
$$ y = [-230, 306, -876, -398, 1281, 582, -287, 254, -62, -784, 917, 70, -1300, 200, 1256, -112, 601, 312, -1290, -123, 976, -367, -669, 380, 263, 354, 1001, -656, -1439, 798, 523, -606, 128, 226, -428, 969, 654, -1226, -895, 347, -436, 412, 522, -750, 29, 1339, -287, -743, -9, -515, -503, 1249, -15, -502]
8191e02
$$ Imaginary data points
##PAGE= N=2
##DATA TABLE= (X++(I..I)), XYDATA
0@%%%qK4k4K4l2M0o0Q4j04J20j46J86k27K71l22L77m45N28o18P12q19R41j077
26e75J236j408J589j792K021k275K553k857L187l546L947m391M870n393N974o614
42c474P320q108Q984r958J1062j2320J3761j5435J7398j9746K2621k6235L0920
55A6790l7258M6373o0636Q6183j45367N03340K28022j091532M47612O6522l97082
66c37033N77716k5515r58294O66088P78500o36032q6422K08785p03404L24916
76a90695P64224p65865l45330Q31932j12873j45678M58694o80067n39619R59805
86B34528R0476o97282L80127J24572l44736O62554K9245j065086K17090O50289
96B81777m17914J06478L23178o04025K10201P85106o22914n38641M68052j42241
$$ y = [0, 0, 0, 0, -8, 16, -8, 16, -16, 24, -36, 48, -56, 64, -82, 104, -123, 148, -174, 203, -242, 286, -332, 380, -439, 502, -575, 661, -747, 842, -950, 1071, -1204, 1349, -1508, 1679, -1867, 2080, -2311, 2559, -2834, 3140, -3474, 3846, -4262, 4722, -5236, 5826, -6494, 7267, -8168, 9230, -10516, 12105, -14130, 16790, -20468, 25905, -34731, 51452, -93915, 409425, 637447, -454085, -6473, 60049, -337033, 240683, 215168, -743126, -77038, 701462, 65430, -20992, 187793, -515611, -190695, 573529, -192336, -537666, 294266, 181393, 35715, 494409, -185658, -725277, 234528, 325004, -372278, 7849, 132421, -212315, 450239, 479484, -585602, -368512, 281777, -136137, -29659, 293519, -310506, -100305, 684801, 61887, -476754, -8702, -150943]
106a50943m1342O51561l87120n43216P34791J64232o19841J54399o8185m04700
116e10364O83592L45228p69838J01210M96750l85191L4910K15763o69853N1852
126d05941Q31795k45752l47475L81001k25709j87307N41888l07569o19469N34290
136e0248L15306l04308K60246m7797n29065L94898L21816o34241l2146M08133
146A02594j88309J89572L43248n65239j86229N38850j99490k99819L15444j47036
156i6414j18513N95861o5652n68467K15303J28179k98099K39630O2962m19098
166c24308L18512M35674l84468j33141J66714k89175O6653L67960l25121j54450
176b55150M69423k6644k03760J84679k40939k77032M13351P9498l45196K04484
$$ y = [-150943, -192285, 459276, 72156, -471060, 263731, 427963, -191878, -37479, -105664, -510364, 173228, 518456, -251382, -150172, 346578, -38613, -3703, 212060, -457793, -405941, 425854, 180102, -167373, 213628, -12081, -199388, 342500, 34931, -584538, -50248, 265058, -39250, 220996, 173199, -355866, 39032, 360848, -273393, -305539, 102594, -85715, 103857, 447105, -118134, -304363, 234487, 34997, -264822, 50622, -96414, -214927, 380934, 315282, -253185, -37882, 90297, -207802, 31828, 94790, -324308, -5796, 429878, 45410, -87731, 78983, -210192, -143539, 224421, -100700, -255150, 214273, 187629, -16131, 168548, -72391, -349423, 63928, 143426, -201770, 2714]
186B714J61735k01724J99209L9791m84582O4727L54043j87881j7470K26356j91658
197c4740J6836L01843k78295k81318K50243n01r0091K72791n6834k30500K56721
208A26155O0329l18447M6146N6476j73213K28248K06710k74744K738K16857j79717
219b462p8556J11956j98743n629L39368n1710j67296J60524m5596j60913J36017
230C6960n4152k07261J94250J64854j19067P0671L2735k09911M8567J14792j97166
241a24728k1161J93032k3855K9682J24984j70927j18601J53802n8421j32893J31255
252a7831L6368m4426J61436J994j99862K9206M4148j23003N4335R3055q3661P1034
264B2793J42560j12256q8831L7850q5897j7129J24758l7925l1962J50246P714
$$ y = [2714, 164449, -37275, 161934, 201725, -282857, -218130, 135913, -51968, -69438, 156918, -34740, -17904, 283939, 5644, -275674, -25431, -25932, -116023, 156768, 99934, -130566, 126155, 186484, -131963, -85817, -29341, -202554, 25694, 232404, -42340, -39602, 177255, -2462, -81018, 30938, -167805, -173434, 165934, 114224, -53072, 107452, 61856, -99057, 36960, -17192, -224453, -30203, 134651, 15584, 86255, 118990, -90921, -42354, 72438, -124728, -145889, 47143, 23288, 52970, 177954, 7027, -111574, 42228, -16193, -149086, -17831, 18537, -25889, 135547, 137541, -62321, -33115, 11033, -111970, -57635, 35420, -48241, 22793, 165353, 53097, -35734, 2116, -83781, -100910, 23848, -14077, -46039, 104207, 111921]
275A11921j06143J5381n3775r5249R1489N2708o3442Q0380P8832q0403n562J0616
287C6753j26726j8948J01810r866J1739Q9294k7258l6378L9827p5062r8233N1878
299f1170L8974k977P3674K6262m5373K1263j6248j00682r512L7800j3559N2348
311H00P5658k5644j5152J4086o6059m9016K1947j2841J0943Q9463K7751l3744
323C8192P065k0593o3970j3560M39q288N6061N9036l838J650l419n5519l9045
336d5789m794j0101K3622N4412K3146J3406J2941m1934n6532j1500p901n222L9724
349a6522M2632K0109J9173j4560n2793l0697j1780j6811J4233M8591L6987J6904
361E5466J735k4557l7084l1259k3262P02L2829L8129K7579J5993o633k6812l6592
$$ y = [111921, 5778, 21159, -32616, -127865, -36376, 16332, -47110, 33270, 112102, 31699, 26137, 36753, -89973, -108921, -7111, -16977, -5238, 84056, 56798, 20420, 60247, -14815, -113048, -61170, -22196, -25173, 48501, 74763, 29390, 50653, 34405, -66277, -75789, -37989, -51548, 800, 76458, 50814, 35662, 49748, -16311, -65327, -43380, -56221, -45278, 44185, 71936, 38192, 45257, 24664, -39306, -52866, -52427, -60715, -4654, 54382, 50544, 52194, 48775, -6744, -45789, -50583, -60684, -37062, 17350, 40496, 53902, 66843, 24909, -31623, -43123, -51024, -56246, -16522, 26110, 46219, 65392, 50832, -1961, -32658, -44438, -61249, -47016, 1575, 38562, 55466, 57201, 32644, -4440, -35699, -58961, -58259, -25430, 12699, 40278, 56271, 49638, 22826, -13766]
374a3766l5505j0552K0290K8854K7124K9699J4546j8839l8284l3101k0537l081
386e3152J8499L1593L5232K4730k319k7510l4625k6492j7938k297K6300M2178
398A4199K9277Q530p760k3756l4654l0754j1493J3751L2112L4858K0808M315r161
411D0272k9934m1935k3375O214K0208K5562L2956K4714k835k4321l4148l2318
423c8940j2069O564J8382L4675L4819R788j2318k4652l2530k4376q389N722L1238
436a2086M1116J4283k130k834k8567m1329j4596o79J2344M1924K9071K12R573
449D6302q946m9741k9205M98n474K0198M5667J7910O423N826l6886l9436k187
462b9051j5057p845M6172L5514O063J7259j8082m8252n708r029l5585K8996N4721
$$ y = [-13766, -49271, -59823, -39533, -10679, 16445, 46144, 60690, 41851, 3567, -29534, -50071, -53152, -34653, -3060, 32172, 56902, 54583, 27073, -7552, -34044, -51982, -54279, -27979, 14199, 43476, 52006, 44246, 20490, -14164, -44918, -56411, -42660, -10548, 24310, 45118, 49433, 40272, 10338, -31597, -54972, -48758, -28550, -2988, 29968, 54682, 51847, 27526, -6622, -38940, -51009, -44445, -26063, 8612, 43431, 53219, 40901, 16249, -16281, -40657, -49046, -43324, -12086, 29030, 43313, 41183, 38349, 9782, -31547, -46143, -46822, -34478, 7446, 36517, 36729, 46302, 37356, -12385, -41590, -41092, -46566, -26368, 19299, 37209, 43632, 49458, 12572, -26864, -29051, -44108, -51953, -5781, 29733, 35796, 53055, 34973, -13279, -18987, -28016, -63601, -34605, 20116]
475B0116K970J7961K0564m9122l3533Q057l5903j0811N7732J3931L102N2635j5836
488E1863o5521L01r718l7879L5264K9516j3843N3603L5717o8188k4747J0380n1835
501e5087N520N6916k2264J5358P7369l2417n1668K3744m9774n1737P3814K0269
513A0043l8078O5374L0374n8499J8690j2780j01624K9374P7023m1096J9608O8574
525F6983m7073o410M2762r4564n3665Q4965m727j5506R1660j8997o4565P0697
537E1560j6718j14381L6311L1151m6594R2392N8135j07727J6776P1277r6942l3755
549e8515N3827o2573K6317J37125n3515p0078Q1553l8770p5944P0918l6420p7698
561a03773J33111N9163r2124M1713O099j16909N9180N7707j36391K5405J39619
$$ y = [20116, 23086, 41047, 61611, 12489, -21044, -12987, -48890, -59701, -1969, 11962, 15064, 67699, 51863, -13658, -13357, -23075, -60954, -25690, 3826, -10017, 43586, 79303, 11115, -13632, -3252, -55087, -49567, 7349, -14915, 443, 77812, 45395, -6273, 17471, -32303, -84040, -10226, 10043, -28035, 37339, 67713, 9214, 27904, 15124, -86500, -57126, 19897, -21199, -1591, 66983, 19910, 13500, 56262, -38302, -91967, -7002, -11729, -27235, 64425, 45428, -19137, 51560, 34842, -79539, -43228, -12077, -58671, 33721, 91856, -15871, 905, 72182, -24760, -58515, -4688, -67261, -40944, 96181, 42666, -27412, 54141, 15371, -60573, 10345, -26075, -103773, 29338, 88501, -3623, 38090, 44189, -72720, -13540, 44167, -92224, -66819, 72800]
572G2800m7821J377O5606j32977m2329J37953o7116r1015J22537R520m2821J22914
584A08628m7135j66521Q5203N3433j08707O4584N1580j02252J00714J10103j73648
595b4018n3686R3958p6228J6817J23435j15227l6180J95751m1891j39465O5159
606H425m7737p6525J70727J3023j60578J08088R2650j21125L3827J3513j77532
617a43244P5483J77374j17063l4036J16796p9932k979J19399j63877j17360J95005
628B5566K5980q3888J05436m4909j12099J66263J0077k25685N5555J07822p8654
639d8536J03846P1459k05579K6483J76968j34139q1425R7820q4041L0282K18581
650A71719j15138j70096J49139J0975j10773R4000n5729j31420K17621J08049
$$ y = [72800, 24979, 26356, 91962, -41015, -83344, 54609, -12507, -103522, 19015, 28535, -14286, 108628, 61493, -105028, -19825, 33608, -75099, -10515, 41065, -61187, 39527, 149630, -24018, -77704, 16254, -59974, -43157, 80278, -34949, -71129, 124622, 82731, -56734, 8425, -39312, -115837, 54890, 67913, -92665, 15423, 108073, -13052, 20775, 34288, -143244, -67761, 109613, -7450, -41486, 75310, -4622, -7601, 111798, -52079, -169439, 25566, 51546, -32342, 73094, 28185, -83914, 82349, 92426, -133259, -77704, 30118, -48536, 55310, 126769, -78810, -52327, 124641, -9498, -90923, 6897, -77144, -46862, 171719, 56581, -113515, 35624, 46599, -64174, 29826, -25903, -157323, 60298, 168347]
660A68347k01424J5546O1272j28153Q6633R1373k17470J4181K34034o6844n8201
671g06Q3120j54589m6212K28251p7082j80213J50967N5119o6187J27945o8903
682E1510k25911J45501J33707j65077K0017Q1866j03879J12958J31500k39694
692e7502q3654J77173n0486k5002J24871j28866n5244K48237l4900k14468O6864
703c2977P466o9331J78978N078k20041J19312J60249j47120k0059K8858j56676
714a46263R7039K07870j58967q8594J58081m4299l6223J07195j61595j22584K39717
725E1377N2360j44034P5077r686j03740J62649J5911k57858N6152J75034p5742
736b500L8772O1583j84843L1064J96503j44701j24273J28586k5148J254J75675
$$ y = [168347, -33077, -17531, 43741, -84412, 2221, 93594, -123876, -109695, 124339, 57495, -706, 82414, -72175, -118387, 109864, 32782, -147431, 3536, 58655, -7532, 120413, 51510, -174401, -28900, 104807, -60270, -40253, 41613, -62266, 50692, 182192, -57502, -141156, 36017, -14469, -39471, 85400, -43466, -98710, 149527, 114627, -99841, -32977, -25511, -94842, 84136, 89214, -130827, -11515, 148734, 1614, -18445, 10413, -146263, -49224, 158646, -321, -88915, 69166, 24867, -11356, 95839, -65756, -188340, 51377, 103737, -40297, 34780, 25094, -78646, 84003, 99914, -157944, -101792, 73242, -2500, 36272, 97855, -86988, -55924, 140579, -4122, -128395, 191, -24957, -23703, 151972]
747A51972j08392j74356J59170M4124j38229O0040r671j05347J87197J04307k15506
758d4691j4906J06086r1034L3464P7960j72473J1817K32634o1471j16263P3436
769C4559p6177m9022J74102n3649j66009J39714Q9838q8321N7499l1797j71943
780a41206J11566J31992j49370j4850J09137n7942M7244R1509j84611p6424J73921
791D0966k1975p0393R7247n0765n3792J69528k5572j89512O0097N4493p1112J00890
803D0100L4038j54785P1446J33988j26064n2626N5019q4495M5183J52202j05526
814H480q1595J34823j5542p6536O1855p2527q2806J63121M7822j23315N0243L3670
826D7693r0838O7383K9388j59493L0649J42133n1068o521N8761j02610j0834J22504
$$ y = [151972, 43580, -130776, 28394, 72518, -65711, -5671, -15342, -120689, 66508, 170815, -44691, -59597, 46489, -44545, -11081, 66879, -105594, -93777, 138857, 77386, -38877, 34559, -41618, -90640, 83462, 29813, -136196, 3518, 93356, 5035, 62534, 30737, -141206, -29640, 102352, -47018, -61868, 47269, -10673, 36571, 128080, -56531, -132955, 40966, 18991, -51402, 45845, -4920, -58712, 110816, 85244, -104268, -44171, 10322, -60790, 40100, 74138, -80647, -9201, 124787, -1277, -53903, 1116, -83379, -38196, 114006, 8480, -73115, 61708, 46166, -30370, 31485, -41042, -123848, 39273, 87095, -36220, 14023, 47693, -43145, 24238, 53626, -105867, -75218, 66915, 15847, 9326, 68087, -34523, -45357, 77147]
838G7147q3426r8861J01262K0357k4039R1565m5768j14782Q7389L6838j06052
849e8370K7866L7406n5039Q4625O9155j25995k4305P5675n6651q994O4154p1012
861d1485n280J35288k9010r2697M2271k1202m9452Q3129m364q4548P8843O4428
873G5921o9375Q046M709r0061L4936P8189o6083q069P6972k8604n549M6954q4435
886b6449n5512Q9645M739m3734N5852q86l8167O4384r526j04407K3323M9121l6647
899b8264L4752M0663n9594J4436N7809o4475m2078L6945k2927P445P4428k5847
911B3293m3584N2291l877n3361J6283j3174l2651O8173L5988n3217J3583K5078
923C4825m8493K26J7777n1176J1116O9064j2500j3224L0479l5153l0500L5617
$$ y = [77147, -6279, -105140, -3878, 16479, -7560, 84005, 38237, -76545, 10844, 47682, -58370, -30504, 6902, -48137, 36488, 105643, -20352, -44657, 31018, -25633, -34627, 29527, -41485, -46765, 88523, 59513, -33184, 9087, -12115, -61567, 21562, 17198, -67350, 11493, 75921, 6546, 14592, 19301, -70760, -35824, 42365, -23718, -31787, 45185, 16581, 11032, 57986, -26449, -81961, 7684, 12423, -31311, 24541, 23655, -14512, 49872, 40346, -64061, -40738, 8383, -28264, 6488, 47151, -12443, 1993, 59802, -4673, -46751, -9806, -32733, -25288, 49140, 23293, -20291, 32000, 28123, -25238, -8955, -22129, -54780, 13393, 49381, -3836, 9747, 34825, -13668, -13442, 4335, -46841, -35725, 33339, 20839, 7615, 38094, 2941, -27559, 8058]
935H058k0273l8730M4893K7302j1768K7199q734n1528J5035J4287m1583Q979L5846
$$ y = [8058, -12215, -50945, -6052, 21250, 9482, 36681, 27947, -23581, -8546, 5741, -35842, -26863, 8983]
$$ [...]
8191C00
##END NTUPLES=NMR FID
##END=
