##TITLE=1H_LR-721-R3-F2
 CDCl3
 8 sc, 
 9.10.2024
##JCAMPDX= 6.0         $$ Bruker NMR JCAMP-DX V2.0
##DATA TYPE= NMR FID
##DATA CLASS= NTUPLES
##ORIGIN= UXNMR, Bruker Analytische Messtechnik GmbH
##OWNER= root
$$ XWIN-NMR		Version 3.5
$$ Wed Oct  9 15:56:53 2024 Russian Standard Time (UT+4h)  she@DPX200
##.OBSERVE FREQUENCY= 200.1318
##.OBSERVE NUCLEUS= ^1H
##.DELAY= (6, 6)
##.ACQUISITION MODE= SIMULTANEOUS
##.ACQUISITION SCHEME= undefined
##.AVERAGES= 8
##.DIGITISER RES= 18
##SPECTROMETER/DATA SYSTEM= spect
##.PULSE SEQUENCE= zg30
##.SOLVENT NAME= D2O
##.SHIFT REFERENCE= (INTERNAL, D2O, 0, 15.7039)
##AUDIT TRAIL= $$ (NUMBER, WHEN, WHO, WHERE, WHAT)
$$ ##TITLE= Audit trail, XWIN-NMR		Version 3.5
$$ ##JCAMPDX= 5.01
$$ ##ORIGIN= Bruker BioSpin GmbH
$$ ##OWNER= she
$$ F:/spectra/data/she/nmr/H-F/1/audita.txt
$$ ##AUDIT TRAIL=  $$ (NUMBER, WHEN, WHO, WHERE, WHAT)
(   1,<2024-10-09 15:55:56.84 +0400>,<she>,<DPX200>,
      <created by zg, POWCHK disabled, PULCHK disabled
       configuration hash MD5:
       00 E9 B6 7A A2 85 ED C7 34 08 36 98 17 FE 4E 26
       data hash MD5: 16K
       87 3D CD D7 41 4B 15 64 19 21 B7 39 1F 5E F4 83>)
$$ ##END=
$$ 
$$ hash MD5
$$ FB 4D 70 AA 30 11 8A 3E 06 FB 24 33 12 53 56 22
##$RELAX= 
##$RELAX= 
##$RELAX= 
##$RELAX= 
##$RELAX= 
##$RELAX= 
$$ Bruker specific parameters
$$ --------------------------
##$DU= <F:/spectra>
##$EXPNO= 1
##$NAME= <H-F>
##$PROCNO= 1
##$TYPE= <nmr>
##$USER= <she>
##$AMP= (0..31)
100 100 100 100 100 100 100 100 100 100 100 100 100 100 100 100 100 100 
100 100 100 100 100 100 100 100 100 100 100 100 100 100 
##$AQSEQ= 0
##$AQ_mod= 1
##$AUNM= <au_zg>
##$AUTOPOS= <>
##$BF1= 200.13
##$BF2= 200.13
##$BF3= 200.13
##$BF4= 200.13
##$BF5= 200.13
##$BF6= 200.13
##$BF7= 200.13
##$BF8= 200.13
##$BYTORDA= 1
##$CFDGTYP= 0
##$CFRGTYP= 5
##$CHEMSTR= <none>
##$CNST= (0..31)
1 1 145 1 1 1 1 1 1 1 1 1 1 1 1 1 1 1 1 1 1 1 1 1 1 1 1 1 1 1 1 1 
##$CPDPRG= <>
##$CPDPRG1= <>
##$CPDPRG2= <>
##$CPDPRG3= <>
##$CPDPRG4= <mlev>
##$CPDPRG5= <mlev>
##$CPDPRG6= <mlev>
##$CPDPRG7= <mlev>
##$CPDPRG8= <mlev>
##$CPDPRGB= <>
##$CPDPRGT= <>
##$D= (0..31)
0 1.2 0 0 0 0 0 0 0 0.06 0 0.03 0 0 0 0 0.0002 0 0 0 0 0 0 0 0 0 0 0 0 
0 0 0 
##$DATE= 1728474956
##$DBL= (0..7)
120 120 120 120 120 120 120 120 
##$DBP= (0..7)
150 150 150 150 150 150 150 150 
##$DBP07= 0
##$DBPNAM0= <>
##$DBPNAM1= <>
##$DBPNAM2= <>
##$DBPNAM3= <>
##$DBPNAM4= <>
##$DBPNAM5= <>
##$DBPNAM6= <>
##$DBPNAM7= <>
##$DBPOAL= (0..7)
0.5 0.5 0.5 0.5 0.5 0.5 0.5 0.5 
##$DBPOFFS= (0..7)
0 0 0 0 0 0 0 0 
##$DE= 6
##$DECBNUC= <off>
##$DECIM= 24
##$DECNUC= <off>
##$DECSTAT= 4
##$DIGMOD= 1
##$DIGTYP= 9
##$DL= (0..7)
0 120 120 120 120 120 120 120 
##$DP= (0..7)
150 150 150 150 150 150 150 150 
##$DP07= 0
##$DPNAME0= <>
##$DPNAME1= <>
##$DPNAME2= <>
##$DPNAME3= <>
##$DPNAME4= <>
##$DPNAME5= <>
##$DPNAME6= <>
##$DPNAME7= <>
##$DPOAL= (0..7)
0.5 0.5 0.5 0.5 0.5 0.5 0.5 0.5 
##$DPOFFS= (0..7)
0 0 0 0 0 0 0 0 
##$DQDMODE= 0
##$DR= 18
##$DS= 0
##$DSLIST= <SSSSSSSSSSSSSSS>
$$ [...]
##$SUBNAM2= <"">
##$SUBNAM3= <"">
##$SUBNAM4= <"">
##$SUBNAM5= <"">
##$SUBNAM6= <"">
##$SUBNAM7= <"">
##$SUBNAM8= <"">
##$SUBNAM9= <"">
##$SW= 24.0689170037331
##$SWIBOX= (0..15)
0 0 2 0 0 0 0 0 0 0 0 0 0 0 0 0 
##$SW_h= 4816.95568400771
##$TD= 16384
##$TD0= 1
##$TE= 0
##$TE2= 300
##$TE3= 300
##$TEG= 300
##$TL= (0..7)
0 120 120 120 120 120 120 120 
##$TP= (0..7)
150 150 150 150 150 150 150 150 
##$TP07= 0
##$TPNAME0= <>
##$TPNAME1= <>
##$TPNAME2= <>
##$TPNAME3= <>
##$TPNAME4= <>
##$TPNAME5= <>
##$TPNAME6= <>
##$TPNAME7= <>
##$TPOAL= (0..7)
0.5 0.5 0.5 0.5 0.5 0.5 0.5 0.5 
##$TPOFFS= (0..7)
0 0 0 0 0 0 0 0 
##$TUNHIN= 0
##$TUNHOUT= 0
##$TUNXOUT= 0
##$USERA1= <user>
##$USERA2= <user>
##$USERA3= <user>
##$USERA4= <user>
##$USERA5= <user>
##$V9= 5
##$VALIST= <valist>
##$VCLIST= <CCCCCCCCCCCCCCC>
##$VD= 0
##$VDLIST= <DDDDDDDDDDDDDDD>
##$VPLIST= <PPPPPPPPPPPPPPP>
##$VTLIST= <TTTTTTTTTTTTTTT>
##$WBST= 1024
##$WBSW= 4
##$XGAIN= (0..3)
0 0 0 0 
##$XL= 0
##$YL= 0
##$YMAX_a= 815655
##$YMIN_a= -973267
##$ZGOPTNS= <>
##$ZL1= 120
##$ZL2= 120
##$ZL3= 120
##$ZL4= 120
##$ABSF1= 10
##$ABSF2= 0
##$ABSG= 5
##$ABSL= 3
##$ALPHA= 0
##$AQORDER= 0
##$ASSFAC= 0
##$ASSFACI= 0
##$ASSFACX= 0
##$ASSWID= 0
##$AUNMP= <proc_1d>
##$AZFE= 0.1
##$AZFW= 0.1
##$BCFW= 1
##$BC_mod= 2
##$BYTORDP= 1
##$COROFFS= 0
##$CY= 11.3945322036743
##$DATMOD= 1
##$DC= 2
##$DFILT= <>
##$DTYPP= 0
##$F1P= 15.6554695791079
##$F2P= 12.8336369535428
##$FCOR= 0.5
##$FTSIZE= 0
##$FT_mod= 4
##$GAMMA= 1
##$GB= 0.15
##$INTBC= 1
##$INTSCL= 1
##$ISEN= 128
##$LB= 0.24
##$LEV0= 0
##$LPBIN= 0
##$MAXI= 10000
##$MC2= 0
##$MEAN= 0
##$ME_mod= 0
##$MI= 1.114404
##$NCOEF= 0
##$NC_proc= 0
##$NLEV= 6
##$NOISF1= 3.799351
##$NOISF2= 2.8
##$NSP= 1
##$NTH_PI= 0
##$NZP= 0
##$OFFSET= 15.70392
##$PC= 1
##$PHC0= -26343.27
##$PHC1= 12.38743
##$PH_mod= 1
##$PKNL= yes
##$PPARMOD= 0
##$PSCAL= 0
##$PSIGN= 0
##$REVERSE= no
##$SF= 200.130013532006
##$SI= 16384
##$SIGF1= 3
##$SIGF2= 2
##$SINO= 400
##$SIOLD= 16384
##$SREGLST= <1H.CDCl3>
##$SSB= 0
##$STSI= 0
##$STSR= 0
##$SW_p= 3612.71676300578
##$SYMM= 0
##$S_DEV= 0
##$TDeff= 0
##$TDoff= 0
##$TI= <>
##$TILT= no
##$TM1= 0
##$TM2= 0
##$TOPLEV= 0
##$USERP1= <user>
##$USERP2= <user>
##$USERP3= <user>
##$USERP4= <user>
##$USERP5= <user>
##$WDW= 1
##$XDIM= 8192
##$YMAX_p= 0
##$YMIN_p= 0
$$ End of Bruker specific parameters
$$ ---------------------------------
##NTUPLES= NMR FID
##VAR_NAME=  TIME,          FID/REAL,        FID/IMAG
##SYMBOL=    X,             R,               I
##VAR_TYPE=  INDEPENDENT,   DEPENDENT,       DEPENDENT
##VAR_FORM=  AFFN,          ASDF,            ASDF
##VAR_DIM=   8192,          8192,            8192
##UNITS=     SECONDS,       ARBITRARY UNITS, ARBITRARY UNITS
##FACTOR=    0.0002076,     1,               1
##FIRST=     0,             0,               0
##LAST=      1.7004516,     0,               0
##MIN=       0,             -973267,         0
##MAX=       1.7004516,     815655,          0
$$ Real data points
##PAGE= N=1
##DATA TABLE= (X++(R..R)), XYDATA
$$ plain form
0 0 0 0 0 0 -8 9 -9 16 -17 24 -35 49 -57 65 -85 105 -127 154 -180 207 -246 292 -339 389 -451 513 -585
27 -585 676 -768 864 -972 1098 -1233 1382 -1548 1719 -1912 2132 -2369 2626 -2908 3219 -3562
43 -3562 3944 -4372 4843 -5369 5971 -6655 7445 -8367 9451 -10761 12378 -14436 17141
56 17141 -20878 26412 -35508 53786 -159879 632326 459861 -330038 277256 -106435 -326598
67 -326598 591718 111051 -973267 -40381 463637 -77638 356487 274884 -692285 27206
77 27206 654142 -391507 -461592 184489 -197429 207685 807301 -302614 -649287 412243
87 412243 138868 -368396 109980 -223564 -345354 753995 471374 -586048 -80447 182687
97 182687 -328068 156213 183757 -616087 37935 758408 -22406 -179823 112274 -442382
$$ packed form
0@%%%%qJ7j8K5l3M1n9Q4j06J22j50J90k32K81l34L87m53N38o31P28q40R64j098
27e85J261j444J632j836K070k331K615k930L267l631M044m501M995n534O127o781
43c562P506q316R215j0212J1340j2626J4100j5812J7818k0212K3139k6814L1577
56A7141l8019M7290o1920Q9294k13665P92205j72465p89899O07294l83691k20163
67c26598R18316m80667j084318R32886N04018n41275M34125q1603r67169P19491
77B7206O26936j045649p0085O46081l81918M05114N99616j109915l46673J061530
87D12243k73375n07264M78376l33544j21790J099349k82621j057422N05601K63134
97A82687n10755M84281K7544p99844O54022P20473p80814j57417K92097n54656
$$ plain form
107 -442382 -141611 564492 -213171 -508526 398750 298425 -43488 274253 -276680 -622363
117 -622363 336648 324374 -433822 21464 276291 -113518 315754 270860 -624370 -271717
127 -271717 360994 -113019 -54862 295840 -216060 -43526 578196 -90940 -541685 36059
137 36059 -15495 -101588 393841 18717 -382148 324183 339536 -343304 -137698 -26777 -302098
148 -302098 221603 401844 -256764 -70510 340596 -106091 -123006 114046 -349008 -223142
158 -223142 437888 138415 -165492 172968 -15569 -178459 213078 -76225 -463149 104679
168 104679 317662 -41671 121650 101461 -266583 37453 187540 -310434 -180737 210880
178 210880 2072 87258 302018 -143586 -236826 161172 -43460 -223726 80561 -14318
$$ packed form
107d42382L00771P06103p77663k95355R07276j00325l41913L17741n50933l45683
117f22363R59011j2274p58196M55286K54827l89809M29272m4894q95230L52653
127b71717O32711m74013N8157L50702n11900J72534O21722o69136m50745N77744
137C6059n1554q6093M95429l75124m00865P06331J5353o82840K05606J10921k75321
148c02098N23701J80241o58608J86254M11106m46687j6915K37052m63054J25866
158b23142O61030k99473l03907L38460j88537j62890L91537k89303l86924N67828
168A04679K12983l59333J63321k0189l68044L04036J50087m97974J29697L91617
178B10880k08808Q5186K14760m45604r3240L97998k04632j80266L04287r4879
$$ plain form
188 -14318 -67678 342119 158823 -283418 -37340 65196 -176660 11460 68972 -162960
198 -162960 128749 320122 -82639 -122107 51489 -173713 -107679 161772 -54277 -85988
208 -85988 229209 97691 -66475 73354 -120850 -258941 89391 111507 -117556 72012
218 72012 152268 -23843 74470 27092 -261626 -97675 129458 -41363 -1459 166874 4301
229 4301 -11928 116979 -98381 -198619 8029 -11703 -25273 173499 80634 -80995 75668
240 75668 55749 -152321 -88440 -30236 -70665 110531 165904 -40386 -3457 95972 -72404
251 -72404 -112540 -16134 -81686 -21538 154863 72095 -8496 68451 -28648 -120296 -5635 -30073
263 -30073 -107398 49295 130316 46005 56954 12639 -109368 -42071 8220 -101343 -43487
$$ packed form
188a4318n3360M09797j83296m42241K46078J02536k41856J88120N7512k31932
198a62960K91709J91373m02761l9468J73596k25202O6034K69451k16049l1711
208h5988L15197j31518j64166J39829j94204j38091L48332K2116k29063J89568
218G2012Q0256j76111R8313m7378k88718J63951K27133j70821L9904J68333j62573
229D301j6229J28907k15360j00238K06648j9732j3570J98772r2865j61629J56663
240G5668j9919k08070O3881N8204m0429J81196N5373k06290L6929R9429j68376
251g2404m0136R6406o5552O0148J76401q2768q0591P6947r7099r1648J14661k4438
263c0073p7325J56693Q1021q4311J0949m4315j22007O7297N0291j09563N7856
$$ plain form
274 -43487 104458 72515 51861 66724 -47643 -85808 -13778 -60996 -70216 57083 65522 25701
286 25701 90375 45771 -81256 -69289 -44731 -62845 12307 54719 15210 71182 101777 -22501
298 -22501 -85405 -49928 -61036 -36620 31652 29810 47872 96197 29990 -51143 -38053 -55728
310 -55728 -79899 -8559 45356 42942 66346 52003 -8812 -19652 -41116 -95371 -52948 35482
322 35482 44309 42969 62679 33861 -5771 -32855 -79132 -74322 -4133 24955 28951 66525 66687
335 66687 12084 -26625 -52016 -65596 -39231 -9786 13228 62916 81836 29962 -15358 -27641
347 -27641 -49940 -61732 -38884 -416 49124 76438 47474 10286 -2988 -35174 -73807 -61098
359 -61098 -12699 27407 50755 54631 43225 21999 -20537 -65765 -65913 -28938 1499 22774 48855
$$ packed form
274d3487J47945l1943k0654J4863j14367l8165P2030m7218r220J27299Q439l9821
286B5701O4674m4604j27027J1967K4558j8114P5152M2412l9509N5972L0595j24278
298b2501o2904L5477j1108K4416O8272j842J8062M8325o6207q1133J3090j7675
310e5728k4171P1340N3915k414K3404j4343o0815j0840k1464n4255M2423Q8430
322C5482Q827j340J9710k8818l9632k7084m6277M810P0189K9088L996L7574J62
335F6687n4603l8709k5391j3580K6365K9445K3014M9688J8920n1874m5320j2283
347b7641k2299j1792K2848L8468M9540K7314k8964l7188j3274l2186l8633J2709
359f1098M8399M0106K3348L876j1406k1226m2536m5228j48L6975L0437K1275K6081
$$ plain form
372 48855 63280 41967 -7431 -48710 -54860 -40350 -26988 -1625 42514 69981 52063 9502
384 9502 -22574 -39496 -51285 -51971 -21949 29251 61129 53033 29174 8897 -17794 -53583 -65890
397 -65890 -35471 10632 38003 45530 46138 34838 -641 -45868 -64566 -43493 -10466 11817 33458
410 33458 57167 56007 15096 -33485 -50951 -44747 -36435 -17053 22032 57613 60825 30905 -7476
423 -7476 -29550 -40407 -52718 -41266 6817 46937 50489 38463 21433 -5633 -34484 -57258
435 -57258 -51835 -7771 29056 33533 41684 47518 15854 -27856 -51802 -54374 -27391 6954 17280
448 17280 37279 64893 36316 -17816 -32974 -41251 -50125 -23009 8669 29415 59638 49352
460 49352 -2122 -14082 -18211 -58370 -54089 -1038 24560 43111 54706 19450 -1199 -202 -49644
$$ packed form
372D8855J4425k1313m9398m1279o150J4510J3362K5363M4139K7467j7918m2561
384I502l2076j6922j1789o86L0022N1200L1878q096k3859k0277k6691l5789j2307
397f5890L0419M6103K7371P527O08j1300l5479m5227j8698K1073L3027K2283K1641
410C3458K3709j160m0911m8581j7466O204Q312J9382L9085L5581L212k9920l8381
423g476k2074j0857j2311J1452M8083M0120L552j2026j7030k7066k8851k2774
435e7258N423M4064L6827M477Q151N834l1664m3710k3946k572K6983L4345J0326
448A7280J9999K7614k8577n4132j5158q277q874K7116L1678K0746L0223j0286
460D9352n1474j1960m129m0159M281N3051K5598J8551J1595l5256k0649R97m9442
$$ plain form
473 -49644 -74036 -16487 14020 16100 53600 50751 9126 4746 -24595 -71430 -34253 1710 -15660
486 -15660 32373 80709 26803 -6423 -505 -45321 -49872 -8524 -28276 -4275 82879 55910
498 55910 -8599 11051 -14888 -64598 -23897 -15650 -32928 47111 73584 6573 24580 23453
510 23453 -72294 -57323 7284 -31078 -7552 65007 26344 23526 61125 -41641 -94321 1877
522 1877 -6155 -44450 41170 48498 4523 63588 23545 -90422 -35838 2305 -60868 12761
534 12761 78501 -4715 20191 75158 -32819 -60410 -5573 -69636 -35895 95839 25940 -33099
546 -33099 72778 33668 -60474 -6163 -42180 -93519 51143 79223 -32531 36927 68793
557 68793 -55042 -18437 20972 -101716 -47273 84236 12313 17505 89306 -38845 -63515
$$ packed form
473d9644k4392N7549L0507K080L7500k849m1625m380k9341m6835L7177L5963j7370
486a5660M8033M8336n3906l3226N918m4816m551M1348j9752K4001Q7154k6969
498E5910o4509J9650k5939m9710M0701Q247j7278Q0039K6473o7011J8007j127
510B3453r5747J4971O4607l8362K3526P2559l8663k818L7599j02766n2680R6198
522A877q032l8295Q5620P328m3975N9065m0043j13967N4584L8143o3173P3629
534A2761O5740q3216K4906N4967j07977k7591N4837o4063L3741J31734o9899n9039
546c3099J05877l9110r4142N4311l6017n1339J44662K8080j11754O9458L1866
557F8793j23835L6605L9409j22688N4443J31509p1923N192P1801j28151k4670
$$ plain form
568 -63515 64133 -36431 -119956 28079 40173 -1101 103854 27814 -105109 26356 42305
579 42305 -111904 -27260 47679 -41053 62730 128418 -61965 -60244 49121 -64547 -53818
590 -53818 66432 -50693 -43554 156285 59880 -83126 9783 -36375 -90295 71678 18852
601 18852 -119587 67352 137352 -35085 1001 9834 -135548 -10131 106095 -70772 -40372
612 -40372 114949 2991 -1405 93107 -100129 -147824 82532 39197 -61341 66669 17122
623 17122 -49461 125801 39085 -191506 -41639 71079 -40304 50094 73549 -96319 29902
634 29902 149692 -84294 -116682 28057 -59383 -133 165248 -25186 -109242 107681 44457
645 44457 -90377 12295 -66147 -120219 149439 136342 -113482 -7714 73818 -59709 22333
$$ packed form
568f3515J27648j00564q3525J48035J2094m1274J04955p6040j32923J31465J5949
579D2305j54209Q4644P4939q8732J03783O5688j90383J721J09365j13668J0729
590e3818J20250j17125P139J99839r6405j43006R2909m6158n3920J61973n2826
601A8852j38439J86939P0000j72437L6086Q833j45382J25417J16226j76867L0400
612d0372J55321j11958m396R4512j93236m7695K30356m3335j00538J28010m9547
623A7122o6583J75262q6716k30591J49867J12718j11383R0398K3455j69868J26221
634B9902J19790k33986l2388J44739q7440N9250J65381j90434q4056K16923o3224
645D4457j34834J02672p8442n4072K69658j3097k49824J05768Q1532j33527Q2042
$$ plain form
656 22333 21755 -183041 -18935 195049 6650 -39545 65211 -75183 -42747 127177 -73276
667 -73276 -167107 84685 80967 -5452 105871 -32984 -168713 82633 97530 -143724 -43417
678 -43417 59019 -20672 116895 113902 -171074 -85582 123345 -33707 -66767 48707 -65712
689 -65712 1704 208052 3275 -162146 15732 -1028 -58774 93613 -10982 -144539 112087
700 112087 166492 -73399 -49294 -21132 -115326 65907 130737 -127651 -62391 156987 32300
711 32300 -23381 28116 -141983 -95287 159660 33915 -107116 56522 39130 -24962 109586
722 109586 -21533 -212813 8429 122823 -28886 23424 35448 -91062 67277 139513
732 139513 -138712 -139613 65005 9207 25005 108926 -73339 -80501 142291 24548 -136041
$$ packed form
656B2333n78k04796J64106K13984j88399m6195J04756j40394L2436J69924k00453
667g3276r3831K51792l718q6419J11323j38855j35729K51346J4897k41254J00307
678d3417J02436p9691J37567k993k84976Q5492K08927j57052l3060J15474j14419
689f5712O7416K06348k04777j65421J77878j6760n7746J52387j04595j33557K56626
700A12087N4405k39891K4105K8162r4194J81233O4830k58388O5260K19378j24687
711C2300n5681N1497j70099M6696K54947j25745j41031J63638j7392o4092J34548
722A09586j31119j91280K21242J14394j51709N2310J2024j26510J58339P2236
732A39513k78225r01K04618n5798J5798Q3921j82265p162K22792j17743j60589
$$ plain form
743 -136041 -9988 -20326 -46315 145901 76850 -131762 5800 85316 -56322 -10096 -4921
754 -4921 -133682 38070 188796 -23179 -77418 43765 -31345 -17921 69614 -96295 -111447
765 -111447 130400 93187 -40623 31869 -27800 -97817 69402 41995 -131658 -10276 93014
776 93014 5780 61259 46380 -137313 -47769 104228 -33934 -70906 40765 -5060 30828
787 30828 127908 -45019 -136848 34234 27195 -54897 37400 6737 -54391 96900 86724 -94070
799 -94070 -47021 8543 -62704 31396 79517 -69029 -17660 118029 7661 -52486 -2763
810 -2763 -79012 -42056 108017 15496 -71798 56793 51614 -32354 20857 -32463 -113014 28909
822 28909 81749 -28280 15459 49540 -41862 10389 50256 -89653 -76384 54526 20780
$$ packed form
743a36041J26053j0338k5989J92216o9051k08612J37562P9516j41638M6226N175
754d921j28761J71752J50726k11975n4239J21183p5110J3424Q7535j65909j5152
765a11447K41847l7213j33810P2492n9669p0017J67219k7407j73653J21382J03290
776I3014q7234N5479j4879j83693Q9544J51997j38162l6972J11671m5825L5888
787C0828R7080j72927r1829J71082p039q2092R2297l0663o1128J51291j0176j80794
799i4070M7049N5564p1247R4100M8121j48546N1369J35689j10368o0147M9723
810b763p6249L6956J50073r2521q7294J28591n179q3968N3211n3320q0551J41923
822B8909N2840j10029M3739L4081r1402N2251L9867j39909J3269J30910l3746
$$ plain form
833 20780 14569 65850 -29814 -47148 67325 -2618 -99972 -8261 20403 -4292 74136 39905
845 39905 -66150 4447 39326 -56070 -29553 14327 -39207 25931 98552 -6042 -43016 16179
857 16179 -27461 -32369 28460 -32206 -43412 79295 63407 -26757 57 -14707 -56587 14523
869 14523 16631 -55528 12846 71170 6024 9654 18658 -64516 -42886 35224 -10460 -21736 40279
882 40279 15392 8404 51876 -23385 -84342 -2680 19137 -18755 21589 23978 -8777 42735
894 42735 33147 -61847 -43245 6894 -21622 6905 48234 -3509 -848 46548 -6029 -43236
906 -43236 -11771 -31404 -22834 52885 33022 -20400 19494 24799 -23041 -15357 -23858 -47542 17155
919 17155 54720 1686 4432 29605 -12888 -21025 -2558 -38843 -28957 32541 24790 11890 34994
$$ packed form
833B0780o211N1281r5664j7334J14473o9943r7354R1711K8664k4695P8428l4231
845C9905j06055P0597L4879r5396K6517M3880n3534O5138P2621j04594l6974N9195
857A6179m3640m908O0829o0666j1206J22707j5888r0164K6814j4764m1880P1110
869A4523K108p2159O8374N8324o5146L630R004q3174K1630P8110m5684j1276O2015
882D0279k4887o988M3472p5261o0957Q1662K1817l7892M0344K389l2755N1512
894D2735r588r4994J8602N0139k8516K8527M1329n1743K661M7396n2577l7207
906d3236L1465j9633Q570P5719j9863n3422L9894N305m7840P684q501k3684O4697
919A7155L7565n3034K746K5173m2493q137J8467l6285R886O1498p751j2900K3104
$$ plain form
932 34994 -2346 -34557 2864 -7057 -44352 -6418 25649 17258 36021 20508 -31488 -14590
944 -14590 6760 -32624 -27315 15487 13430 22852 39326 -1164 -23602 -4143 -22926 -31585 7812
957 7812 9666 1109 35661 32406 -10199 -14043 -18468 -31884 -3620 11092 -7878 17278 43512
970 43512 9490 -13297 -10910 -27486 -22245 4274 -66 6469 35482 21722 -4762 -1062 -15646
983 -15646 -35733 -14977 3301 6690 23536 24339 5704 7369 -1543 -34179 -30176 -1962 4011
996 4011 11573 24082 16353 10010 4661 -21887 -32059 -11081 -3064 -115 20825 27659 13694 4427
1010 4427 -9324 -23675 -18953 -13070 -9682 12734 30572 19459 6736 1307 -11378 -20874 -21236
1023 -21236 -15738 3907 23234 20107 11713 10911 -884 -20154 -24439 -16265 -3760 11263 17389
$$ packed form
932C4994l7340l2211L7421r921l7295L7934L2067q391J8763j5513n1996J6898
944a4590K1350l9384N309M2802k057R422J6474m0490k2438J9459j8783q659L9397
957G812J854q557L4552l255m2605l844m425j3416K8264J4712j8970K5156K6234
970D3512l4022k2787K387j6576N241K6519m340O535K9013j3760k6484L700j4584
983a5646k0087K0756J8278L389J6846Q03j8635J665q912l2636M003K8214N973
996D011P562J2509p729o343n349k6548j0172K0978Q017K949K0940O834j3965r267
1010D427j3751j4351M722N883L388K2416J7838j1113j2723n429j2685r496l62
1023b1236N498J9645J9327l127q394q02j1795j9270m285Q174J2505J5023O126
$$ plain form
1036 17389 17934 18267 6582 -15389 -24167 -17606 -10178 -2543 10818 22184 23854 11813 -6853 -16660
1050 -16660 -17504 -17535 -12797 2908 20467 24459 14784 2581 -5880 -14250 -22790 -19894 -2451 15086
1064 15086 19561 16600 12540 4053 -11276 -23745 -22250 -8284 5037 12507 17687 20796 13386 -5315
1078 -5315 -20247 -20512 -13153 -6688 2144 16154 24509 17457 660 -11114 -15232 -16976 -15869 -5027
1092 -5027 12100 23091 19451 6269 -1548 -7857 -19785 -23510 -9665 7031 15922 18786 15710
1105 15710 8457 -1862 -17645 -26108 -14114 498 5445 13659 21887 16311 3333 -11744 -22383
1118 -22383 -16765 -6444 -4431 7903 25179 20316 5447 -2308 -13576 -20478 -14221 -10213 234
1131 234 22848 23301 6373 5775 1195 -19819 -22984 -12733 -6135 12054 22551 10102 9417 12240
$$ packed form
1036A7389N45L33j1685k1971q778O561P428P635J3361J1366J670j2041j8666r807
1050a6660q44l1M738J5705J7559L992r675j2203q461q370q540K896J7443J7537
1064A5086M475k961m060q487j5329j2469J495J3966J3321P470N180L109p410j8701
1078e315j4932k65P359O465Q832J4010Q355p052j6797j1774m118j744J107J0842
1092e027J7127J0991l640j3182p817o309j1928l725J3845J6696Q891K864l076
1105A5710p253j0319j5783q463J1994J4612M947Q214Q228n576j2978j5077j0639
1118b2383N618J0321K013J2334J7276m863j4869p755j1268o902O257M008J0447
1131B34K2614M53j6928n98m580k1014l165J0251O598J8189J0497j2449o85K823
$$ plain form
1145 12240 -12440 -26402 -12805 -9246 -2985 17857 17596 11344 15931 -3963 -25213 -10810 -8476
1158 -8476 -18988 5934 26189 14153 14225 7936 -18930 -14171 -4070 -24526 -12092 24928 18062
1171 18062 9625 19579 -3450 -20650 -5431 -16767 -22074 13940 17824 2499 25255 18321 -22224
1184 -22224 -15873 -7490 -23289 -444 16978 -3142 18248 38185 -8562 -25421 -2171 -19731
1196 -19731 -18857 16630 3247 -237 37114 15006 -21499 -447 -11805 -37719 5037 21559
1208 21559 -7500 15902 27850 -8480 932 2186 -45473 -21348 30030 2886 -1881 30886
1220 30886 3694 -6390 17667 -25967 -46921 11757 12764 -8945 31519 21364 -21411 11788
1232 11788 11520 -42566 -18139 8994 -14337 24315 46474 -18922 -16260 27834 -14998 -32289
$$ packed form
1145A2240k4680j3962J3597L559O261K0842k61o252M587j9894k1250J4403K334
1158h476j0512K4922K0255j2036P2o289k6866M759J0101k0456J2434L7020o866
1171A8062q437R954k3029j7200J5219j1336n307L6014L884j5325K2756o934m0545
1184b2224O351Q383j5799K2845J7422k0120K1390J9937m6747j6859K3250j7560
1196a9731Q74L5487j3383l484L7351k2108l6505K1052j1358k5914M2756J6522
1208B1559k9059K3402J1948l6330R412J254m7659K4125N1378k7144m767L2767
1220C0886k7192j0084K4057m3634k0954N8678J007k1709M0464j0155m2775L3199
1232A1788k68n4086K4427K7133k3331L8652K2159o5396K662M4094m2832j7291
$$ plain form
1244 -32289 2257 -18729 -2637 58575 14832 -30479 16004 3007 -35499 4345 -4527 -38272
1256 -38272 28671 50646 -10382 2737 9779 -41792 -5391 28675 -38329 -24004 48590 19514
1268 19514 2948 22351 -36486 -39893 35779 -34 -45712 19569 28077 -572 38421 4262
1280 4262 -64194 -4697 25809 -28700 1573 26059 -20121 23631 59054 -34904 -52113 10520
1292 10520 -10782 -4019 38694 -18651 -24796 64009 25958 -51570 -14870 -12665 -26776 42532
1304 42532 27024 -44293 14831 50471 -17498 -11302 -3609 -59604 -2901 67145 -4360 -23508
1316 -23508 30390 -1532 -4040 31197 -46588 -68095 42891 43904 -15489 16118 1504 -28851
1328 -28851 37511 15907 -76263 -20779 41679 2560 24449 31469 -46719 -13933 51452 -21988
$$ packed form
1244c2289L4546k0986J6092O1212m3743m5311M6483j2997l8506L9844q872l3745
1256c8272O6943K1975o1028J3119P042n1571L6401L4066o7004J4325P2594k9076
1268A9514j6566J9403n8837l407P5672l5813m5678O5281Q508k8649L8993l4159
1280D262o8456N9497L0506n4509L0273K4486m6180M3752L5423r3958j7209O2633
1292A0520k1302O763M2713n7345o145Q8805l8051p7528L6700K205j4111O9308
1304D2532j5508p1317N9124L5640o7969O196P693n5995N6703P0046p1505j9148
1316b3508N3898l1922k508L5237p7785k1507J10986J013n9393L1607j4614l0355
1328b8851O6362k1604r2170N5484O2458l9119K1889P020p8188L2786O5385p3440
$$ plain form
1340 -21988 -48920 7697 -8655 13040 73567 -6806 -64229 20465 23254 -32145 -2231 -14650
1352 -14650 -33136 61036 62201 -45856 -25749 18872 -23204 1611 20373 -50154 -10895 75689
1364 75689 17848 -24485 4827 -35200 -27447 50183 -1914 -58481 24006 47039 3361 20040
1376 20040 -19187 -70470 15956 49757 -34722 -18749 31165 1188 25044 36346 -57670 -51976
1388 -51976 36057 7857 -15054 26309 -9801 -14841 60542 12894 -69328 -17679 9611 -8925
1400 -8925 37214 17863 -47331 18702 59044 -26687 -38289 -5168 -29867 14156 60257 -17489
1412 -17489 -31076 40331 9043 -24401 7877 -33295 -43749 50864 43713 -26549 4466 11016
1424 11016 -23575 19624 7281 -68387 -11416 59876 10452 300 16750 -32065 -9471 40585
$$ packed form
1340b1988k6932N6617j6352K1695O0527q0373n7423Q4694K789n5399K9914j2419
1352a4650j8486R4172J165j08057K0107M4621m2076K4815J8762p0527L9259Q6584
1364G5689n7841m2333K9312m0027P753P7630n2097n6567Q2487K3033m3678J6679
1376B0040l9227n1283Q6426L3801q4479J5973M9914k9977K3856J1302r4016N694
1388e1976Q8033k8200k2911M1363l6110n040P5383m7648q2222N1649K7290j8536
1400h925M6139j9351o5194O6033M0342q5731j1602L3121k4699M4023M6101p7746
1412a7489j3587P1407l1288l3444L2278m1172j0454R4613p151p0262L1015O550
1424A1016l4591M3199j2343p5668N6971P1292m9424j0152J6450m8815K2594N0056
$$ plain form
1436 40585 -27898 -51937 23590 20112 4028 41463 -6177 -51605 16390 20225 -36985 -5397
1448 -5397 9357 -14816 41496 47028 -43675 -32263 21621 -12875 -11039 16910 -24430 -1623
1460 -1623 64703 9516 -40915 794 -11761 -25635 27741 6333 -35251 26083 41791 -12589
1472 -12589 -694 -7324 -50589 4185 43844 -19377 -15209 33944 5448 3226 18058 -43852
1484 -43852 -42844 34907 15426 -18687 21816 9679 -13587 29365 3399 -56171 -10274 19526
1496 19526 -8641 21924 26753 -28516 1073 37833 -22534 -35975 1995 -11620 9180 48810
1508 48810 -6275 -30772 26230 8933 -31305 -3150 -10587 -22632 37258 36304 -21326 260
1520 260 12767 -24970 -2918 10192 -36296 -7223 47082 12677 -4759 10883 -23398 -18607
$$ packed form
1436D0585o8483k4039P5527l478j6084L7435m7640m5428O7995L835n7210L1588
1448e397J4754k4173N6312N532r0703J1412N3884l4496J836K7949m1340K2807
1460a623O6326n5187n0431M1709j2555j3874N3376k1408m1584O1334J5708n4380
1472a2589J1895o630m3265N4774L9659o3221M168M9153k8496k222J4832o1910
1484d3852J008P7751j9481l4113M0503j2137k3266M2952k5966n9570M5897K9800
1496A9526k8167L0565M829n5269K9589L6760o0367j3441L7970j3615K0800L9630
1508D8810n5085k4497N7002j7297m0238K8155p437j2045N9890r54n7630K1586
1520B60J2507l7737K2052J3110m6488K9073N4305l4405j7436J5642l4281M791
$$ plain form
1532 -18607 24843 -12828 -36801 21765 28523 1518 18666 -5421 -38411 5803 14028 -27977
1544 -27977 -2426 22782 -1875 19096 27972 -30037 -28639 11768 -8699 -9044 18521 -5638 -873
1557 -873 42145 5465 -37971 -7103 -2451 -14679 16477 8504 -16699 22780 29162 -19258 -14271
1570 -14271 -2829 -25803 526 27870 -5273 -2674 26003 439 -9906 3963 -26416 -26327 24098
1583 24098 16784 -8022 14486 10424 -8940 7779 -7829 -36815 -1487 21960 -1175 9670
1595 9670 18839 -9234 -3209 8694 -22162 -20364 8713 1662 7153 27963 1143 -16375 7611
1608 7611 -2397 -23539 -5147 -354 -1180 25410 18568 -13394 -1661 5614 -18369 -12401 1465
1621 1465 -6848 8727 25828 3296 -4364 4847 -14173 -17793 3792 -3083 -6991 17799 17490 1929
$$ packed form
1532a8607M3450l7671k3973N8566O758k7005J7148k4087l2990M4214Q225m2005
1544b7977K5551K5208k4657K0971Q876n8009J398M0407k0467l45K7565k4159M765
1557h73M3018l6680m3436L0868M652j2228L1156p973k5203L9479O382m8420M987
1570a4271J1442k2974K6329K7344l3143K599K8677k5564j0345J3869l0379Q9N0425
1583B4098p314k4806K2508m062j9364J6719j5608k8986L5328K3447k3135J0845
1595I670R169k8073O025J1903l0856J798K9077p051N491K0810k6820j7518K3986
1608G611j0008k1142J8392M793q26K6590o842l1962J1733P275k3983N968J3866
1621A465q313J5575J7101k2532p660R211j9020l620K1585o875l908K4790l09j5561
$$ plain form
1635 1929 3899 -8457 -21074 -2166 1911 -11043 5802 20901 7767 4921 1501 -16471 -12470
1648 -12470 -451 -8496 -1194 17507 9880 3125 9270 -4066 -17340 -8762 -5991 -3944 11480
1661 11480 11166 2784 10377 6477 -13871 -14758 -6555 -6365 2563 10869 6478 9774 10677 -6175 -13647
1676 -13647 -6904 -8466 -6309 6871 10713 9540 9945 685 -8610 -6678 -8981 -12451 373 11651
1690 11651 9640 8368 6077 -2126 -6755 -9886 -13315 -5118 7219 8569 7938 10494 4770 -4644 -10488
1705 -10488 -12319 -7878 613 4658 7457 12549 9813 -1446 -8255 -9108 -9191 -5838 -322 6418 12596
1720 12596 11774 2435 -4345 -6308 -9386 -10735 -4755 4866 10704 10653 6699 2349 -2441 -9374 -12835
1735 -12835 -8123 1076 6380 8366 9252 7623 1426 -7715 -12436 -8840 -2969 1115 5573 10637 11021
$$ packed form
1635A929J970j2356j2617J8908M077j2954J6845J5099j3134k846l420j7972M001
1648a2470J2019q045P302J8701p627o755O145j3336j3274Q578K771K047J5424
1661A1480l14q382P593l900k0348q87Q203J90Q928Q306m391L296R03j6852p472
1676a3647O743j562K157J3180L842j173M05r260r295J932k303l470J2824J1278
1690A1651k011j272k291q203m629l131l429Q197J2337J350o31K556n724r414n844
1705a0488j831M441Q491M045K799N092k736j1259o809q53q3L353N516O740O178
1720A2596q22r339o780j963l078j349N980R621N838n1l954m350m790o933l461
1735a2835M712R199N304J986Q86j629o197r141m721L596N871M084M458N064L84
$$ plain form
1750 11021 3960 -4699 -9163 -9056 -7491 -3897 2659 10862 12404 6207 -486 -4409 -8162 -10623 -8585
1765 -8585 -651 8389 10920 7566 4889 1292 -6232 -12089 -9787 -3691 3422 7922 8113 8317 5857
1780 5857 -3538 -11793 -9842 -5096 -2301 3559 9040 10456 8590 609 -8787 -8928 -6875 -7706 -1789
1795 -1789 8196 10557 8517 4909 -2411 -6492 -7523 -10883 -5989 6870 9291 5872 7890 4358 -4738
1810 -4738 -7952 -10332 -9907 2088 8546 4523 8539 10537 -1500 -7938 -7126 -10196 -6091 4143 4779
1825 4779 8222 13760 2462 -7595 -3216 -7085 -12712 -2168 4553 6177 13335 7813 -5548 -2106
1839 -2106 -1934 -14263 -8623 4453 2720 8294 14413 1517 -3928 -583 -11426 -12775 2864 932
1853 932 -1137 14860 12504 -2123 -1506 -7402 -14328 -476 2063 -7291 7979 18637 2325 -1490
$$ packed form
1750A1021p061q659m464J07J565L594O556Q203J542o197o693l923l753k461K038
1765h585P934R040K531l354k677l597p524n857K302O096P113M500J91K04k460
1780E857r395q255J951M746K795N860N481J416j866p981r396j41K053q31N917
1795a789R985K361k040l608p320m081j031l360M894J2859K421l419K018l532r096
1810d738l214k380M25J1995O458m023M016J998j2037o438Q12l070M105J0234O36
1825D779L443N538j1298j0057M379l869n627J0544O721J624P158n522j3361L442
1839b106J72j2329N640J3076j733N574O119j2896n445L345j0843j349J5639j932
1853I32k069J5997k356j4627O17n896o926J3852K539r354J5270J0658j6312l815
$$ plain form
1867 -1490 -778 -14670 -9094 4403 -4708 -766 17013 6971 -1053 7660 -7775 -20268 -1598
1880 -1598 2560 -3722 10094 9587 -1628 10922 6088 -21052 -13507 3477 -3213 3893 13065 -1798
1894 -1798 3298 15037 -8937 -18608 -1228 -5816 -4663 17908 8580 -6657 9717 5623 -13122
1907 -13122 -4651 -6871 -17020 10823 23013 -3127 -1941 9825 -5746 -5011 -134 -20179 -8605
1920 -8605 23234 9890 -3445 9159 -2942 -11602 6690 -5603 -22083 5371 15574 3065
1932 3065 13894 4348 -21784 -1842 11824 -15820 -12434 9110 3476 13707 20603 -15088 -19888
1945 -19888 10641 -1406 -15631 3550 -272 -534 26525 10888 -21866 -5773 1197 -12622 6008
1958 6008 6993 -15889 8638 29893 -2099 -13236 -4481 -17246 -1433 21067 -8433 -14984 22490
$$ packed form
1867a490P12j3892N576J3497r111L942J7779j0042q024Q713j5435j2493J8670
1880a598M158o282J3816n07j1215J2550m834k7140P545J6984o690P106R172j4863
1894a798N096J1739k3974r671J7380m588J153K2571r328j5237J6374m094j8745
1907a3122Q471k220j0149K7843J2190k6140J186J1766j5571P35M877k0045J1574
1920h605L1839j3344j3335J2604j2101q660J8292j2293j6480K7454J0203j2509
1932C065J0829r546k6132J9942J3666k7644L386K1544n634J0231O896l5691m800
1945a9888L0529j2047j4225J9181l822k62K7059j5637l2754J6093O970j3819J8630
1958F008R85k2882K4527K1255l1992j1137Q755j2765J5813K2500k9500o551L7474
$$ plain form
1971 22490 16274 -6001 204 -16169 -22550 15434 14485 -15275 3754 15421 -2346 8871 3839
1984 3839 -32424 -13719 21113 3583 -1044 10744 -7488 1167 23720 -12875 -34786 2446
1996 2446 10699 1873 17102 -178 -17402 16539 15187 -25516 -14424 2545 -6916 16553 24788
2009 24788 -16411 -10914 18660 -3686 -12756 337 -18145 -5203 36934 11592 -21173 2796
2021 2796 3485 -10171 7743 -7794 -28626 15441 32549 -4857 -2724 3676 -19281 801 16898
2034 16898 -21556 -16128 22666 9952 3780 15545 -19021 -25131 19369 6979 -23039 3054
2046 3054 9459 592 24899 5971 -36288 -6547 18028 -10745 -2677 10958 -10960 9684 31451
2059 31451 -13395 -26009 4747 -6584 -5653 22429 -4933 -18196 25940 18032 -19149 -5552
$$ packed form
1971B2490o216k2275O205j6373o381L7984r49k9760J9029J1667j7767J1217n032
1984C839l6263J8705L4832j7530m627J1788j8232Q655K2553l6595k1911L7232
1996B446Q253q826J5229j7280j7224L3941j352m0703J1092J6969r461K3469Q235
2009B4788m1199N497K9574k2346r070J3093j8482J2942M2137k5342l2765K3969
2021B796O89j3656J7914j5537k0832M4067J7108l7406K133O400k2957K0082J6097
2034A6898l8454N428L8794j2714o172J1765l4566o110M4500j2390l0018K6093
2046C054O405q867K4307j8928m2259K9741K4575k8773Q068J3635k1918K0644K1767
2059C1451m4846j2614L0756j1331R31K8082k7362j3263M4136p908l7181J3597
$$ plain form
2071 -5552 -8647 -19852 19861 20634 -22342 -255 24964 -5153 -4319 2447 -28961 -8727 31051
2084 31051 1251 -10908 16403 -1940 -8665 18999 -11222 -35017 10007 18571 -4180 14382
2096 14382 3817 -22541 12678 18200 -30186 -15836 14775 -2152 11790 23474 -19646 -14392
2108 -14392 22404 -6344 -21046 7695 -6037 -6598 33845 10686 -26031 2963 5099 -16792
2120 -16792 7336 1994 -25904 14350 35248 -9348 -10140 5238 -17956 -1870 19671 -18450
2132 -18450 -15348 28978 10393 -7531 10792 -14312 -25408 17928 9045 -21553 7588 14265
2144 14265 -5708 17199 7065 -36401 -8310 21421 -7718 -2964 13986 -9391 5663 28336
2156 28336 -16445 -28992 9073 -74 -6339 20664 -988 -16718 22012 12179 -23595 -4367
$$ packed form
2071e552l095j1205L9713P73m2976K2087K5219l0117Q34O766l1408K0234L9778
2084C1051k9800j2159K7311j8343o725K7664l0221k3795M5024Q564k2751J8562
2096A4382j0565k6358L5219N522m8386J4350L0611j6927J3942J1684m3120N254
2108a4392L6796k8748j4702K8741j3732n61M0443k3159l6717K8994K136k1891
2120a6792K4128n342k7898M0254K0898m4596p92J5378k3194J6086K1541l8121
2132a8450L102M4326j8585j7924J8323k5104j1096M3336q883l0598K9141O677
2144A4265j9973K2907j0134m3466K8091K9731k9139M754J6950k3377J5054K2673
2156B8336m4781j2547L8065r147o265K7003k1652j5730L8730r833l5774J9228
$$ plain form
2168 -4367 -2399 -16848 18889 22720 -19516 -2254 21418 -7653 -7456 2082 -24282 -4104 33026
2181 33026 1353 -14014 14024 -245 -10664 11635 -11148 -26553 15463 18558 -6684 9553
2193 9553 4115 -20338 6711 12060 -24918 -9727 16852 1534 9202 16189 -19141 -12971 18633
2206 18633 -6236 -19853 6877 1743 440 24556 1685 -22974 4332 4850 -15627 3175 4650
2219 4650 -12708 14484 23268 -11854 -9693 2823 -13137 -714 13595 -11917 -5253 25243 6454
2232 6454 -10682 1499 -11439 -12990 13704 2342 -13543 12307 14041 -5894 4307 -1315 -22358
2245 -22358 -1394 12468 -6286 1721 12448 -3928 3110 11649 -16206 -17558 8172 2141 -1891
2258 -1891 11999 384 -4507 13521 -1007 -20193 -2491 2760 -5130 10154 10516 -6905 3632
$$ packed form
2168d367J968j4449L5737L831m2236J7262K3672k9071J97R538k6364K0178L7130
2181C3026l1673j5367K8038j4269j0419K2299k2783j5405M2016L095k5242J6237
2193I553n438k4453K7049N349l6978J5191K6579j5318P668O987l5330O170L1604
2206A8633k4869j3617K6730n134j303K4116k2871k4659K7306N18k0477J8802J475
2219D650j7358K7192Q784l5122K161J2516j5960J2423J4309k5512O664L0496j8789
2232F454j7136J2181j2938j551K6694j1362j5885K5850J734j9935J0201n622k1043
2245b2358K0964J3862j8754Q007J0727j6376P038Q539k7855j352K5730o031m032
2258a891J3890j1615m891J8028j4528j9186J7702N251p890J5284L62j7421J0537
$$ plain form
2271 3632 8192 -11214 -7794 690 -8947 2349 17346 1099 -4426 7031 -2291 -8789 161 -7735
2285 -7735 -7301 13622 9985 -3736 4099 2373 -9474 -2368 -1722 -10259 2491 11649 1509 4419
2299 4419 6697 -7901 -7481 1880 -6086 -6319 6438 5051 4050 9679 -2044 -10385 -234 -1816
2313 -1816 -8420 1359 5895 2807 7972 4767 -6811 -3854 -1818 -8500 -2601 6422 2274 3886 8574
2328 8574 431 -4983 -3449 -7803 -5640 4255 3154 586 8070 6249 -2757 -3856 -5415 -7045 -567
2343 -567 2764 755 6081 8004 -41 -3350 -2609 -6696 -5440 187 1888 4838 7680 2632 -1410
2358 -1410 -396 -4560 -8126 -3207 1677 3379 6064 5111 1472 927 -2847 -7989 -5423 -4 1474
2373 1474 3485 6143 4755 1491 -1965 -5996 -5711 -2458 -1026 1377 6235 6864 3019 -640 -3432
$$ packed form
2271C632M560j9406L420Q484r637J1296J4997j6247n525J1457r322o498Q950p896
2285g735M34K0923l637j3721P835j726j1847P106O46q537J2750R158j0140K910
2299D419K278j4598M20R361p966k33J2757j387j001N629j1723q341J0151j582
2313a816o604R779M536l088N165l205j1578K957K036o682N899R023m148J612M688
2328H574q143n414J534m354K163R895j101k568P484j821r006j099j559j630O478
2343e67L331k009N326J923q045l309P41m087J256N627J701K950K842n048m042
2358a410J014m164l566M919M884J702K685r53l639n45l774n142K566N419J478
2373A474K011K658j388l264l456m031K85L253J432K403M858O29l845l659k792
$$ plain form
2388 -3432 -5071 -4635 -3818 -609 4898 6909 4037 1296 -223 -3551 -5929 -5255 -1840 2646 5470 4798
2404 4798 3432 1965 -1823 -6380 -6179 -2594 723 2697 4548 5611 4033 -541 -4934 -5697 -3972
2419 -3972 -2472 130 3975 6250 5407 1261 -2495 -4005 -4366 -4850 -2490 2594 5863 5073 2748 367
2435 367 -2172 -4752 -5895 -3559 708 4346 4335 4279 3383 -64 -4144 -6375 -4952 -1065 1774 3093
2451 3093 5371 5828 1851 -3310 -4766 -4698 -3718 -1064 1829 4721 6709 3468 -1414 -3042 -3776 -5482
2467 -5482 -3517 1048 4246 5175 4563 1438 -1027 -3013 -6723 -5973 -206 2843 3481 4842 4012 1134
2483 1134 -1093 -5279 -6886 -1806 1092 728 4569 6627 1989 -505 -2695 -5765 -4513 -1123 -661
2498 -661 3380 7928 3643 -828 -147 -2708 -6213 -4011 -1892 1237 7175 5638 217 930 -203 -6118
$$ packed form
2388c432j639M36Q17L209N507K011k872k741j519l328k378O74L415M486K824o72
2404D798j366j467l788m557K01L585L317J974J851J063j578m574m393p63J725
2419c972J500K602L845K275q43m146l756j510l61m84K360N084L269p90k325k381
2435C67k539k580j143K336M267L638j1n6q96l447m080k231J423L887K839J319
2451C093K278M57l977n161j456O8R80K654K893K892J988l241m882j628p34j706
2467e482J965M565L198R29o12l125k465j986l710P50N767L049O38J361q30k878
2483A134k227m186j607N080K898l64L841K058m638k494k190l070J252L390M62
2498f61M041M548m285m471O81k561l505K202K119L129N938j537n421P13j133n915
$$ plain form
2514 -6118 -5151 -2071 -1651 3256 7225 3225 1510 1409 -5366 -6316 -482 -2186 -2437 5456 6931 3335
2530 3335 2385 -2995 -7543 -1569 -634 -4809 1501 7756 4309 3691 1578 -6297 -5356 -530 -4007 -1844
2546 -1844 6076 3026 2237 6790 -602 -8677 -3573 -2315 -2584 4456 3441 -1248 6979 6735 -6460
2561 -6460 -7229 -2550 -4481 1226 6130 -668 1786 8889 -45 -5959 -2116 -6777 -5696 6872 5309
2576 5309 -1168 4764 3731 -3158 563 -4109 -12461 611 10484 1423 1285 4814 -2526 -309 2401
2591 2401 -10870 -9187 6875 4932 1476 7528 -434 -6270 3942 -733 -11363 -1912 3155 443
2605 443 10611 7285 -9758 -2944 5723 -5718 -6091 659 -3647 5871 16056 -1982 -9562 3230
2619 3230 -1924 -6896 2796 -2755 -5780 12880 10917 -5891 -1109 -2044 -10432 2753 6158 -10284
$$ packed form
2514f118R67L080M20M907L969m000j715j01o775r50N834j704k51P893J475l596
2530C335r50n380m548N974R35m175O310O255l447o18k113p875R41M826l477K163
2546a844P920l050p89M553p392q075N104J258k69P040j015m689Q227k44j3195
2561f460p69M679j931N707M904o798K454P103q934n914L843m661J081J2568j563
2576E309o477N932j033o889L721m672q352J3072R873r061j38L529p340K217K710
2591B401j3271J683J6062j943l456O052p962n836J0212m675j0630R451N067k712
2605D43J0168l326j7043O814Q667j1441l73O750m306R518J0185j8038p580J2792
2619C230n154m972R692n551l025J8660j963j6808M782r35q388J3185L405j6442
$$ plain form
2633 -10284 -456 14185 3083 -283 1137 -13217 -6232 11592 -2098 -9116 8131 6229 -18
2646 -18 7960 -5525 -17025 3198 6956 -6933 3983 6772 -5102 7519 9805 -14703 -10921
2659 -10921 5139 -2299 2192 10819 -6560 -3579 16260 -271 -15420 -1129 -2619 -3851 14292
2672 14292 4657 -12017 7036 9376 -9949 -2257 -777 -14286 5585 18212 -4973 -3952 8460
2685 8460 -5667 -3058 7519 -13940 -12537 16808 8521 -5056 6853 -2991 -10418 10249 463
2698 463 -19314 2810 12259 -2575 8499 6981 -16641 -2111 11943 -10435 -7549 8466 -4215
2711 -4215 4163 19808 -7776 -17081 8174 459 -9453 6892 -2279 -8695 19092 11308 -16553
2724 -16553 -2350 2990 -11708 4916 9168 -13910 1811 19450 -3866 -5182 4393 -15109 -6593
$$ packed form
2633a0284R828J4641j1102l366J420j4354O985J7824j3690p018J7247j902o247
2646a8P978j3485j1500K0223L758j3889J0916K789j1874J2621K286k4508L782
2659a0921J6060p438M491Q627j7379K981J9839j6531j5149J4291j490j232J8143
2672A4292r635j6674J9053K340j9325P692J480j3509J9871J2627k3185J021J2412
2685H460j4127K609J0577k1459J403K9345q287j3577J1909r844p427K0667r786
2698D63j9777K2124R449j4834J1074j518k3622J4530J4054k2378K886J6015j2681
2711d215Q378J5645k7584r305K5255p715r912J6345r171o416K7787p784k7861
2724a6553J4203N340j4698J6624M252k3078J5721J7639k3316j316R575j9502Q516
$$ plain form
2737 -6593 18426 -2037 -12019 12477 5501 -4426 9378 -7970 -21787 9713 12173 -10442 4089
2750 4089 8425 -8466 7458 9657 -20850 -9384 12252 -3185 1859 14194 -9727 -6782 18062
2763 18062 -3519 -17912 2832 -1622 -3346 19546 3055 -17783 7883 10260 -12986 -1770
2775 -1770 312 -13702 10524 20046 -10549 -5382 10140 -8475 -3739 9238 -14069 -9781 20685
2788 20685 6771 -7254 6706 -6393 -11660 13754 784 -20645 5554 14598 -2441 7414
2800 7414 2116 -19389 1465 13720 -12131 -6661 10970 -2444 4458 16468 -11742 -16097 9521
2813 9521 451 -7420 8340 -2831 -7347 19205 7772 -19135 -3678 3153 -7574 7994 6404
2826 6404 -14224 5013 18510 -6672 -8217 1538 -11607 -1026 16860 -4581 -9167 12709 3242
$$ packed form
2737f593K5019k0463r982K4496o976r927J3804j7348j3817L1500K460k2615J4531
2750D089M336j6891J5924K199l0507J1466K1636j5437N044J2335k3921K945K4844
2763A8062k1581j4393K0744m454j724K2892j6491k0838K5666K377k3246J1216
2775a770K082j4014K4226R522l0595N167J5522j8615M736J2977k3307M288L0466
2788B0685j3914j4025J3960j3099n267K5414j2970k1429K6199R044j7039R855
2800G414n298k1505K0854J2255k5851N470J7631j3414O902J2010k8210m355K5618
2813I521r070p871J5760j1171m516K6552j1433k6907J5457O831j0727J5568j590
2826F404k0628J9237J3497k5182j545R755j3145J0581J7886k1441m586K1876r467
$$ plain form
2839 3242 -5506 5535 -9727 -16088 12468 10969 -9084 3064 5416 -5799 7294 2702 -19975
2852 -19975 -3828 14475 -1079 707 7960 -7429 -1357 12018 -8343 -14213 5402 1565 -114
2865 -114 13585 -853 -12266 7188 5041 -11362 -1904 234 -5497 12150 12074 -10968 -4100 7524
2879 7524 -5251 -3932 2982 -8330 108 16334 1274 -7207 3117 -3755 -6824 6294 -2123
2892 -2123 -9799 8117 10423 -2122 2016 -1587 -11432 2335 6450 -8688 -2374 9550 2241 2551
2906 2551 4324 -9866 -6982 6592 -1608 -5176 6145 2238 -687 8422 -628 -11493 -1118 1436
2920 1436 -3940 4252 3961 -4106 5165 7714 -6792 -6876 -173 -3689 1767 7078 -2326 -842 8674
2935 8674 -366 -6703 -874 -3784 -4237 6331 4035 -2297 4265 2907 -4569 -618 -1508 -8115 479
$$ packed form
2839C242q748J1041j5262o361K8556j499k0053J2148K352j1215J3093m592k2677
2852a9975J6147J8303j5554J786P253j5389O072J3375k0361n870J9615l837j679
2865a14J3699j4438j1413J9454k147j6403R458K138n731J7647p6k3042O868J1624
2879G524j2775J319O914j1312Q438J6226j5060q481J0324o872l069J3118q417
2892b123p676J7916K306j2545M138l603r845J3767M115j5138O314J1924p309L10
2906B551J773j4190K884J3574q200l568J1321l907k925R109r050j0865J0375K554
2920A436n376Q192k91q067R271K549j4506q4O703l516N456N311r404J484R516
2935H674r040o337N829k910m53J0568k296o332O562j358p476L951q90o607Q594
$$ plain form
2950 479 7603 1095 1339 3742 -2474 -1644 1145 -6439 -5313 4538 3357 973 4628 720 -3202 535
2966 535 -2352 -5865 184 2484 535 5014 4581 -3248 -1980 143 -4117 -2694 1366 -149 3116
2981 3116 6777 -52 -3438 -133 -2514 -4403 -267 300 697 5288 3463 -1266 -390 -1815 -5108 -1880
2997 -1880 1255 29 2415 4199 1276 480 -893 -4833 -3701 1004 -22 102 3937 3554 901 25
3013 25 -2741 -4393 -1423 -380 -548 2858 4486 1705 487 -626 -3271 -3311 -1532 -1255 2055 4064
3029 4064 2132 847 1063 -1279 -3840 -2828 -1382 584 2893 2651 1813 2154 -111 -3563 -3402 -1810
3045 -1810 -765 978 3059 3196 2382 456 -2077 -2742 -2232 -2114 -1013 2045 3638 2885 931 -828
3061 -828 -2051 -2215 -2891 -1795 1148 3133 2890 1942 1005 -799 -2666 -3597 -2771 -364 1827 2246 2663
$$ packed form
2950D79P124o508K44K403o216Q30K789p584J126R851j181k384L655l908l922L737
2966E35k887l513O049K300j949M479m33p829J268K123m260J423M060j515L265
2981C116L661o829l386L305k381j889M136N67L97M591j825m729Q76j425l293L228
2997a880L135j226K386J784k923p96j373l940J132M705j026J24L835l83k653q76
3013B5k766j652K970J043j68L406J628k781j218j113k645m0J779K77L310K009
3029D064j932j285K16k342k561J012J446J966K309k42q38L41k265l452J61J592
3045a810J045J743K081J37q14j926k533o65N10J18J101L058J593p53j954j759
3061h28j223j64o76J096K943J985k43r48r37j804j867r31Q26K407K191M19M17
$$ plain form
3078 2663 2696 675 -2285 -3160 -2698 -1299 61 1445 2825 3265 1394 -1021 -2575 -2640 -2041 -1313 692
3095 692 2792 3300 1984 70 -1090 -2150 -3012 -2924 -159 2208 2710 2140 1494 143 -1471 -3052 -3306
3112 -3306 -1101 1120 2075 2476 2774 1436 -896 -2682 -2955 -1688 -300 521 2187 3419 2599 -27
3128 -27 -1852 -2271 -2542 -1682 -489 1379 3343 2652 642 -343 -1582 -2915 -2929 -1055 920 2215 2780
3145 2780 2038 659 87 -2662 -3849 -1673 -14 1182 2272 2589 1771 770 -1938 -3617 -2280 -693
3161 -693 -552 1822 3307 2266 1370 -52 -2774 -2685 -1826 -1830 441 3800 2667 540 1098 -438 -2861
3178 -2861 -2233 -2462 -1237 2656 3486 1003 1319 976 -2293 -2527 -1929 -2510 91 3366 1942 2176 2307
3195 2307 -1793 -3270 -422 -1987 -2789 1501 2403 2186 3613 76 -3849 -816 -293 -3689 -713 2721
$$ packed form
3078B663L3k021k960q75M62J399J360J384J380M40j871k415j554o5N99P28K005
3095F92K100N08j316j914j160j060q62Q8K765K367N02n70o46j351j614j581k54
3112c306K205K221R55M01K98j338k332j786k73J267J388Q21J666J232q20k626
3128b7j825m19k71Q60J193J868J964o91k010r85j239j333j4J874J975J295N65
3145B780p42j379n72k749j187K176J659J196J090L17q18j001k708j679J337J587
3161f93J41K374J485j041q96j422k722Q9Q59mK271L359j133k127N58j536k423
3178b861O28k29J225L893Q30k483L16l43l269k34N98n81K601L275j424K34J31
3195B307m100j477K848j565q02M290R02k17J427l537l925L033N23l396K976L434
$$ plain form
3211 2721 1360 3018 3212 -2346 -2897 -508 -3181 -1832 2785 575 585 4891 1547 -3267 -1406 -2769
3227 -2769 -3046 2354 1413 -1855 3616 4989 -1680 -1643 -1372 -4675 -209 3510 -975 586 5261 321
3243 321 -1319 1072 -4313 -5071 2787 1691 -556 3704 1662 -1877 2861 -857 -7800 -1526 3356
3258 3356 -112 2677 3742 -2545 1089 3439 -5432 -5243 1873 -992 623 6863 30 -3640 3390
3273 3390 -491 -5459 250 -1386 -3424 6889 6026 -4106 -258 2036 -4097 -881 920 -5982 1086
3288 1086 9117 6 -2053 2653 -3707 -3585 3742 -3215 -5123 5856 4062 -1120 4457 -1503 -8247
3303 -8247 2396 3263 -6144 492 4990 -877 4406 4242 -8509 -4270 4978 -2895 -2757 5065 -1202
3318 -1202 83 8878 -1569 -8031 1705 -1023 -4229 5820 2056 -5663 5716 6089 -6045 -2284
$$ packed form
3211B721j361J658J94n558n51K389k673J349M617k210J0M306l344m814J861j363
3227b769k77N400r41l268N471J373o669L7K71l303M466L719m485J561M675m940
3243C21j640K391n385p58P858j096k247M260k042l539M738l718o943O274M882
3258C356l468K789J065o287L634K350q871J89P116k865J615O240o833l670P030
3273C390l881m968N709j636k038J0313q63j0132L848K294o133L216J801o902P068
3288A086Q031r111k059M706o360J22P327o957j908J0979j794n182N577n960o744
3303h247J0643Q67r407O636M498n867N283j64j2751M239R248p873J38P822o267
3318a202J285Q795j0447o462R736k728l206J0049l764p719J1379L73j2134L761
$$ plain form
3332 -2284 -135 -6881 3136 8078 -5024 -1577 8199 -1060 -3421 2009 -6992 -5105 9033 2048
3346 2048 -4408 5196 1016 -4861 4787 -1051 -11065 1725 6767 -2150 3797 4064 -7195 1404
3360 1404 6718 -8376 -6108 5306 -454 1753 8708 -4371 -6392 6902 -677 -8010 2541 -403
3374 -403 -3704 9617 5198 -8611 386 3213 -6277 1438 2805 -8215 2689 12153 -2484 -4055
3388 -4055 2884 -5799 -2138 7700 -4813 -6541 9496 4344 -3439 3831 -3367 -9482 5554 4239
3402 4239 -7748 1975 5655 -2773 5058 4123 -12225 -4049 8104 -2223 -1501 5061 -3597 476
3416 476 10792 -4165 -11322 3011 869 -2525 7184 187 -6904 7399 6092 -8916 -2404 143
3430 143 -5896 5779 8797 -7060 -2113 8278 -1801 -2911 1426 -8362 -2705 12474 1462 -6428
$$ packed form
3332b284K149o746J0017M942j3102L447R776r259k361N430r001J887J4138o985
3346B048o456R604m180n877R648n838j0014J2790N042q917N947K67j1259Q599
3360A404N314j5094K268J1414n760K207O955j3079k021J3294p579p333J0551k944
3374d03l301J3321m419j3809Q997K827r490P715J367j1020J0904R464j4637j571
3388d055O939q683L661R838j2513j728J6037n152p783P270p198o115J5036j315
3402D239j1987R723L680q428P831r35j6348Q176J2153j0327P22O562q658M073
3416D76J0316j4957p157J4333k142l394R709o997p091J4303j307j5008O512K547
3430A43o039J1675L018j5857M947J0391j0079j110M337r788N657J5179j1012p890
$$ plain form
3444 -6428 4350 514 -3633 5018 -3296 -11263 5298 8157 -2676 2366 1275 -7578 2817 5945
3458 5945 -9251 -5123 6355 1132 3133 6319 -7490 -5931 8232 -699 -7869 1734 404 -322
3472 -322 10242 1034 -10372 840 4009 -4782 621 1457 -6020 5265 10174 -4441 -5275 1323
3486 1323 -4192 218 6132 -5382 -4363 9764 4197 -4062 -199 -4186 -5115 6878 2517 -7552
3500 -7552 2536 6635 -1249 1761 -135 -9527 -539 7421 -2039 -1954 4239 -1172 1572 6129 -6061
3515 -6061 -9036 3520 2735 -863 3831 -798 -3061 6681 2200 -8880 -2525 2021 -1214 4256 4192
3530 4192 -5175 166 5800 -2579 -4184 153 -3508 559 8474 -52 -4518 2853 845 -2584 884
3545 884 -3347 -5218 6037 6343 -2379 -271 1170 -3185 901 914 -6224 -932 6489 1094 106 2551
$$ packed form
3444f428J0778l836m147Q651q314p967J6561K859j0833N042j091q853J0395L128
3458E945j5196M128J1478n223K001L186j3809J559J4163q931p170R603j330p26
3472c22J0564r208j1406J1212L169q791N403Q36p477J1285M909j4615q34O598
3486A323n515M410N914j1514J019J4127n567q259L863l987r29J1993m361j0069
3500g552J0088M099p884L010j896r392Q988P960r460Q5O193n411K744M557j2190
3515f061k975J2556p85l598M694m629k263R742m481j1080O355M546l235N470o4
3530D192r367N341N634q379j605M337l661M067P915q526m466P371k008l429L468
3545H84m231j871J1255L06q722K108J441m355M086J3p138N292P421n395r88K445
$$ plain form
3561 2551 -3798 -3146 3559 -1690 -4783 2102 2577 999 4639 -711 -6124 512 2171 -3509 -735
3576 -735 2073 -95 3657 3903 -3993 -3340 1474 -2055 -1376 2804 -530 257 5119 1008 -3547 -999
3592 -999 -1746 -2362 2851 1492 -2206 2427 3874 -1207 -1418 -1568 -3854 311 3266 -706 206 3842
3608 3842 562 -1078 103 -3125 -3402 1469 1464 188 2876 1346 -1377 957 -457 -4500 -1402 1827
3624 1827 391 2090 2141 -1119 -134 1187 -3181 -3190 570 438 729 3314 1000 -799 385 -1070 -3098
3641 -3098 -594 -96 -553 2811 2962 -15 -537 -301 -2292 -1129 -382 -1601 659 3741 1379 -469
3657 -469 279 -1387 -2064 -653 -811 -342 2220 2258 541 873 -256 -2782 -1879 -35 -570 773 1975
3674 1975 1285 1344 724 -1972 -2673 -629 -811 -332 1805 1886 1242 1209 -581 -2240 -1444 -1075 -1300 1178 2269
$$ packed form
3561B551o349O52O705n249l093O885M75j578L640n350n413O636J659n680K774
3576g35K808k168L752K46p896O53M814l529O79M180l334P87M862m111m555K548
3592i99p47o16N213j359l698M633J447n081k11j50k286M165K955l972R12L636
3608C842l280j640J181l228k77M871nj276K688j530k723K334j414m043L098L229
3624A827j436J699N1l260R85J321m368rL760j32K91K585k314j799J184j455k028
3641c098K504M98m57L364J51k977n22K36j991J163P47j219K260L082k362j848
3657d69P48j666o77J411j58M69K562L8j717L32j129k526R03J844n35J343J202
3674A975o90N9o20k696p01K044j82M79K137Q1o44l3j790j659P96L69k25K478J091
$$ plain form
3693 2269 958 1196 648 -1331 -1568 -1484 -1541 -170 1888 1432 971 1541 342 -1474 -1693 -1719 -591 873
3711 873 1398 1086 1628 1026 -961 -1652 -1318 -1365 -280 1051 1558 1757 1304 -240 -1404 -1133 -1616 -1609 58
3730 58 1348 1713 1611 674 -433 -997 -1392 -2030 -729 896 1278 1473 1392 500 -487 -1392 -2070 -1146 204
3749 204 669 1004 2028 1259 -203 -1461 -1530 -1568 -647 -101 1056 2077 1845 266 -922 -1313 -1349 -1425 -500
3768 -500 746 1650 1970 1084 144 -698 -1399 -1966 -1113 181 948 1204 1437 697 150 -1215 -2319 -1230
3786 -1230 -235 219 1175 2055 1422 835 -674 -1423 -1566 -1079 -472 330 1885 2042 805 70 -892 -1643 -1448
3805 -1448 -1216 -363 1393 1772 1235 827 212 -1305 -1654 -1242 -611 497 1420 1328 1119 1127 -614 -1973 -1417
3824 -1417 -1067 -287 1085 1138 1247 1458 187 -1557 -1293 -1205 -1015 388 1699 1202 1400 808 -942 -864 -936
$$ packed form
3693B269j311K38n48j979k37Q4n7J371K058m56m61N70j199j816k19k6J128J464
3711H73N25l12N42o02j987o91L34m7J085J331N07J99m53j544j164K71m83PJ667
3730E8J290L65j02r37j107n64l95o38J301J625L82J95q1q92r87r05o78R24J350
3749B04M65L35J024p69j462j258o9l8R21N46J157J021k32j579j188l91l6p6R25
3768e00J246R04L20q86r40q42p01n67Q53J294P67K56K33p40n47j365j104J089
3786a230R95M54R56Q80o33n87j509p49j43M87O07Q02J555J57j237p35r62p51J95
3805a448K32Q53J756L79n37m08o15j517l49M12O31J108R23r2k09Qj741j359N56
3824a417L50P80J372N3J09K11j271j744K64Q8J90J403J311m97J98n92j750P8p2
$$ plain form
3843 -936 -2227 -798 1876 1146 1048 1623 -8 -984 -655 -2032 -2189 1066 1506 578 1789 1160 -986 -643
3861 -643 -975 -2308 -592 1021 539 1508 2282 -537 -1246 -266 -1572 -1910 194 61 1189 3251 621
3878 621 -1588 210 -762 -2474 -259 426 -562 2505 2497 -743 -113 -57 -2811 -1291 1346 -1019 237
3895 237 3170 990 -337 447 -2455 -2567 1110 -88 -1424 2249 2107 -233 1174 -718 -3840 -544
3911 -544 970 -1817 1122 3246 -522 754 1900 -2801 -2973 617 -895 -118 3529 -151 -1027 2930
3927 2930 198 -3977 -580 -485 -1498 2818 2123 -1816 1660 2102 -3169 -1628 83 -2882 204 4196
3943 4196 -86 -611 2590 -1430 -1814 1528 -2284 -3239 3353 2647 -1035 1772 180 -3009 1247 277
3959 277 -4808 404 3476 -613 1414 2723 -3366 -1455 2121 -2735 -2380 2575 -342 118 4985 -725
$$ packed form
3843i36j291J429K674p30r8N75j631r76L29j377j57L255M40r28J211o29k146L43
3861f43l32j333J716J613m82R69P74k819p09R80j306l38K104j33J128K062k630
3878F21k209J798r72j712K215O85r88L067ql240O30N6k754J520K637k365J256
3895B37K933k180j327P84k902j12L677j198j336L673j42k340J407j892l122L296
3911e44J514k787K939K124l768J276J146m701j72L590j512P77L647l680q76L957
3927B930k732m175L397R5j013M316o95l939L476M42n271J541J711k965L086L992
3943D196m282n25L201m020l84L342l812r55O592p06l682K807j592l189M256r70
3959B77n085N212L072m089K027J309o089J911L576m856L55M955k917M60M867n710
$$ plain form
3975 -725 -4271 1076 113 -2991 1332 458 -2029 4238 3778 -3755 -1162 720 -3421 443 2802 -2894
3991 -2894 277 4968 -629 -1906 1450 -3648 -3165 4109 408 -2683 3065 1811 -1785 2339 -1547
4006 -1547 -6020 1588 3379 -2489 959 2957 -2066 1483 2724 -5131 -3058 2954 -575 204 4438
4021 4438 -1741 -2298 4316 -505 -5166 394 -101 -1293 4940 2060 -4689 1462 3105 -3416 -1169
4036 -1169 288 -3652 2154 6168 -1900 -2056 2727 -1733 -1604 2669 -3331 -3466 5477 2856 -2126 1548
4052 1548 -1613 -3893 3094 1166 -5879 436 4551 -67 2048 940 -5591 -623 4072 -2908 -2811
4067 -2811 3268 61 1007 5015 -2358 -5296 2386 774 -2506 2128 -267 -2272 5212 3263 -5497
4082 -5497 -2296 971 -1982 2262 2418 -4101 401 6242 -665 -3551 -58 -3217 -783 5212 -381
$$ packed form
3975g25l546N347r63l104M323q74k487O267m60p533K593J882m141L864K359n696
3991b894L171M691n597j277L356n098M83P274l701l091N748j254l596M124l886
4006a547m473P608J791n868L448J998n023L549J241p855K073O012l529P79M234
4021D438o179n57O614m821m661N560m95j192O233k880o749O151J643o521K247
4036a169J457l940N806M014q068j56M783m460J29M273o000j35Q943k621m982L674
4052A548l161k280O987j928p045O315M115m618K115j108o531M968M695o980R7
4067b811O079l207R46M008p373k938P682j612l280M634k395k005P484j949q760
4082e497L201L267k953M244J56o519M502N841o907k886L493l159K434N995n593
$$ plain form
4097 -381 -3462 3203 2203 -1761 1033 -2472 -5409 2943 4883 -2248 -212 1778 -1476 1814 1768 -6276
4113 -6276 -3118 5016 1627 -237 2081 -1973 -1228 4268 -1575 -5944 319 1772 308 3704 570
4128 570 -4629 1397 3357 -3065 -2163 239 -1613 3966 5093 -3262 -3193 2737 -96 -1749 460 -2750
4144 -2750 -1060 6079 2380 -3304 107 -107 -2157 1907 -145 -4371 1560 5057 -113 -254 -291 -3710
4160 -3710 196 3791 -2556 -2698 3024 2157 1102 1703 -3341 -3825 2833 1434 -2758 503 1312 -6
4176 -6 3207 1189 -4831 -2027 2117 -630 375 1760 -1931 724 4378 -1631 -4253 -333 -92 -19
4192 -19 3173 -525 -2193 3065 2273 -2812 -1368 -1140 -2089 2392 3267 -1787 -151 2307 -795 -749 -108
4209 -108 -3598 -1403 4133 1639 -1083 1037 -89 -1026 1548 -1602 -3874 1275 2970 128 1190
$$ packed form
4097c81l081O665j000l964K794l505k937Q352J940p131K036J990l254L290m6q044
4113f276L158Q134l389j864K318m054P45N496n843m369O263J453j464L396l134
4128E70n199O026J960o422R02K402j852N579J127q355O9N930k833j653K209l210
4144b750J690P139l699n684L411k14k050M064k052m226N931L497n170j41l7l419
4160c710L906L595o347j42N722q67j055O01n044m84O658j399m192L261Q09j318
4176fL213k018o020K804M144k747J005J385l691K655L654o009k622L920K41P3
4192a9L192l698j668N258p92n085J444K28r49M481Q75n054J636K458l102M6O41
4209a08l490K195N536k494k722K120j126r37K574l150k272N149J695k842J062
$$ plain form
4224 1190 532 -2132 337 1449 -3055 -1613 1821 444 1515 2514 -1362 -2185 1466 -310 -2327 311
4240 311 247 -145 3554 1294 -2713 -595 579 -1702 -92 254 -1259 1601 3233 -696 -1427 313
4256 313 -1787 -1244 1342 -397 -777 2698 1663 -729 43 -1353 -2759 811 1014 -1300 862 1935
4272 1935 1 562 -158 -2751 -1156 1501 -467 -199 2121 254 12 1168 -1225 -2516 63 126
4288 126 -169 1801 1141 -630 864 739 -2374 -1322 -195 -355 1217 1785 -267 59 1207 -1054 -1620
4305 -1620 -143 -690 -369 2042 1134 -93 996 -255 -1635 -216 -559 -1597 750 2083 549 468
4321 468 400 -1353 -606 -105 -1425 -283 1512 1012 719 934 -596 -1219 -378 -845 -1137 708 920 345
4339 345 1414 551 -1210 -1030 -559 -1085 86 1006 574 992 1625 -548 -1218 -409 -934 -767 696 582
$$ packed form
4224A190o58k664K469J112m504J442L434j377J071R99l876q23L651j776k017K638
4240C11o4l92L699k260m007K118J174k281J610L46j513K860J632l929p31J740
4256C13k100N43K586j739l80L475j035k392P72j396j406L570K03k314K162J073
4272A935j934N61p20k593J595K657j968K68K320j867k42J156k393j291K579O3
4288A26k95J970o60j771J494j25l113J052J127j60J572N68k052L26J148k261n66
4305a620J477n47L21K411r08j227J089j251j380J419l43j038K347J333j534q1
4321D68o8j753P47N01j320J142J795n00k93K15j530o23Q41m67k92J845K12n75
4339C45J069q63j761J80M71n26J171R20m32M18O33k173o70Q09n25J67J463j14
$$ plain form
4357 582 597 1546 556 -770 -946 -894 -1576 46 892 300 848 1000 136 -647 -629 -1686 -534 768 457
4376 457 414 1410 497 -301 -425 -1126 -1132 -68 618 158 1294 1170 -70 -318 -962 -1153 -553 -279 295 956
4396 956 1197 176 -319 -269 -857 -1259 -522 272 504 959 822 131 208 -689 -1307 -773 -56 422 825 1005
4416 1005 489 226 -368 -1266 -958 -514 -215 477 830 883 442 -65 -657 -906 -803 -381 -158 667 1217 706
4436 706 132 -104 -786 -933 -756 -309 436 885 915 300 317 -305 -940 -917 -379 -8 574 828 708 816 232
4457 232 -614 -635 -575 -113 122 631 756 754 186 -674 -726 -651 -782 -276 529 1039 948 489 -200 -643 -732 -793 -718
4480 -718 99 764 643 748 563 50 -750 -745 -865 148 438 203 625 1077 68 -564 -627 -1037 -828 155
4500 155 144 472 1429 531 -524 -379 -791 -1272 -298 435 261 771 871 -35 120 -416 -1308 -872 253 447
$$ packed form
4357E82J5R49r90j326j76N2o82J622Q46n92N48J52q64p83J8j057J152J302l11
4376D57m3R96r13p98j24p01oJ064O86m60J136j24j240k48o44j91O00K74N74O61
4396I56K41j021m95N0n88m02P37P94K32M55j37o91P7q97o18N34P17M78M03J80
4416A005n16k63n94q98L08M44K99O92L53N3m41n07n92k49J03M22K23Q25N50n11
4436G06n74k36o82j47J77M47P45M49L0o15J7o22o35K3N38L71N82K54j20J08n84
4457B32q46k1O0M62K35N09J25kn68q60n2P5j31N06Q05N10r1m59o89m43q9o1P5
4480g18Q17O65j21J05j85n13q00Nj20J013K90k35M22M52j009o32o3m10K09R83
4500A55j1L28R57q98j055J45m12m81R74P33j74N10J00r06J55n36q92M36J125J94
$$ plain form
4520 447 409 959 356 27 181 -1055 -1277 -13 -33 134 1324 922 224 409 -498 -1398 -320 -149 -487
4539 -487 642 1561 240 -5 151 -985 -840 -169 -831 105 1742 620 -129 460 -267 -1295 -2 -639
4557 -639 -753 1038 994 111 742 181 -1361 -547 128 -817 -69 1139 408 646 1293 -1077 -1212 224 -567
4576 -567 -895 971 542 82 1470 76 -1596 -165 -298 -1115 845 944 -340 869 1193 -758 -824 -147
4594 -147 -1628 -167 1612 -99 -66 1771 198 -880 -45 -1231 -1509 1181 910 -444 1267 772 -1130
4611 -1130 462 -230 -2061 -262 1177 143 577 1231 -1055 -541 900 -1602 -1805 651 14 70 1822
4628 1822 -164 -1413 972 -254 -1979 84 167 -751 1595 1670 -1375 -592 298 -1199 -652 875 -1264
4645 -1264 -15 2787 384 -1084 509 -1081 -1212 1355 -433 -1465 1867 1654 -305 621 -384 -2159
$$ packed form
4520D47l8N50o03l29J54j236k22J264k0J67J190m02o98J85r07r00J078J71l38
4539d87J129R19j321k45J56j136J45O71o62R36J637j122p49N89p27j028J293o37
4557f39j14J791m4q83O31n61j542Q14O75r45P48J208p31K38O47k370j35J436p91
4576e67l28J866m29m60J388j394j672J431j33q17J960R9j284J209L24j951o6O77
4594a47j481J461J779j711L3J837j573j078Q35j186k78K690k71j354J711m95j902
4611a130J592o92j831J799J439j034M34O54k286N14J441k502k03K456o37N6J752
4628A822j986j249K385j226j725K063Q3r18K346P5l045P83Q90j497N47J527k139
4645a264J249K802k403j468J593j590j31K567j788j032L332k13j959R26j005j775
$$ plain form
4661 -2159 116 1206 -1208 101 1677 -204 704 1339 -2389 -1693 1218 6 -689 996 -85 -310
4677 -310 1908 -53 -2767 -255 324 -838 1094 651 -1220 1360 1605 -1717 -1348 25 -1499 573
4693 573 2549 -452 -978 1801 145 -1037 132 -1620 -1440 2322 1619 -1448 249 740 -885 269
4709 269 -374 -2670 201 2492 16 35 750 -1214 -145 1549 -1442 -2224 1315 977 345 1792 -834
4726 -834 -2132 1351 680 -2102 -310 641 109 1913 1510 -2473 -1150 1322 -594 -572 731 -963 474
4743 474 3147 108 -2108 -86 -233 -381 1293 -223 -1813 1785 2483 -686 -861 -659 -1611 1023 1625
4760 1625 -1679 -822 2170 839 -214 151 -2228 -1090 1865 381 -1213 736 659 18 1733 -425
4776 -425 -3229 -352 1835 -191 332 368 -1094 1139 1997 -2135 -2349 611 312 778 1660 -1207 -1230 2079
$$ packed form
4661b159K275J090k414J309J576j881R08O35l728O96K911j212o95J685j081k25
4677c10K218j961k714K512N79j162J932m43j871K580K45l322L69J373j524K072
4693E73J976l001n26K779j656j182J169j752J80L762p03l067J697M91j625J154
4709B69o43k296K871K291k476J9P15j964J069J694k991p82L539l38o32J447k626
4726h34j298L483o71k782J792R51n32J804m03l983J323K472j916K2J303j694J437
4743D74K673l039k216K022j47j48J674j516j590L598O98l169j75K02r52K634O02
4760A625l304Q57K992j331j053L65k379J138K955j484j594J949p7o41J715k158
4776d25k804K877K187k026N23L6j462K233Q58m132k14K960k99M66Q82k867k3L309
$$ plain form
4794 2079 376 -2194 -739 -362 -269 2288 1307 -1879 -51 1517 -616 -493 -320 -2070 629 3075
4810 3075 1 -1272 516 -531 -442 717 -1408 -1772 2105 1589 -307 371 -277 -1693 697 697 -2108
4827 -2108 -391 1793 502 1021 833 -2321 -1144 1842 -549 -1406 581 539 394 1965 -634 -2269
4843 -2269 397 537 -1109 262 342 -899 1516 1901 -1558 -1114 77 -967 522 1731 -1199 -419
4859 -419 2158 532 -1323 -153 -929 -975 1827 520 -1692 1101 1446 -1008 172 -490 -2213 296
4875 296 1706 -605 -124 1123 -567 -68 1132 -1513 -1586 1084 436 -209 1227 -367 -863 1208 -9
4892 -9 -2077 -255 799 -138 1462 1174 -1318 -45 918 -1315 -599 343 -846 281 2099 -120 -1153
4909 -1153 717 -381 -1122 570 -671 -1076 1791 1177 -939 21 117 -1389 275 476 -1510 257 1892
$$ packed form
4794B079j703k570J455L77R3K557r81l186J828J568k133J23J73j750K699K446
4810C075l074j273J788j047Q9J159k125l64L877n16j896O78o48j416K390%k805
4827b108J717K184j291N19j88l154J177K986k391q57J987m2j45J571k599j635
4843b269K666J40j646J371Q0j241K415L85l459M44J191j044J489J209k930P80
4859d19K577j626j855J170p76m6K802j307k212K793L45k454J180o62j723K509
4875B96J410k311M81J247j690M99J200k645p3K670o48o45J436j594m96K071j217
4892ik068J822J054r37J600k88k492J273R63k233P16R42j189J127J818k219j033
4909a153J870j098p41J692j241m05K867o14k116R60R6j506J664K01j986J767J635
$$ plain form
4926 1892 40 -12 481 -1128 -985 741 -479 -872 1130 481 149 1105 -265 -1771 98 593 -748
4943 -748 525 799 -276 779 830 -1566 -840 181 -761 17 1026 -155 -44 1389 -187 -936 -74
4960 -74 -543 -482 1347 456 -360 623 594 -885 -176 -321 -1172 462 908 -223 350 781 -299 -595 46
4979 46 -1081 -317 749 421 -196 884 -187 -734 305 -316 -1255 74 593 41 875 640 -658 -93
4997 -93 267 -756 -445 314 -32 490 1151 3 -463 -174 -307 -520 303 51 27 787 667 -386 -289 -451
5017 -451 -772 -221 70 -279 476 1088 126 -78 -95 -710 -740 14 -84 -61 884 327 52 28 -433 -855 -374 31
5039 31 63 591 869 211 40 -133 -765 -221 31 -215 191 441 376 356 211 -405 -668 -337 -29 77 579
5060 579 535 355 86 -29 -462 -567 -250 -57 454 496 447 209 255 -203 -559 -556 -123 -5 354 332 311 405 -40
$$ packed form
4926A892j852n2M93j609J43J726j220l93K002o49l32R56j370j506J869M95j341
4943g48J273K74j075J055N1k396P26J021r42P78J009j181J11J433j576p49Q62
4960g4m69O1J829q91q16R83k9j479P09j45q51J634M46j131N73M31j080k96O41
4979D6j127P64J066l28o17J080j071n47J039o21r39J329N19n52Q34k35j298N65
4997i3L60j023L11P59l46N22O61j148m66K89j33k13Q23k52k4P60j20j053R7j62
5017d51l21N51K91l49P55O12r62k04j7o15l0P54r8K3R45n57k75k4m61m22M81M05
5039C1L2N28K78o58j71j73o32N44K52k46M06K50o5k0j45o16k63L31L08J06N02
5060E79m4j80k69j15m33j05L17J93N11M2m9k38M6m58l56LM33J18L59k2k1R4m45
$$ plain form
5083 -40 -307 -473 -308 -329 -128 494 180 495 357 -312 -547 -186 -298 -379 376 432 239 188 -32 -133 -392 -173
5105 -173 -304 -43 569 368 309 -52 -85 -411 -575 -386 -64 37 190 267 369 147 -342 -438 -642 -139 -179 204
5127 204 178 521 265 -49 -344 -261 -470 -348 -91 69 652 209 384 -58 -362 -477 -443 -55 -61 704 575 292
5149 292 4 -11 -408 -598 -145 -195 163 348 423 245 89 -568 -529 -235 -240 -74 388 585 539 35 -219 -314 -480
5172 -480 -205 -215 90 600 95 79 124 -255 -335 -266 -254 -153 319 419 3 113 329 -467 -517 -344 -305 248 237
5195 237 348 356 335 -182 -495 -345 -605 -191 342 361 268 498 65 -476 192 -307 -656 81 447 324 496 52
5217 52 -256 -273 -426 -571 -219 367 411 381 438 -278 -322 -39 -486 -618 82 357 66 358 133 -276 -93 -91 -449
5240 -449 40 -16 -329 323 821 -188 -418 1 -489 -556 186 39 186 789 288 -509 -93 -318 -530 141
$$ packed form
5083d0k67j66J65k1K01O22l14L15j38o69k35L61j12q1P55N6j93n1k20j01k59K19
5105a73j31K61O12k01n9l61l3l26j64J89L22J01J53P7J02k22m89r6k04N03m0L83
5127B04k6L43k56l14k95Q3k09J22K57J60N83m43J75m42l04j15L4L88oP65j29k83
5149B92k88j5l97j90M53n0L58J85P5j78j56o57L9K94nJ66M62J97m6n04k54r5j66
5172d80K75j0L05N10n05j6M5l79q0O9J2J01M72J00m16J10K16p96n0J73L9N53j1
5195B37J11Qk1n17l13J50k60M14N33J9r3K30m33n41O68m99l49P37L66j23J72m44
5217E2l08j7j53j45L52N86M4l0N7p16m4K83m47j32P00K75k91K92k25m09J83Kl58
5240d49M89n6l13O52M98j009k30M19m90o7P42j47J47O03n01p97M16k25k12O71
$$ plain form
5260 141 112 243 125 519 75 107 271 -564 -435 462 178 -144 450 126 -39 216 -435 -868 171 154 -1
5281 -1 455 257 -304 160 289 -818 -495 -88 -209 402 931 -90 -114 579 -12 -774 -246 -100 -232 1086
5301 1086 199 -442 125 234 -708 -174 -107 -551 226 890 112 -224 147 -414 -274 302 -601 -640 685 644
5321 644 -154 145 -383 -401 215 91 -860 188 534 61 481 318 -726 -425 336 -450 23 460 -189 297
5341 297 1249 -367 -1005 107 -136 -417 492 -84 -513 929 727 -614 -346 -304 -549 155 743 -565 -69
5360 -69 805 182 -114 -101 -531 -639 1208 371 -463 545 362 -151 654 -658 -1315 188 1287 -243 328
5379 328 288 -513 276 757 -1295 -485 600 156 258 848 -618 -701 864 196 -1193 156 75 -118 1231
5398 1231 380 -1119 -155 902 -520 -395 -74 -603 638 1580 -305 -754 531 -164 -223 569 -771 -857
$$ packed form
5260A41k9J31j18L94m44L2J64q35J29Q97k84l22N94l24j65K55o51m33J039j7j55
5281aM56j98n61M64J29j107L23M07j21O11N29j021k4O93n91p62N28J46j32J318
5301A086q87o41N67J09r42N34O7m44P77O64p78l36L71n61J40N76r03l9J325m1
5321F44p98K99n28j8O16j24r51J048L46m73M20j63j044L01P61p86M73M37o49M86
5341B97R52j616o38J112k43k81R09n76m29J442k02j341K68M2k45P04N88j308M96
5360f9Q74o23k96J3m30j08J847q37q34J008j83n13Q05j312o57J503J099j530N71
5379C28m0q01P89M81k052Q10J085m44J02N90j466q3J565o68j389J349q1j93J349
5398A231q51j499R64J057j422J25L21n29J241R42j885m49J285o95n9P92j340q6
$$ plain form
5416 -857 1065 687 -320 45 -494 -833 721 330 -1374 153 1156 366 215 105 -1277 -259 1117
5433 1117 -546 -632 719 -51 -235 734 -768 -1287 452 466 -649 633 199 -557 777 883 -1482 -885
5451 -885 426 -497 353 758 -640 -160 1541 -196 -883 35 -695 -271 1452 117 -1229 690 527
5468 527 -461 238 -239 -1296 655 1200 -710 10 672 -713 299 633 -1179 -801 1037 263 -39 655
5486 655 -383 -547 840 -114 -1581 213 756 -183 915 274 -1343 45 792 -916 -388 342 -531
5503 -531 477 1380 -489 -590 619 -229 -395 584 -391 -597 1558 759 -936 305 39 -702 674 275
5521 275 -1047 479 1198 -349 -200 190 -1199 -205 1015 -539 -553 665 89 126 719 -613 -964 804
5539 804 280 -569 707 435 -354 548 604 -1347 -289 402 -213 382 557 -473 -376 1061 -642 -647 105
$$ packed form
5416h57J922l78j007L65n39l39J554l91j704J527J003p90j51j10j382J018J376
5433A117j663q6J351p70j84R69j502n19J739J4j115J282m34p56J334J06k365N97
5451h85J311r23Q50M05j398M80J701j737o87R18p30M24J723j335j346J919j63
5468E27r88O99m77j057J951N45j910P20O62j385J012L34j812L78J838p74l02O94
5486F55j038j64J387r54j467J794N43r39J098o41j617J388P47j708N28P30q73
5503e31J008R03j869j01J209q48j66R79r75k06K155p99j695J241k66p41J376l99
5521B75j322J526P19j547J49L90j389R94J220j554j4J218n76L7N93j332l51J768
5539H04n24q49J276k72p89R02N6j951J058O91o15N95J75j030R7J437j703nP52
$$ plain form
5558 105 -479 -203 715 51 -858 735 257 -690 122 -104 -962 670 865 -535 103 403 -529 -123 215
5577 215 -813 -427 995 -18 -264 324 -236 -559 584 -270 -1001 323 536 -134 544 319 -753 192
5595 192 244 -744 193 573 -207 493 1125 -532 -581 463 -501 -351 532 -98 50 739 231 -615 -216 125
5615 125 -335 33 144 -493 252 630 -320 -245 -1 -756 0 484 42 -202 552 103 -22 235 -267 -728
5635 -728 397 267 -322 305 481 -19 282 177 -840 -346 92 -221 306 644 -15 5 395 -264 -641 -129
5655 -129 50 264 676 96 -268 384 78 -703 -323 -161 -88 289 635 -287 127 106 -255 -369 -111 -236 -64
5676 -64 556 357 -33 216 35 -384 112 -327 -348 -81 345 177 143 -106 -294 -187 293 -197 -56 471 -78
5697 -78 175 314 -218 -242 9 -10 -343 424 351 98 364 126 -286 -134 91 -66 -48 199 242 328 181 54
$$ packed form
5558A05n84K76R18o64r09J593m78r47Q12k26q58J632J95j400O38L00r32M06L38
5577B15j028L86J422j013k46N88n60l23J143q54p31J324K13o70O78k25j072R45
5595A92N2r88R37L80p80P00O32j657m9J044r64J50Q83o30J48O89n08q46L99L41
5615A25m60L68J11o37P45L78r50P5K44p55P56M84m42k44P54m49j25K57n02m61
5635g28J125j30n89O27J76n00L01j05j017M94M38l13N27L38o59K0L90o59l77N12
5655a29J79K14M12n80l64O52l06p81L80J62P3L77L46r22M14k1l61j14K58j25J72
5676f4O20j99l90K49j81m19M96m39k1K67M26j68l4k49j88J07M80m90J41N27n49
5697g8K53J39n32k4K51j9l33P67p3k53K66k38m12J52K25j57J8K47M3Q6j47j27
$$ plain form
5719 54 -162 -184 -217 -361 188 116 258 649 83 88 18 -304 2 5 -74 45 97 214 -170 -56 -178 -375 -203 51
5743 51 -12 235 388 129 13 -163 -357 -231 154 52 200 299 0 -79 -136 -307 -165 41 -162 -113 176 375
5765 375 151 -75 -157 -366 -278 -291 -105 127 471 211 209 -41 -317 -342 -405 172 35 163 215 244 217 143 -413 -161
5789 -161 -115 51 208 295 409 330 -33 -164 -236 -262 -213 -91 443 172 234 58 -77 -184 -288 -330 6 77 304
5812 304 153 -2 249 11 -254 -222 -114 134 239 297 246 235 241 -103 -295 -182 -154 163 180 166 277 22 -264
5835 -264 -75 -184 -418 -150 173 192 116 320 -72 -209 -200 -193 -276 109 147 309 275 177 -100 -130 -336 -98 -238 163
5859 163 -136 256 269 -196 -275 -152 -459 -235 -125 -227 20 346 369 -31 -5 -249 -58 114 -149 48 494
5880 494 242 -9 -14 -70 -419 -141 -84 260 142 402 136 -109 93 -119 -296 -7 -120 130 501 260 -111
$$ packed form
5719E4k16k2l3j44N49p2J42L91n66Np0l22L06Lp9J19N2J17l84J14j22j97J72K54
5743E1o3K47J53k59j16j76j94J26L85j02J48R9k99p9n7j71J42K06k03M9K89J99
5765C75k24k26q2k09Q8j3J86K32L44k60kk50k76k5o3N77j37J28N2K9k7p4n56K52
5789a61M6J66J57Q7J14p9l63j31p2k6M9J22N34k71O2j76j35j07j04m2L36P1K27
5812C04j51j55K51k38k65L2J08K48J05N8n1j1Ol44j92J13K8L17J7j4J11k55k86
5835b64J89j09k34K68L23J9p6K04l92j37RPq3L85L8J62l4r8k77l0k06K38j40M01
5859A63k99L92J3m65p9J23l07K24J10j02K47L26K3m00K6k44J91J72k63J97M46
5880D94k52k51nn6l49K78N7L44j18K60k66k45K02k12j77K89j13K50L71k41l71
$$ plain form
5901 -111 42 -58 -223 -178 -198 -163 91 654 413 -13 74 -368 -154 -126 -319 -188 107 480 99 54 -260 -287
5923 -287 157 94 -239 58 467 83 308 348 -206 -297 -120 -148 -173 295 -29 101 374 -248 -745 -316 -80 -352
5945 -352 306 55 -143 519 284 -266 -165 91 -531 49 401 -93 120 449 -162 -186 130 -411 -254 616
5965 616 101 -282 283 178 -381 -57 -136 -737 141 496 -99 311 345 -333 241 271 -767 -446 84 118 243
5986 243 496 -171 -469 395 -50 -705 297 292 -127 504 498 -688 148 339 -461 -188 -42 -381 168 944 -22
6007 -22 -659 105 -432 -259 314 -166 -429 625 706 -387 157 -211 -561 490 195 -601 273 897 -126
6026 -126 93 124 -1022 -473 614 -468 -240 511 109 228 714 -629 -1103 259 300 -528 328 186 -211
6045 -211 846 511 -1114 -384 373 -309 86 573 -783 68 971 -217 -681 207 -393 -140 1075 134
$$ packed form
5901a11J53j00j65M5k0L5K54N63k41m26Q7m42K14K8j93J31K95L73l81m5l14k7
5923b87M44o3l33K97M09l84K25M0n54r1J77k8k5M68l24J30K73o22m97M29K36k72
5945c52O58k51j98O62k35n50J01K56o22N80L52m94K13L29o11k4L16n41J57Q70
5965F16n15l83N65j05n59L24p9o01Q78L55n95M10L4o78N74L0j038L21N30L4J25
5986B43K53o67k98Q64m45o55J002nm19O31oj186Q36J91q00K73J46l39N49P76r66
6007b2o37P64n37J73N73m80k63J054Q1j093N44l68l50J051k95p96Q74O24j023
6026a26K19L1j146N49J087j082K28P51m02J19M86j343m74J362M1q28Q56j42l97
6045b11J057l35j625P30P57o82L95M87j356Q51R03j188m64Q88o00K53J215r41
$$ plain form
6063 134 -842 465 473 -434 227 -326 -873 635 902 -584 -44 321 -475 -32 386 -1151 -441 1089 344
6082 344 -222 608 -416 -573 646 -248 -904 105 376 -314 955 122 -1031 222 761 -956 -392 91
6100 91 -387 535 1146 -633 -657 621 -355 -600 398 -361 -445 1175 354 -741 91 -373 -635 605 104
6119 104 -1013 240 1215 -269 183 276 -1207 -142 909 -562 -569 596 -8 -122 706 -296 -777 757
6137 757 233 -604 455 133 -331 630 323 -1378 -208 369 -287 448 801 -576 252 1179 -560 -1035
6155 -1035 199 -110 -120 1076 -1 -792 846 332 -806 27 -270 -800 659 1013 -671 40 560 -380
6173 -380 204 156 -868 -302 1111 243 -152 707 -383 -156 742 -254 -1069 450 628 -229 679 235 -1141
6192 -1141 382 616 -869 -75 502 -48 495 958 -761 -943 708 -289 -420 614 -374 -113 1168 296
$$ packed form
6063A34r76J307Qr07O61n53n47J508K67j486N40L65p96M43M18j537P10J530p45
6082C44n66Q30j024j57J219q94o56J009K71o90J269q33j153J253N39j717N64M83
6100I1m78R22O11j779k4J278r76k45R98p59q4J620q21j095Q32m64k62J240n01
6119A04j117J253R75j484M52R3j483J065J051j471pJ165o04j14Q28j002m81J534
6137G57n24q37J059l22m64R61l07j701J170N77o56P35L53j377Q28R27j739m75
6155a035J234l09j0J196j077p91J638n14j138Q33k97n30J459L54j684P11N20r40
6173c80N84m8j024N66J413q68l95Q59j090K27Q98r96q15J519J78q57R08m44j376
6192a141J523K34j485P94N77n50N43M63j719j82J651r97j31J034r88K61J281q72
$$ plain form
6210 296 -914 141 -59 -521 526 133 -653 396 791 -372 18 195 -837 136 982 -152 0 1000
6228 1000 -17 24 391 -748 -838 588 347 -436 354 374 -194 323 100 -1111 -264 523 -225 335 515
6247 515 -249 5 574 -564 -668 338 214 174 660 102 -682 347 221 -530 -128 53 -260 640 739 -702
6267 -702 69 499 -523 -208 19 -410 107 760 -35 -469 332 -401 -243 233 -382 -525 508 595 -115 117
6287 117 -17 -722 -116 66 -267 -47 575 15 -10 478 -644 -238 209 35 -147 230 16 -1 761 368
6307 368 -862 -129 -16 -284 72 264 -135 150 474 -343 -593 -8 -398 128 496 -72 106 640 142 -382
6327 -382 21 -364 -404 268 370 -171 53 317 -235 228 -204 -626 -195 88 -2 163 259 85 -214 159 -321
6348 -321 -435 230 130 347 360 382 -70 122 -60 -380 -122 136 155 491 92 -255 -69 -127 -287 -404 -210
$$ packed form
6210B96j210J055k00m62J047l93p86J049L95j163L90J77j032R73Q46j134J52J000
6228A000j017M1L67j139r0J426k41p83P90K0n68N17k23j211Q47P87p48N60J80
6247E15p64K54N69j138j04J006j24m0M86n58p84J029j26p51M02J81l13R00R9j441
6267g02P71M30j022L15K27m29N17O53p95m34Q01p33J58M76o15j43J033Q7p10K32
6287A17j34p05O06J82l33K20O22n60k5M88j122M06M47j74j82L77k14j7P62l93
6307C68j230P33J13k68L56J92l99K85L24q17k50N85l90N26L68n68J78N34m98n24
6327c82M03l85m0O72J02n41K24K64n52M63m32m22M31K83r0J65R6j74k99L73m80
6348c21j14O65j00K17J3K2m52J92j82l20K58K58J9L36l99l47J86n8j60j17J94
$$ plain form
6369 -210 -76 217 391 53 -264 15 -249 -311 34 -63 7 233 433 202 -3 -56 -500 -77 -136 -171 -9 252
6391 252 176 134 182 -263 -190 -109 -42 -39 393 342 35 85 278 -234 -74 -234 -68 35 321 193 94 182 -282 -251
6415 -251 -261 -109 -184 365 387 67 306 84 -256 -125 -205 -118 172 55 195 144 30 -132 -304 -133 -115 -120 171
6438 171 388 77 371 145 -141 -246 -508 136 153 135 13 57 -36 -171 -233 -250 -344 -54 242 146 254 440 136
6461 136 -86 -174 -449 -219 192 122 194 439 122 -40 12 -439 -317 56 17 244 245 193 -155 -88 -130 -220 -144 -87
6485 -87 -103 148 182 304 -348 -84 -246 -292 121 18 197 168 377 233 121 -266 -242 -30 -271 -151 103 327
6507 327 214 -81 -222 -267 -256 -333 -228 87 465 441 -69 120 56 -435 -261 289 -127 219 160 236 0 -140
6529 -140 -201 -241 -93 66 194 149 90 107 315 -298 -461 -272 -191 100 388 248 237 176 194 -322 -257 -167 -19 151
$$ packed form
6369b10J34K93J74l38l17K79k64o2L45r7P0K26K00k31k05n3m44M23n9l5J62K61
6391B52p6m2M8m45P3Q1O7LM32n1l07N0J93n12J60j60J66J03K86j28r9Q8m64L1
6415b51j0J52p5N49K2l20K39k22l40J31q0Q7K90j17J40n1j14j62j72J71J8nK91
6438A71K17l11K94k26k86j05k62O44J7j8j22M4r3j35o2j7r4K90K96r6J08J86l04
6461A36k22q8k75K30M11p0P2K45l17j62N2m51J22L73l9K27Jn2l48O7m2r0P6N7
6485h7j6K51L4J22o52K64j62m6M13j03J79k9K09j44j12l87K4K12k41J20K54K24
6507C27j13k95j41m5J1p7J05L15L78k4n10J89o4m91J74N50m16L46n9P6k36j40
6529a40o1m0J48J59J28m5n9J7K08o13j63J89Q1K91K88j40j1o1J8n16O5R0J48J70
$$ plain form
6553 151 397 21 485 557 55 -274 -196 -65 -42 316 78 -194 577 74 -181 -27 -225 -346 58 221 171
6574 171 341 -4 -235 -72 6 -479 -395 509 247 35 345 -146 -353 -55 -363 -496 133 105 206 470 32
6595 32 -345 -153 -81 -417 26 116 -273 550 358 -157 -478 113 -402 -248 81 -233 -125 528 365 -282 114
6616 114 -418 -761 -15 -18 -354 173 629 112 174 108 -700 -118 676 -239 -132 302 127 6 478 -576 -683
6637 -683 240 10 -345 489 1 -292 417 161 -1001 -197 16 -161 302 426 -320 -50 781 -210 -442 -6
6657 -6 -320 164 803 128 -413 524 -123 -640 45 -471 -626 671 858 -446 205 259 -605 -78 228 -768
6677 -768 -115 936 219 -75 595 -383 -617 500 -282 -579 235 468 -111 579 -48 -745 325 344 -714
6696 -714 -77 482 -356 215 638 -756 -455 609 -351 -241 659 -301 -121 1533 89 -904 -112 -422 -368
$$ packed form
6553A51K46l76M64P2n02l29P8J31K3L58k38k72P71n03k55J54j98j21M04J63n0
6574A71J70l45k31J63P8m85Q4R04k62k12L10m91k07K98l08j33O29k8J01K64m38
6595C2l77J92P2l36M43R0l89Q23j92n15l21N91n15J54L29l14J08O53j63o47L96
6616A14n32l43P46ll36N27M56n17O2o6q08N82P94r15J07M34j75j21M72j054j07
6637f83R23k30l55Q34m88k93P09k56j162Q04K13j77M63J24p46K70Q31r91k32M36
6657fl14M84O39o75n41R37o47n17O85n16j55J297J87j304O51N4q64N27L06r96
6677g68O53J051p17k94O70r78k34J117p82k97Q14K33n79O90o27o97J070J9j058
6696g14O37N59q38N71M23j394L01J064r60J10R00r60J80J654j444r93P92l10N4
$$ plain form
6715 -368 380 102 -601 556 884 -481 -54 -72 -740 342 721 -450 -423 1027 149 -195 373 -768 -904
6734 -904 883 184 -384 546 222 -340 800 -65 -1167 -44 429 -316 483 606 -792 124 821 -949
6752 -949 -606 457 -331 261 1277 -350 -822 671 155 -409 47 -218 -638 926 710 -686 -126 205
6770 205 -436 -99 96 -869 38 1014 23 -352 478 -545 -397 618 -349 -717 625 534 -86 600 -286
6789 -286 -1036 535 438 -829 106 405 -249 464 694 -948 -503 639 -362 -99 547 -343 -93 1225
6807 1225 103 -1079 286 -95 -596 631 193 -771 958 644 -636 -206 6 -564 384 955 -841
6824 -841 -160 1088 -231 -291 270 -710 -779 908 374 -670 652 135 -556 685 -150 -1178 -10 671
6842 671 -230 357 330 -567 -217 908 -784 -629 465 -190 50 723 -618 -737 657 27 -544 199 -77
$$ packed form
6715c68P48k78p03J157L28j365M27j8o68J082L79j171K7J450q78l44N68j141j36
6734i04J787o99n68R30l24n62J140q65j102J123M73p45P99J23j398R16O97j770
6752i49L43J063p88N92J016j627m72J493n16n64M56k65m20J564k16j396N60L31
6770B05o41L37J95r65R07R76r91l75Q30j023J48J015r67l68J342r1o20O86q86
6789b86p50J571r7j267R35K99o54P13K30j642M45J142j001K63O46q90K50J318
6807A225j122j182J365l81n01J227m38r64J729l14j280M30K12n70R48N71j796
6824h41O81J248j319o0N61r80o9J687n34j044J322n17o91J241q35j028J168O81
6842F71r01N87k7q97L50J125j692J55J094o55K40O73j341j19J394o30n71P43k76
$$ plain form
6861 -77 -413 990 739 -401 44 232 -608 -46 153 -630 236 1207 -117 -145 40 -360 -265 372 -597 -444
6881 -444 861 547 -186 133 -290 -838 361 450 -394 246 675 92 264 188 -753 -218 391 -330 -273 327
6901 327 5 99 839 -453 -826 52 156 -230 453 -93 -599 566 473 -630 -361 57 -487 393 450 -53
6921 -53 284 704 -229 -487 -216 -624 -219 838 331 -292 284 62 -14 222 -434 -618 238 648 14 -24 165
6942 165 -289 -33 257 -504 -372 404 207 75 427 -198 -401 355 -157 -705 -60 305 -139 711 339 -303
6962 -303 136 244 -145 -100 90 69 428 640 -108 -335 -70 -86 -353 259 -173 -158 532 242 -393 -56 -266
6983 -266 -345 62 244 -230 194 535 -145 -210 -142 -508 -311 472 88 -44 419 310 6 -78 -306 -685 153
7004 153 226 106 208 394 103 225 -60 -592 -373 65 159 15 188 207 57 130 -198 -476 -149 -97 -30 -3
$$ packed form
6861g7l36J403k51j140M45J88q40N62J99p83Q66R71j324k8J85m00R5O37r69J53
6881d44J305l14p33L19m23n48J199Q9q44O40M29n83J72p6r41N35O09p21N7O00
6901C27l22R4P40j292l73Q78J04l86O83n46n06J165r3j103K69M18n44Q80N7n03
6921e3L37M20r33k58K71m08M05J057n07o23N76k22p6K36o56j84Q56M10o34l8J89
6942A65m54K56K90p61J32P76j97j32L52o25k03P56n12n48O45L65m44Q50l72o42
6962c03M39J08l89M5J90k1L59K12p48k27K65j6k67O12m32J5O90k90o35L37k10
6983b66p9M07J82m74M24L41o80o5O8l66J97P83l84j32M63j09l04q4k28l79Q38
7004A53P3j20J02J86k91J22k85n32K19M38R4j44J73J9j50P3l28k78L27N2O7K7
$$ plain form
7026 -3 377 119 168 123 -59 -115 -241 -189 2 434 -147 62 464 32 42 55 -226 26 125 494 139 -35 -248
7049 -248 -343 -99 -361 -123 179 270 20 128 99 -231 -193 144 -377 -303 266 340 116 100 129 -295 171 -34 -88
7072 -88 181 138 245 477 224 -122 -222 19 -48 -20 93 103 233 377 -111 -163 -67 -332 -403 303 -51 81 193
7095 193 272 -3 -143 -56 -497 -156 144 108 277 275 -35 142 -86 -225 -243 -44 -56 124 193 -168 -128 -110 -233
7118 -233 -225 -295 -94 86 114 120 -67 91 -57 -368 -148 -46 46 68 252 430 53 -119 -141 -43 -208 -74 -71 168
7142 168 275 -56 148 -327 -166 -469 -140 36 160 220 343 233 84 -9 -227 -149 -177 14 -45 41 214 36
7164 36 -191 -455 -35 -377 -134 198 260 253 200 -16 -31 -34 -134 -148 -103 109 163 130 391 -325 -118 126 -316 -158
7188 -158 203 234 14 413 -64 -90 -206 -192 -47 -163 -8 -5 211 224 -225 -261 -163 -421 68 258 -70 118 179
$$ packed form
7026cL80k58M9m5j82n6j26N2J91M32n81K09M02m32J0J3k81K52R9L69l55j74k13
7049b48r5K44k62K38L02R1k50J08k9l30L8L37n21P4N69P4k24j6K9m24M66k05n4
7072h8K69m3J07K32k53l46j00K41o7K8J13J0J30J44m88n2R6k65p1P06l54J32J12
7095A93P9k75j40Q7m41L41L00l6J69kl10J77k28j39j8J99j2J80O9l61M0J8j23
7118b33Qp0K01J80K8Oj87J58j48l11K20J02R2K2J84J78l77j72k2R8j65J34LK39
7142A68J07l31K04m75J61l03L29J76J24O0J23j10j49r3k18P8k8J91n9Q6J73j78
7164C6k27k64M20l42K43L32O2pn3k16j5lj00j4M5K12N4l3K61p16K07K44m42J58
7188a58L61L1k20L99m77k6j16J4J45j16J55LK16J3m49l6R8k58M89J90l28J88O1
$$ plain form
7211 179 -4 -180 -60 -218 -120 119 222 127 228 158 -106 -216 52 -224 -76 202 -71 132 443 -3 -336
7232 -336 -65 -403 -632 38 101 23 419 307 -142 -138 -135 -362 -91 24 -84 200 409 91 43 -22 -445 -354 117
7255 117 -13 -11 176 94 -52 -96 -303 -285 -193 -260 51 404 477 89 -142 -40 -453 1 176 -321 -60 504 317
7278 317 -142 65 -299 -391 67 -236 -178 541 295 111 340 -419 -256 66 -222 -484 244 72 -37 138 237
7299 237 -444 -370 175 -291 -39 406 -205 126 523 -159 -441 76 -468 -340 271 -18 -145 285 265 -567 -329
7320 -329 -294 -502 -16 266 57 11 292 -302 -184 -76 -772 -341 640 124 -249 581 274 -170 413 -282 -529
7341 -529 60 453 -144 370 224 -396 202 285 -829 -404 420 -134 345 727 -337 -240 484 -193 -552 245
7361 245 -140 -97 705 358 -853 149 -110 -482 -32 27 -573 367 714 -303 -259 115 -647 -369 282 -555
$$ packed form
7211A79j83j76J20j58R8K39J03r5J01p0k64j10K68k76J48K78k73K03L11m46l33
7232c36K71l38k29O70O3p8L96j12m49MLk27K71J15j08K84K09l18m8o5m23R1M71
7255A17j30KJ87q2j46m4k07J8R2o7L11L53P3l88k31J02m13M54J75m97K61N64j87
7278C17m59K07l64r2M58l03N8P19k46j84K29p59J63L22k88k62P28j72j09J75R9
7299B37o81P4N45m66K52M45o11L31L97o82k82N17n44J28O11k89j27M30k0q32K38
7320c29L5k08M86K82k09m6K81n94J18J08o96M31R81n16l73Q30l07m44N83o95k47
7341e29N89L93n97N14j46o20N98Q3j114M25Q24n54M79L82j064R7P24o77l59P97
7361B45l85M3Q02l47j211J002k59l72M50N9o00R40L47j017M4L74p62K78O51q37
$$ plain form
7381 -555 -252 630 152 -259 285 -574 -545 400 223 -482 437 592 -75 424 52 -900 -370 214 -466 137
7401 137 384 -47 184 699 -336 -588 114 -126 -59 517 -93 -320 788 221 -637 -90 -8 -509 444 501
7421 501 -445 72 692 -101 -216 -20 -614 -176 960 124 -255 330 -7 -269 426 -216 -847 294 493
7440 493 45 141 47 -491 297 604 -579 -143 618 -94 222 668 -395 -497 495 -103 -502 39 -278 -206
7460 -206 630 249 -768 -5 296 -218 7 -21 -475 473 831 -226 -471 -13 -524 235 616 -305 -574 569
7480 569 216 -181 -50 -460 -657 390 307 -434 248 232 -22 395 136 -941 -91 593 -101 -274 313 -109
7500 -109 33 484 -410 -549 100 39 -112 516 11 -409 314 161 -662 -414 39 -168 436 462 -418 -321 671
7521 671 -101 -218 -103 -348 13 965 -8 -307 74 -27 -252 169 -228 -504 214 406 -188 100 250 -567
$$ packed form
7381e55L03Q82m78m11N44q59K9R45j77p05R19J55o67M99l72r52N30N84o80O03
7401A37K47m31K31N15j035k52P02k40O7N76o10k27J108n67q58N47Q2n01R53N7
7421E01r46N17O20p93j15J96n94M38J136q36l79N85l37k62O95o42o31J141J99
7440D93m48R6r4n38P88L07j183M36P61p12L16M46j063j02R92n98l99N41l17P2
7460b06Q36l81j017P63L01n14K25k8m54R48L58j057k45M58n11P59L81r21k69J143
7480E69l53l97J31m10j97J047q3p41O82j6k54M17k59j077Q50O84o94j73N87m22
7500a09J42M51q94j39O49o1j51O28n05m20P23j53q23K48M53k07O04K6q80R7R92
7521F71p72j17J15k45L61R52r73k99L81j01k25M21l97k76P18J92n94K88J50q17
$$ plain form
7541 -567 17 284 -638 -559 604 425 -21 251 -339 -39 548 -104 -247 55 293 256 401 236 -860 -201
7561 -201 391 -320 -91 304 -70 440 699 -324 -661 322 13 -116 276 -76 -86 558 316 -513 -360 -56
7581 -56 -219 438 189 -230 223 631 3 -42 51 -586 -211 436 136 -259 179 188 -178 114 -326 -609 248 430
7603 430 -72 50 316 -256 115 400 -732 -323 337 57 43 345 -43 -88 527 -238 -659 -92 210 -60
7623 -60 511 -83 -433 189 62 -419 -319 83 -198 541 645 -277 -92 102 -119 -77 128 -210 -288 715 376
7644 376 -180 -117 -89 -390 46 107 -430 313 364 -78 -157 231 -452 -336 206 -255 -50 370 22 74 304 -387
7666 -387 -473 10 -194 62 292 249 90 353 -32 -483 -198 -24 -240 206 411 -11 75 132 -100 -430 -165
7687 -165 -412 -85 309 148 45 284 169 -288 -49 -414 -317 317 208 -134 129 246 -157 -169 34 -340 -206
$$ packed form
7541e67N84K67r22P9J163j79m46K72n90L00N87o52j43L02K38l7J45j65j096O59
7561b01N92p11K29L95l74N10K59j023l37R83l09j29L92l52j0O44k42q29J53L04
7581e6j63O57k49m19M53M08o28m5R3o37L75O47l00l95M38Rl66K92m40k83Q57J82
7603D30n02J22K66n72L71K85j132M09O60k80j4L02l88m5O15p65m21N67L02k70
7623f0N71n94l50O22j27m81J00M02k81P39J04r22J85J94k21M2K05l38p8J003l39
7644C76n56O3K8l01M36O1n37P43N1m42p9L88o83J16N42m61K05M20l48N2K30o91
7666c87q6M83k04K56K30m3j59K63l85m51K85J74k16M46K05m22Q6N7k32l30K65
7687a65k47L27L94j61j03K39j15m57K39l65R7O34j09l42K63J17m03j2K03l74J34
$$ plain form
7708 -206 157 187 -102 231 16 -424 55 -203 -361 24 295 -150 343 -13 -153 -198 4 -242 -124 302 32
7729 32 231 298 -19 -163 -50 -314 -210 17 -28 80 299 75 -136 215 -10 -257 -95 201 -143 55 202
7750 202 -12 -115 50 -609 -211 -152 -14 133 312 181 -41 288 -247 -171 -115 -259 -16 59 354 -29 134
7771 134 -152 -435 -19 -95 -136 129 353 22 250 10 -190 -340 227 -216 -68 252 340 36 52 -143 -247
7792 -247 8 -156 -220 117 77 -78 -114 247 -87 -355 -121 -77 -12 226 75 181 19 177 -189 -218 -165 -136 7
7815 7 25 187 -124 272 -153 -132 14 -369 -93 105 35 181 213 204 93 -221 -403 -462 187 -97 201 254 -26
7838 -26 -262 -166 -186 -198 -30 61 75 213 132 66 -237 -120 -248 -194 172 154 33 80 147 -3 242 -208 -196 -155 18
7863 18 -100 215 209 55 -53 -270 -127 -249 14 91 140 347 70 -81 -225 -407 -49 -148 -192 -192 233 308 -165
$$ packed form
7708b06L63L0k89L33k15m40M79k58j58L85K71m45M93l56j40m5K02k46J18M26k70
7729C2J99O7l17j44J13k64J04K27m5J08K19k24k11L51k25k47J62K96l44J98J47
7750B02k14j03J65o59L98N9J38J47J79j31k22L29n35P6N6j44K43P5K95l83J63
7771A34k86k83M16p6m1K65K24l31K28k40k00j50N67m43J48L20Q8l04J6j95j04
7792b47K55j64o4L37m0j55l6L61l34k68K34M4O5K38j51J06j62J58l66k9N3K9J43
7815GJ8J62l11L96m25K1J46l83K76J98p0J46L2rj11l14j82n9O49k84K98N3k80
7838b6k36R6k0j2J68R1J4J38q1o6l03J17j28N4L66j8j21M7O7j50K45m50J2M1J73
7863A8j18L15oj54j08k17J43j22K63P7M9K07k77j51j44j82L58r9m4%M25P5m73
$$ plain form
7886 -165 54 -146 -234 -110 -243 223 371 163 93 204 93 -399 -300 -118 -125 94 407 12 60 88 -235 -364
7908 -364 -240 2 36 360 -70 -32 133 -46 -264 -222 -205 4 170 267 1 119 194 4 -157 -44 -350 -68
7930 -68 413 215 -24 118 286 -324 74 -416 -421 -6 137 -51 134 264 -288 75 -49 -197 -75 261 149
7951 149 -123 102 -35 -163 172 -294 -118 353 87 -90 452 148 -323 33 -61 -221 156 -39 -193 517
7971 517 215 -448 -48 -47 -506 253 30 -297 114 152 -229 -290 -11 -391 -241 -35 209 -234 277 273 -181 42
7993 42 -328 -593 -150 268 -138 22 282 -14 279 284 -449 -526 223 124 54 314 30 -167 126 104 -712 -346
8015 -346 -118 -205 425 231 -214 139 463 -191 -153 -136 -382 164 532 -195 -250 218 -206 -286 153 -178 -208 337
8037 337 313 6 -83 243 -439 194 244 -607 -72 637 268 262 407 -262 -356 139 -188 -449 292 130 -39 291
$$ packed form
7886a65K19k00q8J24j33M66J48k08p0J11j11m92R9J82pK19L13l95M8K8l23j29
7908c64J24K42L4L24m30L8J65j79k18M2J7K09J66R7k66J18P5j90j61J13l06K82
7930f8M81j98k39J42J68o10L98m90nM15J43j88J85J30n52L63j24j48J22L36j12
7951A49k72K25j37j28L35m66J76M71k66j77N42l04m71L56r4j60L77j95j54P10
7971E17l02o63M00Jm59P59k23l27M11L8l81o1K79l80J50K06K44m43N11mm54K23
7993D2l70k65M43M18m06J60K60k96K93Np33p7P49r9p0K60k84j97K93k2q16L66
8015c46K28q7O30j94m45L53L24o54L8J7k46N46L68p27n5M68m24q0M39l31l0N45
8037C37k4l07q9L26o82O33N0q51N35P09l69oJ45o69r4M95l27k61P41j62j69L30
$$ plain form
8059 291 -18 -595 107 454 -466 -25 -13 -213 77 430 -328 -298 219 -381 -251 517 -166 -216 430 82 -288
8080 -288 -233 -263 -180 401 169 -186 221 461 -75 49 -212 -612 21 415 -312 -68 98 -139 6 123 -441
8101 -441 -622 552 298 22 357 -56 -203 617 -167 -622 21 38 -81 -3 291 -306 -32 483 -638 -357
8121 -357 -152 -114 164 614 -32 -430 337 -91 -575 -68 -298 -305 753 863 -318 -154 169 -341 -99 196
8141 196 -544 -295 593 231 -55 130 -387 -312 435 -180 -582 255 300 184 470 60 -874 43 379 -397 -217
8162 -217 221 -169 397 912 -510 -651 303 -18 -74 236 -188 -204 787 116 -667 -143 -29 -330 498 168
8182 168 -428 257 571 -155 -172 -79 -518 6 590
$$ packed form
8059B91l09n77P02L47r20M41J2k00K90L53p58L0N17o00J30P68o83n0O46l48l70
8080b88N5l0Q3N81k32l55M07K40n36J24k61m00O33L94p27K44J66k37J45J17n64
8101d41j81J174k54k76L35m13j47Q20p84m55O43J7j19P8K94n97K74N15j121K81
8121c57K05L8K78M50o46l98P67m28m84N07k30pJ058J10j181J64L23n10K42K95
8141A96p40K49Q88l62k86J85n17P5P47o15m02Q37M5j16K86m10r34R17L36p76J80
8162b17M38l90N66N15j422j41R54l21n6L10m24j6R91o71p83N24J14l01Q28l30
8182A68n96O85L14p26j7R3m39N24N84
8191E90
$$ Imaginary data points
##PAGE= N=2
##DATA TABLE= (X++(I..I)), XYDATA
$$ plain form
0 0 0 0 0 -8 16 -10 16 -24 32 -40 56 -64 72 -96 120 -143 171 -200 232 -276 327 -380 435 -500 577 -658
26 -658 755 -855 963 -1086 1224 -1377 1543 -1723 1920 -2134 2378 -2643 2927 -3242 3586 -3973
42 -3973 4400 -4874 5400 -5986 6657 -7426 8306 -9340 10557 -12026 13846 -16164 19213
55 19213 -23428 29658 -39784 58961 -107649 468428 724995 -559011 -21133 78803 -365761
66 -365761 304426 226598 -873707 -43856 815655 23856 -33381 217427 -606742 -181663
76 -181663 682028 -254649 -604696 363946 181380 43588 568676 -276926 -829282 345437
86 345437 377047 -447445 12383 129621 -214312 562323 457598 -745280 -335128 373856
96 373856 -180443 -20256 312938 -378366 -40174 775182 -40560 -536987 43374 -184535
$$ packed form
0@%%%qK4k6K6m0N6p2R6j20J36j68K16k63L14l71M32n08O03p07Q15r35J077j235
26f58J413j610J818k049K310k601K920l266L643m054M512n021N570o169O828p559
42c973Q373r274J0274j1386J2643j4083J5732j7646J9897k2583K5872l0010L5377
55A9213m2641N3086o9442R8745j66610N76077K56567j284006N37878R9936m44564
66c65761O70187p7828j100305Q29851Q59511p91799n7237K50808q24169M25079
76a81663Q63691r36677l50047R68642j82566j37792N25088q45602n52356J174719
86C45437L1610q24492M59828J17238l43933P76635j04725j202878M10152P08984
96C73856n54299J60187L33194o91304L38192Q15356q15742m96427N80361k27909
$$ plain form
106 -184535 -170629 555424 -4216 -537848 376232 448013 -264636 -39199 -158858 -528801
116 -528801 316356 531228 -381787 -113566 420759 -78179 -1634 179685 -552467 -323967
126 -323967 534940 103205 -188749 270836 -64747 -193919 405799 -65695 -643489 60197
136 60197 291142 -56855 265422 106211 -411805 150581 357518 -404751 -281549 170340
146 170340 -81614 165269 427080 -233628 -253701 306736 -59545 -290694 104210 -122038
156 -122038 -164042 464993 227860 -311735 21603 56495 -234731 93933 46879 -357874
166 -357874 128030 457771 -57376 -92969 70457 -247406 -74137 225069 -193418 -181946
176 -181946 318288 130074 -47586 168299 -146061 -328601 135519 84697 -209591 94966
$$ packed form
106a84535J3906P26053n59640n33632R14080P1781p12649K25437j19659l69943
116e28801Q45157K14872r13015K68221N34325m98938P6545J81319p32152K28500
126c23967Q58907m31735k91954M59585l35583j29172N99718m71494n77794P03686
136F0197K30945l47997L22277j59211n18016N62386K06937p62269J23202M51889
146A70340k51954K46883K61811o60708k0073N60437l66281k31149L94904k26248
156a22038m2004O29035k37133n39595L33338L4892k91226L28664m7054m04753
166c57874M85904L29741n15147l5593J63426l17863J73269K99206m18487J1472
176a81946N00234j88214j77660K15885l14360j82540M64120n0822k94288L04557
$$ plain form
186 94966 149548 -55484 207070 117886 -364389 -135982 161845 -92057 -16522 166160 -65551
197 -65551 52553 269522 -129788 -267556 44525 -51607 -90011 203540 58457 -106735
207 -106735 174215 97359 -184413 -41525 -55154 -196716 119008 222608 -83459 7994
217 7994 158932 -65422 -66886 2080 -205553 -76193 224078 54736 -41206 135590 3675
228 3675 -114145 36492 -75055 -190055 60278 120136 8518 128003 72747 -142846 -22598
239 -22598 44321 -151556 -87390 75587 28969 103056 153214 -72922 -101566 50559 -66189
250 -66189 -132101 28690 27942 19184 155555 67970 -88956 -16606 -35894 -127546 -908 51879
262 51879 -37455 70151 151841 7068 -44732 -35768 -117079 -53115 55815 -23225 -5704 137456
$$ packed form
186I4966N4582k05032K62554q9184m82275K28407K97827k53902P5535J82682k31711
197f5551J18104K16969l99310j37768L12081r6132l8404K93551j45083j65192
207a06735K80950p6856k81772J42888j3629j41562L15724J03600l06067R1453
217G994J50938k24354j464O8966k07633J29360L00271j69342r5942J76796j31915
228C675j17820J50637j11547j15000K50333N9858j11618J19485n5256k15593J20248
239b2598O6919j95877O4166J62977m6618P4087N0158k26136k8644J52125j16748
250f6189o5912J60791p48q758J36371q7585j56926P2350j9288r1652J26638N2787
262E1879q9334J07606Q1690j44773n1800Q964q1311O3964J08930p9040J7521J43160
$$ plain form
274 137456 80299 -23067 -11571 -76743 -109143 2050 12107 -17240 87515 96839 -3237
285 -3237 12831 -5816 -118096 -83302 9984 6406 49487 89934 22579 16460 38627 -71415
297 -71415 -125318 -33326 5872 16511 73577 60570 24390 38213 -21152 -101525 -59869 -17355
309 -17355 -22832 40680 90283 47734 22805 2556 -57480 -62226 -36470 -48503 366 88642
321 88642 74296 22638 16589 -14771 -58032 -57882 -54989 -25923 51043 74695 40330 36974 20090
334 20090 -43098 -70782 -54819 -33736 8309 45698 50090 58009 45521 -22695 -68653 -52764
346 -52764 -37058 -24506 14705 51945 68336 56956 3359 -45395 -47704 -46695 -51870 -14109 44810
359 44810 67647 55030 27627 -5465 -32137 -55294 -65822 -33648 22776 51022 48737 43375
$$ packed form
274A37456n7157j03366J1496o5172l2400J11193J0057k9347J04755R324j00076
285c237J6068j8647j12280L4794R3286l578M3081M0447o7355o119K2167j10042
297g1415n3903R1992L9198J0639N7066j3007l6180J3823n9365q0373M1656M2514
309a7355n477O3512M9603m2549k4929k0249o0036m746K5756j2033M8869Q8276
321H8642j4346n1658o049l1360m3261J50K893K9066P6966K3652l4365l356j6884
334B0090o3188k7684J5963K1083M2045L7389M392P919j2488o8216m5958J5889
346e2764J5706J2552L9211L7240J6391j1380n3597m8754k309J009n175L7761N8919
359D4810K2837j2617k7403l3092k6672k3157j0528L2174N6424K8246k285n362
$$ plain form
371 43375 27990 -10384 -53929 -68508 -41056 -332 23537 39664 57191 50848 6557 -42741
383 -42741 -59064 -46177 -27117 -5070 29017 62776 62833 23247 -19367 -38506 -45978 -50504 -32710
396 -32710 14835 56200 58729 34812 9792 -13729 -42309 -62064 -47380 -1099 38239 47766
408 47766 43018 35785 11077 -34640 -66237 -53346 -16608 10094 29133 51201 56928 28041 -18413
421 -18413 -50787 -52030 -34125 -18191 6612 47457 65380 37252 -697 -23742 -40725 -47821
433 -47821 -39057 -9870 36231 59996 39254 16786 5683 -26348 -58274 -51624 -21982 15864
445 15864 46617 42775 31407 30786 -5926 -58769 -54650 -26665 -13977 17404 47995 45242 38918
458 38918 13082 -41829 -50608 -25731 -33938 -17880 42426 58119 38701 25013 -15088 -43666
$$ packed form
371D3375j5385l8374m3545j4579K7452M0724K3869J6127J7527o343m4291m9298
383d2741j6323J2887J9060K2047L4087L3759N7l9586m2614j9139p472m526J7794
396c2710M7545M1365K529k3917k5020k3521k8580j9755J4684M6281L9338R527
408D7766m748p233k4708m5717l1597J2891L6738K6702J9039K2068N727k8887m6454
421a8413l2374j243J7905J5934K4803M0845J7923k8128l7949k3045j6983p096
433d7821Q764K9187M6101K3765k0742k2468j1103l2031l1926O650K9642L7846
445A5864L0753l842j1368o21l6712n2843M119K7985J2688L1381L0591k753o324
458C8918k5836n4911q779K4877q207J6058O0306J5693j9418j3688m0101k8578
$$ plain form
470 -43666 -28164 -40252 -45556 22766 61316 34545 35216 23672 -31378 -39901 -33980 -53409 -8748
483 -8748 47552 25801 32484 62519 -2716 -56515 -29192 -36016 -36265 22125 23731 17467 73118
496 73118 39170 -53515 -36085 -19210 -55026 -9230 33435 8147 49483 70137 -19227 -34754
508 -34754 -5130 -67732 -54500 42674 22217 5974 68191 27935 -24574 8920 -49136 -98059
520 -98059 16063 50418 -14378 41911 63914 -16229 2910 -872 -99029 -44562 47654 -6997
532 -6997 19100 91788 695 -30749 36120 -43650 -89670 7063 -3396 -8279 103994 48290
544 48290 -62678 24010 25716 -88360 -33623 6216 -44811 60995 109387 -34286 -19716
555 -19716 50076 -62924 -62026 32607 -47215 -30378 115567 45829 -29379 43121 -38059 -98041
$$ packed form
470d3666J5502j2088n304O8322L8550k6771O71j1544n5050q523N921j9429M4661
483h748N6300k1751O683L0035o5235n3799K7323o824k49N8390J606o264N5651
496G3118l3948r2685J7430J6875l5816M5796M2665k5288M1336K0654q9364j5527
508c4754K9624o2602J3232R7174k0457j6243O2217m0256n2509L3494n8056m8923
520i8059J14122L4355o4796N6289K2003q0143J9139l782r8157N4467R2216n4651
532f997K6097P2688r1093l1444O6869p9770m6020R6733j0459m883J12273n5704
544D8290j10968Q6688J706j14076N4737L9839n1027J05806M8392j43673J4570
555a9716O9792j13000Q98R4633p9822J6837J45945o9738p5208P2500q1180n9982
$$ plain form
567 -98041 42208 7309 -99002 46349 101607 -5961 40635 15395 -124892 -16160 68762
578 68762 -79609 -32773 99852 5467 17073 95455 -74363 -115779 48459 -11090 -58355
589 -58355 80387 16288 -47758 120023 54312 -140734 -38556 14279 -63574 60315 71975
600 71975 -89837 37897 144334 -61142 -84703 13555 -85868 -15933 137682 -21271 -67152
611 -67152 111688 24418 -71859 37696 -64815 -139221 100124 109520 -67310 28776 51047
622 51047 -67472 47661 36156 -183346 -47776 146404 8438 1669 75606 -76161 -30951
633 -30951 122973 -74942 -154188 61035 37022 -6130 135153 -4379 -149122 65393 70404
644 70404 -122125 -22282 17625 -64752 128056 150862 -137655 -79513 92824 -44756 -39974
$$ packed form
567i8041J40249l4899j06311J45351N5258j07568M6596k5240j40287J08732Q4922
578F8762j48371M6836J32625r4385J1606P8382j69818m1416J64238n9549m7265
589e8355J38742o4099o4046J67781o5711j95046J02178N2835p7853J23889J1660
600G1975j61812J27734J06437k05476k3561R8258r9423O9935J53615j58953m5881
611f7152J78840q7270r6277J09555j02511p4406K39345R396j76830R6086K2271
622E1047j18519J15133j1505k19502J35570J94180j37966o769P3937j51767M5210
633c0951J53924j97915p9246K15223k4013m3152J41283j39532j44743K14515N011
644G0404j92529R9843L9907q2377J92808K2806k88517N8142J72337j37580M782
$$ plain form
655 -39974 43946 -106664 -13082 218248 22778 -124753 29004 -30917 -74343 101913 -16375
666 -16375 -153587 98745 145813 -45440 14175 -19359 -161728 50476 138471 -121654 -65304
677 -65304 124606 18958 32889 72264 -165140 -121126 150122 23302 -98390 59305 13154
688 13154 -20200 150261 -4272 -212587 -2967 80234 -43999 58972 40609 -118548 72121
699 72121 166593 -111102 -127125 21463 -42592 46787 144500 -91667 -94841 158038 44133
710 44133 -109443 -10392 -71943 -71652 168978 81314 -133486 22283 80571 -54414 26639
721 26639 -6984 -181829 17203 189732 -11924 -42605 43846 -65428 5643 114476 -120063
732 -120063 -154303 115234 87297 -12786 65473 -49354 -109839 106379 45951 -159283 -17418
$$ packed form
655c9974Q3920j50610R3582K31330j95470j47531J53757n9921m3426J76256j18288
666a6375j37212K52332M7068j91253N9615l3534j42369K12204Q7995k60125N6350
677f5304J89910j05648J3931L9375k37404M4014K71248j26820j21692J57695m6151
688A3154l3354J70461j54533k08315K09620Q3201j24233J02971j8363j59157J90669
699G2121R4472k77695j6023J48588o4055Q9379R7713k36167l174K52879j13905
710D4133j53576R9051o1551K91K40630q7664k14800J55769N8288j34985Q1053
721B6639l3623j74845J99032J72529k01656l0681Q6451j09274P1071J08833k34539
732a20063l4240K69537k7937j00083P8259j14827o0485K16218o0428k05234J41865
$$ plain form
743 -17418 70144 -11916 100885 74881 -151015 -44742 107319 -47015 -57542 32328 -59040
754 -59040 32789 184436 -29255 -145958 29918 12178 -45242 54272 -36464 -89693 133392
765 133392 117986 -92165 -36303 -1921 -83397 45559 76748 -102643 -16845 133209 12139
776 12139 -19145 16445 -118174 -61869 125973 8580 -86565 53968 43799 -4966 69796
787 69796 -47723 -154320 35155 86015 -45277 16459 44646 -45077 48769 71634 -113959
798 -113959 -81936 51213 -9180 18016 88905 -44630 -47996 100047 4615 -103327 -11958
809 -11958 -17856 -20752 109838 42183 -89198 25966 62317 -59136 -25853 -5488 -75081 37887
821 37887 115609 -21849 -29562 43245 -38348 -32065 41738 -59354 -67046 86419 61593 -14192
$$ packed form
743a7418Q7562q2060J12801k6004k25896J06273J52061j54334j0527Q9870r1368
754e9040R1829J51647k13691j16703J75876j7740n7420R9514r0736n3229K23085
765A33392j5406k10151N5862L4382q1476J28956L1189j79391Q5798J50054j21070
776A2139l1284L5590j34619N6305J87842j17393r5145J40533j0169m8765P4762
787F9796j17519j06597J89475N0860j31292O1736K8187q9723R3846K2865j85593
798a13959L2023J33149o0393K7196P0889j33535l366J48043r5432j07942R1369
809a1958n898k896J30590o7655j31381J15164L6351j21453L3283K0365o9593J12968
821C7887P7722j37458p713P2807q1593O283P3803j01092p692J53465k4826p5785
$$ plain form
833 -14192 29792 -25514 -70318 41755 16002 -93777 1753 73521 10083 36956 27289 -80948
845 -80948 -28531 47953 -39758 -37718 44420 3177 14740 80402 -18492 -83398 4108 -342
857 -342 -31974 33054 8346 -29837 68145 60426 -61172 -41075 -2631 -39731 13726 45075
869 45075 -29581 7227 75142 -3305 -38406 -1289 -49644 -39271 54869 22833 -22207 36829
881 36829 24695 -19925 13026 -25666 -81397 8238 58184 -1977 11770 31466 -15333 5694
$$ packed form
833a4192M3984n5306m4804J12073k5753j09779R5530P1768o3438K6873r667j08237
845h0948N2417P6484q7711K040Q2138m1243J1563O5662r8894o4906Q7506m450
857c42l1632O5028k4708l8183R7982p719j21598K0097L8444l7100N3457L1349
869D5075p4656L6808O7915p8447l5101L7117m8355J0373R4140l2036m5040N9036
881C6829j2134m4620L2951l8692n5731Q9635M9946o0161J3747J9696m6799K1027
$$ [...]
8191a59
##END NTUPLES=NMR FID
##END=
