##TITLE=1H_LR-721-R3-F1
 CDCl3
 8 sc, 
 9.10.2024
##JCAMPDX= 6.0         $$ Bruker NMR JCAMP-DX V2.0
##DATA TYPE= NMR FID
##DATA CLASS= NTUPLES
##ORIGIN= UXNMR, Bruker Analytische Messtechnik GmbH
##OWNER= root
$$ XWIN-NMR		Version 3.5
$$ Wed Oct  9 15:28:21 2024 Russian Standard Time (UT+4h)  she@DPX200
##.OBSERVE FREQUENCY= 200.1318
##.OBSERVE NUCLEUS= ^1H
##.DELAY= (6, 6)
##.ACQUISITION MODE= SIMULTANEOUS
##.ACQUISITION SCHEME= undefined
##.AVERAGES= 8
##.DIGITISER RES= 18
##SPECTROMETER/DATA SYSTEM= spect
##.PULSE SEQUENCE= zg30
##.SOLVENT NAME= D2O
##.SHIFT REFERENCE= (INTERNAL, D2O, 0, 15.7039)
##AUDIT TRAIL= $$ (NUMBER, WHEN, WHO, WHERE, WHAT)
$$ ##TITLE= Audit trail, XWIN-NMR		Version 3.5
$$ ##JCAMPDX= 5.01
$$ ##ORIGIN= Bruker BioSpin GmbH
$$ ##OWNER= she
$$ F:/spectra/data/she/nmr/H-F/1/audita.txt
$$ ##AUDIT TRAIL=  $$ (NUMBER, WHEN, WHO, WHERE, WHAT)
(   1,<2024-10-09 15:26:51.31 +0400>,<she>,<DPX200>,
      <created by zg, POWCHK disabled, PULCHK disabled
       configuration hash MD5:
       00 E9 B6 7A A2 85 ED C7 34 08 36 98 17 FE 4E 26
       data hash MD5: 16K
       78 13 E7 0C BD A1 3F 91 39 4E 34 31 AD E6 74 A0>)
$$ ##END=
$$ 
$$ hash MD5
$$ 01 29 4F BD 04 F4 36 F8 A4 3B C8 24 DC 70 A8 77
##$RELAX= 
##$RELAX= 
##$RELAX= 
##$RELAX= 
##$RELAX= 
##$RELAX= 
$$ Bruker specific parameters
$$ --------------------------
##$DU= <F:/spectra>
##$EXPNO= 1
##$NAME= <H-F>
##$PROCNO= 1
##$TYPE= <nmr>
##$USER= <she>
##$AMP= (0..31)
100 100 100 100 100 100 100 100 100 100 100 100 100 100 100 100 100 100 
100 100 100 100 100 100 100 100 100 100 100 100 100 100 
##$AQSEQ= 0
##$AQ_mod= 1
##$AUNM= <au_zg>
##$AUTOPOS= <>
##$BF1= 200.13
##$BF2= 200.13
##$BF3= 200.13
##$BF4= 200.13
##$BF5= 200.13
##$BF6= 200.13
##$BF7= 200.13
##$BF8= 200.13
##$BYTORDA= 1
##$CFDGTYP= 0
##$CFRGTYP= 5
##$CHEMSTR= <none>
##$CNST= (0..31)
1 1 145 1 1 1 1 1 1 1 1 1 1 1 1 1 1 1 1 1 1 1 1 1 1 1 1 1 1 1 1 1 
##$CPDPRG= <>
##$CPDPRG1= <>
##$CPDPRG2= <>
##$CPDPRG3= <>
##$CPDPRG4= <mlev>
##$CPDPRG5= <mlev>
##$CPDPRG6= <mlev>
##$CPDPRG7= <mlev>
##$CPDPRG8= <mlev>
##$CPDPRGB= <>
##$CPDPRGT= <>
##$D= (0..31)
0 1.2 0 0 0 0 0 0 0 0.06 0 0.03 0 0 0 0 0.0002 0 0 0 0 0 0 0 0 0 0 0 0 
0 0 0 
##$DATE= 1728473210
##$DBL= (0..7)
120 120 120 120 120 120 120 120 
##$DBP= (0..7)
150 150 150 150 150 150 150 150 
##$DBP07= 0
##$DBPNAM0= <>
##$DBPNAM1= <>
##$DBPNAM2= <>
##$DBPNAM3= <>
##$DBPNAM4= <>
##$DBPNAM5= <>
##$DBPNAM6= <>
##$DBPNAM7= <>
##$DBPOAL= (0..7)
0.5 0.5 0.5 0.5 0.5 0.5 0.5 0.5 
##$DBPOFFS= (0..7)
0 0 0 0 0 0 0 0 
##$DE= 6
##$DECBNUC= <off>
##$DECIM= 24
##$DECNUC= <off>
##$DECSTAT= 4
##$DIGMOD= 1
##$DIGTYP= 9
##$DL= (0..7)
0 120 120 120 120 120 120 120 
##$DP= (0..7)
150 150 150 150 150 150 150 150 
##$DP07= 0
##$DPNAME0= <>
##$DPNAME1= <>
##$DPNAME2= <>
##$DPNAME3= <>
##$DPNAME4= <>
##$DPNAME5= <>
##$DPNAME6= <>
##$DPNAME7= <>
##$DPOAL= (0..7)
0.5 0.5 0.5 0.5 0.5 0.5 0.5 0.5 
##$DPOFFS= (0..7)
0 0 0 0 0 0 0 0 
##$DQDMODE= 0
##$DR= 18
##$DS= 0
##$DSLIST= <SSSSSSSSSSSSSSS>
$$ [...]
##$SUBNAM2= <"">
##$SUBNAM3= <"">
##$SUBNAM4= <"">
##$SUBNAM5= <"">
##$SUBNAM6= <"">
##$SUBNAM7= <"">
##$SUBNAM8= <"">
##$SUBNAM9= <"">
##$SW= 24.0689170037331
##$SWIBOX= (0..15)
0 0 2 0 0 0 0 0 0 0 0 0 0 0 0 0 
##$SW_h= 4816.95568400771
##$TD= 16384
##$TD0= 1
##$TE= 0
##$TE2= 300
##$TE3= 300
##$TEG= 300
##$TL= (0..7)
0 120 120 120 120 120 120 120 
##$TP= (0..7)
150 150 150 150 150 150 150 150 
##$TP07= 0
##$TPNAME0= <>
##$TPNAME1= <>
##$TPNAME2= <>
##$TPNAME3= <>
##$TPNAME4= <>
##$TPNAME5= <>
##$TPNAME6= <>
##$TPNAME7= <>
##$TPOAL= (0..7)
0.5 0.5 0.5 0.5 0.5 0.5 0.5 0.5 
##$TPOFFS= (0..7)
0 0 0 0 0 0 0 0 
##$TUNHIN= 0
##$TUNHOUT= 0
##$TUNXOUT= 0
##$USERA1= <user>
##$USERA2= <user>
##$USERA3= <user>
##$USERA4= <user>
##$USERA5= <user>
##$V9= 5
##$VALIST= <valist>
##$VCLIST= <CCCCCCCCCCCCCCC>
##$VD= 0
##$VDLIST= <DDDDDDDDDDDDDDD>
##$VPLIST= <PPPPPPPPPPPPPPP>
##$VTLIST= <TTTTTTTTTTTTTTT>
##$WBST= 1024
##$WBSW= 4
##$XGAIN= (0..3)
0 0 0 0 
##$XL= 0
##$YL= 0
##$YMAX_a= 696629
##$YMIN_a= -789796
##$ZGOPTNS= <>
##$ZL1= 120
##$ZL2= 120
##$ZL3= 120
##$ZL4= 120
##$ABSF1= 10
##$ABSF2= 0
##$ABSG= 5
##$ABSL= 3
##$ALPHA= 0
##$AQORDER= 0
##$ASSFAC= 0
##$ASSFACI= 0
##$ASSFACX= 0
##$ASSWID= 0
##$AUNMP= <proc_1d>
##$AZFE= 0.1
##$AZFW= 0.1
##$BCFW= 1
##$BC_mod= 2
##$BYTORDP= 1
##$COROFFS= 0
##$CY= 11.3945322036743
##$DATMOD= 1
##$DC= 2
##$DFILT= <>
##$DTYPP= 0
##$F1P= 15.6554695791079
##$F2P= 12.8336369535428
##$FCOR= 0.5
##$FTSIZE= 0
##$FT_mod= 4
##$GAMMA= 1
##$GB= 0.15
##$INTBC= 1
##$INTSCL= 1
##$ISEN= 128
##$LB= 0.24
##$LEV0= 0
##$LPBIN= 0
##$MAXI= 10000
##$MC2= 0
##$MEAN= 0
##$ME_mod= 0
##$MI= 1.114404
##$NCOEF= 0
##$NC_proc= 0
##$NLEV= 6
##$NOISF1= 3.799351
##$NOISF2= 2.8
##$NSP= 1
##$NTH_PI= 0
##$NZP= 0
##$OFFSET= 15.70392
##$PC= 1
##$PHC0= -26345.17
##$PHC1= 14.58743
##$PH_mod= 1
##$PKNL= yes
##$PPARMOD= 0
##$PSCAL= 0
##$PSIGN= 0
##$REVERSE= no
##$SF= 200.130013532006
##$SI= 16384
##$SIGF1= 3
##$SIGF2= 2
##$SINO= 400
##$SIOLD= 16384
##$SREGLST= <1H.CDCl3>
##$SSB= 0
##$STSI= 0
##$STSR= 0
##$SW_p= 3612.71676300578
##$SYMM= 0
##$S_DEV= 0
##$TDeff= 0
##$TDoff= 0
##$TI= <>
##$TILT= no
##$TM1= 0
##$TM2= 0
##$TOPLEV= 0
##$USERP1= <user>
##$USERP2= <user>
##$USERP3= <user>
##$USERP4= <user>
##$USERP5= <user>
##$WDW= 1
##$XDIM= 8192
##$YMAX_p= 0
##$YMIN_p= 0
$$ End of Bruker specific parameters
$$ ---------------------------------
##NTUPLES= NMR FID
##VAR_NAME=  TIME,          FID/REAL,        FID/IMAG
##SYMBOL=    X,             R,               I
##VAR_TYPE=  INDEPENDENT,   DEPENDENT,       DEPENDENT
##VAR_FORM=  AFFN,          ASDF,            ASDF
##VAR_DIM=   8192,          8192,            8192
##UNITS=     SECONDS,       ARBITRARY UNITS, ARBITRARY UNITS
##FACTOR=    0.0002076,     1,               1
##FIRST=     0,             0,               0
##LAST=      1.7004516,     0,               0
##MIN=       0,             -789796,         0
##MAX=       1.7004516,     696629,          0
$$ Real data points
##PAGE= N=1
##DATA TABLE= (X++(R..R)), XYDATA
$$ [...]
2680C185o624M107P247j0982m890J0852j126m569M854j588k387O021k981n371
2694d252N170j130m262Q294K0q052N631J903p037M604J511j0509P476J0241j1779
2709b171k533J0804n633m431O859n190l535J1016k315p880Q222L69q201N099J297
2724A777o398N521J769o436O931J837j0766M531P061j0443O39R454p484M5R471
2739G509r167m338J2382n474r892J1521J785q703O387J823p611N701J357r999
2753f719N562O092q046K808N443q082K262N645r587J176R103q996j213J3478p562
2768A364q698J1934j893r007Q165n58q295J1317L100j3699L991Q230q479M62M544
2783B478p168M091P735r157m23P517p952j043R635p279m640J1217k810n540R053
$$ plain form
2680 3185 -3439 668 7915 -3067 -7957 2895 1769 -2800 2054 466 -1921 4100 1119 -4252
2694 -4252 918 -212 -4474 3820 3840 -4212 1419 3322 -3715 889 2400 -8109 -633 9608 -2171
2709 -2171 -4704 6100 467 -3964 2895 -2295 -5830 5186 2871 -5009 3213 3582 -4619 480 1777
2724 1777 -4621 900 2669 -3767 3164 5001 -5765 -1234 5827 -4616 -3977 5477 -2007 -1962 7509
2739 7509 -1658 -5996 6386 912 -8980 2541 4326 -4377 2010 3833 -3778 1923 3280 -6719
2753 -6719 -1157 4935 -3111 -303 5140 -2942 -680 4965 -4622 -3446 5657 -3339 -4552 8926 1364
2768 1364 -7334 4600 2707 -6300 1865 1307 -6988 4329 7429 -6270 -2279 5951 -2528 -2066 2478
2783 2478 -4690 -599 7136 -2021 -2444 5073 -2879 -3922 5713 -1566 -6206 5011 2201 -3339 5714
2798E714n383r611J3129K733j4359N107Q552p045K675L148j0817L036R843q557
2812a835k871Q085l969l59O859o687m709Q228l387l187Q532m843o597J2162J108
2827F530j2209L863L610o561P267K953j2380M349J1647q770m628O007l890n68
2841b780P890n455l769P594j893l482N304m590n487R214J330o471M192l24n193
2856c920Q034O61j2856M108J0099o534j190N045n713P54P812p267n496Q137k36
2871A438l557N172j745m877N207O80m842K572j333k794P745J253q905K368N027
2886C409n076J216K058o602L547Q620o915m615O971j512m089M498j287m113N249
2901A359J869l826J648l62l872L752J850m808N64L034p76K181o14o558L166N655
$$ plain form
2798 5714 331 -9280 3849 6582 -7777 -2670 5882 -1163 1512 4660 -6157 -3121 6722 -1835
2812 -1835 -4706 3379 -590 -949 5910 -777 -5486 2742 -645 -3832 4700 -143 -6740 5422 6530
2827 6530 -5679 -1816 1794 -4767 2500 5453 -6927 -2578 9069 299 -4329 1678 -2212 -2780
2841 -2780 5110 -345 -4114 3480 1587 -1895 3409 -1181 -6668 2546 3876 -2595 1597 1273 -3920
2856 -3920 4114 4775 -8081 -3973 6126 -408 -1598 3447 -2266 -1512 6300 -967 -6463 1674 1438
2871 1438 -2119 3053 1308 -3569 1638 2318 -2524 48 -1285 -4079 3666 4919 -3986 -1618 3409
2886 3409 -1667 -451 1607 -4995 -1448 7172 257 -4358 2613 1101 -2988 1510 223 -3890 1359
2901 1359 3228 -598 1050 688 -3184 568 2418 -2390 -1826 1208 432 2613 1999 -4559 -1393 4262
2917D262n636k091N580j597j018M117l702l639N210m46m357L634J734l767K061
2932C45K645l380j183Q15l97J997M50l312J871L082k287j346M32j941J558L230
2948B579l645r21N240j359m170K558N45l456J734K550j951O11J086k054L92J489
2964A228k340j319K521Q70P3r59o71J941M82l691m34L016o11j055K287o20j088
2981c70J480r63k430K106J451k922R61L129j147k353J135M53j241j31k37J106
2997B7J001l11n69j09r9J99o66j395J563K314j544j406K396L9k896O27R29o54
3015e54n9J437o70KJ377j401j798J077J037j085n29J939J067j658j066J055N9
3032B30j355K06P86N80K51K92j000l59J135q66k099J426K209j333j081J657P79
$$ plain form
2917 4262 -1374 -3465 2115 518 -500 3617 -85 -3724 1486 1040 -3317 317 2051 -1716 345
2932 345 2990 -390 -1573 -758 -1155 842 1292 -2020 -149 2933 646 -700 -268 -2209 -651 2579
2948 2579 -1066 -1987 3253 1894 -2276 282 827 -2629 -895 1655 -296 315 1401 -653 -261 1228
2964 1228 -1112 -2431 90 960 1033 74 -597 1344 1826 -1865 -2299 717 106 -949 1338 718 -370
2981 -370 1110 147 -2283 -177 1274 -1648 -687 2442 1295 -1058 77 530 -711 -842 -1079 27
2997 27 1028 717 148 39 -60 139 -527 -1922 -359 1955 411 -995 1401 1440 -1456 -829 100 -554
3015 -554 -613 824 154 156 1533 132 -1666 -589 448 -637 -1166 773 1840 182 -884 171 230
3032 230 -1125 -919 -133 447 698 990 -10 -369 766 -100 -2199 -773 1436 103 -978 679 1458
3049A458j756o87M71J07J36O27r9j02J083m83j694k08J847m93j836J506J966j034
3067H09j490R93Q8j025l94L99K33P17J047j149o80J292l16k036k17K678j3j619
3085f83R41J140r81j303L20K2N0N50J3l35R38P44j934q61J572L72j924L01K040
3104I82L45j720N37K73q54n23N60r8K22J658p76j306R99O77j836j033K062R27
3122A096j484k4J496k48j320o2pk17P75J48n37R73R48j001j605P92Q84j443m63
3141a299J595J145j094o74Q53m73o05K13k53L95J128J62j342P7J273j030j984
3158a913J071J681q67l81J045N57j106k68l03l00N92L63p49K95J327K50j923k02
3176h31J143l48j343J012J653j115n95R48k07q53N96o38l37J737M86j898J23J679
$$ plain form
3049 1458 -298 -985 -514 -407 -271 356 257 155 1238 755 -939 -1147 700 207 -1629 -123 1843 809
3067 809 -681 312 400 -625 -1019 -620 -387 330 1377 228 -452 840 524 -1512 -1729 949 936 -683
3085 -683 258 1398 417 -886 -566 -544 -494 56 69 -266 672 1416 -518 -1379 193 565 -1359 -1058 982
3104 982 1327 -393 144 417 -437 -960 -400 -498 -276 1382 606 -700 299 976 -860 -1893 169 1096
3122 1096 -388 -412 1084 836 -484 -546 -553 -770 5 153 -384 589 1537 536 -1069 -277 607 -836 -1299
3141 -1299 296 1441 347 -327 526 53 -552 -339 -592 -197 931 1093 -249 -172 1101 71 -1913
3158 -1913 -842 839 -28 -409 636 1193 87 -181 -484 -784 -192 171 -578 -283 1044 1294 -629 -831
3176 -831 312 -36 -1379 -367 1286 171 -424 524 317 -536 60 -578 -915 822 1308 -590 -467 1212
3194A212p31j518J0O51O29m38M95L36J21j034M72l61o68P77n2m56J265Q34k151
3213f07o54K224l86k366J106J572m88J73j07q19M43P88j452o80J225M00P6o1l91
3232dK90j62j247J048J135k353L40K585r28j104R53j239m52K103o12k434K475
3249C94J781k238n93J138j026L0R03j090L33J209o94J18Q90j868l79J414o08n5
3267c41J445j681j44L119j819l639L146J075k211J084O42j798J664J532l360l36
3283a622K377j216n55J939r01o97J402n15l90P04j735k67L467q37k872K373L90
3300A045k014J823q55l047L544K284m273O32K985k489l59J955k281p52L123j143
3316A78q63K218j563j661L049q21j962J506j1q10K864j383l425L282J489m076
$$ plain form
3194 1212 481 -1037 -1027 -376 253 -185 310 646 767 -267 205 -156 -824 -47 -99 -555 710 1544 -607
3213 -607 -1261 963 577 -1789 -683 889 401 574 467 -352 91 879 -573 -1253 -28 372 448 387 -4
3232 -4 286 124 -1123 -75 1060 -1293 -953 1632 704 -400 553 -686 -1138 965 353 -2081 394
3249 394 2175 -63 -656 482 -544 -514 389 -701 -368 841 147 265 1155 -713 -1092 322 -286 -341
3267 -341 1104 -577 -721 2398 579 -3060 86 1161 -1050 34 676 -1122 542 2074 -1286 -1622
3283 -1622 755 -461 -1016 923 22 -675 727 212 -178 526 -1209 -1476 1991 1154 -1718 655 1045
3300 1045 -969 854 -1 -3048 496 2780 -1493 -861 2124 -365 -724 1231 -1050 -1802 1321 178
3316 178 -685 1533 -30 -1691 1358 537 -1425 81 70 -740 2124 741 -2684 598 2087 -1989
3332a989R86K635k809J240K741l831m47L782k650j876L742j336j835L093j47k411
3348a112K013o17k086K903m60k805K766J399k946R09J506l464K122J606m046J245
3364a067M308l576j352L807j964k568L655j137k288L714m83l028K862P31l631
3379b017J856R36k452J931J233k975J904J469l707R02L111l837mL815k331p93
3395i59L404k952k125M728j004m137L622R02k614J791P45l348J947J550l078R41
3411e87K071k806Q35K775k841n37K282k264K45L054l047j410M797j024l593K560
3427E10k66k520L371K00l704K528K377l113K45J771k840N48K501k111l72K154
3443A279j608J36K173l054j092L585k65k327J783o85j466L633p80m402K429K216
$$ plain form
3332 -1989 -1003 1632 -1177 63 2804 -1027 -1474 2308 -342 -2218 1524 188 -1647 1446 1299 -1112
3348 -1112 901 284 -1802 1101 641 -2164 602 2001 -945 -36 1470 -1994 128 1734 -2312 -1067
3364 -1067 3241 -335 -1687 2120 156 -2412 1243 106 -2182 1532 1049 -1979 883 1614 -2017
3379 -2017 -161 775 -1677 254 1487 -1488 416 1885 -1822 -920 2191 -1646 -1650 2165 -166 -959
3395 -959 2445 -507 -2632 2096 1092 -3045 577 1479 -1135 656 1401 -1947 0 1550 -1528 -587
3411 -587 1484 -1322 -487 2288 -553 -1090 1192 -1072 -827 2227 -820 -2230 2567 1543 -2050 510
3427 510 244 -2276 1095 1295 -2409 119 2496 -617 -372 1399 -1441 -893 1608 -503 -875 1279
3443 1279 -329 -193 1980 -1074 -2166 1419 1154 -1173 610 -75 -1541 2092 1312 -3090 -661 1555
3459A555k496Q86J611l046J355K479k903p80J849r68J46K035j866j522K570j96
3475G09j417J123j521l68L455n84l385K043J089k096J487J09k878J951K567k535
3491b51o35K012j837j42K292j808j401J949N61o35J013j588j002K808m33k119
3507a216Q58N22j99J366p28k180J467J651k130j48J397j007Q9K215j787j451J752
3524D71k61o45J125n31j282J613J046j567n40M9J63J185n01j470J114J122j110
3541a9p1J34q18N42J184j182o62J574n77n33J095q31j100J290P11j024M6K94l08
3560b55O68K01j568L32J027k63J74l51k99Q89J80j345m8R47n86n8J157m81p54
3579d33R32n5m44m7j07o16Q79Q61j268k66N82K90k29l53l28M61M63j79k60K54
$$ plain form
3459 1555 -941 -55 1556 -1490 -135 2344 -559 -1339 510 -458 -312 1723 -143 -1665 905 709
3475 709 -708 415 -1106 -1474 1981 1397 -1988 55 1144 -952 535 644 -2234 -283 2284 -251
3491 -251 -886 1126 -711 -853 1439 -369 -1770 179 740 105 1118 -470 -1472 1336 903 -1216
3507 -1216 -358 164 -35 1331 603 -1577 -110 1541 -589 -737 660 -347 -258 1957 170 -1281 471
3524 471 210 -435 690 159 -1123 490 1536 -31 -571 -522 -359 826 325 -1145 -31 1091 -19
3541 -19 -90 44 -774 -232 952 -230 -892 682 105 -428 667 -164 -1264 26 737 -287 -241 53 -255
3560 -255 413 614 -954 -622 405 142 316 -35 -334 555 735 -610 -658 289 -297 -355 802 321 -433
3579 -433 499 444 0 -47 -154 -770 109 970 -298 -564 18 308 79 -274 -602 -141 322 143 -117 137
3599A37j93j50J42k16M8M55k4q3K87k94p40N11K15n11j63N59J27L71k38m15J95
3620B0K8M9n50K88K21L09k73j98K24K01o11l33Q72l58j29K22K61q6J74l38n77
3641e84M18N35p45K56L71J52k54m65R5L23l04J34Q3K93R9n54j90L94J53k22m80
3662d92N12K96l96lL20l4m82j0K42j98J87K35j12K17N4n42K51k08L35m02jM70
3684B39J06k82n40M77L34o75L51P6O8l6K4k18L6J67j29l59J37O12j06k89K3K71
3706B87l82K1q2K51J8p1J44j14J50j01k22k82K96P1m70N79K67j28n06K70K46l14
3728g2l4k14K39J86J56k84L1R2Ok79j53M31k5r7m2J97O7k88L2n5j75J64J75P3
3752A31R0O7k53j90J1L91m00K39J99j76j31R0N2j33l8m15K45J99M4J37k63J42
$$ plain form
3599 137 -56 -206 -64 -280 -232 223 199 116 403 109 -631 -120 95 -416 -579 -20 107 478 240 -175 20
3620 20 48 97 -453 -165 56 365 92 -106 118 319 -292 -625 247 -111 -240 -18 243 157 331 -7 -584
3641 -584 -166 369 -376 -120 251 403 149 -316 -221 102 -202 -68 15 308 407 -147 -337 57 210 -12 -492
3662 -492 20 316 -80 -83 237 203 -279 -289 -47 -245 -58 177 65 282 336 -206 45 -163 172 -230 -231 239
3684 239 345 63 -477 0 334 -341 10 86 154 118 142 -76 -40 127 -2 -361 -224 388 282 -7 16 287
3706 287 -95 -74 -156 95 113 42 186 72 222 121 -101 -383 -87 -16 -486 93 360 232 -274 -4 242 -72
3728 -72 -106 -320 -81 105 261 -23 8 100 106 -173 -326 105 80 -17 -59 138 205 -83 -51 -106 -281 -117 58 131
3752 131 221 288 35 -155 -144 247 -153 86 285 109 -22 68 120 -13 -51 -466 -221 -22 22 159 -104 38
3774C8K9mm38L30J65o5j93J50L44m10k35J70L2M1J88j56J59J65k33m43K31J49
3796A4J4k75R0M64j44k52L7O8q2l8kj18K71J1P0j30J07j05k91L7K38J90k07n5
3820h8J86L08l63k28K43k73L68k13q9m3L45p9j15j14J91j77j53K75J55l39K83
3841H0P6j31j70J25k63Q3N55k85j06O2P7l52O0n6Q5j28K97l12L79J53k26k01K55
3864E7R7k51K46k51J29J74k04j69K28J04k31P3Q2k79O8K09J2P0j65k6q0M6N5K93
3888B87m57L39P6j77l97K81J84n06L37J53j32qM04l70k94L91P5k38J64J01j81
3909C2j01L60k20j15J03l4N5p5j8k06M30l20J60j69j4J01K52l45j6M71j32n83
3931c84L84Q1k10P7M36n13K5L69k73J03J70l06j16K39j96J15Pk49L47K03n81j43
$$ plain form
3774 38 67 63 -375 -45 120 55 -138 12 356 -54 -289 -119 -87 -46 142 -14 145 310 77 -366 -135 14
3796 14 28 -247 -157 307 163 -89 -52 16 -66 -104 -106 -224 47 58 128 -2 105 0 -291 -254 -16 174 -33 -88
3820 -88 98 406 43 -185 58 -215 153 -60 -149 -192 153 74 -41 -155 36 -141 -294 -19 136 -203 80
3841 80 156 25 -145 -20 -283 -200 355 70 -36 26 103 -249 -189 -245 -160 -288 9 -303 76 229 3 -198 57
3864 57 154 -97 149 -102 27 201 -3 -172 56 160 -71 2 84 -195 -127 82 94 164 -1 -27 -107 -61 -6 287
3888 287 -170 169 245 68 -329 -48 136 -370 -33 120 -12 -20 384 14 -280 111 186 -52 112 213 32
3909 32 -69 291 71 -44 59 25 80 5 -13 -219 211 -109 51 -118 -132 -31 221 -124 -140 331 199 -384
3931 -384 0 81 -129 -52 384 -129 -104 265 -8 95 265 -41 -157 82 -114 1 8 -241 106 309 -272 -415
3953d15O19m84j02P54j54m79O18j7p80M68J45l27J57L94m37k07P56o67j24M75
3973A93l02j86N15k20N2J05k7j22KJl75P66Jn79J58K73p41K90M52m04j34Q60n99
3996b1l5P46n74n03P46l05n44M15K26j90L26l29m05M19J36q63Q10O4l38L47K90
4017D18p95K96P99j130n0R23n67k93R49l45n70M80M1p28N13K10m37M66K07n85
4037a98J17J0l62K90N1j86N48N33j063k60J156o11l07P91o75l19J124j17j431
4056i09J053M91j281O53M41q30J79K47Q6m31N23q00L23Q30n61j91L32k77L3P82
4076F93j202j23J429n47q73Q53m6p46R35Q6j284N50J033j135J75O71p28M2P04
4095D87o5p83k09L82M65L65r13j41Q65m4p13M82r06J48J201J52j347L96Q32j290
$$ plain form
3953 -415 204 -280 -382 372 218 -261 357 340 -440 28 173 -154 3 397 -40 -247 509 -158 -282 193
3973 193 -109 -295 220 0 52 157 130 8 10 11 -364 402 403 -176 -18 255 -486 -196 256 -148 -282 578 -21
3996 -21 -56 690 116 -387 359 54 -490 -75 151 -39 287 -42 -447 -28 108 -755 55 119 -219 128 418
4017 418 -377 -81 718 -412 -462 461 -106 -399 550 205 -365 115 156 -572 -59 151 -286 180 387 -198
4037 -198 -81 -71 -433 -143 -92 -278 270 803 -260 -520 636 25 -282 509 -166 -485 639 522 -909
4056 -909 144 635 -646 7 448 -382 -203 44 130 -301 222 -578 -255 575 14 -177 155 -122 -89 693
4076 693 -509 -632 797 250 -623 230 184 -562 373 459 -825 -275 758 -377 -202 469 -259 -217 487
4095 487 422 -361 -570 -188 277 642 -271 -412 453 409 -304 178 -728 -580 621 773 -574 -178 654 -636
4115f36P95K53j254M73J059l69l89J05l55K51P75p02q68P49L95j66K66o05j18
4134c41R94k98r39N09J22m71Q71J5j134M45Q71p14l6N09j137K19J570n55j093
4153e93M83K99n8Q5p34J20Q50k16k31m2j8j04P70p83n14P41J64k27N2L59r71J09
4175d59J139n97p65M59L67L0K70m07j119J056O38m01p43K26N12J80l52j77n8K12
4195A1p3L34l53l49N83N62q80o7J01o24O13J009q37n14O88M17j62q59K09N1M23
4216B83K9k77k67M96J01l75k20k84N89k15n2P56m17l96M73K60q35k35L68K23R2
4237I7K17m27N2J80N1k64m21N22L54k17m84M89K8m76K10K49o43L05N59j51k77
4258d7M94m06n34P83J7q66J67O68J39r2m06Q2L7j42j33M0J17O6J66j5k18O0J6
$$ plain form
4115 -636 159 412 -842 -369 690 321 -68 37 -318 -67 708 6 -862 -113 282 116 382 -223 -341
4134 -341 653 355 -584 -75 47 -424 447 462 -672 -227 644 -70 -106 403 -734 -515 1055 500 -593
4153 -593 -110 189 131 216 -518 -398 452 236 5 -37 -55 -159 611 -172 -686 55 219 -8 44 403 -568 -459
4175 -459 680 83 -682 -223 144 174 444 37 -1082 -26 612 211 -532 -306 206 386 34 -143 -201 11
4195 11 -62 272 -81 -430 153 715 -165 -232 -131 -755 -142 867 30 -484 204 621 459 -400 -191 -140 283
4216 283 312 35 -232 264 365 -10 -230 -514 75 -140 -192 564 147 -249 224 484 -351 -586 -218 5 97
4237 97 314 -113 -61 119 170 -94 -515 7 361 144 -340 149 177 -299 -89 160 -483 -178 381 230 -47
4258 -47 447 41 -493 290 307 -559 -392 276 415 323 -83 -1 36 -106 -239 -199 -82 -16 150 135 -83 -23 -7
4281go31M38M46m33k45R08n2r72M25J83k48K22J59k86R9M27l97l76Q5LJ59j70
4303b63JO48j23l16J33K15n49K1M37k88Q7N68m85k96N53o5q69K85N79k64k55N05
4325B59J40l40J16j96j06L38j85NK89j67L91o45l65M41L40r81J42J029P6p24J45
4346BM05o63p0L28l26L50N99n56k18O51k02q14QM80P4l21l5N64rm27L54m89N8
4369b57j07O10m39Q0O53k14o08M02R4p17RP08R1m98N36m08j06L52%n35R6O19r8
4392B63l22K42K00j50p00K88M36l92k0Q36m63m79K42N7l46P7P00q03N10M73m24
4413B25n18L32M71p79j26M98K28j84k13K20r2k2k50k52J84O20J16m95NN22j21
4434C69j012K04Q57n89p9M38J24m35J08L62q95M42L92m47k7P45L0q80L17K52l35
$$ plain form
4281 -7 -638 -200 246 -187 -432 476 424 -548 -123 60 -188 34 193 -93 6 433 36 -340 -255 -252 -93 -263
4303 -263 -262 386 263 -53 80 295 -254 -233 204 -84 3 571 86 -210 343 278 -591 -306 273 9 -246 259
4325 259 399 59 175 -21 -127 211 26 31 320 153 544 -101 -466 -25 315 -666 -524 505 581 -143 2
4346 2 407 -256 -326 2 -324 26 625 69 -149 502 300 -514 -506 -26 48 -273 -308 256 247 -180 174 -315 -257
4369 -257 -364 246 -193 -113 540 326 -282 120 214 -503 -494 214 305 -193 343 -65 -171 181 181 -354 -258 361 263
4392 263 -59 183 383 233 -467 -179 257 -135 -155 681 218 -261 -19 38 -308 -231 469 -334 176 649 225
4413 225 -293 39 510 -269 -395 103 331 147 -66 154 62 40 -210 -462 -278 342 458 -37 -32 490 369
4434 369 -643 -439 418 -171 -250 188 312 -123 -15 347 -548 -106 286 -161 -188 557 587 -293 24 276 -59
4455e9m18K02M95j69r7K87N5k89K1k4m93K14P66l96k90O67M0j170L02O12j86m42
4477c72N90L11l87j42j88k8j04M44j74m23O41M10l01n36L04J83l99j48N72l36
4497h3j82P00Q5q13N10L3q14L45O72n04j76N58K57q18n9J58K47n00J93M52k14
4518D7N4K04l85o02N95M18p36r2J206k84j013Q59L00j198K65O65m77O1N34l30
4538I1k13K76j01p31L23J78K43o6Q4N9N16q45k67O33m62l42J121k59o81R53j51
4559C59r95O37O32j300M28J159o18n68O05o6n46R3J4j99P58j38m08L22M2k07J81
4580A85q92n0J216l67o73J246J62j543O29Q78j363J85J017p85q6J039p95r44J302
4599C61l15p91N38N44l31L16k47j32N65m35r43Q49L13q28O51O01r47N07L80j756
$$ plain form
4455 -59 -477 -275 220 51 -46 241 296 7 28 4 -489 -275 491 95 -195 472 512 -658 -356 256 70 -372
4477 -372 218 529 142 0 -188 -216 -320 124 -50 -473 168 578 277 -259 45 228 -171 -319 253 -83
4497 -83 -265 435 520 -293 217 250 -564 -219 453 -51 -227 331 588 -230 -289 -131 116 -384 -191 261 47
4518 47 101 305 -80 -682 -87 331 -405 -497 709 425 -588 271 571 -627 -362 303 -174 -113 421 91
4538 91 -122 154 53 -678 -355 -177 66 0 84 143 659 -186 -453 180 -282 -624 497 238 -443 510 359
4559 359 -636 1 633 -667 -239 920 302 -266 339 273 -273 -180 -166 -365 393 255 -153 169 211 4 185
4580 185 -707 -757 459 92 -581 665 827 -716 -87 791 -572 -387 630 -155 -241 798 3 -941 361
4599 361 46 -745 -207 337 6 322 75 -57 508 73 -870 -21 292 -536 115 716 -231 276 656 -1100
4619a100N08J256r60o30J637j63j333J091k97o15P09P3p27R03K96q20M43n1m96
4638b76L30j03o59J229J48j278N41Q79j504qJ283q82k84J505r62m92J292l58j482
4657a081Q71Q64j235K23Q74j77q0M5j123P73N25r34k0J224j074P27L43j488K51
4676d92J231j026l64J764r65j065J675J1j877J089J89o32O97M56j358O36J135
4693A104p02q56J06p9R75J01j175L16R35p64p4N76j355K21J475p36o88J215m34
4712A61q26J409J78k442O11J857k17p82Q8k62N43M27j042n68N83M54L15k40q75
4731f28O37P24p47l97M70l81k45J671o27j385M42J029p66K71l65p92J029J431
4749A371j051j166N50N53K55n14r23N21R77M6j6n42p58R67M07j029k15O34j28
$$ plain form
4619 -1100 -592 664 -296 -926 711 548 -785 306 9 -606 103 176 -551 352 648 -172 271 220 -276
4638 -276 54 -49 -708 521 669 -609 -68 811 -693 -701 582 -300 -584 921 -41 -533 759 401 -1081
4657 -1081 -210 654 -581 -358 516 339 259 304 -819 -46 479 -455 -475 749 -325 402 745 -743 -492
4676 -492 739 -287 -651 1113 148 -917 758 769 -1108 -19 170 -462 235 691 -667 -31 1104
4693 1104 402 -454 -348 -427 548 649 -526 -210 725 -39 -113 463 -892 -671 804 68 -620 595 161
4712 161 -665 744 922 -1520 -909 948 731 -51 37 -225 318 745 -297 -865 -282 172 487 247 -628
4731 -628 9 733 -14 -411 59 -322 -567 1104 477 -908 -466 563 -203 68 -297 -1089 -60 1371
4749 1371 320 -846 -296 257 512 -2 -925 -404 573 619 603 61 -697 270 677 -352 -567 67 -61
4768f1L29O68j370r02J051J118j062m45L01O23M85k01q10p70R82O14k49j088Q4
4787g03J311J05o32k7o23k95J056R91j435m82J138L22m36j10j007o3J680j56p88
4806a54m96Q40P83l22j281l34J117K24k5J54o63m56J738l82j447K58M65l18J064
4825G65O0j711J91J841n07j278j04K81O54P94q07q72P50R1J60o79n31L09J324
4844G31l06o48Q00n56p68J210K11k065Q03J478n60j99M45j289M85J441j313j193
4862a293J269O16j72M0o91l15Q37k21o32P77n15l90J552m09j488J115Jp67Q39
4881A53M95j685Q43J991j488r94Q66l46k42O84l77k50J328m62p40N52n8j073R04
4900A01k12m83J143j51r77J535j47k082J081J083j347J61J129j062j07J325j132
$$ plain form
4768 -61 268 936 -434 -1336 -285 833 -229 -674 -373 250 735 534 -276 -1046 -64 550 301 -787 -703
4787 -703 608 713 81 54 -569 -864 192 1183 -252 -734 404 726 290 180 -827 -890 790 634 -154
4806 -154 -650 190 973 651 -630 -964 153 377 352 506 -157 -613 1125 743 -704 -446 19 -299 765
4825 765 825 -886 -695 1146 639 -639 -743 -462 192 986 179 -693 57 148 308 -371 -902 -593 731
4844 731 425 -223 577 21 -747 463 674 -1391 -588 890 330 131 576 -713 -228 1213 -100 -1293
4862 -1293 -24 592 420 460 -231 -546 291 70 -562 215 -300 -690 862 453 -1035 80 81 -686 153
4881 153 648 -1037 -194 1797 309 -685 181 -165 -407 277 -100 -350 978 516 -224 328 270 -803 101
4900 101 -111 -594 549 398 -579 956 809 -1273 -192 891 -456 -295 834 -228 -335 990 -142
4917a42j167J676j14j025R94M32r24N91j03p92M88L4n05J092R4q62M96J82j052
4936f07O81K26j443R37J553j534n14J525n16j322J180Jj041J288j30o89O83M10
4954F88j140J66K58k62O4K31k11J047m20q54K50O43j103K85R81q33j74J370j008
4973b2o52J340o05j172J118R19j466M07P62q90J88K48o73J62P73m91OL37jj89
4993I9O4o63K28P21j074K37J431p28j159J193k04p44N33L12o92L01J008j070k17
5012d24J143m72r80M80L39J24j16mJ20J5m03kK92n16J59P09m30K67J41k03q49
5033f10P94J75j144K80J243n40j40O3Nj94p7k0m4L06M17l84l14M05k21p1m24K94
5055b01P32m06l90P86K1r06K63n6l45L98M48p03L42Q02o34j068O05N20m00j96
$$ plain form
4917 -142 -1309 367 253 -772 222 654 -270 321 218 -574 -86 -52 -557 535 629 -233 263 445 -607
4936 -607 74 300 -1143 -206 1347 -187 -701 824 308 -1014 166 167 -874 414 284 -405 278 688
4954 688 -452 -286 -28 -290 -226 5 -206 841 421 -433 -183 460 -643 -358 623 -210 -384 986 -22
4973 -22 -674 666 61 -1111 7 926 -540 -133 629 -261 -73 175 -498 -336 437 -54 -48 289 288 99
4993 99 163 -500 -272 449 -625 -388 1043 315 -844 349 145 -599 -66 246 -446 -145 863 -207 -424
5012 -424 719 247 -733 -253 86 210 94 90 210 225 -178 -180 112 -404 -245 464 34 301 442 239 -610
5033 -610 184 359 -785 -505 738 198 58 121 126 -68 -145 -165 -209 97 514 130 -184 221 0 -71 -495 -201
5055 -201 531 125 -265 521 542 -364 -101 -157 -502 -104 344 -359 -17 785 151 -917 -312 208 -192 -388
5075c88M38K84j07j60j01L2j46qj78%N15K13m17k4O05m02n53J77P10n74o5O05
5097D56l4q74M77j68l30M31L52m25j94Q50k21n79m1N16l82k51L78M42n1k70J84
5118B66k08k87K64j60m34O59L96m22k63P43m42p10l7Q56m29k69Q96k69k50K37
5138A37k97k33J52M35o04K99L17J79n23k23M87K05q77N7P59o7q6J42J13q34N25
5159F3j3n87L85O34k00q12R56j90m84k10L29M11l99J46L28L4m92J78m08r7M82
5180E4J0l67N4R44n64q48R87O6p15J26N17k24J75L80n68m25N29k79l50O46J48
5201B96k48j50p7L91J86j121M13N87k86j59M82R8m79K04j5q12O92M00r57M25R19
5222G89k46q59M73o6l25j69L00P3J57J18L8r6j89j53J7l03L72O38o47k55R86j69
$$ plain form
5075 -388 50 334 227 67 -34 -2 -148 -156 -334 -334 181 394 -23 -47 558 156 -397 -220 490 -84 -149 456
5097 456 422 -452 25 -143 -473 -42 310 -115 -309 541 320 -259 -300 216 -166 -417 -39 403 352 82 266
5118 266 58 -229 35 -125 -559 100 496 74 -189 554 112 -598 -635 221 -208 -477 419 150 -100 137
5138 137 -160 -393 -241 194 -410 -111 206 385 -138 -361 126 331 -546 -489 270 203 117 259 372 -462 63
5159 63 50 -537 -152 482 282 -530 426 236 -248 -458 -129 282 -117 29 357 391 -101 77 -331 -428 54
5180 54 64 -303 -249 695 131 -717 270 336 -379 -253 264 40 215 595 27 -398 131 -148 -498 148 296
5201 296 48 -102 -179 212 398 -723 -310 277 -9 -168 314 412 -67 137 122 -690 2 402 -555 -130 789
5222 789 543 -316 157 91 -234 -403 -103 -30 127 245 283 187 -2 -155 -138 -441 -69 569 -78 -333 653 484
5244D84j229M48M55m62J19N50k81l67R83o08o60K81N65q10L51N18N1l49l45M56
5264A50l86k14j67O45K94m41O03j37n45L57J15j135O84R70j050l30J166nq94R6
5284b24J33n18M63K97k60L93j20J3m09j20N06J84p18J96P73m37l73M82J35r10
5304e14K31O01o53J04P08n90j38O95m69p81L52O26R8m61m7N89j14k31K1m49j17
5325e39N51M06l16k2N40k29o61P13m71r45Q33J201p99p39O88K4n1j59m46k15P86
5346A50N48l65n95Q2L04r6o46L89M22l71N25M86q91o20O88M72p02J35l9k33J243
5367H86j56j010k98O42K65k86l82r1J235l93o08M38l85l77Q95K39j195L31P58
5386E08l90K8N17j220n32J747M53j930L40Q33N5n8m80j006Q45R93m96j57l00O0
$$ plain form
5244 484 -745 -297 158 -304 -185 365 84 -283 700 92 -568 -287 278 -532 -181 337 388 39 -306 150
5264 150 -236 -450 -617 28 322 -119 484 347 -198 159 274 -861 -177 793 -257 -587 579 574 -320 -224
5284 -224 -91 -609 -146 151 -109 284 164 177 -232 -352 154 338 -380 -184 589 152 -221 261 396 -514
5304 -514 -283 318 -335 -231 477 -113 -251 444 -25 -806 -454 172 270 -191 -238 351 237 6 27 -422 -539
5325 -539 12 418 102 80 620 391 -270 443 -28 -973 -140 1061 262 -477 211 235 184 25 -421 -636 150
5346 150 698 333 -262 -180 124 28 -618 -229 193 -178 347 833 -58 -678 10 482 -220 -85 -124 -357 886
5367 886 730 -280 -578 64 329 43 -339 -430 805 412 -196 242 -143 -520 375 614 -581 -250 508
5386 508 118 146 663 -557 -1089 658 1111 -819 -479 354 409 351 -129 -1135 -290 703 207 50 -250 -190
5406a90R04j41j419K67N87m54R48L31j476k8J957o15j614Q07k83m09J896l86k005
5425a323J115J226q40l11j23n52J087M89r34m4O68o61P42J59j899M08J638m42
5443D03k24O58j519l3K185j089k464J856R88r17P21m10j185P98J367j770l06J033
5461I2n18Q46O86j521j07J069q01j68J079j853K85K588j060k061J500K69j076
5478g51J535m49k290K391J571k234l72Q97r53L61J134j548PJ699o07p54J301j641
5496g03m69J747o70p68J205n02l83K159j051k562K161J032k184Q16J115j862J072
5513A53J427k318n09K159j155n32J577q15n30J303l94j017Q72p10k36J807n49
5530E33j713J726K30j675R26L13k013J562J941k848L55K366j908o14J807j331
$$ plain form
5406 -190 714 573 -846 -579 8 -446 502 833 -643 -671 1286 671 -943 -136 -419 -828 1068 682 -1323
5425 -1323 -208 1018 178 -133 -256 -808 279 768 -166 -210 458 -203 539 698 -1201 -793 845 403
5443 403 179 837 -682 -715 1470 381 -2083 -227 761 -156 565 155 -1030 -232 1135 -635 -941 92
5461 92 -426 420 1106 -415 -522 547 -254 -422 657 -1196 -911 1677 617 -1444 56 325 -751
5478 -751 784 335 -1955 436 2007 -227 -599 298 -655 -294 840 -708 -701 998 391 -363 938 -703
5496 -703 -1172 575 -95 -863 342 -160 -543 1616 565 -1997 164 1196 -988 -172 943 -919 153
5513 153 1580 -738 -1247 912 -243 -775 802 -13 -543 760 366 -651 221 -489 -725 1082 533
5530 533 -1180 546 776 -899 27 340 -1673 -111 1830 -1018 -663 1703 -205 -819 988 -343
5546c43r05K137o34o71J379n54j153J050K27j476J021rn82J234j55j594J377Q12
5564A161k612R26J721j826L04J691j357q01J983j231j328K025r6j737J701L59
5580H83j236P93j29j349J293K34j440Q95Q83j382O59O18j611Q16R35j693J91K145
5598A505j558j011K291p13j787J561P0j169J403L38j860R28J024j093o91Q51l83
5615b94L78L15n64L10N40j270K36J245j774J11J516q37l56J614j160j162J605
5632D53J3k064J336J316j208L1R63j056j20O95q81J06M40Jm7N19o47mL10o06J87
5653b63O59r73r8K050p48j393J099j83o60O12K21j025P73P87r82k91R43o94k54
5672d20N11J35k02M36N4m33K95r28J96L57k39P2N31j54l26P77m42j520R41J056
$$ plain form
5546 -343 -1248 889 255 -416 963 409 -744 306 533 -943 78 69 -513 721 566 -1028 349 1161
5564 1161 -1451 -525 1196 -630 -326 1365 8 -793 1190 -41 -1369 656 560 -1177 524 883
5580 883 -353 440 311 -1038 255 489 -951 -56 827 -555 104 722 -889 -73 862 -831 -640 1505
5598 1505 -53 -1064 1227 514 -1273 288 358 -811 592 930 -930 -2 1022 -71 -762 89 -294
5615 -294 84 399 -165 145 685 -585 -349 896 -878 -767 749 -88 -444 1170 10 -1152 453
5632 453 466 -1598 -262 1054 -154 -123 840 -216 -336 359 -522 -416 24 25 -22 497 -150 -154 156 -450 -263
5653 -263 396 -577 -675 1375 627 -766 333 150 -510 102 323 -702 71 858 -124 -415 528 -166 -420
5672 -420 91 226 24 460 514 81 376 -552 -356 1 -238 -166 365 211 -115 662 220 -1300 -359 697
5692F97j180K9J430n03q09N76m11l68M02l4k05L58L02l05j10L23j07l11l1m7P88
5713D84k56l41M85k24n51K58j07l49N76O35o85j44P44k80q54L07P51n81l58P16
5733B26mk64K42l07k5j63J15K63m14N15J39m68j21L59K50r70L62N25k11k35O04
5754D18q1m18P7J00p30N08O57o86l8P90Mj195J20Q86n55j84M00J76k4j87R4k82
5776a50j79L79m4m34M35P47n43n04N07R3j055K99O38j03j44J55K80l49O9j46m13
5797d62L51M18j24k95L37L66q91j31M13R2n55K29O31k41k78M99m05mL8j9l84K62
5819a53P49m01n72N67K32p42l40O74K45n20O18k9m44Q9J94k85l04O11L8m46J66
5840e3Q26o19n39K46M75o95j17N90j8qj33J44m66L01K36p19J83Q42K53q24K1N87
$$ plain form
5692 697 -483 -454 976 473 -336 240 -171 -539 -137 -171 -376 -18 284 -21 -131 192 85 -226 -257 -304 484
5713 484 228 -113 372 148 -403 -145 -252 -601 -25 610 -75 -219 525 245 -609 -302 449 -132 -490 226
5733 226 222 -42 200 -107 -132 -295 -180 83 -331 184 323 -145 -266 93 343 -627 -265 260 49 -186 418
5754 418 337 -81 -4 96 -634 -126 531 -155 -193 597 601 -594 -474 412 -143 -327 73 249 225 38 132 -150
5776 -150 -329 50 6 -428 7 754 211 -293 214 307 -748 -449 189 86 -58 97 377 28 97 -49 -462
5797 -462 -111 307 183 -112 225 591 -300 -431 -18 74 -481 -252 379 138 -140 359 -46 -50 -12 -31 -415 -153
5819 -153 596 195 -377 190 422 -320 -660 14 259 -261 357 328 -116 -27 167 -118 -422 189 227 -219 -53
5840 -53 773 154 -385 -139 336 -359 -476 114 96 88 -45 99 -367 -66 170 -549 -366 476 729 -95 -74 513
5862E13m15o11K70L73l14K89M00k40l99K42k47m82M46L01k67l01R71k03m60j34
5882b68L70l45j75N22M5k7O7M5k22k40L04l3p56Q28N15p08M1O34j63j050L23L33
5904D0j77J90M44n29J03M75k38n91j69L52K43l73M16M19m73n33M04q7n33M44L15
5925A42l27L03L57o64j9L95m03m30N40N82n67J44L45O3m41l74J83N8K83N2J29
5946C51l39j20N32l39n57N17K05r84R25P79r80m80P80q3m90L28j65k86P02K46
5966E42j013M76K59k83j47j86Q1P41k94l1O09r30n94Q63K23j265Q32O83m78J81
5986B69N32j507N0J388m65j061P09L46j36L31l65n81M03J59l20N01k05m34R00
6005E14K67j150N36k49p76J469L79k041M44K047j102j130J358r34j98J552m37
$$ plain form
5862 513 98 -513 -243 130 -184 105 505 265 -134 108 -139 -621 -175 126 -141 -442 529 326 -134 -268
5882 -268 102 -243 -418 104 149 122 189 234 12 -228 76 43 -713 115 630 -78 -37 597 434 -616 -293 40
5904 40 -137 53 497 -32 71 546 308 -283 -452 -100 143 -230 186 605 132 -401 3 -84 -617 -173 142
5925 142 -185 118 475 -189 -208 187 -216 -646 -106 476 -91 53 398 461 20 -354 -171 -113 170 222 351
5946 351 12 -108 424 85 -472 45 250 -734 191 970 -10 -490 290 207 -283 45 -120 -406 296 542
5966 542 -471 5 264 -19 -166 -352 -271 470 176 145 754 -176 -770 93 316 -949 -117 566 88 269
5986 269 801 -706 -656 732 267 -794 -85 261 125 456 91 -490 -87 72 -248 253 48 -386 514
6005 514 781 -369 167 -82 -858 611 990 -1051 -607 1440 338 -792 566 -368 -566 986 549
6022E49j471J079O67p27K25n85q08J231L09n67M94k40p39J143M24k207N91J470
6040H38j025R0J182j907J58K137j287j809J782L60r16J312o25j348J336O53j582
6057f51L33J65m85J005R57k017N19O98p46J55Q12k306P99K669j573j184J359o72
6075a63o22J934j203k104K819Q55k177N07N08j345Q03R86j321q0J156q90J018
6092F81N09k342K21J952q80j009J403r41K38K444k205k008K536M11k247J540K58
6109E61j782J776J174k699J30J510j471O16J436j884j7J929q22p20R46j690J21
6126h86K450j407j524K304l30j300J715q09k085K614N70k650J331J354k405Q45
6142b13J670k527k87K419r60o36J531j336n32J997q42j408J531o46o86K002q90
$$ plain form
6022 549 -922 157 824 97 322 -263 -1071 160 469 -98 396 156 -583 560 984 -1223 -632 838
6040 838 -187 -97 1085 -822 -664 1473 186 -1623 159 519 -397 915 290 -1058 278 931 -651
6057 -651 -318 -153 -638 367 1324 -693 -174 524 -222 -67 745 -1561 -762 1907 334 -850 509 -163
6075 -163 -785 1149 -54 -2158 661 1516 -661 -154 354 -991 -188 798 -523 -603 553 -337 681
6092 681 1190 -1152 -931 1021 141 -868 535 -406 -168 2276 71 -1937 599 1010 -1237 303 561
6109 561 -1221 555 1729 -970 -840 670 -801 -185 1251 -633 -650 1279 457 -263 683 -1007 -886
6126 -886 1564 157 -1367 937 607 -693 1022 213 -1872 742 1312 -1338 -7 1347 -1058 -213
6142 -213 1457 -1070 -1357 1062 102 -534 997 -339 -871 1126 284 -1124 407 -239 -925 1077 187
6159A87j649K279K56k628J477R40k197J101J783k420J33K125j732p31K237j588
6175d27q67K423n19j218J191m37q56J542o91j615K014K52j897J762J94k123J252
6192b0R79k354J006J959k385L33K382k105j044J949n24j469J984m40j052J566
6208G65o4j490R08J75j145J033K46r96P83O68j933J418N20k219O21K124j818j56
6226e60J858j351r19J983p68j736J940K45j574J051O84j330O88L1q57N36M25r48
6244f02O83O11r76Q9R21j400L38J001j564L33K297j737r44J585k49j353J329J92
6262E54j616J201R55j308k44J003j269K57J024p48j37O58m26L66M89j496J40R66
6280C69p08K8Q95n88n10J303m94j276J091K65j293P63J131j226R7R30p13n86N06
$$ plain form
6159 187 -1462 817 1073 -1555 -78 862 -1335 -234 1549 -871 -738 1387 -345 -1076 1161 -427
6175 -427 -1294 1129 610 -608 583 146 -710 832 141 -1474 540 792 -1105 657 851 -1272 -20
6192 -20 959 -1395 -389 1570 -815 -482 1900 -205 -1249 700 176 -1293 691 251 -801 765
6208 765 701 -789 119 294 -851 182 428 -568 215 883 -1050 368 888 -1331 -710 1414 -404 -560
6226 -560 1298 -53 -972 1011 243 -1493 447 692 -882 169 853 -477 211 242 -615 -79 346 -602
6244 -602 81 692 -284 -195 726 -674 -336 665 -899 -566 1731 -6 -950 635 386 -967 362 554
6262 554 -1062 139 1094 -214 -458 545 -724 -467 557 -191 -328 330 -96 270 759 -737 -597 369
6280 369 -339 -311 584 -4 -514 789 295 -981 110 375 -918 -155 976 -250 -153 777 64 -522 -16
6299a6k93o6O76l70k29P39Pn04J79j069N73J147o19o60R05N2p54M91p1q19M90
6320b11Q84j110L29P97p57l82Q47o02m15M91L87l63P4j2N0N10k10o79M42q9l0
6341d9M75k70n92Q57j62r43M59M64n22L8J051p43n06O46M3o74L54M9j86Q4N16
6362C89k08o52L61L42n11r1L07K68Q7n32M58m4o14L68o5j36q0N94j41m39P29m94
6384a04m39K75L86m32J23L41L73l69j70N3k53J81K33j73j55K22N10o35k66N34
6404B35o2q02M41O55n17K2K94J36n87m5K17m29K32O44l91k57M91l9o65J28N35
6425B36p5m99N15K16k58k78K19j88m05O35k26k66N03N13o00l73J90L35n98P0N41
6446B07O1m44J60K00j79j01R6l21M2M73j60m6O1M23m28o81Q16r1l18J35O14l88
$$ plain form
6299 -16 -309 -375 301 -69 -298 441 448 -56 123 -946 -373 774 155 -505 400 452 -302 189 118 -701 -211
6320 -211 673 -437 -108 689 -68 -450 397 -205 -620 -129 258 -105 -31 -43 7 517 307 -372 70 -19 -49
6341 -49 426 156 -436 421 259 -684 -225 239 -283 -245 806 63 -443 203 246 -428 -74 -25 -211 -127 389
6362 389 181 -471 -110 232 -279 -370 -63 205 292 -240 218 174 -440 -72 -137 -273 -353 241 100 -339 390 -104
6384 -104 -543 -268 118 -314 -191 150 523 154 -16 37 -216 -35 198 25 -130 92 602 -33 -299 235
6404 235 173 -629 -188 467 -50 -28 266 402 -185 -230 -13 -442 -210 434 43 -214 277 238 -427 -299 236
6425 236 161 -338 177 393 135 -143 76 -112 -517 118 -108 -374 129 642 42 -331 -141 194 -404 -334 207
6446 207 268 -176 -16 184 5 -96 0 -321 -279 194 34 -12 49 472 44 -637 179 88 -230 -95 519 131
6468A31j24K17j82k32p7L39l81L17N33j19p28L02M09o64l55O18J20j00K43j4m32
6489a79p1M68n96O5L89M09n77K6N52l08n46L44J86n48kO01K79m46Q6k80J4j62
6511b96L91m41p3R82j87n73L60J81m31k57J31K61m11N02M95m07k31J15l84k34
6531e07K31N79l72j56N92j1n63k70P08k52l86K67K86k62K21J22k05m24P37m78
6551a43n35J012J87p12j14Q24l33p20N73p7K3J44J22j59k3j73K02l37o8M46Q9
6572B28n16L56O39o79l71N07j2q69O92M44n93L95J87q46K15K69k81m29L50O61
6592C47m18J56pm7q7j29j35N35l24R3N61l97m83N02m06n21J082K90j294Q50O13
6613G81p44k52O80r88L5P88l95j89O49J96o19K62j53m33L82N1o7N35o61k54R65
$$ plain form
6468 131 7 224 42 -190 -267 72 -309 8 541 422 -306 -4 405 -259 -614 4 124 24 267 253 -179
6489 -179 -250 218 -378 -313 76 485 -92 -66 486 178 -368 -24 162 -386 -388 213 492 46 132 -148 -134 -296
6511 -296 95 -346 -419 563 376 -197 163 344 -87 -344 -213 48 -363 139 634 227 -4 111 -273 -507
6531 -507 -276 303 -69 -225 367 356 -207 -477 231 -21 -407 -140 146 -116 105 227 22 -402 335 -143
6551 -143 -678 334 521 -191 -305 519 186 -534 39 -38 -15 129 251 92 69 -104 98 -239 -307 139 228
6572 228 -288 68 707 28 -343 164 152 -717 -25 419 -174 221 408 -438 -223 46 -235 -664 -314 347
6592 347 -71 85 78 31 -56 -185 -320 215 -109 -16 545 148 -335 167 -239 -760 322 612 -682 168 781
6613 781 37 -215 465 -523 -488 300 -95 -284 365 561 -58 204 51 -382 0 51 -16 519 -142 -396 569
6634E69j54j159Q11J90p30O58O02j326L70J163j089j024J667o70n11J356l95q72
6652e44J156m11n87N64m02n35J373k62o56L80L9m07N13R6j678J111J334j266l00
6671d82J452j194m74J634j174j124J684J32q55Q56Oj287R49N10j346L88M71m32
6689b86J060q8j775Q09J067j302K43P79j230M91J760j663r11J717m36j095J528
6706F68k51j608J699O06j742L49N74j100J260J58j459N70J213r08K03L0j463P96
6724d05J621j588l77J560q33o93J989j107k050K428K30j720J229N27j597R81J016
6741A211k160lJ519p74L78O70j491L15J619j529o64J140p79J1J918j514j044K351
6759A174o39j564J632l44j779J935R07k240O08J668k042J25J452j902J26K084
$$ plain form
6634 569 415 -744 67 257 -473 185 787 -539 -169 994 -95 -1119 548 -122 -633 723 328 -544
6652 -544 612 201 -386 178 -224 -759 614 352 -304 76 115 -292 221 317 -1361 -250 1084 -182 -482
6671 -482 970 -224 -698 936 -238 -1362 322 454 -401 455 461 -826 123 633 -713 -325 146 -286
6689 -286 774 686 -1089 -280 787 -515 -272 507 -723 -232 1528 -135 -1046 671 235 -860 668
6706 668 417 -1191 508 1114 -628 -279 295 -805 455 613 -846 -276 937 29 232 262 -1201 -405
6724 -405 1216 -372 -749 811 -22 -715 1274 167 -1883 545 775 -945 284 811 -786 195 1211
6741 1211 -949 -952 567 -207 171 841 -650 -335 1284 -245 -909 231 -548 -537 1381 -133 -1177 1174
6759 1174 535 -1029 603 259 -1520 415 1322 -918 -310 1358 -684 -559 893 -1009 -883 1201
6775A201r59o46J044j021Q6J279j227j064J992j03j161J652o99j741J951L48k204
6792a272J321P80j951J303J409k131n25K026j162q03J574n34m78J351p13r32J061
6809C24k40q73J226l35r30J692l06j369J259L16k158J268J514k268L59J620j274
6826a75j84J494j621l35J432l96j104J365j09q02Q65k51p34O59J99j148J566%
6844G21j399P39L93j396R14N43j483P66J741j866n16J799r63j112J626m12j181
6861a086J593L20j102M96K17r99O63K56p75J88M25k99O08J8j444Q09N15p34j15
6880d46J304j094k91J547q61j022J243k40j159J168N53j270Q34P70q80k72P6m05
6898d45L70K90n07J16P36m59j10M7q01N37R80r26j34R33l10o43J007l77j443J203
$$ plain form
6775 1201 242 -404 640 -381 -295 984 -243 -1307 685 582 -579 1073 374 -1367 584 932 -1272
6792 -1272 49 829 -1122 181 1590 -541 -1066 960 -202 -1005 569 35 -443 908 195 -737 324
6809 324 84 -789 437 102 -828 864 558 -811 448 764 -1394 -126 1388 -880 -521 1099 -175
6826 -175 -359 1135 -486 -821 611 215 -889 476 367 -435 430 179 -555 104 303 -845 721 721
6844 721 -678 61 454 -942 -28 515 -968 -202 1539 -327 -843 956 -7 -1119 507 95 -1086
6861 -1086 507 827 -275 221 438 -561 102 358 -417 -229 196 -103 505 523 -921 -112 403 -331 -446
6880 -446 858 -236 -527 1020 159 -863 380 140 -1019 149 702 -568 266 1036 156 -116 -40 -445
6898 -445 -75 215 -292 -176 560 101 -9 38 -763 -226 754 -172 -306 627 317 -326 681 304 -1139 64
6918F4O46q33J43N3j66J47J72r14OP45K07m3k09k86M17N35r19k43O00n35L53O50
6940E90o42l11P40k15q11O03R2o03M88R83j088j18N63r2k49p0J48k18K89k6Q5
6961A38m1k09Q6o2m25J36P87n97L34J50j71l73N18On79K92M81m98N3L20l80o5
6983i9K3M56l61k96L87K82q4p1j15j03k39K27K01m22J22N85m89j43J42j72l04
7004d73N10L24l75j40N72j43l78q0p4J7K0P02m73k5K74O1m87j92K45q4l35O22
7026H8N27q56J64N68m84n33M38P5J0L11N3o17J67L72k03p09K21L78N8l0L25k23
7048A00j37j89K32O0l58L07K37n31N10L43p04k06O71m18l56L56N73l59j4K95m26
7069a4k13L40j24k38K37K51j44l77L81K32m46l26N38j98j62L29L78k18m09J80
$$ plain form
6918 64 710 -123 20 73 -93 54 226 -688 -682 63 270 227 18 -268 149 684 -235 -478 122 -413 -60 590
6940 590 -52 -363 377 162 -649 -46 46 -557 -69 914 -174 -292 271 179 -70 -140 8 -210 79 53 138
6961 138 97 -112 -26 -88 -513 -377 410 -187 147 297 126 -247 271 277 -302 -10 471 -27 26 346 -34 -99
6983 -99 -76 380 19 -277 110 392 308 237 122 19 -220 7 208 -214 -92 493 4 -139 3 -169 -473
7004 -473 37 361 -14 -154 418 275 -103 -183 -257 -240 -220 482 9 -16 258 319 -168 -360 -115 -199 -534 88
7026 88 615 -241 -77 491 7 -526 -88 -13 -3 308 361 -256 -89 283 80 -629 -408 -30 28 -2 323 100
7048 100 -37 -226 6 66 -292 15 252 -279 231 574 -130 -336 335 -83 -439 -83 490 131 117 412 -14
7069 -14 -227 113 -11 -249 -12 239 95 -282 99 331 -115 -441 97 -101 -263 66 444 226 -183 -3
7089cj19l33O05j82k07N28M08q21j25J89J20l71J75K00K27k47r3L1j4l52M65J00
7111A81m07O59l48m30L05L88l57o35O19J22l40L74P0j50K7J36j87k22O0L66k77
7132d6J24L24M0n99N8K10o4o18M67L66n55L84L08m81j66P11o03l58P83J04m95
7153a06l9N64m74l09J32M02m08J89K60Lj71j67J15Oj57K53j95J02K54L4k79j63
7175a54R62j038K7J20K14m78M82L34n60k1L25m03q3K94R0q7Q4J23j77J5j91M51
7197C29l31j47J40M11m24k4M74l26o63N07O1j19J22N82q80L01K23k98j67k4K44
7218ip2L5K79j56O2k17j87J40j28L91K28o49K49M12l78n59N74K26n29L42K64l75
7240e7l5O95o72l68M58Q6m74O11j10k16M4K55k47K3l29ON24J04l39J17j85j07
$$ plain form
7089 -3 -122 -455 150 -32 -239 289 697 -124 -249 -60 60 -311 -136 64 291 44 -49 -18 -32 -384 81 181
7111 181 -226 433 85 -345 -40 348 -9 -644 -25 97 -243 131 201 51 78 214 27 -195 -135 231 -46
7132 -46 78 402 442 -157 -99 111 47 -571 -104 262 -293 91 399 -82 -248 463 -140 -498 285 389 -106
7153 -106 -145 419 -55 -364 -232 170 -238 -49 211 214 43 -124 -9 -3 -160 93 -102 0 254 288 9 -154
7175 -154 808 -230 -203 -83 131 -347 135 469 -91 -112 213 -190 -273 21 111 24 108 231 54 69 -122 329
7197 329 -2 -149 -9 402 -22 -46 428 102 -561 -54 7 -112 10 592 -288 13 236 -62 -229 -253 -9
7218 -9 -81 -46 233 77 139 -78 -265 -125 -253 138 366 -283 -34 378 0 -559 15 241 -288 54 318 -57
7240 -57 -92 603 -69 -437 21 107 -367 244 134 -82 -38 217 -30 -7 -336 -330 194 298 -41 76 -109 -216
7262b16O42n45o24R01M00r71K39P56q77P5P37o45m47P46nl87N45q7p77L41L34
7283A35k85k12L2J46Q35m31o98N59L03r57N65K45o30O06N63p57n29R28o37n16
7303g35J089j01j034J083K88o81L6J94n38L64K14o01M53M61n46L84N9j110N31
7322a90N72p41J30Q53j060K77J121j139q36J324j98o24R30M1j062P27O80j444
7340f39J26P09l77L97j71m31O18K68o41j87N21o84K45R92o73l43R63m99o79J144
7360F59o20j135J343N76j333M11O96q94M57J84r29L54Q54o92P1L25m79M5L76m43
7380a74j58P62m85j58Q39n02r29J253l52p56O79L81j150J163K33j105K02O81n27
7399a03k63N22m20J02N95k81n23O85k76o8L61k62n90J245l78n75O06l93o24R06
$$ plain form
7262 -216 426 -119 -743 158 558 -413 -174 582 -295 -220 517 -128 -575 171 166 -221 324 237 -540 -199 135
7283 135 -150 -362 -330 -184 651 220 -478 81 384 -573 -8 237 -393 213 776 19 -510 418 -219 -735
7303 -735 354 253 -781 302 590 -91 -55 139 -399 -35 179 -422 31 492 -54 330 389 -721 -190
7322 -190 382 -359 -229 624 -436 -159 962 -177 -1013 311 113 -511 419 460 -602 125 805 -639
7340 -639 -513 196 -181 216 45 -386 232 500 -141 -328 193 -491 -246 746 73 -270 693 194 -485 659
7360 659 39 -1096 247 823 -510 -99 597 -297 160 344 -585 -231 623 -69 2 327 -152 -107 269 -174
7380 -174 -332 430 -55 -213 626 124 -805 448 96 -660 19 400 -750 413 646 -459 -257 424 -103
7399 -103 -366 156 -264 -162 433 152 -371 314 38 -30 331 69 -521 724 346 -229 377 -16 -640 266
7419B66J30j097N90P26p96K65L57p16j87R71n58k81N20n8m14M71l40m67P17j52
7439e3n9M31j55m95R11P8j219M31L30p89N04O63j065J15J164p55m25Q34n70m12
7459e36O32K74p42O30o1n87L97lm18O39k46n5K34j93l58O28M3p34K80N70o12R2
7481a26O81n21l35N48k06l17L92J77m12L45K07o46K05j3j16K32Rk26L99J58m84
7502d9J89m8n22L32L20n88M70M01o01k01O87k36p70L69L71j44j6M8k93K52K41
7523B12j35m87K68K81J07l31L3L09J29p20K38J22n06L87M91l40PL31m00M2J06
7544A44o17J11M69M91m45l89M2N44l74m17L03N6o0K04K51l59lK74j31k2o4M5m32
7567c79M78L98o93k9L80O0m85J39m8K61J19Q4k30k53J55L14q9m62K00L90l04K16
$$ plain form
7419 266 396 -701 -111 615 -181 84 441 -275 -462 509 -49 -330 190 132 -282 189 -151 -618 99 -53
7439 -53 -112 319 164 -331 580 658 -561 -130 200 -589 -85 578 -487 -372 792 37 -388 446 -124 -536
7459 -536 96 370 -372 258 197 -390 7 4 -414 225 -21 -76 158 -35 -393 235 278 -456 -176 394 -218 -126
7481 -126 555 34 -301 247 41 -276 116 293 -119 226 433 -213 -8 -21 -137 95 104 -122 277 435 -49
7502 -49 140 92 -430 -98 222 -366 104 505 -96 -297 390 154 -616 -247 124 -20 -36 12 -281 -29 212
7523 212 77 -410 -142 139 246 -85 -52 257 386 -334 -96 26 -480 -93 398 58 65 396 -4 38 144
7544 144 -473 -362 107 598 153 -236 -194 350 -24 -441 -138 -82 -142 62 313 -46 -49 225 94 72 8 53 -379
7567 -379 99 497 -196 -225 155 215 -270 -131 -179 82 201 285 55 -198 -43 271 182 -280 -80 310 6 222
7589B22p0m03JM82j23l29L23K08j98m1K38p35R8N11j78m48M64J15O6m23K5O3R9
7612c3j31J58J90n73M66J05j40j68L41n13RO83R3p75K36M03n70K9K88l26J70M27
7634C69l89j43M4L35r7j25m10M93K07n35K99L85p03J05N16n30l13O00p7j54L69
7655B46q5l21j9N93n46l82N88o1JL09l32n1l5j82K31o6q6K67J19nj17K78n63o
7679b25L11k72k39M48M41q90J42L93j8j65Q9J40k60K21K69l41j54J16k56N8J34
7700e8Q6J61l76J10M03m95R1M3R5k65l4N35l70J47L97n31k36O02j47m07L54R8
7722B03k05K79k91j56mJ05k14N0O1K98k35K43j32P8R0m70N46N1m73L04K23l47
7744Dn4K93o8l48L26J04l72O02k83qn59L63r1l3K02m8J09j42J39o9j18r6L24j58
$$ plain form
7589 222 152 -251 -250 232 109 -220 103 311 113 72 310 -425 -327 184 6 -442 22 137 203 -220 -195 -132 -33
7612 -33 -164 -6 184 -389 77 182 42 -126 215 -298 -289 394 487 -288 -52 351 -219 -190 98 -228 -58 369
7634 369 -20 -163 -119 216 119 -6 -416 77 284 -251 48 433 -270 -165 351 -179 -492 108 31 -123 246
7655 246 161 -160 -179 414 -132 -514 74 13 14 323 -9 -60 -95 -277 -46 -112 -198 69 188 183 66 344 -219 -225
7679 -225 86 -186 -425 23 464 -426 -284 109 91 -74 15 155 -105 116 385 44 -110 6 -250 -192 -58
7700 -58 28 189 -187 -77 326 -169 -78 -35 60 -205 -239 296 -74 73 470 -61 -297 305 158 -249 105 203
7722 203 -2 277 -14 -170 -174 -69 -283 -233 -172 126 -109 134 2 80 170 -300 246 297 -176 128 351 4
7744 4 -50 243 175 -173 153 257 -115 487 204 196 -363 0 -91 -124 78 30 139 -3 136 67 -51 -147 177 19
7768A9k21N74j15k05j36K02j27j74N98l11l4p3J89j21q4L10m27m2J40P1r7N4K32
7791B22j04l8j08L7j77J89%J14k1j08K69k37n01N73k87j75L90K15l59K27J08j7
7813B12l29L71m05M2J39J31r6J59l08j56K72j76J15j15J94r7N20n13j76K57j35
7834i4j77K85K50k87jJ87j75k25K05k69N4J65J54k17O5l6j73L7o1K5J25J77l5
7857b1R7R2n7m2J4k82J29O0j73l5L59q6j06K59j01n23N62L2j73J54K5l07J51j84
7881a56j75L53m1%J08rp8J92j62k36K94j01o1j41N14j57m4Q1k47j84L30k27k83
7904d30N92j28m0J07oj37J25l10J78O9o4r6L73k09k83J55J75j17K4J85l34j29
7926c00P97m48m02N53k98K3J84R8k95L15M2l07j80R3J41r8J44j30l8L00j18j44
$$ plain form
7768 19 -202 372 257 52 -84 118 -9 -183 415 104 70 -3 186 65 -19 291 -136 -178 -38 33 -64 -10 222
7791 222 118 80 -28 9 -168 21 21 135 114 6 275 38 -463 110 -177 -352 38 253 -106 121 229 212
7813 212 -117 254 -151 -109 30 161 65 224 -84 -240 32 -144 -29 -144 50 -47 473 -40 -216 41 -94
7834 -94 -271 14 264 -23 -24 163 -12 -237 -32 -301 -247 -82 72 -145 -80 -116 -289 -252 -313 -288 -163 14 -21
7857 -21 76 168 111 69 83 -199 -70 -10 -183 -218 141 55 -51 208 107 -416 146 178 5 159 184 -123 28 -156
7881 -156 -331 22 -19 -19 89 80 2 194 32 -204 90 -11 -72 -213 301 144 100 181 -66 -250 80 -147 -430
7904 -430 162 34 -6 101 95 -42 83 -227 -49 20 -44 -140 233 24 -259 -104 71 -46 -22 163 -171 -300
7926 -300 497 49 -353 200 -98 -75 109 207 -88 227 269 -38 -218 -125 16 -82 62 -68 -106 194 76 -68
7948f8J74l58o5O31n08Q9L58j57k75K64j11l81O35l6l57K48J72n63K24J51l22
7969b55J79J24r7L26q7j66q9K56k62K49p9k63O0M09l93J48J13l22J6P1k8j66K97
7992D1J12k42j35R3Qj65L19J5l3J76R5k15K5m19L45K18m66n4L73k8k93N37l69
8015f2l26O59o5n95L37K83k61L9Q5l25K4K25j97N4j83L21q7K14j01k7J25k47k8
8038a38J41M0k92N49k26n15P01j53k38J71J16l57J97K04k61k10M42j51j43P6R9
8059E2p8K43l52J5Q1k85Q7N2M2P9L23p2m51N19j48m90N30j92k31K77L13l13J64
8082A65N4k44m1j78K18j36N7J89k9n2m3OJ2k20K57J56r3Q4j70K77l24n7P8j68
8106b02J94O9j72Q2L78l84j68J17J72j11j26m6K58j02j00K7o0M6K06o9PJ28Pj62
$$ plain form
7948 -68 106 -252 -317 314 -194 -105 253 96 -179 85 -26 -407 228 192 -165 83 255 -308 -84 67 -255
7969 -255 -76 48 -49 277 190 24 -65 191 -71 178 99 -164 -104 305 -88 60 173 -149 -133 -62 -90 -256 41
7992 41 153 -89 -224 -131 -123 -288 31 46 13 189 284 69 94 -325 20 238 -228 -282 91 63 -230 307 -62
8015 -62 -388 271 206 -389 -52 231 -30 9 94 -231 -207 18 -179 -125 -308 13 -74 140 39 12 137 -110 -138
8038 -138 3 43 -249 300 74 -441 260 107 -131 40 156 -201 -4 200 -61 -271 171 20 -123 -47 52
8059 52 -26 217 -135 -120 -39 -324 -237 -185 -143 -64 259 187 -264 255 107 -383 147 -45 -276 1 314 1 165
8082 165 219 -25 -66 -244 -26 -162 -105 84 55 3 -40 -34 -22 -242 15 171 78 162 -8 269 -55 -112 -34 -202
8106 -202 -8 61 -111 -29 349 -35 -203 -86 86 -25 -151 -197 61 -41 -141 -114 -174 -128 78 9 16 144 151 -11
8130a1j07L52m24l50O17j14q8K05P0k46L03k40k43j27N12M4q5j58O6J83l08oj12
8153b67M72j80K94j69k83J56K86m80L5O2j51j41L69L11m24K4Q8K05m16J09p4Q6
8175h8J22M5K70m17J02Nr5m14N39J62k03J65K03o82oN23
$$ plain form
8130 -11 -118 234 -190 -540 77 -37 -125 80 150 -96 207 -33 -276 -403 109 153 68 -90 -24 159 -149 -155 -267
8153 -267 205 25 319 150 -133 23 309 -171 -136 -74 -225 -366 3 314 -110 -86 2 207 -209 -100 -174 -88
8175 -88 34 79 349 -68 34 39 -56 -470 69 231 28 193 396 -286 -292 231
8191B31
$$ Imaginary data points
##PAGE= N=2
##DATA TABLE= (X++(I..I)), XYDATA
0@%%%qK4k4K4m0N6p2R6j20J36j63K06k54L05l61M22m96N88o90P98r18J054j205
26f42J380j576J781k005K259k544K855l195L565l965M412m910N448o033O680p395
42c885Q188r070J0049j1140J2373j3780J5390j7257J9456k2085K5296k9333L4571
55A8773m1655N1835o7762R6256j62107N55448K13588j282455N56480K50914m09264
66b19949M84937m2898r38106O72310P11046p08398q5727L05348n64844L05991
76h0290N95822p07362k08910O35935k34223P5891M33673q57139l11133J126670
86D68934j40857p63471M52679L6776k76222P45193k01126j054965N74541O63086
96E04568o75555L0976L65671m93793K41301N74762o34142k77156M63273k19906
$$ plain form
0 0 0 0 0 -8 16 -8 16 -24 32 -40 56 -64 72 -91 115 -139 166 -195 227 -269 319 -371 427 -491 563 -642
26 -642 738 -838 943 -1062 1197 -1347 1508 -1687 1878 -2087 2325 -2585 2863 -3170 3510 -3885
42 -3885 4303 -4767 5282 -5858 6515 -7265 8125 -9132 10324 -11761 13535 -15798 18773
55 18773 -22882 28953 -38809 57447 -104660 450788 664376 -618079 -61599 189315 -219949
66 -219949 264988 222090 -716016 -43706 667340 -41058 -126785 178563 -386281 -80290
76 -80290 515532 -191830 -400740 235195 972 76863 510536 -346603 -657736 468934
86 468934 328077 -435394 17285 54061 -222161 523032 321906 -733059 -158518 504568
96 504568 -170987 -140011 225660 -268133 -26832 547930 -86212 -363368 99905 -120001
106a20001M9961M77372n44949k76208P59647o9845m63470K29474k45935j49391
116c53345Q12584j63023q50922N42043M70063n79565R3861J69709n64112L16229
126a06478N81426n74136j51207N22315k81191j31943M29944l62412l28733N07183
136A04768N0041j97560K16746k52241j78422N75021j23268o16027L24027K65202
146A68287k62206K59386J5739n12337L43811L78846o02009o4817M77424k69930
156f7806p5254M44660k47478k76377L45091o8278k19101K48007j07947k09878
166b34361L93102P8931l48457Q1778O0048j33006J99725o7924l26983L40464K67087
177C10404m02656J3116K60257k80587k4318K72572k50023p0989L74128j38937
$$ plain form
106 -120001 -70040 407332 -137617 -413825 345822 275977 -187493 41981 -203954 -353345
116 -353345 459239 296216 -554706 -12663 457400 -122165 -28304 141405 -422707 -106478
126 -106478 474948 -99188 -250395 271920 -9271 -141214 288730 -73682 -402415 104768
136 104768 154809 -42751 173995 -78246 -256668 318353 195085 -420942 -96915 168287
146 168287 -93919 165467 181206 -331131 12680 391526 -210483 -275300 202124 -67806
156 -67806 -143060 301600 54122 -222255 122836 54558 -164543 83464 -24483 -234361
166 -234361 158741 237672 -110785 -29007 31041 -101965 97760 29836 -297147 43317 310404
177 310404 -92252 -79136 181121 -99466 -123784 148788 -101235 -172224 201904 62967
187F2967k03837L04057o6906l20120K00878J27257j95706O5949P3402o8166J41748
198A21523l1495k55614J22204J40825j85493L2370J21865j01846J04829Q7413
208A56581k81647K3951K62588k21581j45992L06686j68j84756J53378J7491j68679
219h2148R3749J2975j64122J20631J29036j39954M977J20425n8992o2046k1376
230d6845l0043R9723K4181j37267R0021J59070j42016q8002R5343n9314k9421
241f4570J10202p9546m7791K08716j0983k12660P0947J07031j37637l7116J08800
252A5393L799r213K7711k1776M502N834p5682k2368O1627K9167N191k2594j8426
265a6835Q8581J5896j75027k6950J63768k0493j04888Q3038O4305n3648J0630
$$ plain form
187 62967 -140870 163187 96281 -223839 -22961 104296 -91410 -25461 47941 -20225 121523
198 121523 90028 -165586 -43382 97443 -88050 -55680 66185 -35661 69168 156581
208 156581 -125066 -101115 161473 -60108 -206100 100586 100418 -84338 69040 86531 -82148
219 -82148 11601 24576 -139546 -18915 110121 -29833 -24856 95569 36577 -25469 -46845
230 -46845 -76888 22835 47016 -90251 -230 158840 16824 -71178 24165 -35149 -64570
241 -64570 45632 -33914 -81705 127011 116028 -96632 -25685 81346 -56291 -93407 15393
252 15393 19192 9979 37690 15914 20416 26250 -49432 -71800 -10173 18994 24185 1591 -16835
265 -16835 71746 87642 -87385 -114335 49433 28940 -75948 7090 71395 17747 28377
276B8377r629q4667L0392O1626o6296o523J14484M972r5527J883O2579l1747r0379
289h0455J1255J03635K3123o0825L207L7320j7923k1694k8555m8243N2837R5486
301F9168n2606o2993R6564L9498j23736m0083P9948j798n1698L4916N5979k134
313D1025j7045j8948l1620M320K8360l0497l7215P5768Q2127p0601p8867O6334
325A3141L8378r6035l7135P9206L2510k1259J2507M894j7648P879k1220o2083
337f6865K2355Q2869j8274n9440O0414O9704p8742q4567N0623M5219n0297j2744
349c9745N6031K3293o258o573m2459k4425M5418j659o8389L4105J07996k2183
361E5152q8793L0167N5163o2266o2440M3688M5493p400M194R994j0765Q809l563
$$ plain form
276 28377 18748 -65919 -35527 26099 -40197 -46720 67764 72736 -22791 -20908 41671 9924 -80455
289 -80455 -69200 34435 57558 -3267 -60 37260 19337 -2357 -30912 -79155 -26318 69168
301 69168 16562 -46431 50133 89631 -34105 -74188 5760 3962 -47736 -12820 43159 41025
313 41025 23980 5032 -26588 -22268 6092 -24405 -61620 14148 96275 25674 -53193 13141
325 13141 51519 -44516 -81651 -2445 30065 8806 21313 26207 8559 16438 -4782 -66865
337 -66865 -44510 38359 20085 -39355 21059 90763 12021 -72546 -21923 23296 -27001 -39745
349 -39745 16286 39579 33321 26748 -15711 -40136 5282 3623 -64766 -30661 77335 55152
361 55152 -33641 -3474 51689 -10577 -73017 -29329 16164 8764 12958 22952 12187 20996 17433
374A7433o4593j8045Q1578K2265p1684J7224R3097k7772r7495J0184N0584k6544
386a3768k4384L4873K6607Q179Q334l4973m1503L1220K2114o4338j2061R9454
398C9754L0056q0888r436O4682k3498p4541R231M4967M663O355J0124j3751R191
411A6909J8129n5640n3890O1191N5774n8229k0835Q7953J9629q5950k6072M2628
423A597n783k9037J4830K3458J6177K2535j8818n2365J0624M0935m3723n1617
435g1187O9320P1878n5828m4870N9859J2630p4145j6544L7999N487J1410K0517
447B6526k3353J641M3912l8123p9673L2485O8087l2647l8393N6229M7530m2329
459B1892m9896J4360J8771k6399j0680K9139J6242J3369J3611m4009l1250N5567
$$ plain form
374 17433 -47160 -65205 16373 38638 -33046 -15822 77275 49503 -47992 -37808 12776 -13768
386 -13768 -38152 -3279 23328 31507 39841 4868 -36635 -5415 16699 -47639 -59700 39754
398 39754 69810 -11078 -20514 44168 20670 -53871 -44640 327 4990 11345 21469 7718 16909
411 16909 35038 -20602 -74492 -13301 42473 -15756 -36591 51362 70991 -14959 -41031 1597
423 1597 -4186 -33223 -18393 5065 21242 43777 24959 -27406 -16782 24153 -19570 -71187
435 -71187 -1867 70011 14183 -30687 29172 41802 -32343 -48887 -10888 -5401 6009 26526
447 26526 3173 4814 48726 10603 -69070 -36585 31502 -1145 -39538 16691 64221 21892
459 21892 -28004 -13644 5127 -21272 -31952 -2813 13429 26798 40409 -3600 -34850 20717
471B0717m857r2141L4362J09484l5960o3342N3551J9445n4855j0783L2r266M1681
484H068K1157l5510J2444L8931k6974n0766o680L5251K1052m1034o301Q7472M559
497F1669r8386J2510N4666n5623j3046M8670k7707J9145P7739p1689p0783R6930
509C4095K895j14780L4854Q1952k8459p674K0474j7335J2531j1704o0537K7686
521b6002M6838l2663J0937L1768k7302K4295J146j01225L4602J05081r6820m6203
533g5548J48170j0024j06280O0125N161q0877O2150J5471r0141Q1321Q4283j07935
545a4124j7849P5898m6094l1468K2913k7540M5189N1559q2423J3157Q8417r4760
557a7125n1201J00570m3293m5195J09341l9132o5192J39415l5319j77763J14009
$$ plain form
471 20717 15860 -76281 -41919 67565 31605 -31737 21814 41259 -13596 -24379 -24347 -33613 8068
484 8068 29225 -6285 6159 45090 18116 -32650 -39330 -4079 16973 -24061 -30362 57110 61669
497 61669 -36717 -24207 30459 -25164 -38210 10460 -17247 1898 79637 7948 -62835 34095
509 34095 36990 -77790 -42936 39016 10557 2883 23357 6022 18553 6849 -53688 -26002
521 -26002 20836 -11827 -890 30878 3576 27871 29017 -72208 -37606 67475 -29345 -75548
533 -75548 72622 62598 -43682 16443 21604 -59273 2877 18348 -71793 9528 93811 -14124
545 -14124 -31973 43925 -2169 -33637 -10724 -38264 6925 58484 -23939 -10782 77635 -17125
557 -17125 -68326 32244 -11049 -56244 53097 13965 -51227 88188 52869 -124894 -10885
568a0885R9114j54135J2309J14714o2889J4615N8980j20667o306J15034q1041
579b1157m5640J06404l0681k5459Q4662o6724m9994R2706p7441n5894J72967m0418
591D3331j56854J54732P1379j67944L8422M3959j29710J07639J16186j98084P95
602g6149K03345r2698r7621R2272o3466l4453J34349n4417p1516J19682l6637
613B2691p4105J23970n5135j45862J34203N4631j03721R1310p243j53832J61404
624D8311R9543k67212k464K12692q5995l0991J14415j32861k9000K01151j00988
635B6601j57385J40548R180p7206J37613k1053j48788J04385M1639j01206P3872
646B8200l2503j40180J94182J21272k36362p085J38083r9978L9328Q5831k22890
$$ plain form
568 -10885 88229 -65906 -53597 61117 -1772 12843 71823 -48844 -55150 59884 -21157
579 -21157 -66797 39607 8926 -16533 68129 1405 -48589 44117 -33324 -89218 83749 43331
591 43331 -113523 41209 112588 -55356 -16934 27025 -102685 4954 121140 -76944 -76149
602 -76149 127196 34498 -63123 29149 -34317 -68770 65579 11162 -60354 59328 22691
613 22691 -51414 72556 17421 -128441 5762 60393 -43328 47982 40739 -113093 48311
624 48311 147854 -119358 -121822 90870 4875 -26116 88299 -44562 -73562 127589 26601
635 26601 -130784 9764 18944 -58262 79351 58298 -90490 13895 55534 -45672 28200
646 28200 -4303 -144483 49699 170971 -65391 -72476 65607 -34371 4957 90788 -132102
657a32102J6205K93069j08602j76962J47615k4130r5591J58286m3419j78534J45539
668A374Q8503j08009O9407j7651j66767J33929J22250j77626j2916Q9070n8588
679c7024J11278O5470k69003j054K64078j00316j27257J26922o1147k9696K14242
690A56493r4762k22939J55200P5179j33258R1315K2656j65542J17901J45044j51872
701d585n0311M0439o2544J14618Q8355k17005j6537K15485m7603p7044M0842j26076
713a01966J8934K35001j10861j87270J76484N0775j25877J00344j6931j90620
723a51987J25619J44367j38830n043O4474r5452P4257J10861j85138p3996J55688
734B4820J1985j1835K3343j28573K5964J95072j07048j59615J17635K0489m8438
$$ plain form
657 -132102 -115897 177172 68570 -108392 39223 15093 -80498 77788 34369 -144165 1374
668 1374 89877 -18132 51275 33624 -133143 786 123036 -54590 -67506 21564 -37024
679 -37024 74254 139724 -129279 -130333 133745 33429 -93828 33094 -28053 -57749 156493
690 156493 61731 -161208 -6008 69171 -64087 27228 49884 -115658 2243 147287 -4585
701 -4585 -54896 -14457 -77001 37617 125972 -91033 -107570 107915 60312 -16732 24110 -101966
713 -101966 -83032 151969 41108 -146162 30322 81097 -44780 55564 38633 -151987
723 -151987 -26368 117999 -20831 -25874 38600 -56852 17405 128266 -56872 -130868 24820
734 24820 36805 24970 48313 -80260 -54296 140776 33728 -125887 -8252 12237 -36201
745c6201J25503m9458j57710J40629Q0242j60732K6894O2443j18628P5544J46809
756A35335j37644q0579J08707p582j4789K9272j09983k453J73549k4047j13503
767d3717L7445k479o829Q1478p9891r9977J41631N0020j10816N4216K6958j24432
779g6393N6802R8516j15725k6534R7050l4116P263P4945j02931o9105J21969J5789
791D7530q4878J0795J4233K2262O3535o2045p9364P4943J9844o3832L9017R830
803A1870n0748O9589L1280r6723K0353M8750q6010J6388R8406o8684m9726R7228
815D1973N885o2738J1094j6389j6099O1316o458n6497M0546L9195k8466j4150
827g88j8794q917M4650j1645m4742N7596L1242o6446J1002M0812n5276j3567M6531
$$ plain form
745 -36201 89302 39844 -117866 22763 103005 -57727 -30833 31610 -87018 -11474 135335
756 135335 -2309 -82888 25819 18237 3448 32720 -77263 -79716 93833 69786 -43717
767 -43717 -6272 -8751 -15580 65898 -13993 -113970 27661 77681 -33135 21081 48039 -76393
779 -76393 -19591 78925 -36800 -63334 33716 -400 6863 81808 -21123 -90228 31741 47530
791 47530 -37348 -26553 -12320 9942 73477 11432 -67932 7011 26855 -36977 2040 11870
803 11870 -38878 30711 61991 -34732 -14379 34371 -51639 -35251 63155 -5529 -55255 41973
815 41973 47858 -14880 -3786 -20175 -36274 25042 18584 -37913 2633 41828 13362 -788
827 -788 -19582 -28499 16151 4506 -40236 17360 48602 -17844 -6842 33970 -21306 -34873 11658
840A1658k2895j892N3184k9940l6242N3992k270o8358J1367M5842o119j2931K713
853a891J4028J6957k4844l4266J6601J6007q130O949k666r6L6354j1572o0910
866c7479J8177M2976l9076j7107N2016M174k8595J4760N682k3331n317q45l535
879a7500K1545J7321j6333j4320J8815K0361l0863m6307K4284N2584j8531l1095
891b0039K7416J6515j8389l282j1119k1523K2835K4011k0634R13K9268j2131k7914
904a4073J1368J2147k4235j8792K9496L7788j5723l2520J3311J8009j5233j2223
916a0680q722n821L7368K7823m3697j9126M6637l749m8764Q127K6252j2083J241
929e194K1766Q14j0132q762q998K966O248o744n599J0191K6893J0303l9657k6255
$$ plain form
840 11658 -11237 -13129 40055 10115 -26127 27865 25595 -42763 -31396 14446 8327 -4604 -1891
853 -1891 12137 29094 4250 -30016 -13415 2592 -5538 1411 -1255 -1351 35003 23431 -37479
866 -37479 -19302 23674 -15402 -32509 19507 23681 -4914 9846 15528 -7803 -13120 -13965 -17500
879 -17500 4045 21366 5033 -9287 9528 29889 -974 -47281 -22997 29587 11056 -20039
891 -20039 7377 23892 5503 2221 -8898 -30421 -7586 16425 -4209 -3296 25972 13841 -14073
904 -14073 -2705 9442 -14793 -33585 -4089 33699 17976 -14544 -1233 16776 1543 -10680
916 -10680 -19402 -25223 12145 39968 -3729 -22855 23782 20033 -28731 -20604 5648 -6435 -5194
929 -5194 16572 17386 7254 -1508 -10506 -7540 -1292 -8036 -13635 -3444 23449 33752 -5905 -32160
943c2160M0694J4115n1052k027M8171m17j4233J1582j4179j5025J9942q819k6033
956b9441K7948K5544k4698l759K7954q753l4309n360K3761J1490j8237n614K8702
969A5228J0963k1286j1282m895m303J9553K619k8852J9663M3545k9045l7369K8938
982C477R606l6049K855K8712j57l004N294o792k225L507j6626j4680J8668K5101
996A7687p268k0315J3105K5754k1706l8624J5883K7325j6946o514K3226K212p592
1009F227L637j6936j4389K3284M178k7747J5456L9366j5286l3711J2548J7017
1021A3644k0491j8265J5421J8759R01k996j361l269J872j012k0919o782L1724
1034G226J3183k8557N78L4429j0635l8242N330K1874r134n940J3727O105P27L134
$$ plain form
943 -32160 8534 22649 -28403 -30430 17741 17324 3091 14673 494 -14531 5411 -3408 -29441
956 -29441 -1493 24051 -647 -4406 23548 14795 -19514 -24874 -1113 10377 -7860 -13474 15228
969 15228 26191 4905 -6377 -11272 -15575 3978 6597 -22255 -2592 40953 11908 -25461 3477
982 3477 13083 -22966 -20111 8601 8444 5440 10734 3942 1717 5224 -11402 -26082 -7414 17687
996 17687 10419 -9896 3209 28963 7257 -31367 -15484 11841 -5105 -11619 11607 13819 6227
1009 6227 9864 -7072 -21461 1823 6001 -21746 -6290 33076 17790 -15921 -3373 13644
1021 13644 -6847 -25112 -9691 9068 9969 6973 5612 2343 4215 3203 -17716 -24498 7226
1034 7226 20409 -8148 -7570 26859 16224 -22018 -16688 5186 -3948 -9888 3839 9944 10671 13805
1048A3805j6144j6779J5214J1498k2417m067L7102J0707l2809p112K2769o759
1060E008k6080N018J8780K919J736J731q367J415Q071j9412j9318K4764K4216
1073B0481k1677j1202L0214O908l4048j0414J8177P31q644O583Q143L740P576
1086A6568r145k2450M710J9384j5135j9274K7756K7811k3510k0032K0246N604
1098A2533k5544m999J4753L974N347O666j1403l222J5825j2168k9629J3269L0104
1111A5506j1270j7236K0638J8054k0613k0591P131Q713o829j434R275M462O200
1124A2006L531k0628j2630K3361J306l2752J2335M1358j2898k7366J7778P520
1136A2921k1440l910M813j147J4451Q864j5447L55J6022r273k3794j118K0299
$$ plain form
1048 13805 -2339 -19118 -3904 7594 -14823 -18890 18212 28919 -3890 -11002 11767 5008
1060 5008 -21072 -16054 2726 5645 7381 9112 745 2160 10231 -9181 -28499 -3735 20481
1073 20481 -1196 -12398 17816 24724 -9324 -19738 -1561 -830 -9474 -2891 5252 8992 16568
1086 16568 7423 -15027 -10317 9067 -6068 -25342 2414 30225 6715 -13317 6929 12533
1098 12533 -13011 -18010 -3257 717 6064 12730 1327 -1895 13930 1762 -27867 -14598 15506
1111 15506 4236 -13000 7638 25692 5079 -15512 -8381 332 -6497 -7931 1344 5806 12006
1124 12006 15537 -5091 -17721 5640 6946 -25806 -13471 27887 14989 -12377 5401 12921
1136 12921 -8519 -12429 -7616 -8763 5688 14552 -895 -540 15482 6209 -17585 -18703 1596
1149A596R311j7715k835L0764R04l5879J301J9544j5924k486J8052r221M260K6591
1163B8263k5480k9621L4381O575m2128J1067L6874r905j0464P223m221k78l408
1176a122j8000Q089K0197o119j546O937n879P109m015l4770J4898M0752l1978
1189e447k0941N1457O30m1800J6365M742k7751K2530J2736l3655K1629L5054l6171
1202f22j5292K7439j1859j7031J1301J526J1894J0468k6698N264L1322l2039k5824
1215c0151L2272j762r341L0277j9173k4856N1739l558o8923K7344M2630m1507
1227a5009K358L9466k6289p117K7745k7463j3116K8850k0185j0976M3230l325
1239A8169k6943J2980m535k760K0233l6944k1025O8334N564n7935K6093K1181
$$ plain form
1149 1596 10907 -6808 -9643 21121 22025 -13854 -12553 6991 -8933 -11419 6633 -2588 1672 28263
1163 28263 2783 -26838 7543 14118 -28010 -16943 19931 10026 -438 6785 2564 2286 -1122
1176 -1122 -19122 -11033 9164 3045 1499 8436 2557 9666 5651 -29119 -14221 26531 -5447
1189 -5447 -26388 25069 25699 -16101 264 5006 -22745 -215 12521 -21134 495 35549 -622
1202 -622 -15914 11525 -334 -17365 -6064 -4538 7356 17824 -8874 -3610 27712 -4327 -30151
1215 -30151 2121 359 -8982 21295 2122 -22734 29005 25447 -43476 -16132 26498 -15009
1227 -15009 -12651 26815 526 -6591 21154 -6309 -19425 9425 -10760 -21736 21494 18169
1239 18169 -8774 4206 -329 -3089 17144 -19800 -40825 27509 33073 -24862 1231 22412
1251B2412m0716K1129J4256n6503K3713N7486m4912j3620M9332l3416k9848M7405
1263A6718q474l6645K5561Q005j963K9133l0523m0081M7549J4047m3382R920O716
1276c419j0033M9579m250p5471L0160N1366n5501n719M6607l7927l841O3887l0675
1289A4763m5358L6282p873k1627M6604j2380n1394M4961L8205l4262j4847j2599
1301a9525p550N3002N21o6556K4766M9786k8687k2P780n3254J9464O1860m5382
1314c797k6505N3869j9172k2406N6290k4670o9263M2281M1327k6339K664p032
1326b753k1833M9169J8747o9569j2266L9251N595J3245q911m5757L3063M9007
1338D6988n0508k3610L3233k5032K515O0133l1586n0182M6604J3921l1781J8351
$$ plain form
1251 22412 -18304 2825 17081 -39422 -15709 41777 -3135 -16755 32577 -839 -30687 16718
1263 16718 8244 -28401 -2840 5165 3202 32335 1812 -38269 9280 23327 -20055 -10135 -3419
1276 -3419 -13452 36127 31877 -43594 -13434 37932 -17569 -23288 23319 -14608 -18449 45438 14763
1289 14763 -30595 5687 -2186 -23813 22791 10411 -40983 3978 42183 7921 -6926 -19525
1301 -19525 -27075 25927 26448 -40108 -15342 34444 5757 5735 13515 -39739 -20275 41585 -3797
1314 -3797 -30302 23567 4395 -18011 38279 13609 -55654 -13373 27954 1615 4279 -2753
1326 -2753 -24586 24583 43330 -26239 -38505 746 6341 19586 10675 -35082 -2019 46988
1338 46988 -3520 -27130 6103 -18929 -16414 43719 12133 -38049 8555 22476 -9305 9046
1350I046j6272m1740N7180M6804n7725k6433L0014R049Q924j5696m6232K3466
1362a9615N3162j7884j9631O215j7522J5214L0462m2266k3771M2929L24r819L4693
1375C2491k6746n0547M7106L5076m8236j5917K0469N208K7500M897n4842o724
1387c0265M6893J431k6771r315K364K8126J8811l1205j4319J6193j0326K585K3810
1400A8012k5055k0337M0400J3558k5499N2j1186j6964L7285J8225m8302p422M5880
1413A8647Q997k2475j6236p619J4428J6705j2557j0708R102P911Q099l991k1896
1426a1593q25J3351p466N352J7445k0016j2080L4168M140l7275o301J7625O397
1439B922N852m347j4473J0558J9368j2021k4241o73J8208P586j2277j229J7161
$$ plain form
1350 9046 -7226 -48966 8214 55018 -2707 -29140 874 9923 18847 3151 -43081 -19615
1362 -19615 33547 15663 -3968 2247 -15275 -61 30401 -11865 -35636 7293 7617 -2202 32491
1375 32491 5745 -44802 2304 37380 -10856 -26773 -6304 -1096 26404 31301 -23541 -30265
1387 -30265 16628 18059 -8712 -18027 -15663 12463 31274 69 -14250 1943 -8383 -5798 18012
1400 18012 -7043 -27380 13020 26578 1079 1131 -10055 -27019 10266 28491 -19811 -27233 18647
1413 18647 27644 5169 -11067 -18686 -4258 12447 -110 -10818 -1716 6195 14294 10303 -11593
1426 -11593 -12418 933 -6533 -1181 16264 -3752 -15832 18336 22476 -14799 -21100 -3475 2922
1439 2922 8774 4427 -10046 512 19880 7859 -16382 -17055 1153 8739 -3538 -4767 12394
1452A2394l725j5769Q752K631j8954M998J6206n001K764P235j6294k049J9245
1465A2433j2363k2899J5508K0754m841j0556K52R124J321j7641n415J4219N30
1478D26j263Q197o432p97J5862j7313k2689K5481J1497k8081R374K5419j6202
1491C479q588J2503j0031p149R502o023J526J8659o690j2931Q430K780n191o430
1505f154j2638J4334K7829k0266k0272K8457M054k6255P256K477j6820K2540J4555
1518A9097k8536O042K3634k4591j0542K3797j0342j6281J9071J0127l658j224
1530F594j4663j94K1498j2579k1252J5893J0664M69J0211j9010j7204L2058K260
1543A4745l9442J4155K6493k1779M470K3459k3987j2356K1883r911r453J8948
$$ plain form
1452 12394 8669 -7100 1652 4283 -14671 -9673 6533 1532 4296 11531 -4763 -6812 12433
1465 12433 70 -22829 -7321 13433 8592 -1964 -1712 7412 8733 -8908 -14323 -104 426
1478 426 -837 7360 928 131 15993 -1320 -24009 1472 12969 -15112 -5738 19681 3479
1491 3479 -5109 7394 -2637 -9786 -284 -6307 -4781 13878 7188 -5743 2687 5467 276 -6154
1505 -6154 -18792 -4458 23371 3105 -17167 11290 15344 -10911 -3655 -1178 -17998 4542 19097
1518 19097 -9439 -3397 20237 -4354 -14896 8901 -1441 -17722 1349 11476 7818 6594
1530 6594 -8069 -8263 13235 656 -20596 -4703 5961 6430 16641 -2369 -19573 12485 14745
1543 14745 -24697 -10542 15951 -5828 -1358 22101 -1886 -14242 7641 -2270 -11723 7225
1555G225r334j0309K8206L449k6657k946N802M993Q289j7602r346L3905N721k9295
1569g899N685N953j7480J3967R934k6004J1322K7164k3624p301K5225k0039k2071
1582b5168K9133Q112j9653O041O222k110J0635j1323k2955J4739J5218r901j05
1595a115P26m71J6647o810k8347J3381J6883k2731L667K5693j5951r900K1228
1608A2900q690j6001J3080n117j1093K5111O582k5760L639J8126q131j1874l765
1621a0993K905J4814J465j3794P499Q943j2072j945K704j0826P360J3006j3547
1634d481K612K0776j6958j8735K1930L503k3661O293J6664l784N93P87j0922L135
1648b248Q470j1575p106J1594Q751j354o282k330Q814k963j7271N584J5436r064
$$ plain form
1555 7225 -2109 -12418 15788 19237 -7420 -10366 -4564 429 8718 -8884 -18230 15675 21396 -7899
1569 -7899 -2214 3739 -13741 226 10160 -15844 -4522 22642 -982 -8283 16942 -3097 -25168
1582 -25168 3965 12077 -7576 -1535 4687 2577 13212 1889 -21066 -6327 8891 -1010 -1115
1595 -1115 -389 -860 15787 8977 -19370 -5989 10894 -11837 -8170 17523 1572 -8328 12900
1608 12900 4210 -11791 1289 -3828 -14921 10190 16772 -8988 -5349 12777 4646 -7228 -10993
1621 -10993 -8088 6726 8191 -5603 1896 10839 -1233 -3178 -474 -11300 -3940 9066 -4481
1634 -4481 -1869 18907 1949 -16786 5144 8647 -15014 -8721 7943 4159 4752 5539 -5383 -2248
1648 -2248 6222 -5353 -12459 -865 7886 6532 250 -2080 6734 3771 -13500 -7916 7520 -1544
1662a544m339J4755j104r287M193n876q292J3910L473j6407P885K0027j0763j6053
1676i422O820O039o975l776M450O748K955k874l227j037m74l65n028k991J2122
1691B965P751j2301k730J5142m523j8597M396J1752m713k210P153k69q26K736
1705E726q632p846R231O365r656j118J4855L384j4394m351Q988j409r730K424
1719f163Q937J218k28M12m698q48M549o948q628J1731J1490r987o472J2823K342
1734I530j5088l970Q758Q74k573L353K423O4K794m029j0368K482R744n291q180
1749i477J1950J1578j0892r814P932K366r591j474P144J892J949K271n605k678
1763b449O508l705j2326N772J4810m126r878Q379P347j0171q678M338L782j869
$$ plain form
1662 -1544 -5883 8872 7768 -1519 2674 -3202 -11494 2416 5889 -10518 -2633 17394 6631 -9422
1676 -9422 -2602 3437 -3538 -7314 -2864 3884 6839 3965 738 -299 -773 -1138 -6166 -9157 2965
1691 2965 10716 -1585 -4315 10827 6304 -12293 -7897 3855 -858 -3068 4085 3816 2990 5726
1705 5726 -2906 -10752 -1521 4844 -4812 -5930 8925 12309 -2085 -6436 2552 1143 -8587 -6163
1719 -6163 2774 3992 3764 4176 -522 -1370 3179 -3769 -12397 -666 10824 837 -5635 7188 9530
1734 9530 -5558 -9528 -770 104 -2469 884 3307 3371 6165 2136 -8232 -5750 3994 -1297 -9477
1749 -9477 2473 14051 3159 -6655 1277 3643 -5948 -7422 -278 1614 3563 5834 229 -2449
1763 -2449 4059 354 -11972 -6200 8610 4484 -5394 2985 10332 161 -8517 -4179 -397 -2266
1777b266J547K539L48L496N53j0658m691J1122J143j2815M979J6886n031j2512
1791e360N699M003q364k037L747L69N091M096o255l425O575j540j1238m48J1842
1806B755L495q534nJ1311j883j3736O63O532l722J08O178l059J641Q748j0236
1821B56j1972J2345N268j4900K129J5861k081q218J843J038k297k054l502K398
1835c886P509J213k470k158L87M035m741j2787P507J5460j0113p399J5936M26
1849H919j4914M164L325r346O035O828q945N068J1426j2412r330J0866J648r884
1863f552J60O540P397n2j0426L2Q347o509o373N901j094J642J1339p381j0117
1878g146J3739p74j9625R219J3994j4468j601J7120l260r543K263m603m54R987
$$ plain form
1777 -2266 -719 1820 2168 5664 6217 -4441 -9132 1990 3133 -9682 -4703 12183 7152 -5360
1791 -5360 339 4342 -4022 -6059 -2312 -1943 3148 7244 989 -2436 4139 2599 -8639 -9087 2755
1806 2755 6250 -2284 -2289 9022 7139 -6597 -5934 598 -3124 -3016 3162 103 1744 10492 256
1821 256 -11716 629 5897 -9003 -6874 8987 6906 -1312 531 1569 -728 -2782 -6284 -3886
1835 -3886 3623 4836 2366 208 595 4630 -111 -12898 -5391 10069 -44 -7443 8493 8919
1849 8919 -5995 -1831 1494 -7852 -1817 5011 -3934 1134 12560 148 -9182 1684 3332 -6552
1863 -6552 -6392 148 7545 7493 -2933 -2901 5446 -1063 -7436 -1535 -2629 -987 10352 2971 -7146
1878 -7146 6593 5819 -13806 -4587 9407 -5061 -6662 10458 7198 -2345 -82 -4685 -5139 4848
1892D848n756q092J1313Q437n398o732n789M053R452r995o720J5562K119j0457
1906c155Q798J157j7150N220J0050j0014L002J0291j2227M54J8868j0792k1000
1919a6498R915J2292l162k639l469K419J1600l248j3784k61L330K100P103n212
1933D86o757J2410K053j2954N704K269j7426P470K1968j0621j3362R973L710k799
1947B124K145j2131q031J9785J0802j4273p396O791O773j96j1169o249Q882M541
1961B398j207N756m128j0906R072P612j2057l666M070k364J0605J1980j9160j4099
1975a6094J9027R948j4902r224L887R714R175m358j2090r97P073L865m662r318
1989h956J989J2335J349l454J603q811p447J5075O934j8301m860J5596P327k077
$$ plain form
1892 4848 -908 -9000 2313 10750 5352 -1380 -7169 -3116 6336 -3659 -10379 5183 7302 -3155
1906 -3155 5643 6800 -10350 -5130 4920 -5094 -2092 8199 -4028 -3574 15294 4502 -16498
1919 -16498 -6583 5709 2547 -92 -3561 -1142 10458 7210 -6574 -6835 -3505 -1405 5698 486
1933 486 -6271 6139 8192 -4762 942 3211 -14215 -6745 15223 4602 -8760 1213 4923 2124
1947 2124 4269 -7862 -15893 3892 14694 421 -6975 -184 6589 6393 -4776 -11025 -2143 2398
1961 2398 1191 6947 2819 -8087 985 8597 -3460 -7126 -3056 -5420 5185 17165 -1995 -16094
1975 -16094 2933 12881 -2021 -11245 -7358 2356 11531 7173 -4917 -5914 1159 5024 362 -8956
1989 -8956 -6967 5368 6717 3263 4866 -3945 -11392 3683 10617 -7684 -12544 3052 10379 8302
2003H302p652j1875L688J6038j690j5425j460J3959R643p681j2663J544M916j773
2017b129L511J568r840K684J5928l647j2361M20k657J516J4818l802j8725Q044
2031d672J8615m531j3963o123M196J1603J120j0388N44O790J019K187o197j2191
2045a1991P782R937q296K628Q245j3439K12J9228j0714j9910J1209R684l276M811
2059F110n032j0116J4180O922j8352m829R889K772L919k699q333Q749M786j4308
2073f342K724P919j3336L765J8151j1023p311J3376r340p084J7371r490j7615
2086a8235K2463J1014j9824J950Q035q418L646J359j3048R044J2296j2337R16
2099a139Q951j0609K80O842j3368L844J6464j5680l044K3355j1909j8203J9572
$$ plain form
2003 8302 650 -11225 -7537 8501 6811 -8614 -10074 3885 13528 5847 -6816 -5272 -356 -2129
2017 -2129 1382 2950 -6890 -4206 11722 8075 -4286 -3866 -6523 -5007 9811 6009 -12716 -4672
2031 -4672 13943 9412 -4551 -10674 -6478 5125 6245 -4143 -3599 3191 4210 6397 200 -11991
2045 -11991 -4209 5728 -2568 60 8305 -5134 -4922 14306 3592 -16318 -5109 4575 1299 6110
2059 6110 1078 -9038 5142 12064 -6288 -11117 -1228 1544 5463 2764 -5569 3180 7966 -6342
2073 -6342 -3618 4301 -9035 -5270 12881 1858 -5453 7923 -1417 -8501 8870 -620 -18235
2086 -18235 4228 15242 -4582 -2632 5403 -3015 631 1990 -11058 -2014 10282 -2055 -1139
2099 -1139 7812 -2797 -2517 4325 -9043 -5199 11265 -4415 -7459 15896 3987 -14216 5356
2112E356o76j7957J4757N530j5426J4023O781k3247P045J5496j8384l551J5179
2125D926m233J416O089j4659K712J5995j6884q561J9139n827n566J7539j0150
2138A936j3359K0785m269k1774J8895O944k3381J4855J7597k3169k480J5122j1976
2151d274N56J1552j6716LK4440r148j4337R946m227k150J2520j3250q492K4572
2165A0995k319j7647J5914p63k2148J7166R768k2842Q336J4621j6967P087J4940
2178A6141k5997o148K7143o270j4418J1453k167m06J4328j3920j4919J8092J926
2191D838j2118J0772j026j0384J7075J001k1185R959O914j8815J2363J6674k3992
2204g924j922K3893r841j1062J0006j0043k612K2699p593j8686J5311P694j1491
$$ plain form
2112 5356 4680 -13277 1480 7010 -8416 5607 12388 -10859 -3814 11682 -6702 -10253 4926
2125 4926 693 2109 8198 -6461 -3749 12246 -4638 -13199 5940 113 -5453 12086 1936
2138 1936 -11423 9362 5093 -16681 2214 9158 -14223 632 18229 -4940 -7420 7702 -4274
2151 -4274 -3718 7834 -8882 -8879 15561 6413 -7924 2022 -2205 -4355 8165 -5085 -13577 10995
2165 10995 8676 -8971 6943 6180 -15968 1198 10966 -11876 -3540 11081 -5886 1201 16141
2178 16141 -9856 -16004 11139 4869 -9549 1904 -263 -669 13659 -261 -15180 2912 4838
2191 4838 -7280 3492 2466 -7918 9157 10158 -11027 -1068 5846 -12969 -606 16068 -7924
2204 -7924 -9846 14047 4206 -6856 3150 -6893 -9505 13194 5601 -13085 2226 9920 -1571
2217a571K163l347p721J4716K747j3810R441M809j4503Q706P614j9652J930J6228
2231G750r609J192J2115j6621m558K3040q737k0398J3699P999p405O672k288j0457
2245g606J0794L973j4474K915O604n628N864M730j0200L159M416j0933M432R171
2259G217j5148k98K0582o664j1930Q680j844o587J0957m069j2685J3866R592j3444
2273a775j582O657m963k63K626m604L234M833n095K361M688r370j863P236l947
2288a827r11O481n738m19J2585p139j4223J0625O340j0582J657O767l962K143
2302A797L646q452j010O436m067l009O041J296j399j29j546J927j75p493J642
2317d495R232k965n503O505J331n166K243k125o017P523M684q686J002R386m091
$$ plain form
2217 -1571 592 -2755 -10476 4240 6987 -6823 2618 7427 -7076 1630 9244 -10408 -8478 7750
2231 7750 -1859 -667 11448 -5173 -9731 13309 4572 -15826 -2127 5872 -1533 5139 2851 -7606
2245 -7606 3188 7161 -7313 -4398 2206 -3422 2442 7172 -3028 131 4547 -6386 -1954 7217
2259 7217 -7931 -8229 12353 5689 -6241 2439 595 -5992 4965 896 -11789 2077 11669 -1775
2273 -1775 -3357 3300 -1663 -1926 700 -3904 -670 4163 -932 1429 6117 -3253 -5116 2120 -1827
2288 -1827 -2738 3743 -1995 -2414 10171 3032 -11191 -566 5774 -4808 -3151 3616 -346 1797
2302 1797 5443 -3009 -4019 2417 -1650 -4659 1382 2678 1279 1150 -396 1531 1356 -6137 -4495
2317 -4495 4737 1772 -3731 2774 4105 -1061 1182 -943 -6960 563 5247 -3439 -2437 6949 2858
2332B858p085L252J642k761J62J705J641J883j928k004M22j58r74j023p92M204
2348A044M776n641l599O924O2r050J226O017j971m82L027q79r95J931l438m215
2364e263M404L656m257p46N690J404n853k418L425R31l891M45L873R98p65J8k076
2381d25j117K353j631m276M148O143m000m030N285J297o174j640L644O41n15J414
2397A117J55m97J490j881m305Q54M663j092l624L817N021m030m809K381J922l396
2413b214p43L119Q12O78J289k644k137K664m63m779J499O730j028m758K546L454
2429D025l995l864J954J702l77J109N58m19J503M92m556k273M413J195m440R99
2445a974O421q92n429R03K511k630j425J732P42J182K150k414k670K167J360m809
$$ plain form
2332 2858 -4227 -975 667 -2094 -1932 -227 1414 3297 1369 -635 -213 -371 -1345 -2368 -3160 1044
2348 1044 5820 179 -3420 3504 3566 -5484 -4258 1759 -212 -694 2333 1454 459 2390 -1048 -5263
2364 -5263 -859 2797 -1460 -2206 3484 4888 -965 -3383 42 973 -2918 -2473 1400 2398 1633 1651 -425
2381 -425 -1542 811 -820 -5096 -948 5195 1195 -2835 2450 3747 -2427 -4067 -423 218 -297 1117
2397 1117 1272 775 2265 384 -3921 -3067 1596 504 -3120 697 5718 1688 -3121 -740 1182 -2214
2413 -2214 -2957 162 974 1652 2941 297 -1840 824 361 -4418 -2919 3811 2783 -1975 571 4025
2429 4025 30 -3834 -1880 -178 -555 554 1112 693 2196 2688 -1868 -4141 272 1467 -2973 -1974
2445 -1974 4447 3555 -1874 -971 1540 -1090 -2515 -783 -41 1141 3291 877 -1793 374 1734 -3075
2461c075j406N895K311m504k67M302r69m847m2K225p44Q87J663j154O75K804l531
2478B23m851L805L187m647q30N844J366m314j015J604q87j208L53K50J540K119
2494B539l74k688k25K854k803m200L288N172l312k197M592O63m968l31J421o80
2510a249R71J520j886Q09M100k509n619J553M111j954k916K959L698j535k831
2525g78Q22K94k138K51J112k13J591J935k611j294M110k430o140K779O191j973
2541A508l618K601K418j405j850j547o89J984K347j274j386K434J705l448k454
2556b674K557J71l915K784N404k804l336K483J098k045o87j554j81M566K527m822
2572d28k347L847J871l781l392K724L192r43l61J817k004j879K462l27l457J595
$$ plain form
2461 -3075 -4481 1414 3725 -779 -1046 3256 2287 -2560 -2602 -377 -1121 -234 1429 275 950 3754 223
2478 223 -4628 -823 2364 -2283 -3113 2731 4097 -217 -1232 372 -515 -1723 -1370 -1120 420 2539
2494 2539 2165 -523 -748 2106 -697 -4897 -1609 3563 251 -1946 2646 3309 -1659 -1990 -569 -1249
2510 -1249 -278 1242 -644 165 4265 1756 -3863 -2310 1801 -153 -3069 -110 3588 2053 -778
2525 -778 44 338 -1800 -1549 -437 -650 941 2876 265 -1029 3081 651 -5489 -2710 3481 1508
2541 1508 -2110 491 2909 1504 -346 -1893 -2582 -598 1749 475 -911 1523 3228 -220 -2674
2556 -2674 -117 54 -3861 -1077 4327 1523 -1813 670 1768 -277 -964 -2518 -2699 1867 4394 -428
2572 -428 -2775 1072 2943 -838 -4230 -1506 1686 743 382 2199 195 -1684 778 451 -3006 -1411
2588a411J944j293L514K186o861k685O893M91n899n61L687L083L47l336k324J727
2604d98J441q68j288j249K522L802k374k639K737k263l854N855K117p501J651
2619b409P023j843k665j36m121J952O737m007n711N018M620j881k415k991N7M192
2635A420j215k242L442r36j894N324j006p843K603L480l530M454J754q557L263
2650a483J0286p788q130N768K144j026L520l788l429P604L77o905J129P13j738
2665b746N193j53m900M121M22n262N508N48j0476M796J0179o829k955N775m504
2680a283l20P434q263o384J1714K299p849L500J157m409M201n66o283M727K345
2695B020m855N228K301q793K704N405p228J398N157p964L190J1223j0199p131
$$ plain form
2588 -1411 533 -760 2754 4940 -1921 -4606 2287 2778 -3121 -3682 5 3088 3435 99 -2225 -498
2604 -498 943 75 -1213 -2462 60 3862 1488 -1151 1586 -677 -4531 1324 3441 -4060 -2409
2619 -2409 4614 2771 106 -30 -4151 -2199 4538 531 -5180 -162 4458 2577 162 -2829 -2772 1420
2635 1420 205 -2037 1405 469 -1425 3899 2893 -4950 -2347 1133 -2397 2057 3811 -4746 -1483
2650 -1483 8803 1015 -7115 -1347 797 -229 3291 -497 -3926 3678 4055 -2850 -1721 -1008 -2746
2665 -2746 2447 2294 -2606 1515 1937 -3325 2183 2731 -7745 -2949 7230 401 -2554 3221 -1283
2680 -1283 -1603 5831 -2432 -8816 2898 5197 -2652 848 2005 -2404 1797 1231 -5052 -325 2020
2695 2020 -2835 2393 4694 -4099 -1395 4010 -3218 -1820 3337 -4627 -1437 9786 -413 -7544
2709g544J2039j995q209O876m51n617R227P88j0454N800M059r159K464N160o016
2724c032K828M596o487K613M216j0001J420R602p913l190J0855m076n196R247
2738E482n009q060J1471l81j2107R826O273j1205K635N685q013K126N200r049
2752e126K555R258p683j644P525o473j943P795o776k715J0928m889o052J2030
2766F790l604j1879J0228L831j1590N436M866q650O421O240j3813N99J1104p098
2780a119l162P091m082MP976p295m531Q858m282m759R852l197p696J0409Q39r529
2796d623O353K69j0381R707O834j4498J836J2210p200k656N427p605k96J1464
2810F841o160o830R222n16n102O079l717o597Q314Q04n810O490o47q506R472M010
$$ plain form
2709 -7544 4495 2500 -5709 1167 716 -4901 4326 5114 -5340 460 4519 -4640 -2176 2984 -3032
2724 -3032 -204 4392 -2095 518 4734 -5267 -3847 5755 -2158 -5348 5507 1431 -3765 5482
2738 5482 473 -7587 3884 3503 -8604 1222 7495 -3710 -1075 4610 -3403 -1277 3923 -5126
2752 -5126 -2571 6687 -996 -2640 4885 -1588 -3531 4264 -2512 -5227 5701 812 -5240 6790
2766 6790 3186 -8693 1535 5366 -6224 -788 4078 -4572 1849 8089 -5724 -5125 5979 -1119
2780 -1119 -4281 2810 -1272 -1268 6708 -587 -5118 3740 -542 -5301 4551 1354 -6342 4067 4906 -4623
2796 -4623 1730 1999 -8382 1325 8159 -6339 -4503 7707 507 -2149 3278 -4327 -4623 6841
2810 6841 681 -6149 3073 2557 -2545 3534 -183 -6780 1534 2338 -3472 3018 2371 -6135 3337 7347
2826G347j3686J696Q736n927K210N347j0366N31J2798p265q777Q159R6l719P140
2841D320k642o537P136Q52o394L760k65n641P317M021q439J629L301n481M325
2856A262L356j1744K643J2679o098n885O113k647k558P175m399p207Q622L288
2870D600o471L200P11n862L925K706n513J201K594k918M586K411r184K88P623
2885C897m270j953M096m168R08Q483n775p803P973J176n852L530J578m624L845
2900A041L080n347j5K046l687K445L488m557l40M300j389k50K36n162J686P072
2916D647m776l863O208J87l496K722j437m361M850J745m754J888L648m028Q0L064
2932B324k746k264K255K66J105P06k953O13L410k606k469J766l83N66L113k963
$$ plain form
2826 7347 -6339 -4643 4093 -1834 376 5723 -4643 -4112 8686 1421 -7356 803 899 -2820 4320
2841 4320 1678 -4859 2277 3129 -3265 495 230 -5411 1906 5927 -2512 -883 2418 -3063 1262
2856 1262 4618 -7126 -4483 8196 2098 -3787 2326 -321 -2879 4296 -103 -7310 1312 4600
2870 4600 -1871 1329 2040 -3822 103 2809 -2704 -1503 1091 -1827 2759 5170 -4014 -3726 3897
2885 3897 -373 -2326 1770 -2398 -1490 6993 1218 -6585 1388 2564 -3288 242 1820 -2804 1041
2900 1041 4121 -1226 -1241 805 -2882 -437 3051 -1506 -1846 2454 1065 815 1051 -4111 -2425 4647
2916 4647 -129 -3992 2216 2403 -1093 1629 192 -4169 681 2426 -2328 -440 3208 -820 -740 2324
2932 2324 -422 -2686 -431 -165 940 1646 -1307 -694 2716 110 -2359 -593 -976 -410 2703 -260
2948b60k046M729k75n121J957K630l573J086L054j951o49J841j591q83J523j285
2964h14j511K949R79q47q29o39J167P25k890n21L617k33j671J608j39j956J135
2981A30o3k467K018K447k639k63L091j283k941J351J186j220l4O30N88P34p48
2998E17j161M9K69J70k40o15J124K159j526k065J885N45l044L49K407n86m79J182
3016I40l64n51O99r75j911J690J847j365q49J865M25j653j158Q79P76q45k75J407
3034E82N10n75L11r11r17J039o9j567J185K488j225j879J483Q24k163n38J166
3051b56P18o03P01J59m92J32j47j509K01J721P7j511P74K038j121k252N94J033
3069B57r23J51O90L54J90L09j076p87O22M36j633J65K895l34j954M34J463j305
$$ plain form
2948 -260 -2306 2423 2148 -2973 -1016 1614 -1959 -873 2181 230 -419 1422 -169 -1052 471 -814
2964 -814 -2325 624 1603 756 -73 -712 455 1180 -1710 -2231 1386 1153 -518 1090 951 -1005 130
2981 130 67 -2400 -382 2065 -574 -837 2254 971 -1970 -619 567 -653 -687 -57 531 1265 517
2998 517 -644 -595 -326 -156 -396 -1011 113 2272 746 -1319 566 1111 -1933 -1584 823 237 -242 940
3016 940 576 25 724 -251 -2162 -472 1375 10 -839 1026 1451 -202 -1360 -481 295 -550 -825 582
3034 582 1092 517 828 -83 -1000 39 -30 -1597 -412 2076 851 -1028 455 1279 -884 -1422 -256
3051 -256 462 -141 560 719 227 359 212 -1297 -1096 625 702 -809 -35 2003 882 -1370 -776 257
3069 257 -666 -515 175 529 719 1028 -48 -835 -213 223 -1410 -1245 1650 1316 -638 -204 1259 -46
3087d6j458O83Q91R3M5M16m28M29O0j369r48J618Q61j513K54J772q8k138L59N72
3107F5k27o05O48N42r5P88p47r51J94R85j249p12J850R99j549l25J254Qk093M55
3127g65O40j96K46R10p91J15J004j338j481J211J338j208n34J648R04j471r10
3144f78N98P5r65N83J66J09J137K31j591k95J247q42j858J782J703j018j073J251
3162E62K13r15n21J86k22Q42M09n74O4N52R9j622j11J577k80j285J074J586j198
3181D36j050P64pq70M00K24l30J300O17j921j44J513o50j566M73J140K09m56J13
3200A95L92k44r30M58q7k50N41O90q11L01J011j934j066K313L56k503J022K092
3218A546p79q12K91j015K60R99j103l20J365P77j046N3k97j84L09j014Q16J303
$$ plain form
3087 -46 -1504 -821 70 163 208 624 196 625 685 -684 -1632 -14 847 -666 -412 1360 1272 -866 -507 65
3107 65 -162 -767 -119 423 328 1116 369 -582 -388 597 -652 -1364 486 1485 -64 -389 865 873 -1220 -765
3127 -765 -125 -321 -75 835 44 159 1163 -175 -1656 -445 893 -315 -849 799 1703 232 -678
3144 -678 -80 -5 -970 -387 -221 -112 1025 1256 -335 -630 617 -225 -2083 -301 1402 384 -689 562
3162 562 775 -140 -661 -475 -697 145 554 -20 44 596 695 -927 -1038 539 259 -1026 48 1634 436
3181 436 -614 150 143 -727 -327 -103 -433 867 1484 -437 -581 932 282 -1284 -811 329 538 82 195
3200 195 587 343 -587 -129 -216 -466 75 765 -46 255 1266 -668 -1734 579 935 -1568 -546 1546
3218 1546 767 -45 246 -769 -509 490 -613 -933 432 1209 163 216 -81 -265 44 -970 -154 1149
3236A149j440m02K458p03k460Q87K66p68J879p6k115J725K045k550j679J718k75
3253c41k78J050m90j02J112n11q64N41o91n76J724k13n52J071j015o68K380q77
3271G00l892K633K697k452k48J885j738J18K042k857j212L494o24j605K269p06
3287E04j515J402n6j166J006o81o58K821k04l185J810J190k427R77M70k363K580
3304E05K413l655r76L765j952j725K235r83j365L095l38k100K004n41k292K213
3320C03P90k725J526J305j572J652j06l583K465K494m383J32L664k187o32L160
3336B303l050j377L703j473k711L493N91l088K445R20l134Q78J170k356J997J180
3352A491l125J712K268l180j99K225k481N23K866l254k82M401k636k952M044o84
$$ plain form
3236 1149 -291 -693 1765 1062 -1398 -511 -245 -1013 866 790 -1325 400 2445 -105 -1784 -66 -341
3253 -341 -619 431 -59 -161 951 440 -424 117 -574 -1150 574 361 -191 880 -135 -803 1577 700
3271 700 -3192 -559 2138 -314 -562 1323 -415 -297 1745 -1112 -2324 1170 546 -1059 1210 504
3287 504 -1011 391 335 -831 175 -506 -1164 1657 1453 -1732 78 1268 -1159 -182 288 -2075 505
3304 505 2918 -737 -1713 2052 100 -1625 610 -373 -1738 1357 1019 -1081 923 382 -1910 303
3320 303 1093 -1632 -106 1199 -373 1279 1173 -2410 55 2549 -1834 -1702 1962 -225 -857 2303
3336 2303 -747 -2124 1579 106 -2605 888 1479 -1609 836 1756 -1378 -500 670 -1686 311 1491
3352 1491 -1634 78 2346 -834 -1033 1192 -1289 -766 2100 -1154 -1436 2965 329 -2623 1421 737
3368G37l413L215P12k933K624P57l487J777J763l495N70K570k048K15K326k621
3384g31J56K438l207k75L780k609j839M199o84k905L325j351l187M103Q30m826
3400b783K584K830l362M37J838l163M12K916k369k36K781k168m66K831k439j865
3416b222L016q59j305L099j739k337M516k73m496J726K206l147K272J683m003
3431a863J277L552l600j116K650j458o15L220j854j695K766r99j257K254j767
3446e05k023L838P95l335J307P87k145K556K43m530J854L800k735p69K376k109
3462e95n36L048k380j662K665K1j299K232j165k237K408O63k013O71P5q88K666
3479A674L6l738J191K683k425M5J156k009J055K596k274j781K624q09j141J907
$$ plain form
3368 737 -2676 539 1251 -1682 942 1699 -1788 -11 1752 -1743 -1173 1397 -651 -436 1890 -731
3384 -731 -575 1863 -1344 -1619 2161 -448 -2287 1912 1228 -1677 1648 297 -2890 1213 2043 -2783
3400 -2783 -199 2631 -731 -294 1544 -1619 -1207 1709 -660 -896 1885 -283 -749 2082 -357 -2222
3416 -2222 794 -65 -1370 1729 -10 -2347 2169 1896 -2600 -874 1332 -1815 457 2140 -1863
3431 -1863 -586 2966 -634 -1750 900 -558 -1173 2047 193 -1502 1264 265 -992 1262 -505
3446 -505 -2528 1310 2105 -1230 77 864 -1281 1275 1518 -3012 -1158 2642 -93 -862 1514 -595
3462 -595 -1131 1917 -463 -2125 540 561 -738 1494 329 -1908 500 1163 -850 -179 -104 -992 1674
3479 1674 1710 -2028 -837 1846 -579 -534 622 -1387 -332 2264 -10 -1791 833 24 -1117 790
3495G90o40j811K160Q81j508J95m20r23K130L03k495O85J253l02K37l9k221J170
3513e55K171j833j018K157p08o49J791j404j614J791O95j335R87j53q50J114O12
3530A199j636n34R03r7P31k88j421J069J474j441m46P77p59L97J251j227p98J729
3548H83l88r80N49k19r28J021J170j187l08O43j98J97q8q96MJ306j30n01j61k97
3568e08O78P13j668k3J151k16k15M90j28q55M61M87q19K56K97n68N02O17p72m30
3588e50Q99J33r45N5M0M39K15k19j45J31q1j26O0k34L23Q29p57l74N00l4n83K97
3610a27M27n06J1K61K17k29r1l02K02L23j4n05J41L78K08m04k57K64M9n6j64M22
3632B48q8r0L2j62j00K11l25J67J24K12k98j40Q03k15o17l30O92j99l22J99M04
$$ plain form
3495 790 150 -1661 499 1380 -128 67 -353 -1276 854 1157 -1338 -653 600 298 535 496 -1725 -555
3513 -555 1616 -217 -1235 922 214 -435 1356 -48 -1662 129 824 -511 476 323 -527 587 1199
3530 1199 -437 -971 -68 -165 566 278 -1143 -74 1400 -41 -487 290 -469 -72 1179 -48 -846 883
3548 883 495 -485 64 -155 -1083 -62 1108 -79 -387 256 58 255 167 -729 -725 581 451 -50 -211 -508
3568 -508 170 883 -785 -808 343 127 -88 402 274 -581 -120 367 -452 -196 101 -467 35 652 -120 -550
3588 -550 349 482 -463 -408 -368 71 286 67 -78 53 -28 -154 -94 -328 -5 824 67 -307 193 159 -424 -127
3610 -127 300 -206 -195 66 283 54 -37 -339 -137 186 172 -333 -192 186 394 -10 -267 -3 46 -10 -174 248
3632 248 160 70 102 -60 -160 51 -274 -107 17 229 -69 -209 594 379 -238 -568 124 -75 -397 -198 206
3653B06l5J16j78p1j58K25m9k12Q7M68l03l05M85k08l44Q5L87m5p3J72j58j25
3675c3Q2q4j39R1J99m1k21J3P75o24l48J46K06l14J16K68Q1p4j76r9l51N13K38
3698B24l30L8N03j99l07l0L14k33l50M66J26k69J01Q6K03m14R7k84k27L85K62
3719A62l47J47O22o36j75n7L91R5m06J89P9P3L4l12l1R9J82m16%K45L88j84k48
3742a06L84l60j10mL11P7k37J14j11J12J62q3l36K63J49l31N3K99j60j63N8l6
3764e5J30j37q7K3%M18j34l18J28J39Q9l59N7Q6K54m75J27J33k0l40K66P9J70
3787A74p0R8k98j59N05n89m5P11l37j89K08K25l7k91r9O7K59m73K97p5N9K18r5
3810F4j88P2M7l12K22K98k15k16N50k96J84k31J4j10%R4M0j08r8J67N0M6j07L20
$$ plain form
3653 206 171 287 109 38 -120 105 56 -156 -69 399 96 -209 276 68 -276 -191 196 151 78 250 92 -33
3675 -33 49 -35 -174 -83 116 75 -146 -133 642 18 -330 -184 22 -292 -176 92 173 99 -77 -176 -527 -14 224
3698 224 -106 -68 435 236 -71 -101 213 -20 -370 96 222 -47 54 140 343 -71 26 -258 -485 -100 162
3719 162 -185 -38 584 -52 -227 -284 107 202 -204 -15 64 137 171 -141 -172 -73 109 -307 -307 -62 326 142 -106
3742 -106 278 -82 -192 -196 115 192 -45 69 -42 70 232 149 -187 76 225 -106 -53 246 86 -77 -19 -55
3764 -55 75 -62 -149 -126 -126 292 158 -160 -32 107 196 -163 -106 -20 234 -241 -114 19 -1 -341 -75 4 174
3787 174 104 202 -96 -255 250 -339 -384 327 -10 -199 9 234 197 -94 -193 -126 133 -340 -43 -118 -59 159 64
3810 64 -124 -52 -5 -317 -95 203 -12 -228 322 26 210 -21 -7 -117 -117 -23 17 -91 -189 -22 28 74 -33 287
3834B87j28j73J31J28j74r1K5K03l28j4J67OK27p4j04k40K30l71l1L18K23j90
3856B7j81J68Q5rj53J37J34m30K61k5j40M16K42n12l48J60L99n45L46j2l11K45
3878d6J07j12j44L34l22j39M91J71n33L09j03r6Q5OK65K7l10j01J74rn1O6J81
3901B50m16J97ml35M98K21n98K04j24O5k67K76j44L61ml61K96J46j25r6m6j74
3923a80M47P0l70m33N86J40n32J67L45n64J55L48K2l25K2L21m82M78j25l05J53
3944f2J47j90m7O4J64K1o1l25O36r7m07M15j15n11K64L94m57jN89n84l50Q87k96
3967G8l77M40M2l91J97N9l00M25K21o77K56O0l07L81l40j52N31J12l82k4N33n89
3989b04j88O98l24m87J027k71n59P00l00n13N06K06o22L27J19j46K86J27m90j1
$$ plain form
3834 287 159 -14 117 245 71 -20 5 208 -120 -134 33 39 266 192 88 -152 78 -293 -324 -6 217 27
3856 27 -154 14 99 90 -63 74 208 -222 39 14 -126 290 532 20 -328 -168 231 -314 32 20 -291 -46
3878 -46 61 -51 -195 139 -183 -322 169 340 -193 116 13 -83 2 8 273 300 -10 -111 63 54 3 69 250
3901 250 -166 31 27 -308 190 411 -187 17 -107 -42 -309 -33 -177 184 180 -181 115 261 136 40 -6 -180
3923 -180 267 337 -33 -466 120 260 -272 -105 240 -324 -169 179 201 -124 -102 219 -263 215 90 -215 -62
3944 -62 85 -105 -152 -88 76 97 36 -289 347 250 -157 258 143 -368 -104 290 -167 -168 421 -163 -513 374 78
3967 78 -299 141 183 -208 -11 48 -252 173 394 -283 -27 33 -274 107 -233 -385 146 258 -124 -148 385 -204
3989 -204 -392 306 -18 -505 522 251 -308 392 92 -421 85 291 -331 -4 115 -31 255 382 -108 -119
4009a19K31l75L03L49m88J89N12j012M7Q29o59k40O39p8o21P30lq40P26J77n38
4030b41K80L67p55J98O25n40n79R04m83J70L18n01P4P95p78o88R74P2n86O79l77
4051g2n01J291j55j237L01Q28j007M23M43n04k45R54m02n02M56k25M0P72n41l70
4071b53L85J80l82M47n33r04J487o1j103R13R0q10P20M04j202J72R21o30j9O72
4091D94p34j19Q25j24j138O64L03l71Q34n98n88Q72J93r20K09J68m59J284l03
4110D92j395P51P29r03J02Q85j147j16J254J8j105J45M46m58N47l17n25O43O68
4129G14n50j93o6l14P74q4r52L21N82l22L65K36j170J15J011l15o76N13k14J30
4149i5R71m75j327N63N87j65j48k79K07O24J56q95j81J01K45N06j44p63M68M88
$$ plain form
4009 -119 112 -263 40 389 -99 90 602 -410 -363 466 -193 -433 206 128 -493 237 234 -606 120 297 -241
4030 -241 39 406 -349 -151 474 -66 -645 259 -224 -54 264 -237 -163 632 -146 -834 140 212 -374 305 -72
4051 -72 -573 718 563 -674 -373 455 -552 -129 314 -190 -435 519 117 -385 71 -154 -114 658 117 -253
4071 -253 132 312 -70 377 -156 -1060 427 366 -737 176 266 -544 176 580 -622 -450 471 -159 -178 494
4091 494 -240 -359 466 342 -796 -132 171 -200 634 36 -552 320 513 -407 -198 -30 -489 795 492
4110 492 -903 -152 577 -326 -224 661 -486 -602 652 670 -435 -290 156 -302 245 -72 -597 46 714
4129 714 164 -29 -95 -409 365 281 -671 -350 232 -90 275 511 -659 -544 467 152 -524 -11 -225 -95
4149 -95 876 401 -926 -363 224 59 -89 -368 -161 463 619 -276 -457 -356 -111 395 251 -512 -44 444
4169D44m72k14L69p39J49R48k28q19M22O22m41M5p4q67R03P84p51o26K91O00J68
4190E14n64n43M01J29L1L28j54n24L62N63n41l85J53J4M8O40k04q64N32N10j03
4211C43q61J36N55J60Q2l79j51K13L04m81j92P4L12J68k32K75k1q71N59O18p12
4232a01n13O48K68j76K8k47r7N78m2o06p2J72Q15m86l81QK37l91o8N97l49l8Q39
4255F23j24n07J33j40l05J86M77m97L4O43j89m27m5j02J9J12K0J09R6k19K78j0
4277A65m29m5M28n62lJ175o93l71Q96j12r79J62N16l00K07J39J2l67L75j53m50
4298c89J72M12L3k41j71N07j2p44K47K06m20L0N87L7m33M31K0p50L71K71n61J56
4320b41Q41m93k07L98%m87oo8Q2L11j24K66q6k3q6o9m23K49M51l04l95J022j24
$$ plain form
4169 444 -28 -242 127 -612 -463 485 257 -562 -140 482 41 86 12 -855 48 832 81 -545 -254 346 514
4190 514 -50 -593 -192 -63 -32 296 142 -382 -20 543 2 -383 -230 -216 -168 472 268 -596 -64 446 343
4211 343 -518 -382 173 333 415 36 -115 98 402 -79 -271 -197 115 283 51 326 305 -566 -7 611 -101
4232 -101 -614 34 302 126 154 -93 -190 388 346 -260 -332 -160 655 169 -212 -204 33 -358 -426 171 -178 -216 623
4255 623 499 -8 125 -15 -320 -134 343 -154 -120 523 334 -93 -138 -240 -221 -109 -89 20 116 -103 175 165
4277 165 -264 -309 119 -443 -446 729 36 -335 561 449 -530 -368 148 -152 55 194 206 -161 214 61 -389
4298 -389 -217 195 228 -13 -184 323 311 -433 -186 20 -400 -370 217 254 -179 252 272 -478 -107 164 -397 -241
4320 -241 600 107 -100 298 298 -189 -195 -263 -181 130 6 272 186 163 77 8 -415 -166 285 -19 -414 608 484
4343D84r79J56N56k75j77M56l36j6O88m73k49J33J55q43L00O69K37p14L69n3K9
4364A17n36K14K15j68p8M20k6m06O44k19r19N86P87r03j31J000K0o21q3K41k51
4385i7k70M31k01L76j2J55l87J4K38l78m71M23O85n54j29P93l44n86J37J82l68
4406c63M08K99j58l53O16j18j058N10M70m14n33Q48L92m11l24K28k1l92K54k84
4426d04J01L76J71j86m22O27n6o34l9P24k5l04K88J62n34K44j80j34L4M55K1o77
4448c92P58R9p60L8K55M9l78L44L79k08j49J07k25n8n2N3j1P4R04n39o66P25k9
$$ plain form
4343 484 -495 -339 217 -58 -235 221 -115 -131 557 84 -165 -32 123 -720 -420 249 486 -228 141 88 117
4364 117 -419 -205 10 -158 -236 184 158 -248 396 177 -742 -156 631 -272 -403 597 617 -4 -87 154 -97
4385 -97 -367 64 -137 239 227 382 -5 9 247 -131 -602 -179 506 -48 -177 616 272 -314 -177 5 -363
4406 -363 45 344 186 -167 449 331 -727 -217 253 -161 -694 154 546 135 -189 39 18 -374 -120 -404
4426 -404 -303 73 244 58 -364 263 207 -427 -466 258 233 -71 217 379 -155 89 -91 -225 -191 264 285 -392
4448 -392 366 465 -295 -257 -2 47 -331 13 392 184 35 142 -83 -141 -193 -140 -151 -77 827 288 -378 347 318
$$ [...]
8191C5
##END NTUPLES=NMR FID
##END=
