##TITLE=1H_LR-721-R2-C1
 CDCl3, 8 sc, 
 25.9.2020
##JCAMPDX= 6.0         $$ Bruker NMR JCAMP-DX V2.0
##DATA TYPE= NMR FID
##DATA CLASS= NTUPLES
##ORIGIN= UXNMR, Bruker Analytische Messtechnik GmbH
##OWNER= root
$$ XWIN-NMR		Version 3.5
$$ Fri Sep 25 11:58:53 2020 Russian Standard Time (UT+4h)  she@DPX200
##.OBSERVE FREQUENCY= 200.1315066352
##.OBSERVE NUCLEUS= ^1H
##.DELAY= (6, 6)
##.ACQUISITION MODE= SIMULTANEOUS
##.ACQUISITION SCHEME= undefined
##.AVERAGES= 8
##.DIGITISER RES= 18
##SPECTROMETER/DATA SYSTEM= spect
##.PULSE SEQUENCE= zg30
##.SOLVENT NAME= CDCl3
##.SHIFT REFERENCE= (INTERNAL, CDCl3, 0, 15.7039)
##AUDIT TRAIL= $$ (NUMBER, WHEN, WHO, WHERE, WHAT)
$$ ##TITLE= Audit trail, XWIN-NMR		Version 3.5
$$ ##JCAMPDX= 5.01
$$ ##ORIGIN= Bruker BioSpin GmbH
$$ ##OWNER= she
$$ F:/spectra/data/she/nmr/H-F/1/audita.txt
$$ ##AUDIT TRAIL=  $$ (NUMBER, WHEN, WHO, WHERE, WHAT)
(   1,<2020-09-25 11:57:35.65 +0400>,<she>,<DPX200>,
      <created by zg, POWCHK disabled, PULCHK disabled
       configuration hash MD5:
       00 E9 B6 7A A2 85 ED C7 34 08 36 98 17 FE 4E 26
       data hash MD5: 16K
       19 F7 D3 35 E8 9C 9A 91 0F 29 7A 1A C2 51 65 5E>)
$$ ##END=
$$ 
$$ hash MD5
$$ 7C DB 3A 1A 25 97 50 E1 4F 95 A3 3F 32 A6 A4 17
##$RELAX= 
##$RELAX= 
##$RELAX= 
##$RELAX= 
##$RELAX= 
##$RELAX= 
$$ Bruker specific parameters
$$ --------------------------
##$DU= <F:/spectra>
##$EXPNO= 1
##$NAME= <H-F>
##$PROCNO= 1
##$TYPE= <nmr>
##$USER= <she>
##$AMP= (0..31)
100 100 100 100 100 100 100 100 100 100 100 100 100 100 100 100 100 100 
100 100 100 100 100 100 100 100 100 100 100 100 100 100 
##$AQSEQ= 0
##$AQ_mod= 1
##$AUNM= <au_zg>
##$AUTOPOS= <>
##$BF1= 200.13
##$BF2= 200.13
##$BF3= 200.13
##$BF4= 200.13
##$BF5= 200.13
##$BF6= 200.13
##$BF7= 200.13
##$BF8= 200.13
##$BYTORDA= 1
##$CFDGTYP= 0
##$CFRGTYP= 5
##$CHEMSTR= <none>
##$CNST= (0..31)
1 1 145 1 1 1 1 1 1 1 1 1 1 1 1 1 1 1 1 1 1 1 1 1 1 1 1 1 1 1 1 1 
##$CPDPRG= <>
##$CPDPRG1= <>
##$CPDPRG2= <>
##$CPDPRG3= <>
##$CPDPRG4= <mlev>
##$CPDPRG5= <mlev>
##$CPDPRG6= <mlev>
##$CPDPRG7= <mlev>
##$CPDPRG8= <mlev>
##$CPDPRGB= <>
##$CPDPRGT= <>
##$D= (0..31)
0 1.2 0 0 0 0 0 0 0 0.06 0 0.03 0 0 0 0 0.0002 0 0 0 0 0 0 0 0 0 0 0 0 
0 0 0 
##$DATE= 1601020655
##$DBL= (0..7)
120 120 120 120 120 120 120 120 
##$DBP= (0..7)
150 150 150 150 150 150 150 150 
##$DBP07= 0
##$DBPNAM0= <>
##$DBPNAM1= <>
##$DBPNAM2= <>
##$DBPNAM3= <>
##$DBPNAM4= <>
##$DBPNAM5= <>
##$DBPNAM6= <>
##$DBPNAM7= <>
##$DBPOAL= (0..7)
0.5 0.5 0.5 0.5 0.5 0.5 0.5 0.5 
##$DBPOFFS= (0..7)
0 0 0 0 0 0 0 0 
##$DE= 6
##$DECBNUC= <off>
##$DECIM= 32
##$DECNUC= <off>
##$DECSTAT= 4
##$DIGMOD= 1
##$DIGTYP= 9
##$DL= (0..7)
0 120 120 120 120 120 120 120 
##$DP= (0..7)
150 150 150 150 150 150 150 150 
##$DP07= 0
##$DPNAME0= <>
##$DPNAME1= <>
##$DPNAME2= <>
##$DPNAME3= <>
##$DPNAME4= <>
##$DPNAME5= <>
##$DPNAME6= <>
##$DPNAME7= <>
##$DPOAL= (0..7)
0.5 0.5 0.5 0.5 0.5 0.5 0.5 0.5 
##$DPOFFS= (0..7)
0 0 0 0 0 0 0 0 
##$DQDMODE= 0
##$DR= 18
##$DS= 0
##$DSLIST= <SSSSSSSSSSSSSSS>
$$ [...]
##$SUBNAM2= <"">
##$SUBNAM3= <"">
##$SUBNAM4= <"">
##$SUBNAM5= <"">
##$SUBNAM6= <"">
##$SUBNAM7= <"">
##$SUBNAM8= <"">
##$SUBNAM9= <"">
##$SW= 16.880792210976
##$SWIBOX= (0..15)
0 0 2 0 0 0 0 0 0 0 0 0 0 0 0 0 
##$SW_h= 3378.37837837838
##$TD= 16384
##$TD0= 1
##$TE= 0
##$TE2= 300
##$TE3= 300
##$TEG= 300
##$TL= (0..7)
0 120 120 120 120 120 120 120 
##$TP= (0..7)
150 150 150 150 150 150 150 150 
##$TP07= 0
##$TPNAME0= <>
##$TPNAME1= <>
##$TPNAME2= <>
##$TPNAME3= <>
##$TPNAME4= <>
##$TPNAME5= <>
##$TPNAME6= <>
##$TPNAME7= <>
##$TPOAL= (0..7)
0.5 0.5 0.5 0.5 0.5 0.5 0.5 0.5 
##$TPOFFS= (0..7)
0 0 0 0 0 0 0 0 
##$TUNHIN= 0
##$TUNHOUT= 0
##$TUNXOUT= 0
##$USERA1= <user>
##$USERA2= <user>
##$USERA3= <user>
##$USERA4= <user>
##$USERA5= <user>
##$V9= 5
##$VALIST= <valist>
##$VCLIST= <CCCCCCCCCCCCCCC>
##$VD= 0
##$VDLIST= <DDDDDDDDDDDDDDD>
##$VPLIST= <PPPPPPPPPPPPPPP>
##$VTLIST= <TTTTTTTTTTTTTTT>
##$WBST= 1024
##$WBSW= 4
##$XGAIN= (0..3)
0 0 0 0 
##$XL= 0
##$YL= 0
##$YMAX_a= 961921
##$YMIN_a= -840496
##$ZGOPTNS= <>
##$ZL1= 120
##$ZL2= 120
##$ZL3= 120
##$ZL4= 120
##$ABSF1= 10
##$ABSF2= 0
##$ABSG= 5
##$ABSL= 3
##$ALPHA= 0
##$AQORDER= 0
##$ASSFAC= 0
##$ASSFACI= 0
##$ASSFACX= 0
##$ASSWID= 0
##$AUNMP= <proc_1d>
##$AZFE= 0.1
##$AZFW= 0.1
##$BCFW= 1
##$BC_mod= 2
##$BYTORDP= 1
##$COROFFS= 0
##$CY= 11.3945322036743
##$DATMOD= 1
##$DC= 2
##$DFILT= <>
##$DTYPP= 0
##$F1P= 16.9975609425685
##$F2P= -3.02152046262296
##$FCOR= 0.5
##$FTSIZE= 0
##$FT_mod= 4
##$GAMMA= 1
##$GB= 0.15
##$INTBC= 1
##$INTSCL= 1
##$ISEN= 128
##$LB= 0.24
##$LEV0= 0
##$LPBIN= 0
##$MAXI= 10000
##$MC2= 0
##$MEAN= 0
##$ME_mod= 0
##$MI= 1.114404
##$NCOEF= 0
##$NC_proc= 0
##$NLEV= 6
##$NOISF1= 3.799351
##$NOISF2= 2.8
##$NSP= 1
##$NTH_PI= 0
##$NZP= 0
##$OFFSET= 15.70392
##$PC= 1
##$PHC0= -9974.896
##$PHC1= 16.8009
##$PH_mod= 1
##$PKNL= yes
##$PPARMOD= 0
##$PSCAL= 0
##$PSIGN= 0
##$REVERSE= no
##$SF= 200.130013532006
##$SI= 16384
##$SIGF1= 3
##$SIGF2= 2
##$SINO= 400
##$SIOLD= 16384
##$SREGLST= <1H.CDCl3>
##$SSB= 0
##$STSI= 0
##$STSR= 0
##$SW_p= 3612.71676300578
##$SYMM= 0
##$S_DEV= 0
##$TDeff= 0
##$TDoff= 0
##$TI= <>
##$TILT= no
##$TM1= 0
##$TM2= 0
##$TOPLEV= 0
##$USERP1= <user>
##$USERP2= <user>
##$USERP3= <user>
##$USERP4= <user>
##$USERP5= <user>
##$WDW= 1
##$XDIM= 8192
##$YMAX_p= 0
##$YMIN_p= 0
$$ End of Bruker specific parameters
$$ ---------------------------------
##NTUPLES= NMR FID
##VAR_NAME=  TIME,          FID/REAL,        FID/IMAG
##SYMBOL=    X,             R,               I
##VAR_TYPE=  INDEPENDENT,   DEPENDENT,       DEPENDENT
##VAR_FORM=  AFFN,          ASDF,            ASDF
##VAR_DIM=   8192,          8192,            8192
##UNITS=     SECONDS,       ARBITRARY UNITS, ARBITRARY UNITS
##FACTOR=    0.000296,      1,               1
##FIRST=     0,             0,               0
##LAST=      2.424536,      0,               0
##MIN=       0,             -840496,         0
##MAX=       2.424536,      961921,          0
$$ Real data points
##PAGE= N=1
##DATA TABLE= (X++(R..R)), XYDATA
0@%%%%%%%%%qJ6j6J6k4M0m8N9q3J04j24J51j80K13k56L06l62M25m96N74o62P63
$$ 0 0 0 0 0 0 0 0 0 0 -8 8 -8 8 -16 24 -24 35 -48 56 -68 83 -97 116 -140 166 -196 229 -267 307 -355 408
31D08q78J006j146J302j471J657j867K097k348K627k930L259l621M012m437M908
$$ 408 -470 536 -610 692 -779 878 -989 1108 -1240 1387 -1543 1716 -1905 2107 -2330 2578
47B578n425N986o598P268q003Q810r703J0695j1796J3029j4419J5995j7802J9900
$$ 2578 -2847 3139 -3459 3809 -4194 4616 -5087 5608 -6188 6841 -7578 8417 -9385 10515
61A0515k2362K5299k8880L3339l9043M6593n6922P1126j17441J039697q66312
$$ 10515 -11847 13452 -15428 17911 -21132 25461 -31461 39665 -77776 961921 95609
72I5609k44404K15107r06808J425606o4153q18004L59694o11428O57655N37343
$$ 95609 -148795 66312 -840496 585110 520957 -297047 62647 -548781 108874 646217
82F46217j017400M83723m20701k9361J169314j033057n0089M98220p84782J112544
$$ 646217 -371183 112540 -308161 -337522 831792 -201265 -251354 246866 -537916 574628
92E74628k12433j099519J038925l26815q8767O62374j046871L18317M69516m18545
$$ 574628 362195 -737324 301601 -25214 -113981 548393 -498478 -180161 289355 -129190
102a29190M82253o19291p5145P70140n44343L85260k24872p43763J179154k49015
$$ -129190 353063 -266228 -341373 428767 -115576 269684 44812 -698951 480203 231188
112B31188m96299N79174q58992M48458P39620r50299L09360l9799l36959Q39648
$$ 231188 -265111 314063 -544929 -96471 643149 -307150 2210 -37589 -374548 465100
122D65100l67591k41992J66070l71486O73650q9160n09738M07586m79506L40900
$$ 465100 97509 -144483 21587 -349899 323751 234591 -275147 132439 -347067 -6167
132f167N41066r16134L16914J70079m33314P58609l65844m42326N89629l12178
$$ -6167 534899 -381235 -64321 105758 -327556 431053 65209 -377117 212512 -99666
142i9666J60698J89665n39561K85914L0090m0209K04669m69798K68506J80021
$$ -99666 61032 250697 -288864 -2950 27140 -13069 191600 -278198 -9692 170329
152A70329l77859M47705k77598k37718O26101m25384l0567L62292n10393K69453
$$ 170329 -207530 240175 -37423 -275141 350960 -74424 -104991 257301 -253092 16361
162A6361J89366l70925K24994j32390j2110K75069k53866N6278k6820l4779L28862
$$ 16361 205727 -165198 59796 -72594 -84704 190365 -63501 -7223 -34043 -68822 260040
173B60040l36291k2434K55751l33778K95082M4542m56976L74062j9182k04837
$$ 260040 -76251 -98685 157066 -176712 118370 162912 -294064 79998 60816 -144021
183a44021L21179k37824p9403K53643j05102L9347o0040m7978J35648j14321R1179
$$ -144021 177158 -60666 -140069 113574 8472 47819 -12221 -60199 75449 -38872 52307
194E2307k7408j82511K58056j15884j09630K91499k55257k5787K74558k27584
$$ 52307 24899 -157612 100444 -15440 -125070 166429 -88828 -114615 159943 -67641
204f7641O3327J05624k09065J27294N4050j14210K6116J505L4185o7485L369J20027
$$ -67641 -4314 101310 -107755 19539 73589 -40621 -14505 -13000 21185 -46300 -42931 77096
216G7096j43107M4102R4649j68451J57694K5473k15490J95190m360j62206J60417
$$ 77096 -66011 -21909 72740 -95711 61983 87456 -128034 67156 62796 -99410 61007
227F1007m5094q7287J04725m3986l0758O3733L948n7910N421J04578p9313m7858
$$ 61007 15913 -71374 33351 -10635 -41393 22340 26288 -31622 -26201 78377 -936 -48794
239d8794J48377j08349n7573J51349j09336j3091J10095j46679K6322J37763j11408
$$ -48794 99583 -8766 -66339 85010 -24326 -37417 72678 -74001 -47679 90084 -21324
250b1324k3697Q4052l5722j0146N2499l4606m6348P1037j1950q1950R1337r641
$$ -21324 -45021 39031 3309 -6837 45662 11056 -35292 35745 23795 -58155 33182 23541
262B3541j17744J17739K3402j23879Q7706K4123q1288Q5297n575r1414Q8804K3628
$$ 23541 -94203 23536 46938 -76941 10765 34888 -46400 38897 33322 -58092 30712 54340
274E4340j10724M3521N8927q9819J2037O4999p3910J6058O8458q2702K0802Q3912
$$ 54340 -56384 -12863 46064 -43755 -31718 33281 -40629 -24571 43887 -38815 -18013 65899
286F5899r4662L601R8071q8969l0264R5754n2278l9133O4888m9777j4574R5169
$$ 65899 -28763 -25162 72909 -16060 -46324 49430 -2848 -41981 22907 -26870 -41444 53725
298E3725o0746n8504J09811j2504o9641P6319j1969o6675P2796o878o9643O7994
$$ 53725 -7021 -65525 44286 31782 -37859 38460 26491 -40184 32612 25734 -43909 24085
310B4085r877q1574Q4686K6810r9649N1102N2846p4905L1566M3333o6461K8684
$$ 24085 14208 -67366 17320 44130 -55519 -4417 48429 -26476 5090 48423 -18038 10646
322A0646L2699q5085L5061O9192r8370j0280Q3337n6846l967O8219o8048l809
$$ 10646 43345 -41740 -6679 62513 -35857 -46137 37200 -19646 -23613 44606 -23442 -27251
334b7251P7906n7376m229O6773p1708k7468Q5972k6384n9227M3064l000l4660
$$ -27251 50655 -6721 -10950 55823 -15885 -43353 42619 16235 -42992 72 -2928 -37588
346c7588N7582j1279o1052Q1149J795q7392Q8442J6691r6106O0957N303o1208
$$ -37588 19994 8715 -52337 28812 30607 -56785 31657 48348 -47758 13199 18502 -42706
358d2706O5163j3797o1411N4160J0051m3659L0617L6809n2914j5313Q1720l1221
$$ -42706 22457 8660 -52751 1409 11460 -32199 -1582 35227 -17687 -33000 48720 17499
370A7499m2935O2872o0114n780R4701j01502j0342R6919q8941J2968P3382o9362
$$ 17499 -25436 37436 -22678 -28458 66243 -35259 -45601 51318 -37623 -24655 48727 -20635
382b0635J4372K7697k6905K6721J650k4915j9096L7547K7974r6196L4164O6619
$$ -20635 -6263 21434 -5471 21250 22900 -2015 -21111 16436 44410 -51786 -17622 48997
394D8997r9586N7330K7980j00324J08490o383r7140J14669k8303o7772P4481k8478
$$ 48997 -50589 6741 34721 -65603 42887 36504 -60636 54033 25730 -42042 32439 3961
406C961j0228J0870k9770K8154j3851J3978P98n0914Q6469k6204o2453J17927
$$ 3961 -6267 4603 -25167 2987 -10864 3114 3912 -47002 39467 13263 -49190 68737
418F8737q0443l9143J30495j04542l732P1181j10051P6959M1201j16784M8376
$$ 68737 -11706 -50849 79646 -24896 -28628 42553 -67498 9461 50662 -66122 -17746
429a7746K4505M816J5493o2869M0085l8m812O5711j09893J5391P6217j15450J04840
$$ -17746 6759 11575 27068 -35801 4284 4246 -566 65145 -44748 -29357 46860 -68590 36250
442C6250K4368j76569J15323L3503n5007R4885j08797l0949J26494l4188L897
$$ 36250 60618 -115951 -628 32875 -22132 72753 -36044 -66993 59501 25313 29210
453B9210l8948m6407Q5947k6499J7050j339j10334J09925J8773p1424R8022j06144
$$ 29210 -9738 -56145 29802 3303 20353 19014 -91320 18605 37378 -34046 63976 -42168
465d2168j0559J62212j29285j114P6647j11992P8744J7551r2227O5459k7731N250
$$ -42168 -52727 109485 -19800 -20914 55733 -56259 22485 40036 -52191 13268 -14463 -9213
477i213M0546o2804M4361l0037K566J15252j36903j8086J06948q3575Q9333k0129
$$ -9213 31333 -31471 12890 -17147 -14581 100671 -36232 -54318 52630 -30945 58388 38259
489C8259j72161J45904L2948o0939O5672j22365O590J31959l9017Q133o6861m2260
$$ 38259 -133902 12002 44950 -15989 49683 -72682 -66092 65867 26850 34983 -31878 -74138
501g4138J19761j5629Q147l8545j20159J42610K9845p8484P5509j22446m024J75365
$$ -74138 45623 29994 38141 -404 -120563 22047 51892 -26592 48917 -73529 -77553 97812
513I7812q6384q398P227j01048J33749M0275j07218j65k4161P1955L1037j01880
$$ 97812 11428 3030 10257 -90791 42958 83233 -23985 -24150 -48311 23644 54681 -47199
525d7199L4318o972J9571P5684j31403K6087R8992r7761O4734n470j12581J14942
$$ -47199 -12881 -19853 -282 75402 -56001 -29914 69078 -28683 36051 30581 -82000 32942
537C2942J172m6905M1972r6246L1494R9881m4266j5378n7799J7441J07770m0775
$$ 32942 34114 -12791 29181 -67065 -35571 64310 20044 4666 -53133 -35692 72078 31303
549C1303j3614m3103n2338J41326j1767p9713M3823r5376M1460J45363j03545
$$ 31303 17689 -25414 -77752 63574 51807 -27906 15917 -79459 -37999 107364 3819
560C819m8682K0436n709R5091k1080p8222J3124P050N2108j6933n4885M1339l7556
$$ 3819 -44863 -24427 -30136 64955 43875 -34347 -21223 -14173 37935 21002 -33883 7456 -30100
573c0100R778O6122p2810J4743K3981n2942Q3691j3698q2969P3988P18k7998K0819
$$ -30100 -20322 45800 -27010 -12267 11714 -41228 42463 28765 -54204 19784 20502 -7496 13323
586A3323m3772J9830L4924k5140j3813k3652M3808L0001m6567K0407k6570j4663
$$ 13323 -30449 -10619 24305 -835 -14648 -38300 5508 35509 -11058 9349 -17221 -31884
598c1884R8942m0601o2610L4364k4864M5823L7623r6089n536M9330Q632J3464
$$ -31884 67058 26457 -36153 -1789 -26653 19170 56793 -39296 -44832 4498 13130 26594
610B6594k7263j8353N739K2746M0267m1228l1313J8742j4692N2351P777r6555
$$ 26594 -669 -19022 -13283 9463 49730 8502 -22811 -4069 -18761 33590 41367 -55188
622e5188K4983M8062j0823J8535m3334k0861O6446J60k8772j637k631Q138L237
$$ -55188 -30205 17857 7034 25569 -17765 -38626 27820 27980 -792 -2429 -5060 3078 6315
635F315O302k3322k0770M5976r373k6973L2609k7810N774N2634m9936j6029M3440
$$ 6315 12617 -10705 -31475 14501 5128 -21845 10764 -17046 -11272 41362 -8574 -24603 18837
648A8837j2367N70k423k5092J0940J4688P30j3876q831P741j870L0875N154n7025
$$ 18837 6470 7040 4617 -20475 -9535 5153 5883 -7993 -16824 -9083 -10953 19922 25076 -31949
662c1949K1173L4509k0483J8789k4135l9154N3147J0476l5565Q205m314p768K1344
$$ -31949 -10776 23733 3250 22039 -2096 -41250 11897 22373 -13192 -4987 -9301 -17069 4275
675D275J6360j4102k2715J4781J2799R53J0954l5910j0516M5497j9448j3824K2421
$$ 4275 20635 6533 -16182 -1401 11398 12351 23305 -12605 -23121 22376 2928 -10896 11525
688A1525l0003M879L2983k1463K093J1600k1186J0022K5080j5772k5762J6182
$$ 11525 -18478 -13599 19384 -2079 14 11614 -9572 450 25530 9758 -16004 178
700A78J6546k5479J745J0670j7837J8176J320k8413L1621R478l1138J8189N150
$$ 178 16724 -8755 -7010 3660 -14177 3999 5319 -23094 8527 18005 -13133 5056 10206
713A0206j6764J5714l190j6014R413k090j1494J5419Q602k9586J594L7124j3325
$$ 10206 -6558 9156 5966 -10048 -635 -2725 -14219 1200 9802 -19784 -18190 18934 5609
726E609j6716K0596j1416j362K2774k3455q845K2119j7206m961K2396j5155j2252
$$ 5609 -11107 9489 -1927 -3289 19485 -3970 -12815 9304 -7902 -12863 9533 -5622 -17874
739a7874J9556K890n920P254p574k586K2845j0023k4205K3096M145k7829J5106
$$ -17874 1682 4572 -1348 5906 -1668 -4254 18591 8568 -15637 7459 11604 -16225 -1119
752a119R451k1254J0617O026j4547J9267O821k6629J2536J8323k0347P37J3428
$$ -1119 8332 -12922 -2305 3721 -10826 8441 15262 -11367 1169 19492 -855 -118 13310
765A3310j8309l243J4077q968K077M635k1350J1266K9801k1350j4688K2908m684
$$ 13310 -4999 -8242 5835 -3133 -1056 3579 -17771 -6505 23296 1946 -12742 10166 5482
778E482p027J6450j3823j2159J7031r173q981K2072j0776k1683K3124R102j5572
$$ 5482 -1545 14905 1082 -11077 5954 -3219 -12200 9872 -904 -22587 537 9639 -5933
791e933R843J301j2584J4267J107j5934J6090k919k9131J9559J8508k3916j45
$$ -5933 3910 5211 -7373 6894 8001 -7933 8157 5238 -23893 -4334 14174 -9742 -9887
804i887Q486r709J5183J0389k1244K001J6254j3905P89J8952k0974j5965K4568
$$ -9887 -1401 -11110 4073 14462 -6782 -4781 11473 -2432 -1643 17309 -3665 -19630 4938
817D938l185j0072J3446j4918j166K5861j5872l737K2065j7016r206K0210j848
$$ 4938 1753 -8319 5127 -9791 -10957 14904 -968 -4705 17360 344 -8862 11348 9500
830I500j0910R38l750m335J3619K843k3484J3158J5294k6279J9004J9260l6598
$$ 9500 -1410 -472 -4222 -8557 5062 7905 -15579 -2421 12873 -13406 5598 24858 -11740
843a1740R213J5922j6953J7423j0232k7731K6762R359j9220j875O905M219m821
$$ -11740 -2527 13395 -3558 13865 3633 -24098 2664 12023 -7197 -9072 -2167 2052 -2769
856b769Q426J578j6178J9176m406j8733L1998j9689k4066M0572j9648j4447K9997
$$ -2769 5657 7235 -8943 10233 5827 -12906 19092 -597 -24663 15909 -3739 -18186 11811
869A1811k2136K541J7197j9144J4627N912j5577J436L693J4954j7885j5376K9481
$$ 11811 -10325 -7784 9413 -9731 4896 10808 -4769 -3333 360 15314 -2571 -17947 11534
882A1534k0644k159K7550l6795J8030K0392m6721L9456J8648m8990J9609M749
$$ 11534 -9110 -11269 16281 -20514 -2484 17908 -28813 10643 29291 -19699 -90 4659
894D659m085J9086k8840l194J1930p56J2477k4096Q266J6232l4179L7580Q819
$$ 4659 574 19660 -9180 -12374 -444 -1200 11277 -12819 -4553 11679 -22500 15080 23899
907B3899m4712L6162j6188j4716N4273m4898j5912L8932l2617J5757J5467k8704
$$ 23899 -20813 15349 -839 -15555 38718 -6180 -22092 16840 -15777 -20 15447 -13257
919a3257J3443q302J0452J7774k7769J6645j1345r278M4634m7160k742N0035n8665
$$ -13257 186 -8116 2336 20110 -7659 8986 -2359 -11637 32997 -14163 -16905 33130 -25535
932b5535J1425L3285m0273L6877r462m1921M9833r57j0939N710k6087K3139k212
$$ -25535 -14110 19175 -21098 15779 6317 -35604 14229 13272 2333 8043 -18044 5095 2883
945B883p541K6061m2948N323K4747l0278M8341j5052n8542O0206n009j1701L9985
$$ 2883 -4658 21403 -21545 -16222 8525 -21753 26588 11536 -47006 13200 8191 -3510 36475
958C6475n9532q71M6478k3579J2995j4907k3993K8004l000J8367j3831l5228N1304
$$ 36475 -23057 -23928 22550 -1029 11966 -2941 -26934 1070 -1930 16437 2606 -32622 18682
971A8682j4367j6705M6912m7738K728L7243n1582L3130J6408n3542K9444R34r852
$$ 18682 4315 -12390 34522 -13216 -10488 26755 -24827 8303 24711 -28831 613 1547 -8305
984h305K5112k5893P734Q570j3471K2482j9843P167J7703m8429L1035J6319m3140
$$ -8305 16807 -9086 -1352 7218 -6253 16229 -3614 3553 21256 -27173 3862 20181 -22959
997b2959L9466j9124k9834N5491k2465r321K8348l6423J2189K1720j3663M332
$$ -22959 16507 -2617 -32451 23040 575 -8746 19602 -16821 -4632 17088 3425 7757
1009G757k0098Q338J0062j8636K8383k0215k1405L9843k8827J2763L9288o3131
$$ 7757 -12341 -4003 6059 -12577 15806 -4409 -25814 14029 -14798 -2035 37253 -25878
1021b5878P490L9136k1293J7802j8955k5770L4705p61m331o422j2151K0578j2676
$$ -25878 -18388 20748 -545 17257 -1698 -27468 7237 6476 2145 -4277 -16428 4150 -8526
1034h526R103K1062l9714J6164J2367k3904M1565k1956l8550M8215j2246j3715
$$ -8526 577 21639 -18075 -1911 10456 -13448 28117 6161 -32389 15826 3580 -10135
1046a0135K4267k7831K923J7598n429N701j4174P628P660j1326K3343k5509j4441
$$ -10135 14132 -13699 -10776 6822 1393 7094 -7080 548 8208 -3118 20225 -5284 -19725
1059a9725M7994l1127j2854K9245l0831K0593J4194m0639K5846Q391j7907J7834
$$ -19725 28269 -2858 -15712 13533 -17298 3295 17489 -23150 2696 11087 -6820 11014
1071A1014p990k783j975j672K2627k3189p433J3428j9881L5678k282n3873M0782
$$ 11014 3024 241 -1734 -3406 19221 -3968 -11401 2027 -17854 17824 15542 -38331 2451
1084B451J0910k0349K8310l0878r796L7928j5041j92k415j8253J3776N144R770
$$ 2451 13361 -6988 21322 -9556 -19352 18576 3535 3343 928 -17325 -3549 1595 11365
1097A1365j3811k6451L7109Mj4628K5643l5800L898M2266l8329O045J6441l5930
$$ 11365 -2446 -28897 8212 8216 -6412 19231 -16569 -12671 29595 -8734 -2689 13752 -22178
1110b2178K2170J1133j9047Q280j0695O945J3013r667M013j3403J3176J7924l7257
$$ -22178 -8 11125 -7922 358 -10337 -3392 9621 -46 3967 -9436 3740 21664 -15593
1123a5593J7145J3278l2741K9303p161k8359L9306j3424j6571K8705j6898l130
$$ -15593 1552 14830 -17911 11392 4231 -24128 15178 1754 -14817 13888 -3010 -6140
1135f140J6141n087Q41j0817N622P991j3324J3353j3020j2528L1721j9340n213
$$ -6140 10001 4914 5755 -5062 560 8551 -4773 8580 -4440 -16968 14753 -4587 -9800
1148i800K8525l3146N458L0388k5477O600M704k1631K0007O717j7706l790M901
$$ -9800 18725 -14421 -8963 21425 -4052 2548 7252 -14379 5628 12345 -5361 -9151 -4250
1161d250Q561j0330K309J1456k0446J1787J3370k2683J8832r60k5926K9258j797
$$ -4250 4311 -6019 -3710 7746 -12700 -913 12457 -10226 8606 7646 -18280 10978 9181
1174I181k4908J8599l467q153J2127p602k259J0113n96p539K060J4495j1709q297
$$ 9181 -15727 2872 -595 -8748 3379 -4223 -6482 3631 3035 -4504 -2444 12051 342 -7955
1188g955K0625j3827r091K1259j6245l174J8477k0073L489K0506j8160k520J5691
$$ -7955 12670 -1157 -10248 11011 -5234 -8408 10069 -10004 -6515 13991 -4169 -6689 9002
1201I002n130l930M631l226k487P119n090j1288J4406J557j8210J4966N001j7972
$$ 9002 3872 -58 4573 1347 -1140 5979 889 -10399 4007 5564 -12646 2320 7321 -10651
1215a0651J4629N638j5808J1645J183j3858J3619J874j8592P559J0059j3736L47
$$ -10651 3978 9616 -6192 5453 6636 -7222 6397 8271 -10321 -2762 7297 -6439 -6092
1228f092J0497p862N8Q803r519L756J2779j6780k676J8055j1372p329J3639r371
$$ -6092 4405 -3457 -3399 5404 -4115 -359 12420 -4360 -7036 11019 -353 -7682 5957 -3414
1242c414o303J3176n843l959J2224r211o449J9671j915j6579R926M173r509P319
$$ -3414 -9717 3459 -2384 -6343 5881 -3330 -9779 9892 7977 -8602 1324 5497 -4012 3307
1256C307j504j1432J1168K2j3579J4859N192j8247Q616J0771j1500M803N380j2900
$$ 3307 1803 -9629 1539 1561 -12018 2841 8033 -10214 -1598 9173 -2327 2476 7856 -5044
1270e044M745Q463j2614J568J0289j4274k405J7933p192p481J1167o383L04J3267
$$ -5044 -299 8164 -4450 -2882 7407 -6867 -9272 8661 1469 -6012 5155 -1228 -924 12343
1284A2343j2769l353J3203j1243l000J2781q098q602R077J310o054P283j28j0382
$$ 12343 -426 -3779 9424 -1819 -4819 7962 -136 -8738 339 1649 -4405 2878 2750 -7632
1298g632J3133M320j8964J2541Q583k2173Q756Q321j4260Q314q21j1120J2876
$$ -7632 5501 9821 -9143 3398 11981 -10192 -1436 6885 -7375 939 118 -11002 1874
1311A874K732r437L153M137j875j207O639m825r271J3002m159q151J4374j5103
$$ 1874 4606 -4831 -1678 2459 584 -623 6016 1191 -8080 4922 763 -7388 6986 -8117
1325h117l997K5379j6965o047J8225j2421K136J1079j0498Q01J509j946J724M16
$$ -8117 -12114 13265 -3700 -9747 8478 -3943 -1807 9272 -1226 -425 1084 -862 862 1278
1339A278P79j3444O058J9139k0125Q8J3724j5811J5522M314k4219J9885J274j8490
$$ 1278 2057 -11387 -5329 13810 -6315 -6227 7497 -8314 7208 11522 -12697 7188 8462 -10028
1353a0028J6219l032q564N935m189M772j112j812M891p994J1790j562j6275K3928
$$ -10028 6191 3159 -5405 530 -3659 1113 1 -1811 3080 -4914 6876 5314 -10961 12967
1367A2967p015j7192K1700j5670k370K2505k3310J135J1962j4592J5417M867j5230
$$ 12967 5952 -11240 10460 -5210 -7580 14925 -8385 -7250 4712 -9880 5537 10404 -4826
1380d826k213K032K0611n414k1432R204p281J3391J6484l8249N236J8541j7226
$$ -4826 -7039 -5007 15604 10190 -11242 -2038 -9319 4072 20556 -17693 -12457 6084 -11142
1393a1142K3208k554k7172J7353l14O229J1907k6722l161J0796Q470O392k7002
$$ -11142 12066 9512 -17660 -307 -621 5608 17515 -9207 -12368 -1572 6898 13290 -13712
1406a3712K474J4857r125J9241j4190j8865L3421j1860o458J9944k8002Q438K0654
$$ -13712 -11238 3619 -5506 13735 -455 -19320 14101 2241 -4217 15727 -12275 -3837 16817
1419A6817k2578K993j158P29J5244j6692j825L253J882K2256k4091r761K4567
$$ 16817 -5761 -2768 -3926 -3197 12047 -4645 -6470 -3217 -1335 20921 -3170 -12931 11636
1432A1636j7970J5449R127l8874J6531P443q071K5416k6232j7497K5297L571J2277
$$ 11636 -6334 9115 18242 -20632 -4101 3342 -4729 20687 -5545 -23042 2255 5826 18103
1445A8103j7081k1761K2860L153R044m628l5191K4800Q347j3622K3536l0464r469
$$ 18103 1022 -20739 2121 5274 14318 9690 -25501 -701 7646 -5976 17560 -12904 -22373
1458b2373L9553j8232L627N488k7342K4417N423j3468Q873j6959R826P749j6158
$$ -22373 17180 -1052 2575 8063 -19279 5138 10561 -2907 5966 -10993 -1167 6582 -9576
1471i576J8103j6710n787L2630k6824L185J6110k7365L0337j416l4549K9478m177
$$ -9576 8527 -8183 -13970 18660 -8164 -4979 11131 -16234 14103 12687 -21862 7616 3439
1484C439m849J3814l1251J3455J6021j4332J2186k0109K458K5755k2529J6263
$$ 3439 -1410 12404 -18847 -5392 10629 -3703 8483 -11626 -9168 16587 -5942 10321
1496A0321m409l0085M0472q082j7405K4979l4940J1016L0660l2934J1759r34j5096
$$ 10321 5912 -24173 16299 8217 -9188 15791 -19149 -8133 22527 -10407 1352 418 -14678
1509a4678L0353j4065k362Q854k4287K7546q03k2359K3713k4976O882K9073m1683
$$ -14678 15675 1610 -752 8102 -16185 11361 10558 -11801 11912 -13064 -6182 22891 -18792
1522a8792J5755J4813k8079K9922j3539j5256L5639k5177q45J5356k0924K0230
$$ -18792 -3037 11776 -16303 13619 80 -15176 20463 -4714 -5559 9797 -11127 9103
1534I103q859j2884K3933k4423J1495J5845l2004K6029o593j9231M1626k6409
$$ 9103 244 -12640 11293 -13130 -1635 14210 -17794 8235 1642 -17589 24037 -2372
1546b372j1475K8600k7000J6851P842l1139K3745p722n792K4006k5222P488O243
$$ -2372 -13847 14753 -12247 4604 12446 -18693 5052 -2670 -8462 15544 -9678 -2190 4053
1559D053j5624L1222j8691j6440L0796k3790J0758J3082l7509K7348K928k4807
$$ 4053 -11571 19651 960 -15480 15316 -8474 2284 15366 -22143 5205 8133 -16674
1571a6674K9159j4629o462K0564k0904J4594M034k0651K0158j0132j657J4361
$$ -16674 12485 -2144 -8606 11958 -8946 5648 9682 -10969 9189 -943 -2600 11761
1583A1761k6533J8505O011k6777K6030r570j0287K7994k4908K185K0180k3544
$$ 11761 -14772 3733 9744 -17033 8997 -573 -10860 17134 -7774 -5589 14591 -8953
1595h953J4396J304j7080J6554j0265L097R698k2096J3666K189r949J9054j8913
$$ -8953 5443 6747 -10333 6221 -4044 -947 8751 -13345 321 2510 -7439 11615 -7298
1608g298M47K1260k3280J1413P025k2349J8678m569j0664J8648j5305j229J2332
$$ -7298 -6851 14409 -8871 2542 9567 -12782 5896 1327 -9337 9311 -5994 -7223 5109
1621E109r654P606m444l274J3570j3407M254Q049j5446J2554l370j1422J8570
$$ 5109 -4545 3061 -1383 -4657 8913 -4494 -240 7809 -7637 4917 1547 -9875 8695
1634H695j1754n301J6282j2999L582O618j0724J0799j511p170P724m211K087j333
$$ 8695 -3059 -8360 7922 -5077 -1495 5123 -5601 5198 3687 -3483 4241 30 2117 784
1648G84n366J0038p920l244J2192r981K216N659j0808J1550J415j2244Q865k81
$$ 784 -4582 5456 -2464 -5708 6484 -3497 -1281 4378 -6430 5120 6535 -5709 3156 2875
1662B875m218M493n066J016J730l994K788l32J194j57m880Q679q22p564Q566k891
$$ 2875 -1343 3150 -1916 -900 830 -3164 -376 -708 486 329 -4551 4128 3306 -4258 4308 1417
1678A417m576O555n498N3N184p347L75N529k427m89L53Q77K93m1J691j632N4o1
$$ 1417 -3159 3396 -2102 -2049 3135 -4212 -3837 1692 -735 -1224 -871 6 299 258 1949 317 371 310
1696C10l675M533J759q797L072M687m152K006J273l163L954M18l216K776K054
$$ 310 -3365 1168 2927 -5870 -2798 1889 -2263 -257 1016 -2147 1807 2225 -991 1785 3839
1711C839n232j163M745j154l106J291n92n7K987k295L59M564m297j649O335j591
$$ 3839 -1393 -2556 2189 1035 -2071 -780 -1372 -1429 1558 -737 -378 4186 -111 -1760 4575 2984
1727B984l735J243q67L36J906l491j249L839P1l877L932K311m518R93L042k428
$$ 2984 -751 492 -375 -39 1867 -1624 -2873 966 1037 -2840 1092 3403 -1115 -122 2920 492
1743D92J324p67m199M356J55n892L947J907m151R02K665J84o42o4q69Q83L485
$$ 492 1816 1049 -3150 1206 1361 -4531 -584 1323 -2828 -1926 739 923 281 217 -652 231 3716
1760C716m068l811O632k221m832M566j825o70M065l859J640L381m115K091J466
$$ 3716 -352 -4163 2469 248 -4584 -18 -1843 -2513 1552 -2307 -667 2714 -1401 690 2156
1775B156k067k88k70J878k122j587L012l881K510L486p358N902K742q739P789
$$ 2156 89 -199 -469 1409 -713 -2300 712 -3169 -659 2827 -4531 1371 4113 -4626 3163
1790C163Q94o616M715j912n64K320n030K819N15j427J738m719O309K631q913O172
$$ 3163 4057 -2559 2156 244 -320 2000 -3030 -211 304 -1123 615 -4104 2205 4836 -4077 2095
1806B095o13k890Q663r659p99Q741j0192M356L970q730N262j929L93O933p413
$$ 2095 1482 -1408 7255 -2404 -3203 5538 -4654 -298 3672 -5058 204 -1725 -1332 5601 -1812
1821a812K184k27k908J0744r048k200P542j2465R187O104j5719Q537j185l647
$$ -1812 372 145 -2763 7981 -1067 -3267 4275 -8190 997 7101 -8618 -81 -1266 -4913
1835d913J3821j1561j723R280p729O975l557m926J0479j2025M065P596j3442J0802
$$ -4913 8908 -2653 -4376 4904 -2825 4150 593 -4333 6146 -5879 -1814 5782 -7660 3142
1849C142l479q648J8858j2540k372J5205j5920O861L213j2052J6883q334q947
$$ 3142 -337 -8985 9873 -2667 -5039 10166 -5754 1107 4320 -7732 9151 817 -8130
1862h130J2033r494R380J098j5122J5408p494o68J8477k2871M015J0924j6056
$$ -8130 3903 -5591 3789 4887 -10235 5173 -2321 -2989 15488 -7383 -3368 7556 -8500
1875h500K0322q080j8959K1955q710J268R211k0207J4048J307j0774J9178j5020
$$ -8500 11822 3742 -15217 6738 -1972 -704 8507 -11700 2348 3655 -7119 12059 -2961
1888b961j367J2835j8210J8002j432k2485K3723j0052m758J8858k4684J1747J2241
$$ -2961 -4328 8507 -9703 8299 6867 -15618 8105 -1947 -6705 12153 -12531 -784 11457
1901A1457k3809J7682l176q114J7993k0861N969J1905j8902J7982r469j2574K5614
$$ 11457 -12352 5330 2154 -5960 12033 -8828 -2859 9046 -9856 8126 -1343 -13917 11697
1914A1697j8296N348J3609k9879K0647O585j9163K1887j7953m407K3806k0896
$$ 11697 -6599 -1251 12358 -17521 3126 9711 -9452 12435 -5518 -9925 13881 -7015
1926g015R690J813k0272K3717q223l920J6945k7622J4037J4034k2083J9516j3592
$$ -7015 2675 4488 -15784 7933 -290 -4210 12735 -14887 -850 13184 -8899 10617 -2975
1939b975j0165L1521k2528j156J4789k3476K0410j47j8874K2055j3381L85J5964
$$ -2975 -13140 18381 -4147 -5303 9486 -13990 6420 6273 -12601 9454 -3927 -3542 12422
1952A2422k2053J3970P69j5218K4641j9153n312K3690k3049J1094N696k4898K6214
$$ 12422 -9631 4339 5108 -10110 14531 -4622 -9934 13756 -9293 1801 7497 -17401 8813
1965H813m361j2993J9594k0102O140J5373j8822J2252q650r178K6036j6071j661
$$ 8813 4452 -8541 11053 -9049 -2909 12464 -6358 5894 -2756 -11934 14102 -1969 -3630
1978c630O648j9360K5911K3k2760J9768j2014J150K1334k4864N352O701j4782
$$ -3630 3018 -16342 9569 9592 -13168 6600 -5414 -4264 17070 -7794 -2442 4259 -10523
1991a0523K0093p116j1595J2529j2023J2397N181k0298J4570l841l551J8711k1361
$$ -10523 9570 2454 -9141 3388 -8635 3762 8943 -11355 3215 -626 -4177 14534 -6827
2004f827K172J3724j7641J4757j320j7199J7423n406k441R897j5685R044O344
$$ -6827 -4655 9069 -8572 6185 4865 -12334 5089 -317 -2758 7139 -8546 498 6842
2017F842j0388R184r554J830J2587j6620O484K610j2260J7014o331q901J3353
$$ 6842 -3546 5638 -3916 -2086 10501 -6119 365 2975 -9285 7729 1398 -7503 5850
2030E850j1334L996J2146j4973L303J422k185J0856j0069m004N290l757R731n095
$$ 5850 -5484 -1488 10658 -4315 -1012 410 -1775 9081 -988 -4992 298 -3459 6272 1177
2044A177r362J1017n720K584R002j4443L112O515o602Q815n012r012R875j228
$$ 1177 -8185 2832 -2888 -304 8698 -5745 -2633 3882 -2720 6095 1083 -7929 1946 718
2058G18n72K43n534N652l01r94M338p247L763L277o389P400l700o771J0133l125
$$ 718 146 389 -5145 507 206 -788 3550 -3697 66 3343 -3046 4354 654 -6117 4016 891
2074H91m276M844m723K466L836n169J161J870M51J11k287L085k497j488N428m770
$$ 891 -3385 1459 -3264 -798 3038 -2131 -970 900 1351 1462 -825 2260 -237 -1725 3703 -1067
2090a067j341M345n087L422L264p308L284L686l951J897L16j863J549k77q65n55
$$ -1067 -2408 1937 -3150 272 3536 -3772 -488 3198 -753 1144 1460 -403 1146 869 4 -551
2106e51J312j244k276M444p70m609N041P90l697L721k074j501M783k508l220L012
$$ -551 761 -483 -2759 1685 915 -3694 1347 2137 -1560 2161 87 -1414 3369 861 -2359 653
2122F53l29k159J804L73k465M93K585j264O75J110m001K620L781n000m17L171
$$ 653 324 -1835 -31 342 -2123 -1630 955 -309 366 1476 -2525 95 3876 -1124 -1541 1630
2138A630l548Q05K434l231M34J653j678J130L087l013j728M050m81k724K746j459
$$ 1630 -1918 -1113 1321 -1910 -1476 177 -1501 -371 2716 -297 -2025 2025 1544 -1180 1566 107
2154A07k246L030j291j481L951k516k945M806J003l411J748R00k721K077J305
$$ 107 -2139 891 -400 -1881 2070 -446 -3391 1415 2418 -993 755 1655 -1066 1011 2316
2169B316l524J426M85l601K797K551m521K77L601k011N67J974l052Q22K554l519
$$ 2316 -1208 218 703 -2898 -101 2450 -2071 -1794 1807 -204 363 2337 -715 107 2661 -858
2185h58N56K856l652j877M312j171j981K625j749n69L881k160j970M382j986l356
$$ -858 -302 2554 -1098 -2975 1337 166 -1815 810 -939 -1508 2373 213 -1757 2625 639 -2717
2201b717L968N51m098J402M73j121K177n70l263L677J508l943K132K257l400P26
$$ -2717 1251 1802 -2296 -894 -421 -1542 635 65 -3198 479 1987 -1956 176 2433 -967 -241
2217b41K130l054J041J297l910J659L536m342L9L788k314n47L178j867j032K781
$$ -241 1889 -1165 -124 1173 -2737 -1078 2458 -1884 -1845 1943 -371 -918 2260 393 -639 2142
2233B142k416l64K666k733k180M573r13l092L020J27k495L590m48k836L473r03
$$ 2142 -274 -638 2028 -705 -2885 1688 775 -2317 703 830 -1665 1925 1477 -1359 2114 1211
2249A211l330M024K74m977J869K114k236O98N38j912J415K323k796N01L444m335
$$ 1211 -2119 1905 2179 -2798 -929 1185 -1051 -353 185 -1727 -312 2011 -785 -284 3160 -1175
2265a175l21L951l136l78K310m236J877L707m168k97K984k213J53L479j537k867
$$ -1175 -1496 2455 -681 -1059 1251 -2985 -1108 2599 -1569 -1866 1118 -1095 -942 2537 1000 -1867
2281a867J927J154k390K489l24n104M540J062m648M635m06m829M966O50k541K498
$$ -1867 60 1214 -1176 1313 989 -4115 425 1487 -3161 1474 1068 -3761 1205 1855 -686 1812
2297A812k207j380L436j29k739j83K085j424j248L966k062j878M316l849O33O052
$$ 1812 -395 -1775 1661 1532 -1207 -1390 695 -729 -1977 1989 -73 -1951 2365 -1484 -851 5201
2313E201o718l29N138m760J486K675n049J181J390n51J143l78l63j070J427K987
$$ 5201 -1517 -1846 3292 -1468 18 2693 -2356 -1175 215 -336 807 429 66 -1004 423 3410
2329C410m976K244K231p279M832K999o864M420j732l972Q607k448m693L927j173
$$ 3410 -1566 678 2909 -4370 462 3461 -3403 1017 -715 -4687 3920 1472 -3221 706 -467
2344d67J322O72j877R80k085J525P18k700M836m661l672R755m030l104O135o735
$$ -467 855 1527 -350 630 -1455 70 788 -1912 2924 -1737 -5409 4346 316 -2788 3347 -3388
2360c388K573O244q021K054K575m623L525m38j179K78k052M003j965j175M778
$$ -3388 -815 5429 -2592 -538 2037 -2586 939 501 -678 -400 -2452 1551 -414 -1589 3189
2375C189n322K081M267q415O130K082q944O956n86n392P008l998j289M921m399
$$ 3189 -2133 -52 4215 -4200 1930 4012 -4932 2024 1438 -3954 3054 -944 -2233 2688 -1711
2390a711J802J720j138P79m350L737L112o602M704k919l922J0487o395l561P915
$$ -1711 91 1811 673 1452 -2898 839 3951 -2651 2053 -866 -4788 5699 -696 -4257 3658
2405C658p284K858O393q153K457R88k484N324k955k392N10j060N573l884k480
$$ 3658 -3626 -768 5625 -2528 -71 917 -1567 3757 802 -1590 -1080 -2140 3433 -451 -2931
2420b931N151o495M142O294j0369L934K545o178R072l096q022P460j286q32J758
$$ -2931 2220 -4275 -133 6161 -4208 -274 2271 -3907 5165 2069 -5953 1507 221 -611 1147
2435A147m719K893J045q07K034m356L761J071n444P424l327n751R506m882k385
$$ 1147 -3572 -679 366 -441 1593 -2763 998 2069 -3375 4049 722 -5029 4477 -405 -2790
2450b790O399p560K972N381p095K280R18r62L510k986k43J16j329N587m630k341
$$ -2790 3609 -3951 -979 4402 -2693 -413 505 -457 3053 67 -176 -60 -1389 4198 -432 -2773
2466b773M953n432M726L403j0266M889L431n308O230k727m736N909j466n75J158
$$ -2773 2180 -3252 1474 4877 -5389 -500 2931 -2377 3853 1126 -3610 2299 833 258 1416
2481A416l139J154n58K100J369o054L570J402k995N699m548l393P933m115j901
$$ 1416 -1723 -569 -1127 973 2342 -3712 -142 1260 -1735 3964 -584 -3977 3956 -159 -2060
2496b060N247n615Q36L504l542J224L26j167J491l99J191j774J94L959m931K6
$$ -2060 3187 -2428 -1592 1912 -1630 -406 -80 -1247 244 -155 1036 -738 -544 3415 -1516 -1490
2512a490M297n049K391J904o148M836J117m965M265ql054K999O4n75n62n02Q28
$$ -1490 2807 -2242 149 2053 -4095 741 1858 -3107 1158 1150 -1904 1095 1159 584 22 -480 348
2529C48q49J912j120l326M687j013l364M996k268j934M554k923l63L373l600r0
$$ 348 -501 1411 291 -3035 1652 639 -2725 2271 3 -1931 2623 -300 -663 2710 -890 -980
2545i80K692j892p76P75L17j077M90J742k152J091J441l390K845J633n229K602
$$ -980 1712 -180 -956 -181 136 -941 -451 1291 -861 230 1671 -1719 1126 2759 -2470 132
2561A32J698m012K369N10k639K380J50j961J161J350j499l89K439j305k059K716
$$ 132 1830 -2182 187 697 -1942 438 588 -1373 -212 1138 -361 -750 1689 384 -1675 1041
2577A041p73j447K450k458q61M053k562j465L294j261j232K414o87j261J338m70
$$ 1041 268 -1179 1271 -1187 -2048 2005 -557 -2022 1272 11 -1221 1193 506 -755 583 113
2593A13j007J927j78l140K288J337l043J842J058k676J996R54k369J919L73k803
$$ 113 -894 1033 855 -2285 3 1340 -1703 139 1197 -1479 517 1471 -898 1021 1394 -1409
2609a409J834J277k505j5J556j707L32J531j474j85K513k413r3L107k142j296
$$ -1409 425 1702 -803 -818 738 -969 -637 894 -580 -765 1748 -665 -758 2349 207 -1089
2625a089K598j317j208K094j304j037K060j310o32K258p69j702K176N28k115J200
$$ -1089 1509 192 -1016 1078 -226 -1263 797 -513 -1145 1113 344 -1358 818 1346 -769 431
2641D31K50k084J904K97k510J790N84k673J916J665l010J013J497j667O71J108
$$ 431 681 -1403 501 798 -1712 78 662 -2011 -95 1570 -1440 -427 1070 -597 74 1182
2657A182k204P89J476k174j10K651k234r34K279j032j53J702j736k54K502j502
$$ 1182 -1022 -233 1243 -931 -1041 1610 -624 -1558 721 -311 -464 1238 -498 -752 1750 248
2673B48j193K328j144j591K137n27j293J266k40j198K522l74k201K002J046k642
$$ 248 -945 1383 239 -1352 785 258 -1035 231 -9 -1207 1315 941 -1260 742 1788 -854
2689h54J484O28k297J048P05j990J297O63k178J637J223k169K27J968j321n22
$$ -854 630 1258 -1039 9 714 -1276 21 684 -1494 143 1366 -803 -576 1392 71 -451
2705d51J524j195n85J881j781m41K759k540j140L172j079o82J162j239K72J879
$$ -451 1073 -122 -707 1174 -607 -1048 1711 -829 -1969 1203 124 -558 604 -635 -363 1516
2721A516j501p34J259j89j534J359N82k341R01J284j971J841O51l251K747Q07
$$ 1516 15 -719 540 351 -1183 176 758 -1583 -682 602 -1369 472 1123 -2128 619 1426
2737A426k903K648Ok331J162M37q00J59k40p5m8J501r01j098K657j284j858L802
$$ 1426 -1477 1171 1177 -1154 8 445 -355 -196 -436 -511 -559 942 41 -1057 1600 316 -1542 2260
2755B260j554j830K489k950J183K828l999P10J699j534J515l71m65L82r62J995
$$ 2260 706 -1124 1365 -1585 -402 2426 -1573 -863 836 -698 817 446 -19 363 -599 1396
2771A396j144k88J584l919K149K534m270J980O43l605M752p40k588K952k267L07
$$ 1396 252 -36 1548 -2371 -222 2312 -1958 22 665 -2940 1812 1072 -1516 1436 -831 -524
2787e24K346k318L73n96O1J815l017K017O24l304M060j683j758M982m408l39M655
$$ -524 1822 -496 -123 -719 -658 1157 -1860 157 781 -2523 1537 -146 -1904 3078 -1330 -1669 2986
2804B986m623J589J376l471K955q16j418K484k126Q96L05j642M177l114j047L801
$$ 2986 -1637 -48 1328 -2143 812 -4 -1422 1062 -1064 -168 137 -1505 2672 -442 -1489 2312
2820B312m578L103K195o685M817n10l506N978l626j754L983k656K411K9l342L516
$$ 2312 -2266 837 3032 -3653 1164 654 -2852 3126 -500 -2254 1729 -927 1484 1513 -1829 1687
2836A687k028L79J685l836L248n63m023O524l272k229N197n033K432L485o683
$$ 1687 -341 38 1723 -2113 1135 572 -3451 3073 -199 -2428 2769 -2264 168 3653 -3030
2851c030L934O60l376L908k711K35J459l904M101j077k004M109m805J617M600
$$ -3030 904 1564 -1812 2096 -615 -380 1079 -2825 1276 199 -1805 2304 -2501 -884 3716
2866C716o386L818L27n225O737k318l053M529m549J432L362m528K326r06q3L425
$$ 3716 -2670 1148 1475 -3750 2987 669 -2384 2145 -2404 -972 2390 -2138 188 -718 -801 2624
2882B624m170J991Q10m153N514k250k780N771n682Q76M966o064K500J434l245
$$ 2624 -1546 445 1255 -2898 2616 366 -2414 3357 -2325 -1449 3517 -2547 -47 1387 -1858
2897a858M186k135j571L564k807J716r19k432M984l459n22L521n445L859J767
$$ -1858 2328 193 -1378 2186 -621 1095 176 -2256 2728 -731 -1253 2268 -3177 682 2449
2912B449n428N064j954k414O178l653j285J988k877L295j63k897K208k204K353
$$ 2449 -2979 2085 131 -2283 3895 242 -1043 945 -1932 1363 1200 -1697 511 -1693 660
2927F60J301m006L592k177j261N834m308j346L466m298L498J275n125K714K90
$$ 660 1961 -2045 1547 -630 -1891 3943 -365 -1711 1755 -2543 955 2230 -2895 -181 109
2942A09p33K134l141J684M24j498L311l098k7K598l629L034K26n002M848o71k431
$$ 109 -624 1510 -1631 53 477 -1021 2290 -808 -835 1763 -1866 1168 1394 -3608 1240 569 -1862
2959a862L481k738J08L147k676R89n43j011K589j719Q98l60k966M246r80k166
$$ -1862 1619 -1119 -1011 2136 -540 449 -94 -1105 1484 -235 663 303 -2663 1583 603 -1563
2975a563L051l443J467L762n038J698J402k868L290j099j547J206j212J558r4
$$ -1563 1488 -1955 -488 3274 -1764 -66 1336 -1532 1758 659 -888 318 -894 664 570
2990E70j631J566j929J883K073m588K425J057k939L669j672k509L943k505o82
$$ 570 -1061 505 -1424 459 2532 -2056 369 1426 -1513 2156 484 -2025 1918 -587 -1269
3005a269K590k861R08Q19M7O76k214J176Q55j301K108j978r27L648l527J82K472
$$ -1269 1321 -1540 -632 187 234 910 -1304 -128 727 -574 1534 -444 -1371 2277 -1250 -1068 1404
3022A404l395J952J215k705J944l45j221K211o15k68n67n8J681j943P5J343k338
$$ 1404 -1991 -39 1176 -1529 415 70 -1151 1060 445 177 -390 -448 1233 -710 -635 708 -1630
3039a630K240K58k984L476j039j876L400j492j203J904j391L02N93j202Q56j57
$$ -1630 610 868 -2116 1360 321 -1555 1845 353 -850 1054 -337 -35 558 -644 212 55
3055E5J89m87p51K283j230j188K855k217J04K279k630R06J056k538J069J100j620
$$ 55 244 -243 -994 1289 59 -1129 1726 -491 -387 1892 -738 168 1224 -1314 -245 855 -765
3072g65M67j3J57O11l75L16o71O28N16j744J526j70k091K137J79j963J611o50
$$ -765 -298 -311 -154 457 82 398 -273 355 871 -873 653 483 -1608 529 708 -1255 356 -294
3090b94o61J727r84q00J575j13r45P55M18q04o54J279j177O8J287j261j26J917
$$ -294 -955 772 -212 -1012 563 450 -495 260 678 -126 -780 499 -678 -610 677 -584 -710 1207
3108A207j930L70J544j376j39J088j092L03O37r44j40P93m99n98J091l24o95J408
$$ 1207 -723 -353 1191 -185 -324 764 -328 -25 612 -332 -472 321 -178 -776 315 -9 -704 704
3126G04j59j136J194j01j144J548m61j485J410R2j482J200K94r95P47M57j059
$$ 704 545 -591 603 502 -642 906 445 -1040 370 462 -1020 180 474 -521 226 683 -376
3143c76O71N51j254M48O91j264J81J371j574j12J263j019J59R51j313M07J206
$$ -376 295 846 -408 40 731 -533 -352 1019 -555 -667 596 -423 -264 687 -626 -219 987
3160I87j298o1J110n27n53O00n00m69J021m65j073J465M4j468J662M2j066J001
$$ 987 -311 -372 738 211 -342 258 -242 -711 310 -155 -1228 237 281 -1187 475 517 -549 452
3178D52l0j175J479n72j020J094n6q64N02O98j090m3J300n47l00J026j181l3J680
$$ 452 422 -753 726 154 -866 228 172 -692 -190 508 -582 -625 675 128 -172 854 -327 -360 1320
3197A320j656mJ287k004O13J373j179j07N10l96P07K62o75p87J149O71j837Q36
$$ 1320 -336 -340 947 -1057 -444 929 -250 -357 153 -243 464 726 51 -736 413 1084 -753 83
3215H3N70j766J208J68j511K047o78j720K206k5j173J230n16k60M44o4k96m53
$$ 83 653 -1113 95 263 -1248 799 121 -1599 607 582 -591 639 123 -137 307 243 -53 -506
3233e06O27m79n80J732q93j253K389j427k12K047k122M88J132j859J127N18k032
$$ -506 121 -358 -938 794 -99 -1352 1037 -390 -602 1445 -677 -189 943 -916 211 729 -1303
3250a303O94O72J55k78m04P31o90N32Q13j808J283P81k676K210M88k710J938p31
$$ -1303 -609 63 218 -60 -464 267 -423 109 922 -886 397 1178 -1498 712 1200 -1510 428 -303
3268c03r08K130j153m34J009l20M78k21K74k10j290J444k30j267K073j668r14
$$ -303 -1211 919 -234 -668 341 21 499 278 552 342 -948 496 266 -1001 1072 -596 -1510
3285a510K800j815K40J580k584J125J513j424K25m13l19Q69j2k26r97M27J639
$$ -1510 1290 -525 -285 1295 -1289 -164 1349 -75 150 -263 -582 287 275 49 -948 -521 1118
3302A118k101J065R55k768K121R86k176J847j129j625L131r19j369P17o92Q67
$$ 1118 -983 82 1037 -1731 390 1376 -800 1047 -82 -1707 1424 505 -864 -147 -839 28
3318B8L17m38L21j089J852m41j507K020j428n72K810k854j13K323k174R68Q55
$$ 28 345 -93 228 -861 991 550 -957 1063 -365 -937 1873 -981 -1094 1229 -945 23 878
3335H78k224J432M10o14K45m16J110j014M4J474k626P68J752k272J617m86k350
$$ 878 -1346 86 496 -118 127 -289 821 -193 -149 1325 -1301 -533 1219 -1053 564 78 -2272
3352b272L192L16j794R85j138O75J666j484k74o64L84J474j505Q65r29j671M145
$$ -2272 920 1236 -558 427 -711 -36 1630 146 -128 -792 -408 1066 -439 426 -503 -2174 1971
3369A971j002k121K037k045R73K459l225N30P25j488J893m89r88N64q00K019o54
$$ 1971 969 -1152 885 -1160 -187 2272 -953 -423 302 -1186 707 218 -770 -206 -1006 1013 359
3386C59j469J755j412J165J555l988K047J410k820K341j195j631K797j185j53
$$ 359 -1110 645 -767 398 1953 -2035 12 1422 -1398 943 -252 -1883 914 -271 -424
3401d24R50j845J736K9n5O00k466J695J190k504J876j576j130M171k611p48K269
$$ -424 526 -1319 417 446 391 991 -1475 220 1410 -1094 782 -794 -1924 2247 -364 -1112 1157
3418A157k872K043J647l060J639p50j49J985k038K55k40o69L047k410r12K458
$$ 1157 -1715 328 1975 -1085 554 -196 -345 1640 -398 -143 -383 -1052 1995 -415 -1327 1131
3434A131k459J890J191l535K869l08j883L171k239j236K128j279J077m05j241
$$ 1131 -1328 562 1753 -1782 1087 779 -1104 2067 -172 -1408 720 -559 518 113 -1128
3449a128J691p32K47P18k526K727j93k427L440k319j054L296k603M29J245k894
$$ -1128 563 -169 78 796 -1730 997 804 -1623 1817 -502 -1556 1740 -863 -434 811 -2083
3465b083K486M52j976J589q03N31P36j807J494q67n40K313k530L13J993l054K175
$$ -2083 403 855 -1121 468 -335 196 932 -875 619 -248 -788 1525 -1005 -692 1301 -1753 422
3482D22P97l129K631k32j178J993j830M06J102j418P35p05M6R98j623J692j25
$$ 422 1219 -1910 721 489 -689 1304 -526 -120 982 -436 299 -406 -360 638 -985 707 582
3499E82j872K328k55j738K403k097J01K316k417J96Q54j085P26k96q9P32p11N69
$$ 582 -1290 1038 783 -955 1448 -649 -548 1768 -649 -453 401 -684 42 -254 -343 389 -322 247
3517B47k97j19J190j495K29J579k231O89R67k135J655k37j419K132q51q35J324
$$ 247 -50 -169 1021 -474 -245 1334 -897 -208 759 -1376 279 42 -1377 755 -96 -931 393
3534C93l08K07j7k52J75n33P17k79r19J380r89o85J821p91j044J974j079L02Q55
$$ 393 85 292 275 23 198 -335 382 103 -816 564 -425 -1110 711 -80 -1124 850 -229 73 928
3553I28j372K74N32n78J89J2o7l18N2R67r31jQ32r42Q21M46j510R23M95j126N11
$$ 928 -444 -170 362 -216 -27 -15 -82 -400 -348 619 -312 -313 519 -423 398 844 -666 257 752 -374 137
3574A37L30r39N50J13n22M35J77m40J49P11n94n19J132n00o06Q33n90l02P95o73
$$ 137 467 -472 78 191 -331 104 281 -159 -10 701 107 -412 720 220 -386 447 -143 -445 350 -323
3594c23l91J229o72m77R19o8n43N84q4n54P25l08n97O12K1q73N17P06j196O58
$$ -323 -714 515 -157 -634 285 217 -326 258 174 -380 345 37 -560 52 73 -800 -283 423 -773 -115
3614a15N64j023R05J00r05O22K86q12O4P89j064R9M54j92K3P19p78j4P99n06k72
$$ -115 449 -574 331 431 -474 148 434 -378 -314 475 -589 -490 -36 -228 -205 514 -264 -278 521 15 -257
3635b57J016q25p42J225j81q02P42l83QP62l78p15Q48K27r88P15M30j028J57N96
$$ -257 759 -66 -808 417 236 -566 176 -207 -199 563 185 -530 318 545 -443 272 702 -326 -169 427
3655D27o51K86K23j214Q88N68p85J96M60o60K34M04lk48J58o56m6Q71n55q03R74
$$ 427 -224 62 285 -929 -41 527 -258 -62 398 -262 -28 376 373 125 283 -373 -419 452 -103 -906 68
3676F8m51m2J059p32m63J199q59J31O65n75m85M91J64o29L76L66o62O8M22l84
$$ 68 -383 -425 634 -98 -561 638 -221 -90 575 0 -485 6 170 -459 -83 283 -379 -311 111 -273
3696b73L10M56j085Q34N23j266O02K70q63L63L36o58M43j2k22Q2O88l61n03Q65
$$ -273 37 493 -592 242 765 -501 101 371 -492 -129 207 -451 -8 -20 -242 -160 528 167 -336 529
3716E29n9l14N78p53m33J191o37m34Q98j005p3P34j46m0J68k44J25J79K09q18
$$ 529 470 156 734 -19 -452 739 102 -332 566 -439 -512 222 76 36 204 -40 85 264 473 -345
3736c45J18O60j009O78M69j199L10L99o45R29j41j006J487m16n65L15p7M8o39
$$ -345 -227 433 -576 102 571 -628 -318 81 -564 365 224 -782 705 289 -276 39 -38 10 -629
3755f29P87j27o90N57J71o00J247q69o48J805r72l30J042j087K89N00r34J17K77
$$ -629 158 31 -659 -102 69 -531 716 -153 -801 1004 32 -298 744 -343 -54 446 -488 -371 -94
3774i4k24M02m40L65j61M8Q94j058j91J268j128Q51r2j637J149M15r66J301q31
$$ -94 -318 84 -356 9 -152 -104 790 -268 -459 809 -319 532 440 -1197 -48 367 -599 702 -129
3793a29m43Q94k01O99m04r78R70k96O75l81j687J508L65j036J130j303l22K239
$$ -129 -572 322 121 820 416 -562 408 112 787 406 -1281 227 592 -444 686 -617 -939 1300
3811A300j534J05Q52j566R50M78q76L03o37L71O35p34N91o47j3J397j538K56R59
$$ 1300 -234 -129 723 -843 107 585 -291 12 -625 -254 381 -353 238 -409 -422 975 -563 -307 652
3830F52j324Q92Q01j897J134k56m96J157j311j87J065j8No22j51J102n59K48Q
$$ 652 -672 220 1021 -876 258 2 -494 663 -648 -835 230 212 217 -405 -556 546 -13 235 243
3849B43j283J522j71j030J385j232n62K119r92j82O98j269R76P40j244K61m75
$$ 243 -1040 482 311 -719 666 -566 -1128 991 -1 -183 515 -754 222 962 -282 -21 -496
3866d96M40O98r66P39q38j45J365r17k37J090j589J215N15j556R58M4q28J207
$$ -496 -56 642 -324 415 -423 -568 797 -120 -357 733 -856 359 874 -682 276 320 -508 699
3884F99o23n64P39l77J83j24m18P50o73L98N78j286R20M06j015J049j073m40J733
$$ 699 76 -488 251 -126 57 -67 -485 265 -408 -10 568 -718 202 608 -407 642 -431 -871 862
3903H62j506%J299j300O43K88n59M78n34K85M79p97K13j45j25J005r05l36J317
$$ 862 -644 -644 655 -645 -2 286 -273 205 -329 -44 435 -362 -149 -294 -419 586 -319 -655 662
3922F62j503Q21N75j540J179L53j166R95M6r94P65l33J47k2m37P51o90K86O29
$$ 662 -841 -20 555 -985 194 547 -619 376 422 -572 193 -140 7 -15 -452 299 -391 -105 524
3941E24j087J167j97r20J214n65n99J135q89RQ63j161M06M65q42M79J33M5K9p00
$$ 524 -563 604 407 -513 701 136 -463 672 -217 -208 655 -506 -100 365 -477 2 135 180 209 -491
3961d91P33l36o4M97r25P31L27j066J02Q27q52R15p4o53K87K64k32L36j13m73
$$ -491 242 -94 -158 339 -586 145 472 -594 -492 335 -517 398 324 -329 -42 222 -10 326 213 -260
3981b60L95j26J70o14L21K49o50P01j38q18J066J6p38J121o66m36J063p18RP4
$$ -260 135 9 179 -435 -114 135 -515 186 48 -770 296 312 -426 695 29 -407 656 -62 -53 21
4001B1k93K43J3L1k59K20M72n62j21P46n06M6M35q65J62M46o46N17J94n39J70
$$ 21 -272 -29 -16 15 -244 -24 448 -114 -235 511 5 51 486 -379 -217 229 -417 100 294 -245 -75
4022g5M43k17j9o6m1J70K56l95m19L87M6l43M82r2m90M32J55n76O22o42J32P53
$$ -75 368 151 132 66 25 195 451 56 -363 24 70 -273 209 117 -373 59 214 -362 260 -382 -250 503
4044E03j35o44M17o2l55L92Q7m18K69kl83L40J62l74J85L99o55R0M73n90M36L40
$$ 503 368 -276 141 79 -276 116 203 -215 54 52 -331 9 171 -203 -18 381 -274 -184 289 -301 135 475
4066D75o62L32Q2p36L38O34o33m5M62j26j96M68m95j23K79n3l49M26k16l39M52
$$ 475 -187 145 227 -509 -171 463 -170 -215 247 121 -75 393 -102 -225 54 1 -348 78 -138 -477 -25
4087b5K59n56O28l38n7P04l90l19K15K78o94K25K09m24J61L88n42M54M41q26K40
$$ -25 234 -322 306 -32 -89 615 225 -94 121 399 -295 -70 139 -285 -124 264 -278 176 617 -209 31
4108C1L90m76K81J15o12J66L52j17l13L41j84k19Q87p12k65O65l89j02L69j36
$$ 31 421 -55 226 341 -271 -105 247 130 -183 158 -26 -245 642 -70 -335 330 -59 -161 208 72
4128G2j63L42l98k09M76R6o42M58L02n39J79K17n64K93J56k61K82J1n06L38L08
$$ 72 -91 251 -147 -356 120 216 -426 32 334 -205 -26 191 -373 -80 76 -185 97 108 -398 -60 248
4149B48m85n2L82k7J10r2M8J75j36l30J45N60m49m75N78k10k93N41m01P6K75K1
$$ 248 -237 -289 93 66 176 84 132 307 171 -159 -14 546 97 -378 200 -10 -303 238 -163 -87 188 209
4171B09l30L26q4m15N18J89o73O2L95o14J89M20n75L45M61p14M60K86o45J78L84
$$ 209 -121 205 121 -294 224 413 -260 -198 197 -417 -228 192 -383 -38 423 -291 169 455 -190 -12 372
4192C72n74N44j54o34L58K21n50L90J00J42o16O29P3n63O06j41o59R92n71m90
$$ 372 -202 342 188 -446 -88 133 -417 -27 73 215 -401 228 301 -262 344 203 -456 536 -35 -525
4212e25Q61o14j08N52n08K88L25o15N82j14K31l18j85Q04m06m65P74r57P2R98
$$ -525 336 -278 -386 166 -342 -54 271 -344 238 124 355 37 -148 656 250 -215 559 -398 -326 672
4232F72j039P81j23r45J127j04o16N31l94j72O62j35N0n79p4N25l22M78%j579
$$ 672 -367 414 291 -654 473 369 -247 284 -110 -282 380 245 295 -284 -358 167 -155 323 323 -1256
4252a256J790J61j142J454j454J23J165j037j25O89j023Q69j19p23J136j003Q39
$$ -1256 534 695 -447 1007 -447 -324 841 -196 -321 368 -655 214 95 -628 508 -495 344
4269C44k7p10R19o87k60J460j607J40J115j306Q62J9j442J562n58r4R41j021L62
$$ 344 317 -393 526 -161 -421 1039 -568 -428 687 -619 243 262 -1180 382 -176 -270 671 -350 12
4288A2J91l16O75j096R9J070j233P06J61j362J667k73j223J774j211j5J136r00
$$ 12 203 -113 562 -534 -435 635 -598 108 269 -1093 574 301 -922 852 -359 -374 762 -138
4306a38L53K65j281J287k49k74K04p94J014o9j098J547q41l39J682j705L54P52
$$ -138 215 480 -801 486 237 -37 167 -627 387 318 -780 767 -74 -413 1269 -436 -82 670
4324F70j690J603J08j596J186n61RR39j323R24l07n24J190r46J77J059j580J019
$$ 670 -1020 583 691 -905 281 -280 -271 668 -655 269 -38 -562 628 -318 -141 918 -662 357
4342C57J34j626J516j84r93J422j400O00J105j561O45J99p40J032o81O2M52j131
$$ 357 491 -1135 381 197 -796 626 -774 -174 931 -630 15 214 -526 506 -175 -113 339 -792
4360g92J048J5j277J879j387lJ773j801N11P75j505J164N6j028Q87m40l81P83
$$ -792 256 271 -1006 873 -514 -517 1256 -545 -34 741 -764 400 456 -572 315 -125 -506 277
4378B77p43O82l43m63J222r35R6Q20j122R41p4j196J355l09o71J079r28J12N55
$$ 277 -466 216 -127 -590 632 -303 -207 613 -509 432 358 -838 517 208 -463 616 -312 -200 355
4397C55q41P13R7l24K30m98O39O8r09J203q21l97J160j111p6R37j076N20M48q82
$$ 355 -486 227 324 0 230 -268 371 439 -470 733 -88 -485 675 -436 -512 425 -651 -131 317 -565
4417e65P72N9k26K28m14J26M2m04P11l00k08O24j027O79M63r30N12K37r37J059
$$ -565 207 266 40 268 -146 -20 22 -382 329 29 -179 445 -582 97 560 -370 142 379 -558 501
4437E01o73k02O52l93j13Q6j16J56J5K8K92l77K17Q4k31O35p24m0O65n81j69O21
$$ 501 -172 -374 278 -115 -228 -142 -258 -102 -87 -59 233 -144 73 157 -74 561 -163 -203 462 -119 -288 333
4459C33m25j03P84p15L97j53k19K47R0O8n01n0P43o82J69J36n76P83j27m44N17
$$ 333 -92 -195 589 -126 271 118 -101 146 236 304 -197 -247 496 -186 -17 119 -457 326 199 -245 272
4480B72n0m59N61l60l13N15j66m0N6p1r0N3L41m83K48P1p6l78M58k41J86J9j94
$$ 272 222 -237 324 -36 -349 166 0 -40 16 -55 -145 -92 249 -234 14 85 9 -369 89 -152 34 53 -141
4503a41Q0K59m04m4K47N7m37J82M15o40L05J33n6K46J61p14K31K71n82N73J0k38
$$ -141 -61 198 -206 -250 -3 54 -383 -201 214 -426 -121 12 -44 202 363 -351 -120 151 -431 142 152 -86
4525h6mj76K02L01M6j13k77L25j3k73N60l14j13J50l11j53L48j84j28N34m48q8
$$ -86 -90 -266 -64 237 283 170 -107 218 205 -68 492 178 65 215 -96 -249 99 -85 -213 321 -127 -215
4547b15P01n77J33J59r4k6J20r6j47l5J07l44M69j48j21j5L35k38J18J48l90J75
$$ -215 486 -91 42 201 107 81 201 105 -42 -77 30 -314 155 7 -114 -129 206 -32 86 234 -156 19
4569A9k34P6o6K69l6k37j60K38J51J5r9j43N31l93l46M95q7M6j74M0M1K64m20
$$ 19 -215 -139 -205 64 28 -209 -369 -131 20 35 -64 -207 324 -69 -415 80 -7 39 -135 -95 -54 210 -210
4592b10M3K33k98L17j07K56j57k01K35l76J51J23j95J64K50n25L46M6k43L30J1
$$ -210 -167 66 -232 85 -22 234 77 -124 111 -265 -114 9 -186 -22 228 -297 49 95 -148 182 193
4613A93rk53L56m4j51n8J17l36L11K4n61N48Ln43N75k16k62P47p25L10K29m77
$$ 193 184 -69 287 243 92 34 151 -185 126 150 -411 137 140 -403 172 -44 -306 441 -284 26 255 -222
4635b22M40k36j88L82p09N38j50O2K23m18J72N50m78Q2K18o11M08K91o54L40k14
$$ -222 218 -18 -206 176 -533 5 -145 -83 140 -278 -106 444 -34 48 266 -345 63 354 -300 40 -174
4656a74k88O99k77j77L51k46M42m62o3Q24j147K30N44n94Q70o66m25P45k63j8
$$ -174 -462 237 -40 -217 134 -112 330 -132 -195 629 -518 -288 256 -338 532 -134 -559 186 -77 -95
4676i5M69n74M97k89l32P26l69J95Kp69P07L1p70J064q79Q9J228j304K36P59j262
$$ -95 374 -200 297 8 -324 402 33 228 230 -539 168 199 -571 493 -386 -297 931 -373 -137 622 -640
4697f40J217m37n49R71o77J76J60r46J235p68k05J044r46M47M58j092J121q8j266
$$ -640 577 140 -409 562 -115 61 221 -725 510 -258 -463 581 -365 82 540 -552 569 481 -785
4716g85J489q02j65R49j321N81L16j076R70m96R4P74r78M78J43o05Q98n16m90
$$ -785 704 -98 -263 686 -635 -54 262 -814 156 -340 -246 528 -450 28 171 -434 464 -52 -542
4735e42J239j145K3J083j556J038M08j111J272j176L20R79j311R42N8j227J111
$$ -542 697 -448 -425 658 -898 140 548 -563 709 -467 -147 832 -479 463 521 -706 405
4752D05n71k66J023j534R59O86j480J225m35p25J765j320J82L61j020R31j89m66
$$ 405 -166 -432 591 -943 16 702 -778 447 12 -713 1052 -268 -86 275 -745 186 -3 -469
4770d69R56j040M44M23p62R13m66o73J679j287q8J076j405P38N30j199J088o25
$$ -469 487 -553 -109 314 -448 465 -1 -674 1005 -282 -370 706 -699 39 569 -630 458 -167
4788a67l03J019q29N75q6k94M43n55l23Q80p13K75M55j093J182m45p05R85m61
$$ -167 -470 549 -280 295 209 -85 358 -197 -520 360 -353 -78 377 -716 466 21 -684 301 -160
4807a60j78Q95o95K92M9o02N20l22kP02r75N27J1q62J239o97k63Q72n58M47L05
$$ -160 -338 557 -138 154 203 -399 121 -201 -203 499 -476 51 62 -800 439 -258 -521 351 -207 240 545
4828E45j064P78O6n46O20o42K42J94o03M79m1j93P23r45M53N76j088P98j46n40
$$ 545 -519 259 325 -221 399 -243 -1 193 -410 69 28 -165 558 -387 66 642 -446 352 206 -334
4848c34J049q61j31O18o09K15k6j43K34j5k97O46m96K89O7m24N79m42k64Q49q50
$$ -334 715 -146 -277 341 -268 -53 -79 -222 12 -3 -300 346 -150 139 206 -218 361 -81 -345 504 -346
4869c46J58M06n20M12J08k87j45o6M83k7l23M80q07K38O26o90j70O52m35M26k03
$$ -346 -188 218 -302 110 218 -69 -214 -280 203 176 -147 333 -474 -236 390 -300 -470 182 -253 173 -30
4890c0j06N26m66j6N27q38M38L2j46L10m76L16m3k46N06m18l62Q33k30o6M00o85
$$ -30 -136 390 -76 -92 435 -403 35 67 -79 231 -245 71 28 -218 288 -130 -492 341 111 45 445 -240
4912b40J24M72m70J38K42m60M40j66p1k5j86M87l76rJ97k68L75j4m92L75l73J82
$$ -240 -116 356 -114 24 266 -194 246 80 9 -16 -202 285 -91 -100 97 -171 204 190 -302 73 -300 -118
4934a18L61k21l80N05k35k4L96n69L78k8o8J92n40K21K28k37M72l79j23N71m73
$$ -118 243 22 -358 147 -88 -112 284 -285 93 65 -3 189 -351 -130 98 -139 333 -46 -169 402 -71
4955g1MK38m38L22K29l65K43l57j12K14q1K60k86J22P6j19J32m4%K97k46n1J23
$$ -71 -67 171 -267 55 284 -81 162 -195 -307 -93 -174 86 -200 -78 -2 -121 11 -33 -33 264 18 -33 90
4978I0K15m53J87L0m46L22N6k7j08K1M17l70M4J21k03J76o3j66M03l33J03P8l79
$$ 90 305 -148 39 69 -377 -55 1 -26 -134 -113 304 -66 -22 99 -104 72 9 -157 246 -87 16 94 -285
5001b85L75J20l68J47L44k50O4K7J00m73N6L52l55o8J43j35J56J99k41J60J2k28
$$ -285 90 210 -158 -11 333 83 147 174 274 -199 -143 209 -146 -214 -71 -206 -50 149 -92 68 80 -148
5023a48J21J23l06J56q6N4J61k21j36J46K55j09J67Kl09%O6J74m5nj19o8M95n45
$$ -148 -27 96 -210 -54 -140 -86 75 -146 -282 -136 119 10 177 179 -130 -130 -64 110 65 60 -59 -127 368 -177
5047a77J59M7j13J77K3j46J39l33K24j54J30M18m43K11j48L2R0o1k69M04j54r8
$$ -177 -18 29 -84 93 116 -30 109 -224 0 -154 -24 394 -49 162 14 46 136 75 -194 210 56 -42
5069d2J22J8k12L38o3J18k06Ln9q7r4q0J46M19l54k23K22J19q7L6rm6N3k19P2
$$ -42 80 98 -114 224 161 279 73 76 17 -70 -164 -244 -98 321 -33 -256 -34 85 -2 34 25 -21 32 -187 -115
5094a15J29R7j85m5J05j92JK48k67M20L0j06m6K12o83P02k06l83K39K6k47J50
$$ -115 14 111 -74 -119 -14 -206 -205 43 -224 196 226 120 74 286 -397 305 99 -284 -45 -19 -266 -116
5116a16K12j86J20k7J71j07P1j55p6L39m43L13K5l28k62L43o6J28K98m79L47K28
$$ -116 96 -90 30 3 174 67 138 -17 -93 246 -197 116 141 -187 -449 -106 -172 -44 254 -225 122 350
5138C50n20M29P6n53K94l42J75M16n45L5N0P4K27k87J39J10j62m9L39n58L72O6
$$ 350 -170 259 335 -218 76 -266 -91 325 -220 -185 -135 -61 166 -121 18 128 -34 -83 256 -302 70 136
5160A36k78J38J26r3Q8l55J37j36L87l8J1p7k34J41O03m47l61L33k98L1N47o81
$$ 136 -142 -4 122 29 117 -238 -101 -237 150 112 123 46 -188 -47 556 109 -252 81 -217 -186 361 -320
5182c20L00n4J15J64k23j95Q2L93j60k93J92J44j11J66m22k5N45k91q2N24m82
$$ -320 -20 -74 41 205 -18 -213 -131 262 102 -191 1 145 34 200 -222 -247 298 7 -75 449 -33
5203c3m13O55k13N6l0J0j86J89k22J40k24O20l07k08O26k52l18L50m0j81K52o48
$$ -33 -446 209 -4 52 22 32 -154 35 -187 -47 -271 349 42 -166 460 208 -110 240 200 19 271 -377
5225c77M76M9j36k1k36M5J45J93l23p9L91q8j73J18j02J8K70j19k38K45k62J56
$$ -377 99 148 12 -9 -245 -200 -55 138 -185 -264 127 39 -134 -16 -118 -100 170 51 -187 58 -204 -48
5247d8M84p34K56R9J10J59l16O9p7k7K81l54k67L62n4r4O3j8J55j82K44N5j98
$$ -48 436 -298 -42 57 167 326 10 79 2 -25 256 -98 -365 -3 -57 -151 -88 -106 49 -133 111 166 -32
5270c2J1K42j08j12p3R1N1j35N0K89n35M96k05oL42l22l41M28k78J16L8j52J48
$$ -32 -21 221 113 1 -72 19 70 -65 -15 274 -261 235 30 24 366 44 -297 131 -147 -31 7 -145 3
5293Cj81K86p9l59L71M8j24L66l92j70O09m89J31K20n13K93K36l31k0K98k17J52
$$ 3 -178 108 29 -330 41 89 -35 331 -61 -231 378 -111 20 240 -273 20 256 -75 -95 203 -14 138
5315A38l54M24j60p2L24l47N4K09o03L78P0m69L86j22j28M58q7l47L88k74K97
$$ 138 -216 208 48 -24 300 -47 7 216 -387 -9 61 -408 -22 -144 -272 186 99 -248 140 -134 163
5336A63q0L9k72j2J79L07o05K96Oj44M75p26K43M04k00R0M9l77L40r5j64J96j00
$$ 163 83 122 -150 -162 17 324 -281 15 21 -123 352 -374 -131 273 73 163 212 -165 175 80 -84 112 12
5359A2j01K78m41L86j85J97m7j28l5L82o99M68J22k75K04j97j69M50l90j74L94
$$ 12 -89 189 -252 134 -51 146 99 -29 -64 318 -381 87 209 -66 138 -59 -228 222 -168 -342 52
5380E2K2j44l1P8P8R2j25J57k68K66j52k85N76m96k23N94j45j85J53l38M74j13
$$ 52 74 -70 -101 -23 55 147 22 179 -89 177 25 -260 316 -180 -403 191 46 -139 14 -324 150 37
5402C7l49J66K57l51o5K78J82l28K36J61k64Q8j6j54K14K07m13K64Q4k23J35j55
$$ 37 -312 -146 111 -240 -305 -27 155 -173 63 224 -40 48 32 -122 92 299 -114 150 234 11 146 -9
5424ij95K73j69J08L3O0o7j70K13j06j97K12K5o7K4j61PQ1L11k73J90k25J83J14
$$ -9 -204 69 -100 8 41 101 34 -136 77 -29 -226 -14 11 -56 -32 -193 -186 -105 206 -67 123 -102 81 195
5448A95j71k51L81q7j92j00J62N7j86J97n0K32j30k7kr9J71k29J57k18L55j95
$$ 195 24 -227 154 67 -125 -225 -63 -6 -192 5 -45 187 57 30 28 -71 100 -129 28 -190 165 -30
5470c0k27K3J68k81J77K15l00K15R8J51l98N45l50m2J03L8n7P7j71k7K16k78J42
$$ -30 -257 -234 -66 -347 -170 45 -255 -40 58 209 -189 356 6 -36 67 105 48 125 -46 -73 143 -135 7
5493GJ40k82N3K23p1m3J80k45r4L11k61p4J55o5K7N6M6j42O4J62m6l31K68q5J73
$$ 7 147 -135 -82 141 70 27 207 -38 -132 179 -82 -156 -1 -66 -39 17 63 -79 -15 147 101 -230 38 -47 126
5518A26ok11k35K52K30m20L82jk36j03L69l33M25k82j18p6K3K22J59j33l33K95
$$ 126 120 -91 -326 -74 156 -264 118 117 -119 -222 147 -186 239 -43 -161 -237 -214 8 167 34 -299 -4
5540dJ09k26K47J58k91J12j69J56K5J79k97K13l88Q8O3P3k16J52L96m94L42j64
$$ -4 105 -121 126 284 -7 105 -64 92 117 296 -1 212 -176 -88 -25 48 -168 -16 380 -114 228 64
5562F4l24L26j98K19L4o3q1j19K14q6j24J68J88o08N27j19q6J62P2k21K48l34
$$ 64 -260 66 -132 87 121 58 -23 -142 72 -14 -138 30 218 -390 137 18 -68 94 166 -55 193 -141
5584a41k5K05j50P3p7P6OK4K15j76j48K9j04J22K55k22o4K53m63K58J35l30no
$$ -141 -166 39 -111 -38 -115 -39 -33 -9 206 30 -118 -89 -193 -71 184 -38 -102 151 -312 -54 81 -249 -254 -260
5608b60P1J7J65Kl7J39l13K68k11J41p4R9N9m07K47J26j65J81J82m72L01k9k23
$$ -260 -189 -172 -7 -5 -42 97 -216 52 -159 -18 -92 7 66 -341 -94 32 -133 48 230 -242 59 30 -193
5631a93J68J4J95l2j87J06P6k59P7K96k67O2Q0k03m0L8J36j88J95j46j11J48J21
$$ -193 -25 -11 184 152 -35 71 147 -112 -35 261 -6 56 136 -67 -107 -69 67 -121 74 -72 -183 -35 86
5654H6p2M1L5j42m1m7J77p7k3J37j01J79r6k80P1J88j62L49j61p8J91k23J53j27
$$ 86 14 55 90 -52 -93 -140 37 -40 -63 74 -27 152 56 -224 -153 35 -127 222 61 -17 174 -49 104 -23
5678b3q7k34K46L19m20J39M7J02jq7k23L34K27m04k4q9J53K5K37m50J62J30k54
$$ -23 -110 -344 -98 221 -199 -60 -13 89 88 1 -222 112 339 -65 -89 -178 -25 0 237 -213 -51 79 -175
5701a75J12O1R3m7j9k4m8J63k10J17J75j33p3L04m55O5k1J93l47K77J0k54J57
$$ -175 -63 -2 91 44 25 1 -47 116 -94 23 198 65 -8 296 -159 -94 -115 78 -269 8 18 -236 -79
5724g9K03k61J01J88k56J57q6R0r7J99j50kJ23j40j29K20j97M8L12l7l39J77P8
$$ -79 124 -137 -36 152 -104 53 -33 57 -40 159 9 7 130 -10 -139 81 -116 -68 244 207 -132 45 123
5747A23j50J00j83j55K59j17nJ06n7n0K50j51j39J94j29J18JJ47k92J23J27o4
$$ 123 -27 73 -110 -265 -6 -123 -128 -22 -79 -129 121 -30 -169 25 -104 14 15 162 -130 -7 120 56
5769E6j78K23l15L67pl25J00J47k22K01j07m14M58jK40k86N3n6J2RN6j54J90j32
$$ 56 -122 101 -214 153 146 -179 -79 68 -154 47 -60 -474 -16 -17 223 -63 -10 -66 -54 -45 11 -143 47 -85
5793h5J37K92j95j82K55k70J5M65p11K56J33p7j74J60N7M1l2n8J33k75L74j74
$$ -85 52 344 149 -33 222 -48 -33 432 -279 -23 110 33 -141 19 76 117 85 27 160 -115 259 85
5815H5J2j7m33J58O78n34K9L6j27L41l17O1J26l1%r9j50K21l80L35K98n11L32
$$ 85 97 80 -353 -195 483 -51 -22 14 -113 228 -89 -28 98 67 67 -32 -182 39 -341 -6 292 -219 113
5838A13P2k14K08k11j41K95l60K51Lj56l3L3J44Q3o5nJ91j21Nj76l2J71r5J27
$$ 113 185 -29 179 -32 -173 122 -238 13 16 -140 -173 -140 4 87 22 17 208 87 92 -84 -116 55 -40 87
5862H7j18k58K13J14j77j1N3J60L1l2j2j07O5J36k28J6J31j25O0Q9l35K84j15
$$ 87 -31 -289 -76 38 -139 -150 -97 63 94 62 50 -57 8 144 -84 -68 63 -62 -2 87 -248 36 -79
5885g9L6O3M5j96r3M16k82M93n25P6Oj05Q3j26L23l12J24M06m88J4K75k34o6L29
$$ -79 -43 20 65 -131 -224 192 -90 403 -122 -46 -40 -145 -62 -188 135 -177 -53 353 -135 -121 154 -80 -146 183
5909A83k61R9R2j11j15L13k57r3K01l73K80r6L71l77pK55k83K68j90o7Q0L42m6
$$ 183 -78 21 113 2 -113 200 -57 -150 51 -322 -42 -138 233 -144 -151 104 -179 89 -101 -168 -88 254 208
5932B08l10j0J53o7N4j32K58k72J59J10M7j60l4J97k68P6j2Pj16K48j81J88j14
$$ 208 -102 -112 41 -26 28 -104 154 -118 41 151 198 38 4 201 -67 9 -3 4 -112 136 -45 143 29
5955B9k22J69L41k75k1J11j93L56n18J95k9j56J32J8K21k47RL4L8J56j68k12L49
$$ 29 -193 -24 317 42 21 132 -61 295 -223 -28 -57 -213 -81 -63 158 -89 -80 -46 -8 148 -20 -232 117
5978A17q3N2j25j56J27j23j5L21r6J94l44K08j10J24m6O7qj37j43J74r9R4q2J9
$$ 117 34 86 -39 -195 -68 -191 -206 115 19 213 -131 77 -33 91 45 112 104 -33 -176 -2 -101 -7 -89 -70
6002g0j93OK21J3j93L10j3k82M70l94J53R6m04K68j5q4K72r2j65N8j12K61l4j35
$$ -70 -263 -257 -36 -23 -216 94 81 -201 269 -125 28 124 -280 -12 -27 -111 161 69 -96 -38 -150 111 77 -58
6026e8J54j53J49k55J33L1Lj77K97j65K11k08K8n8O9J63l52K11j95J40N8k30J72
$$ -58 96 -57 92 -163 -30 1 4 -173 124 -41 170 -38 -10 -68 1 164 -188 23 -172 -32 26 -204 -32
6049c2R5J34l58K81L8o0k10J56k64J91JN0k4l6P4l15L58j93q1K79k7k6J3lo4k8
$$ -32 63 197 -161 120 158 98 -112 44 -220 -29 -28 22 -2 -38 36 -279 79 -114 -195 84 57 31 44 41 -23 -51
6075e1J21k51J00Q5m18M49j86o6J56N9P8Nl6l50Q5K11%P4k77L73j99m0L2J30l26
$$ -51 70 -181 -81 4 -414 35 -151 -217 -61 -2 76 81 45 -305 -220 -9 -9 65 -212 161 -38 -78 -46 84 -242
6100b42J55M1P1K31l24K42P4k54n7j13l1K64L76o11K12R0p6J54j96j30lK2J70
$$ -242 -87 -46 25 256 -68 174 248 -6 -63 -176 -207 57 433 -178 34 124 48 202 6 -124 -127 -105 65
6123F5K1l36J72J12j80J35L0L0j58N9K28j82r1J66n6l4k5j03M4L2M4j01J7j7K81
$$ 65 86 -250 -78 34 -146 -11 19 49 -109 -50 178 -4 -95 71 15 -19 -44 -147 -103 -71 -27 -128 -111 -128 153
6148A53m1j37p0j19J62K07%k58q5K87J9j84P7j02O3K04j17j53K10k01K12j36l87
$$ 153 112 -25 -95 -214 -52 155 155 -103 -188 99 118 -66 11 -91 -28 176 59 -94 116 -85 127 -9 -396
6171c96L04K44k50J38l0Rj9j45L19J96p79M23O8o9P9m4k7K47l51K0Ok05M70J41
$$ -396 -92 152 -98 40 10 19 0 -145 174 370 -409 14 82 13 92 48 21 268 -83 -63 -57 -262 208 349
6195C49n63K30o5o6K73M3j12j73J29J49l55K54j64k51L88J05k26Q5j42j00K75
$$ 349 -214 16 -49 -115 158 201 89 -84 45 194 -161 93 -71 -322 66 171 -55 30 -112 -212 63
6216F3j61J25N0o6J52k13J1L2J5RJ7k71P5J43p1L19k21m8J30j4J18m5l92L92j10
$$ 63 -98 27 77 11 163 -50 -39 -7 8 17 34 -237 -162 -19 -90 229 8 -40 90 76 194 149 -243 149 39
6241C9N2o6o3j25K34j79J78j05j01L76j29j18K3j19J07J04k43K96J3j2r3k27J41
$$ 39 91 25 -38 -163 71 -108 70 -35 -136 240 111 -7 16 -103 4 108 -135 161 174 162 69 -158 -17
6264a7K76k64R2M6k19J8k50M06l01J35K50l50J27K20k96j7K33k62L40J1n22L79
$$ -17 259 -5 87 133 -86 -68 -318 88 -213 -78 172 -178 -51 169 -127 -144 89 -173 167 178 -344 35
6286C5K09n81M52m15K87J84k38L08l26J4J76l11L05l72J35L02L9j97J00k29r3
$$ 35 244 -337 115 -300 -13 171 -67 241 -85 -71 105 -206 99 -273 -138 164 203 6 106 -123 -216
6307b16J68J16k5n02K43J95j73k1L42J53l25J42k67M58k81j94M17m04J01P5k58
$$ -216 -48 68 43 -459 -216 -21 -194 -215 127 280 -45 97 -170 288 7 -187 230 -174 -73 2 -256
6328b56L93m19K76R0j75K38j41J12l15K62p0J29j73l2K36k63P2Pl68N15j6q7J30
$$ -256 137 -282 -6 84 -91 147 6 118 -197 65 -5 124 -49 -81 155 -108 -36 -29 -397 118 102 15 145
6351A45o1j58L56k72j20R9Q1r0l97L54L12l82K60j3j00J34p4k39J45K18l86K99
$$ 145 84 -74 282 10 -110 -11 70 -20 -417 -63 249 -133 127 114 14 148 74 -165 -20 198 -188 111
6373A11k81J16K6J62P0q5k73K6K75m7%ll94L76r6O8K14k43lj70J89k0o8p0n8K5
$$ 111 -170 -54 -28 134 204 119 -154 -128 147 100 100 97 -297 79 -17 51 265 22 19 -151 38 18 -50 -120 -178 -153
6399a53l9L50k49J12n0K11k54J90j70O3K54k31n4J8j85K78J11j22k77K15p2m3
$$ -153 -192 158 -91 21 -29 182 -72 118 -52 11 265 34 -20 -2 -187 91 202 80 -197 18 -54 -97
6421i7K25k5k07O2JM2M8N4k96L48rK2o0p4lJ6j49K24l29O4K04o3l4o9K35k38l1
$$ -97 128 103 -104 -42 -41 1 49 103 -193 155 146 168 108 34 31 47 -102 122 -207 -143 61 -2 -36 -105 130 -108 -139
6448a39L1M33n40J76L19k76q6j99K43N4n3p6J68j62j12K80L6o0r2Q3j32j29L60
$$ -139 -108 325 -215 -39 280 4 -82 -281 -38 16 -37 -113 55 -107 -219 61 97 37 -55 28 -104 -233 127
6471A27k71K26J13l16lJ8O2M7k3j86K37J05j21j59J19J56p5j04J51j82pJ07K6
$$ 127 -144 82 195 -121 -124 -106 -44 3 -20 -206 31 136 15 -144 -25 131 56 -48 103 -79 -86 21 47
6494D7l5J17m01M29j32o3J06M5q9N9j77K44r3L1L8O3o5k48L6JL13l27O1K44j08
$$ 47 12 129 -272 157 25 -38 68 113 24 83 -94 150 57 88 126 189 124 -124 -88 -87 226 -101 -40 204 96
6519I6N1j99j40J07K34j77N3J02m16N54m03M24k80l6J59l34L05k0j58J36k60j5
$$ 96 147 -52 -192 -85 149 -28 25 127 -289 265 -138 286 6 -30 129 -205 100 80 -78 58 -202 -217
6541b17J59J08k8J81l56K79j38j43M1N2M6K70j39k00L5N0K37k40k9N0n1J95n4
$$ -217 -58 50 22 203 -153 126 -12 -155 -114 -62 -16 254 115 -85 -50 0 237 -3 -32 18 -33 162 108
6564A08j00j33K16n7M4k56Q4k6j17J35L51n04M51j82j79J74j83K40j91M3K61k54
$$ 108 8 -125 91 34 78 -178 -94 -120 -237 -102 249 -255 196 14 -165 9 -174 66 -125 -82 179 -75
6586g5O4j56L7J62N1l60L35J6J2J00l20k19K46Q9K4o5k8K59j61l18M11j95J42
$$ -75 -11 -167 -130 32 83 -277 58 74 86 186 -134 -353 -107 -18 6 -59 -87 172 11 -307 104 -91 51
6609E1J69m31M28m03N9J75J17l13J67k36M10l30J32pr8j8K95j28j11j90K32J16
$$ 51 220 -211 217 -186 -127 48 165 -148 19 -217 193 -137 -5 -12 -110 -128 167 39 -72 -262 -30 86
6631H6j90J11J95k59M7k7J01m7J17J5j44j9K58p9m1p5J32j69J75l16J00J40l0
$$ 86 -104 7 202 -57 -10 -37 64 17 134 149 5 -14 244 165 124 49 181 12 187 -129 -29 111 81
6654H1k00P6m3l2j91K2J66J86K9k46L20P1k48r4J22q9K76j42n9j32K93j72L30
$$ 81 -119 -43 -86 -118 -309 -287 -121 65 94 -152 168 239 -9 -103 19 -70 206 64 5 -127 166 -6 324
6677C24j95j1pj02jJ70m14J02L21l54J60k19o1K77J82j08O7J3q6MK92j27l49J40
$$ 324 129 118 111 9 8 178 -236 -134 187 -167 -7 -226 -287 -10 172 64 131 144 58 62 354 227 -122 18
6701A8p2n3J25L9q9j52M19k27k3L6P4l13K97j34J1N0k16L41j98K12N0j70P3k2
$$ 18 -54 -107 18 57 -32 -184 235 8 -15 21 95 -218 79 -55 -44 6 -210 131 -67 145 195 25 98 76
6725G6k01j18L75k32L29j78j45l7n8K97k79J6K84k18j23J82J18K9k6j8j66J40
$$ 76 -125 -243 132 -100 229 51 -94 -131 -189 108 -171 -155 129 -89 -212 -30 88 117 91 73 -93 47
6747D7K11p8M4k02o1Q6J24j18j96J86n7n3M5J04k30K36k3j14j17J59j88J60M8
$$ 47 258 180 224 22 -39 47 171 53 -143 43 -14 -67 -22 82 -148 88 65 -49 -166 -7 -195 -35 13
6770A3J4k7L49l25k01M37l25j42K58l02J52j00q4L83l15J16Q3P8N6n0OJ33l36
$$ 13 27 0 349 24 -177 260 -65 -207 51 -251 -99 -199 -283 100 -215 -99 -16 62 118 68 74 207 -129
6793a29L50j74m7K83k68l1K83l06L19l56P2k2K92l48R8m0P6j33r6PP6Q1Pj57Q0
$$ -129 221 47 0 283 15 -16 267 -39 280 -76 -4 -26 266 -82 16 -24 52 -81 -177 -170 -94 -13 -6 -163 -83
6818h3L35Pl37J32k4k3K8J81mj98j70K03r6N4j32j42L42j73N2L58l87R5n2n5L85
$$ -83 252 259 -78 54 30 7 35 216 212 14 -156 47 -49 5 -127 -269 73 -100 -48 310 -77 18 -34 -89 296
6843B96j58M5j66n0RJ45j39L0J87k21J34j33j11k67M80j3k00Q7j43P6J27P6m36
$$ 296 138 183 17 -33 -24 121 -18 12 199 -22 112 -21 -132 -399 81 68 -132 -45 -188 -112 15 91 -345
6866c45K52J71k1J83j35l59K68P0j3k0M2j6r3K03o2j60J40K5l88MJ95J21j24m4
$$ -345 -93 78 57 240 105 -254 14 84 71 51 93 77 -16 187 125 -35 105 130 -258 -254 -59 62 -62 -106
6890a06J05O3n6J7J07R9j84J77j19j72N7r0J05n6r7K44k7J0J00l22K92n6k99L77
$$ -106 -1 62 6 23 130 229 45 222 103 -69 -12 -102 3 -53 -150 94 67 77 177 -145 147 91 -208 169
6914A69k92J02J63l78N10m51P6L99j39k30M4jk21J94k77K04L1J3K36o9l18K16
$$ 169 -123 -21 142 -236 274 -177 -101 298 159 -71 -27 -28 -249 -55 -332 -128 -97 -84 152 83 -235 -19
6936a9O6j24M6R1N0J36k10P0k15kK68m44M24J81l00l08N6K71k16J29j33K38j59
$$ -19 47 -77 -31 60 110 246 36 106 -109 -111 157 -287 137 318 18 -290 -234 37 -179 -50 -183 55 -104
6959a04J43n6MJk38L38j00K29l41K46l77M75j24l0K9k64K8J5J58Lj17J88j20j48
$$ -104 39 -17 -13 -12 -250 88 -12 217 -124 122 -255 220 96 66 95 -169 -141 -126 32 35 -82 106 -14 -162
6983a62KQ8M0K19k84l0Q6r2l8K54j3j78J50L2j04J46j91J54R7n8j04N6k95J50
$$ -162 -160 -72 -32 187 -97 -127 -41 -133 -171 83 70 -108 42 74 -30 116 -75 79 176 118 14 70 -225 -75
7007g5J17m6lJ17n5r6j02P4J69J9k12J2Q8k63L95n7k80L58j16r8M23l39K02r9
$$ -75 42 -4 -7 110 55 -41 -143 -69 100 119 -93 -81 7 -256 139 82 -198 160 44 -54 369 30 232 133
7031A33l06J48L7k15K11p7j80J56K39R1m01J99k52L93J16l39K8j09n5j12M11k25
$$ 133 -173 -25 12 -203 8 -69 -249 -93 146 237 -164 35 -217 176 292 -47 -19 -128 -183 -295 116 -109
7053a09K23J71k97j48L26l33J11j31Q9p3R1J95q6PK9J2p7K23l93K2K97n21L13
$$ -109 114 285 -12 -160 166 -167 -56 -187 -98 -171 -80 115 29 36 65 77 0 223 -170 -148 149 -372 -59
7076e9J81K9J45m20K95j32j0o4K16j85N2L6k32J7J89j06K40k77L1J79o7K5q0j03
$$ -59 122 151 296 -124 171 39 29 -35 181 -4 48 84 -148 -131 58 -48 192 -85 -54 125 58 83 3 -100
7100a00J59j87j31M04k53J36Q0m31J26J50M8Q5N1M6N3j94N5j31K2P9j7j06j73
$$ -100 59 -128 -259 145 -108 28 108 -323 -197 -47 1 86 137 183 236 42 97 -34 -12 67 50 -56 -229
7123b29J88r2J51J73l20K33j36q9J45j04N8L36k15p2MNk7K5jj79J31k20J64P4
$$ -229 -41 -133 18 191 -129 104 -32 -121 24 -80 -22 314 99 27 31 36 9 34 33 -146 -15 -235 -71 3
7147CM7k82L77k37J30k72K29J61j57j50K39K48m42K75k40J01m2m9R2j85R3L6P9
$$ 3 50 -232 145 -92 38 -234 -5 156 -1 -151 88 336 -106 169 -71 30 -12 -61 31 -154 -61 -25 54
7170E4j51J15m1J90j63p1j01J59J32n9j88N7M4m6J07M9k20J70l4q3K13l12J31
$$ 54 -97 18 -23 167 4 -67 -168 -9 123 64 -124 -67 -23 -69 38 87 -133 37 3 -80 133 -179 -48
7193d8K58m90K95k76K90J66J93l67l2Mo3j16k3K44L28N91j160p8j38M57j41J34
$$ -48 210 -280 15 -261 29 195 388 21 -11 -7 -70 -186 -209 35 363 954 -206 -284 -422 35 -106 28
7215B8j2K06k99M7K42j17j26k1J22j84rK02q1L14l59Q3l51L34q5j20K18K14j07
$$ 28 16 222 -77 -30 212 95 -31 -52 70 -114 -123 79 -2 312 -47 36 -315 19 -66 -186 32 246 139
7238A39k96R5L23k67j49J77L0J04j90J11j02M0p0K20l1K43k42j68J08j16J57l02
$$ 139 -157 -62 261 -6 -155 22 52 156 -34 77 -25 15 -55 165 134 377 135 -33 75 -41 116 -186
7260a86r7Q5J24J44P9j46J77j89NO8o9O3j70R1j26K3J94n6j64J20k2J83q5J2M7
$$ -186 -283 -198 -74 70 149 3 180 -9 -4 64 -5 58 -112 -21 -147 -124 70 14 -150 -30 -52 131 46 58 105
7285A05o2M0o5p9q6K46k2p6K30k41j76L35k30J62m3o7K2o6K01p9o1J68k24o2N1
$$ 105 43 83 18 -61 -147 99 77 1 231 -10 -186 149 -81 81 38 -29 -7 -73 128 49 -12 156 -68 -130 -79
7310g9P8K08m47L05K3k15K58m9p2l0K27k75L16l49K98k78L6N5k68J8N0O8L2Q6
$$ -79 -1 207 -240 65 88 -127 131 82 10 -20 207 -68 248 -101 197 -81 -45 10 -258 -240 -190 -122 -90 -4
7334dn0k0n7n5J08Qk7L3q7J12K8J35k0j36K58m48M64l07J49j42l0K80l41k9P0
$$ -4 -54 -74 -131 -186 -78 -70 -97 -64 -151 -39 -11 124 104 -32 226 -222 242 -65 84 -58 -88 192 -149 -178 -108
7359a08q5L29l87K01J87J40k81J15j21Mj47J05M6k15K13j20P0J44j17J67j05r3
$$ -108 -193 136 -251 -50 137 277 -4 111 -10 -6 -153 -48 -2 -217 -4 -124 -54 90 -27 140 35 -58
7381e8N9J0j16kL05k84l3j30K22p3m8Q8J09Q7j61k5RN7m6k79L44Q7p6j43j37l1
$$ -58 1 11 -105 -107 198 -86 -119 -249 -27 -100 -148 -60 49 136 -25 -50 -41 16 -30 -309 35 122 46 -97 -234 -265
7407b65J78q6J10J25L0p3j10J99L1j25l3J34l1j30Q2j15O7m3j78K04l02L00O2
$$ -265 -87 -173 -63 62 92 19 -91 108 139 14 -19 115 84 -46 36 -79 -12 -55 -233 -29 -331 -31 31
7430C1r8L2J18l30K20J52j54J15n1r7pO7K06J8k54q7K24l8l02L51k60N5q9J05
$$ 31 -67 -35 83 -247 -27 125 -29 86 35 -62 -69 -2 204 222 -32 -119 105 67 -235 116 -144 -89 -178 -73
7454g3NO1j45P3j31M00k74K75k14j4j61K0K31kj31j1J67r5J3J08p7n8O0q5O7j58
$$ -73 -68 -7 -152 -79 -210 190 -84 191 -23 -37 -198 -178 53 51 -80 -91 76 -19 -6 102 25 -33 27 -58 9 -149
7480a49K11J19r5k9N5j15j72J21J01J69n6k44L1k26J35K15Mqj48O3p1M7P9j56
$$ -149 62 181 86 57 112 -3 -175 -54 47 216 160 -84 -53 -279 -144 71 75 67 -81 -18 -89 -42 37 -119
7504a19n4Q8q5J13o7P8M1Q1m2m3j17L92j0j94P0l41J27m4K74j70k4Q5K8k18K93
$$ -119 -173 -85 -170 -57 -124 -46 -5 76 34 -9 -126 266 256 62 132 -209 -82 -126 148 -22 -46 39 67 -151 142
7529A42K7j33j80N13l46N4r1QJ8K14k44j77J00Q4J9J29j06l56M77j85j90K56N2
$$ 142 169 36 -144 369 23 77 -14 -6 12 226 -18 -195 -95 -11 8 137 31 -325 152 -33 -223 33 85
7552H5j97K27k54l3M8K33j06n8k10N03j20m08N6J49L17O9j48k51J44j28J57j42
$$ 85 -112 115 -139 -172 -124 109 3 -55 -265 238 118 -290 -234 -85 232 301 153 -98 46 -82 75 -67
7574f7N5K13k56m4K4J06j18K13j96J00J96q3o1k6r4J0K63l10O4j05J86J30j04
$$ -67 -12 201 -55 -99 -75 31 -87 126 -70 30 226 143 82 56 -38 -28 235 -75 -11 -116 70 200 96
7597I6n3j98rK28K1J24K4k53R7j73L8m9mM0L87k46p7K16k17j38P9J01M2r6j73
$$ 96 43 -155 -164 64 85 209 233 -20 77 -96 -58 -107 -111 -71 316 70 -7 209 -8 -146 -67 34 76 -20 -193
7622a93K01Q7k36L65j16p6r3K4J1j28J75o8N4m1J88j7j02k78P5K72q3k13J17n4
$$ -193 8 95 -141 224 108 32 -61 -37 -26 -154 21 -47 7 -34 154 137 35 -243 -168 104 21 -192 -75 -129
7646a29J03J45l1J08m60M55P5k59j1LL59k25l23J55L41m43L06k35L86j14j81j9
$$ -129 -26 119 88 196 -264 191 266 7 -4 -1 358 133 -190 -35 306 -137 169 -66 320 206 25 6
7668Fq7J4J75P1k95M2J03j79K39J30r1L1k17j28J18Q0Ok40J33L77l97K38j02N1
$$ 6 -81 -67 108 179 -116 -74 29 -150 89 219 128 159 -58 -186 -68 12 18 -222 -89 288 -109 129 27 78
7692G8j45J32R8Q1l22K21J40l97L09k99R2N6op7J55j25j80K19O1r1J42k02L00
$$ 78 -67 65 163 244 -78 143 283 -114 195 -104 -12 44 38 -39 116 -9 -189 30 91 0 142 -60 240
7715B40r4j30Q9l76J32K73k29J19j98K21N8k23J78l4Q7j23L4j05p5j00K21Q4p8
$$ 240 146 16 105 -271 -139 134 -95 24 -174 47 105 -118 60 26 113 -10 24 -81 -156 -256 -35 49 -29
7738b9PJ83m98M75J17n9j13j97J49k9r5J64k09L99j16l31J56L60k78J5L7q1J6
$$ -29 -22 161 -337 138 255 196 83 -114 35 6 -89 75 -134 265 149 -182 -26 334 56 71 108 27 43
7761D3M6j52N8K57l50K1K75j95J0O7J5k70K9O1nn3J47o9K25L9Rk32m5l1L8J68
$$ 43 89 -63 -5 252 -98 -77 198 3 13 80 95 -175 -146 -85 -90 -143 4 -65 160 199 208 -24 -69 -100 -62 106
7787A06l76J94q6J5J70K7j75r4O98n97P9K51k42j18J79n3K21j78P1j8j08O9j08
$$ 106 -270 -76 -162 -147 23 50 -125 -219 479 -118 -39 212 -30 -148 31 -22 199 21 92 74 -34 35 -73
7810g3K65k10m9J19n0J22j45j45N6J16j21o5J70p3J37J4Pr4J06O9k78J35j00l3
$$ -73 192 -18 -67 52 2 124 -21 -166 -110 6 -115 -180 -10 -83 54 68 75 -19 87 156 -122 13 -87 -120
7834a20J32Q5j65Q5J26k83L21l70K57j28R6q4Q4k24P4K2L2J26o8j70J68K78l90
$$ -120 12 97 -68 17 143 -140 181 -189 68 -60 36 -48 36 -188 -114 -92 -60 66 -2 -172 -4 274 -116
7857a16R1q7J72nj38J37O3j47J54k34J40o1j01L34J67m86J32m0N2n0L8J33k65
$$ -116 -25 -112 60 55 -83 54 117 -30 124 -110 30 -31 -132 202 369 -117 15 -25 27 -23 15 148 -117
7880a17R3J15m7k9k55J07J7j6J60Pm9Q1J34l24n8J00nq8n0L51j07RR4l4P5jk40
$$ -117 -24 91 44 15 -240 -133 -116 -132 28 35 -14 67 201 -123 -181 -81 -86 -174 -224 127 20 29 123 89 164 163 -77
7907g7J32j69J80k80L63k56q2K58l66J17L4J36o7J27M0r9q1J81j71j51K65j37
$$ -77 55 -114 66 -214 149 -107 -189 69 -297 -180 -146 -10 -77 50 90 -9 -90 91 -80 -231 34 -103
7929a03JJ9k6j05L49Jk4L2j79k6K11k29L5k90K92P5P6k06J87j81J11j60K10n3
$$ -103 -102 -83 -109 -214 135 136 112 144 -35 -61 150 -79 -44 -334 -42 33 109 -97 90 -91 20 -140 70 17
7953A7j41mK99l20j0K18k04Q7k5Q8J32j62J14k8J58l47o1L94j11j71n8j2K19k40
$$ 17 -124 -128 171 -149 -159 59 -145 -58 -83 5 137 -25 89 61 219 -128 -189 205 94 -77 -135 -147 72 -168
7977a68R8J33J9j04L9J67k15l4Q3k3j69K41q9r4M6K61l83K94k33j33L54j39K32
$$ -168 -70 63 82 -22 17 184 -31 -65 18 -5 -174 67 -22 -116 -70 191 -192 102 -131 -264 90 -49 183
8000A83k37R4J31k65J08J60j60p6o4K27j73qO7L37l71KK38k27L46l00m9J08m0
$$ 183 -54 40 171 -94 14 174 14 -62 -126 101 -72 -80 -13 324 -47 -45 193 -34 312 12 -37 71 31
8023C1L4k7m2J61j24J04J6k78M35m23p5J56O5j14R2P2o4k6p5L4j23L47j51j89
$$ 31 65 38 -4 157 33 137 153 -125 310 -113 -188 -32 33 -81 11 83 19 -7 -82 -48 -171 176 25 -164
8047a64K29j15LL87l39R7m6l8jJ22l68L37k1r8k7J02p0J75j33Q0j96l2J64j85
$$ -164 65 -50 -47 340 1 98 52 14 13 135 -233 104 83 -15 -42 60 -10 165 32 112 -84 -116 48 -137
8071a37L2J56rOJ66k74j04J62r2kj02L77k81m3J70m5k05L66q3k32K21j78K8K03
$$ -137 -105 51 42 48 214 -60 -164 -2 -94 -96 -198 179 -102 -145 25 -20 -225 141 58 -174 47 -131 -103 100
8095A00j61J21K37j52j94L5K67k22Q3j7L5m6J08j71k44K45R7j45J7p5N16m49J82
$$ 100 -61 60 297 145 -49 -14 253 31 114 97 132 86 194 23 -221 24 121 -24 -7 -82 434 -15 167
8118A67j61O6j6n8j29L71l33J19j76J51RL5k82J43Q6r9Q7J28j13J60l01P3o3j63
$$ 167 6 72 56 -2 -131 240 -93 26 -150 1 10 45 -237 -94 -8 -107 -20 108 -5 155 -146 -73 -136 -299
8142b99M22K7j3m06K13K3J29m8lL4j2k92O4J28K41k25m7J19j04m4J27R9j85l6
$$ -299 123 150 137 -269 -56 -33 96 48 45 79 67 -225 -161 -33 208 -17 -64 55 -49 -93 34 133 -52 -88
8166h8j01K97pj41K04j42N4j12J19j19O3J61k83j4J78r7J73k16r0M86j51j65M5
$$ -88 -189 108 101 -40 164 22 76 -36 83 -36 27 188 -95 -109 69 -28 145 -71 -161 325 174 9 54
8189E4k52K07
$$ 54 -198 9
8191I
$$ Imaginary data points
##PAGE= N=2
##DATA TABLE= (X++(I..I)), XYDATA
0@%%%%%%qJ6j6K4l2L2m0O0q2J02j28J60j92K30k74L24l88M61n41O32p33Q45r71
$$ 0 0 0 0 0 0 0 -8 8 -8 16 -16 16 -24 36 -46 56 -72 88 -104 126 -148 176 -212 249 -292 340 -393 452 -519
29e19J115j280J461j658J876k115K381k676K998l351L738m160M620n123N671o271
$$ -519 596 -684 777 -881 995 -1120 1261 -1415 1583 -1768 1970 -2190 2430 -2693 2978 -3293
45c293O928p647Q432r287J0227j1262J2403j3670J5083j6662J8439k0457K2770
$$ -3293 3635 -4012 4420 -4867 5360 -5902 6501 -7169 7914 -8748 9691 -10766 12004
58A2004k5456K8619l2400L7016m2797N0263o0311P4608r6615J34941k19418O94979
$$ 12004 -13452 15167 -17233 19783 -23014 27249 -33062 41546 -55069 79872 -139546 555433
70E55433j03021j208273R47897o95582Q17267M82547j364541L84118N8508L6829
$$ 555433 452412 -755861 192036 -503546 313721 796268 -568273 -184155 -125647 -88818
80h8818Q53619j106415O2206L94271m59068J029904n73931p75683J040733n95056
$$ -88818 764801 -341614 -279408 114863 -344205 685699 111768 -663915 376818 -218238
90b18238L64134M39134j390481Q09575M10126p61221P44089o38680k00057R56651
$$ -218238 145896 585030 -805451 4124 414250 -346971 397118 -241562 -441619 515032
100E15032n74194J16748o7497m46354R16150l58894k42916L23534p81231Q31415
$$ 515032 -59162 57586 -9911 -456265 459885 100991 -141925 181609 -599622 231793
110B31793L14822j060698O18541k62028j46985J029589q93379j88457N79453n03872
$$ 231793 546615 -514083 104458 -157570 -304555 725034 -168345 -356802 222651 -281221
120b81221O01193m0018o73775M28057j86114K84206K38905p74009L74076N464
$$ -281221 319972 279954 -393821 34236 -151878 132328 371233 -402776 -28700 -23236
130b3236j29348O94638p66718j23303O88289n39740M00028O4020p57964O29653
$$ -23236 -152584 542054 -224664 -347967 340322 -199418 200610 264630 -493334 136319
140A36319P365k69611L73437m80384R3047L40794k67017J95996k65673m307M42230
$$ 136319 143684 -125927 247510 -232874 -139827 200967 -66050 129946 -135727 -140034 302196
151C02196m36198J82365R8817m70086N69398j24259m12902N17701l33904m6013
$$ 302196 -134002 48363 147180 -322906 246492 122233 -290669 227032 -106872 -152885
161a52885M37877m31352Q0503J37369j85745K93410j73965j17739J73338j23579
$$ -152885 284992 -146360 -65857 71512 -114233 179177 5212 -112527 60811 -62768
171f2768K34836j58196k44619L84980k15452Q668K64845m72371K11006K59497
$$ -62768 172068 13872 -230747 154233 -61219 -52551 212294 -260077 -49071 210426
181B10426l68934K44962l5262k41348L16791o0555j03452M7096r5000J39410n0107
$$ 210426 -158508 86454 51192 -190156 126635 66080 -37372 9724 -85276 54134 4027
192D027m2414Q7178j88254J69221O2151k39513K59507q2566j97157L30449j39876
$$ 4027 -38387 48791 -139463 29758 91909 -147604 111903 29337 -167820 162629 22753
203B2753j17377K09543j86152K7385J46821j55599J2752M5520J104j3116l7608
$$ 22753 -94624 114919 -71233 -43848 102973 -52626 -39874 5646 6750 -6366 -43974
214d3974J18465p6573n6579J57504j34220K8647J28368k31388J00144J22175k18660
$$ -43974 74491 -2082 -58661 98843 -35377 -6730 121638 -109750 -9606 112569 -106091
225a06091J10054N7452j47438J03544J3209o9711O7921Q190n3292m323Q2040l4343
$$ -106091 3963 61415 -86023 17521 30730 -38981 28940 37130 -16162 -20485 61555 27212
237B7212r7672J25419l0863j26289J54278l4198r9144J37059p9922m6421J66407
$$ 27212 -70460 54959 24096 -102193 52085 17887 -81257 55802 -24120 -70541 95866
248I5866q2814q1385J09587j5768m6577M5431j6674n4935N1073K3128q6559N2829
$$ 95866 13052 -68333 41254 25486 -21091 24340 7666 -47269 3804 26932 -59627 -6798
260f798M7490j17255P1405Q4100j36656M2210Q3370j00147L8359M1861j03669
$$ -6798 40692 -76563 -5158 78942 -57714 -15504 67866 -32281 6078 47939 -55730
271e5730N1566O0613j10419J1313R1143p2183k3142Q8647m6546k6170Q4408n4560
$$ -55730 -4164 56449 -53970 -42657 48486 -23697 -46839 41808 -4738 -30908 53500 -1060
283a060k8691R5173o5432m7854J05126n3645p1357J02155j5451p3815O9455m899
$$ -1060 -29751 65422 -10 -47864 57262 3617 -67740 34415 18964 -54851 14604 9705
295I705m4826Q3580k1992q4312R4265K4799j00385M9005K8812q3299M7069L2535
$$ 9705 -35121 48459 26467 -57845 36420 61219 -39166 9839 38651 -44648 2421 34956
307C4956q2215M2026L5782q2356N2935O2898j00264J5364Q3913p1428j0495O5089
$$ 34956 -47259 -5233 30549 -51807 1128 64026 -36238 -20874 63039 -8389 -18884 46205
319D6205n9346j0992N5625o4594j949Q5243p2302m2986J03216k5629m7130P3761
$$ 46205 -13141 -24133 31492 -33102 -35051 50192 -22110 -65096 38120 12491 -34639 39122
331C9122l6552m1441Q3943l2383m8269O8292m0397n2605Q5894j945p6889L9478
$$ 39122 2570 -38871 45072 12689 -35580 32712 -7685 -60290 25604 23659 -53230 -13752
343a3752L1622m1297L5188J8351o6699M8683L9855r6245M5795N8434j08205K6948
$$ -13752 17870 -23427 11761 30112 -36587 12096 51951 -44294 1501 59935 -48270 -21322
355b1322N6418p4550L9003K6793p1996M4096L8011n0671J4763L9682m0458l0017
$$ -21322 35096 -39454 -451 26342 -45654 -1558 36453 -14218 545 40227 -231 -30248
367c0248O9308o050p5028N3700q397m7701R3084n1834o3844J19369m7447m4959
$$ -30248 39060 33010 -42018 11682 3285 -44416 48668 -3166 -67010 52359 4912 -40047
379d0047R8471n4907k7523N7329l3054M987J0755l1911n188K2251L0388o8787
$$ -40047 58424 3517 -24006 33323 269 5256 16011 -15900 -21088 1163 31551 -37236
391c7236n256R9458p6512o881Q3813r8751M7284O0510j27664P4319L5646j10939
$$ -37236 -42492 56966 -19546 -26427 57386 -41365 5919 66429 -61235 13084 48730 -62209
403f2209O8685J0817m9648L3545k2278J6644J2229j5336K2856m3092M4884K6386
$$ -62209 6476 17293 -32355 1190 -21088 -4444 7785 -7551 15305 -27787 17097 43483
415D3483r6404Q4752o069j02201J29184m3086q2752J15092p1354L771R5522j18793
$$ 43483 -52921 31831 25762 -76439 52745 9659 -73093 41999 -29355 -25584 69938 -48855
427d8855J8121P7575l6448J2987m6331J0480M4496m2131M5927n7186m2995J20533
$$ -48855 -30734 46841 10393 23380 -22951 -12471 32025 -10106 35821 -21365 -64360 56173
439E6173q0744J0228R4268j69038N9845J23709j13057N2361l1677q1754J44573
$$ 56173 -24571 -14343 79925 -89113 -29268 94441 -18616 33745 2068 -79686 64887
450F4887j7682o5946R073m7787P9118J1427m9103L3509q1167O0180Q6632j17948
$$ 64887 47205 -18741 -9668 -57455 21663 33090 -16013 17496 -63671 -3491 83141 -34807
462c4807N7026j4452p9589J64044p3422r7923J29935q1653N103Q2790j12445M2350
$$ -34807 22219 7767 -71822 92222 18800 -79123 50812 -30841 -25738 57052 -55393 -13043
474a3043L4206m3897N7338n0570N459L1630m4483R0769p5499q7260J52234n2634
$$ -13043 21163 -22734 34604 -15966 -10507 21123 -23360 67409 -8090 -95350 56884 4250
486D250j4941N4806j61988J00799J18738j31869M0167l7383m1781J57936m2103
$$ 4250 -10691 44115 -117873 -17074 101664 -30205 9962 -27421 -69202 88734 46631
497D6631o3804m380m7397J14927R923p2578P373q5175R9839R6660j38624M0292
$$ 46631 -17173 -21553 -68950 45977 55900 -16678 -9305 -94480 5359 102019 -36605 3687
509C687k1108n8519J83074n5832j05165O9338p0783P2409Q3358j47093m830L7442
$$ 3687 -17421 -75940 107134 51302 -53863 15475 -55308 17101 100459 -46634 -51464 -14022
521a4022K7870M9179j04445P571N8941k6039O2598q2403l9260J40578q2308j9562
$$ -14022 13848 63027 -41418 -33847 25094 -945 61653 -20750 -60010 80568 -1740 -21302
533b1302O2941j15752P5668O3938j04404M0418l1725j0145J20480n5295n4790
$$ -21302 41639 -74113 1555 65493 -38911 1507 -30218 -40363 80117 24822 -29968
544b9968k7L448J01095l7745p2423J1506l6446J03295K9887j35390M3313q697
$$ -29968 -29995 -26547 74548 36803 -35620 -24114 -60560 42735 72622 -62768 -19455 -28152
556b8152j1003J46167q7208j03747P8770P947M7367m915j04597K7640L7387J8082
$$ -28152 -39155 107012 19804 -83943 -5173 2774 50141 45226 -59371 -31731 5656 23738
568B3738j558o9482L6153J2878k4878O9307m8947l1225O5214m8079L4469K8586
$$ 23738 22180 -47302 -11149 1729 -23149 46158 -2789 -34014 31200 -16879 17590 46176
580D6176j01457N4262M2065o3646K2285j4691k341M9260l1815j8217K816K5416
$$ 46176 -55281 -1019 41046 -22600 -315 -15006 -17347 31913 98 -18119 -15303 10113
592A0113L8071n4286n369J7598k8944P1156j4222r5527M9608J5206J661M2836
$$ 10113 48184 -6102 -11471 6127 -22817 48339 34117 -61410 -11802 3404 5065 47901
604D7901q2440k0410Q2768J810j2061j9979k1419K2837J7091J8862l3599m5713
$$ 47901 -34539 -54949 27819 29629 17568 -2411 -23830 -993 16098 34960 1361 -44352
616d4352L7481O372J3465J9409q4265J0720Q2634k5977q832j5143k7704O3509
$$ -44352 -6871 -499 12966 32375 -51890 -41170 41464 15487 6655 -8488 -36192 27317
628B7317R089n2538J438Q075O095L212l869r455j7781L7953J0824m2928K7529
$$ 27317 36406 -16132 -14694 -6619 -524 2688 -1181 -10636 -28417 9536 20360 -22568 4961
641D961J516j9757M8276l1553l9385N3653m253k3048P937j8121R973K1633o477
$$ 4961 6477 -13280 34996 3443 -35942 17711 13458 -9590 -1653 -19774 -9801 11832 5355
654E355j1354o426J4776N145R203P769m8905O549N2251k8021p985N69l6698M4004
$$ 5355 -5999 -12425 2351 7496 16699 24468 -24437 -17888 34363 6342 -1643 -1074 -37772 6232
668F232K7670m9253K635J5407q083J7810J0612j7878k0741J3536K0434j0708j213
$$ 6232 33902 -15351 -12716 2691 -5392 12418 23030 5152 -15589 -2053 18381 7673 6460
681F460j9033j6362M6049m258l4183K7055j0601r763L8906j6166j6401J9490j5712
$$ 6460 -12573 -28935 17114 12856 -21327 5728 -4873 -14636 24270 8104 -8297 11193 -4519
694d519l08K3527j5475k6687J4358K2317k1391q633K2078j1497L920J4534k6368
$$ -4519 -4827 18700 3225 -23462 -9104 13213 -8178 -16811 5267 -6230 -2310 12224 -14144
707a4144J6653K2371l6663N864J8819k2206P144O659j9160P723P647j0095R562
$$ -14144 2509 24880 -11783 -5919 12900 -9306 -2162 4497 -14663 -6940 707 -9388 174
720A74J1482k1408l656L6440p631k9644J9135J764j4507J9985j3319j9448K6381
$$ 174 11656 -9752 -13408 23032 15401 -14243 4892 6656 -7851 12134 -1185 -20633 5748
733E748m947j4282K3314n520j7752K0255Q116j3606L284p51p197J5107l274k6682
$$ 5748 801 -13481 9833 4313 -13439 6816 14932 1326 4610 3859 -3338 11769 8495 -18187
747a8187J6275J5373k8065O726K1342k0598K591J6709j4589P655J2481k6033K615
$$ -18187 -1912 13461 -14604 -7878 13464 -7134 -4543 12166 -2423 5232 17713 -8320 -5705
760e705K3531j9088j0314J7605j1694q724J8300l279o479R188j1538L261K8664
$$ -5705 17826 -1262 -11576 6029 -5665 -14389 3911 632 -5847 3341 -8197 -4936 23728
773B3728j7527k4346K3694L986j7316J1675m898j7000J7210K508j4737J7893K
$$ 23728 6201 -18145 5549 9535 -7781 3894 -1004 -18004 -794 1714 -13023 4870 4872
786D872k3410J9726J7499k0975R51R015j4065O728Q141j8215P030P517k4605J2743
$$ 4872 -18538 1188 18687 -2288 -1337 7678 -6387 341 8482 -9733 -2703 4814 -19791 -7048
800g048K6671k3560q423J9048n421M364J1791k0947n039K0035r099r604J6862
$$ -7048 19623 -3937 -12360 6688 1267 5631 17422 -3525 -8564 11471 2372 -7232 9630
813I630j1787j9417K5641P280j8951J1047j869q914K4498p881j7380K0975q550
$$ 9630 -2157 -21574 4067 11347 -7604 3443 1574 -7340 17158 9277 -8103 12872 4322
826D322j7545K0094J677j6905J618L544k142Q854N596j8853M149K3524k1416K47
$$ 4322 -13223 6871 8548 -8357 -6739 -3195 -5337 3517 9113 -9740 -5591 17933 -3483 -3236
840c236K6573l2454o069K9763j8727J604N019k6891K1713J9804k4593k831J2074
$$ -3236 23337 -9117 -15186 14577 -4150 -2546 2473 -24418 -2705 17099 -7494 -10325 1749
853A749M329m215L7N834j5579P823R125k4799K0052J370l4634L6019L363l2787
$$ 1749 6078 1863 1900 7734 -7845 -22 9103 -15696 4356 5726 -28908 7111 10474 -22313
867b2313L2540o252j5654K6374j5286J20J4384k0321J011P279M966p556k0350
$$ -22313 10227 3975 -11679 14695 -591 -471 13913 -6408 -5397 1882 6848 -708 -21058
880b1058K7343j126k0928L2462k0312p702L8072l9377J0386L8925n4050M313K8420
$$ -21058 6285 5159 -15769 16693 -3619 -11321 26751 -12626 -2240 36685 -17365 -13052 15368
893A5368j8724J2983j6095j3311K6312l439M390j0612p268K8436k5465R646K8804
$$ 15368 -3356 9627 -6468 -19779 6533 3094 7484 -3128 -10396 18040 -7425 2221 31025
906C1025n2187J7607J7926l6134M4089j7427m3232N2456j4230j1211L1792l1112
$$ 31025 -21162 -3555 14371 -21763 22326 4899 -38333 14123 -107 -11318 20474 -10638
918a0638M135J2366o644K0544k5883j240J3506k2916L4648j8852l2863N9404l3552
$$ -10638 -6503 5863 -781 19763 -6120 -7360 6146 -16770 17878 -974 -33837 25567 -7985
931g985k2122N8770l5825M479K2080n0103L8226K0622l8030J1174j5158R344J7769
$$ -7985 -30107 28663 -7162 -2683 19397 -30706 7520 28142 -9888 1286 -13872 -4528 13241
944A3241k4285K0838j9584j5828M5950k4921J3027J5536o5966M6194L0717m7230
$$ 13241 -11044 9794 -9790 -25618 20332 -4589 8438 23974 -41992 4202 34919 -12311
956a2311L2421l0347k5892O4614k0141j4785P991k7346L0356J0199p890K685l6314
$$ -12311 20110 -10237 -36129 28485 8344 -6441 1550 -25796 4560 14759 6869 9554 -26760
969b6760L6868J5939m4770L9721j9578l0731N5046l5942k867M2951n5062J2764
$$ -26760 10108 26047 -18723 20998 1420 -29311 25735 -10207 -13074 29877 -25185 -12421
981a2421L1442k7381K1306j2063j1247K4107j8026J1385l236j5735K6944l4039
$$ -12421 19021 -8360 12946 883 -10364 13743 -4283 7102 3866 -11869 15075 -18964
993a8964M900M1809m7501J5639J7294m4552M7848L014l9616L5165k0592q632L5711
$$ -18964 -14064 27745 -19756 -4117 13177 -31375 16473 19487 -20129 15036 -5556 -14188 21523
1006B1523k1106n538m342k708K2823j8899J0845L732l3599L8965k646k0469M3883
$$ 21523 417 -5121 -9463 -12171 10652 -8247 2598 6330 -27269 11696 9050 -11419 32464
1019C2464m4903j8348O0682k3342q724L334k9899L3887J1770k2622K852r289J7479
$$ 32464 -12439 -30787 29895 6553 -2171 1163 -28736 5151 16921 -5701 -2849 -12138 5341
1032E341K496j0423K3320k8671n238L3632k7983J7070M093n0014M2488J3078l6497
$$ 5341 7837 -2586 20734 -7937 -13175 20457 -7526 9544 13637 -36377 6111 19189 -17308
1045a7308K5558j1332j1042K9269r114k631m725k462J6141j4862Q657m710k6914
$$ -17308 8250 -3082 -14124 15145 6031 3400 -1325 -3787 12354 -2508 6149 1439 -25475
1058b5475M3227r474l6585L9565j3951n243L0154l8022Q955K8347k8403R546K534
$$ -25475 17752 8278 -28307 11258 -2693 -7936 22218 -15804 -6849 21498 -6905 2641 5175
1071E175j3491P732m623J4328j0469j9983K5500r343J0159J5923n2911K5400L7633
$$ 5175 -8316 -584 -5207 9121 -1348 -21331 4169 -5174 4985 20908 -32003 -6603 31030
1084C1030l8832J4701o977k5181M2310p351k0494R896j4579J2602J3101n463m412
$$ 31030 -7802 6899 -78 -25259 17051 9700 -10794 -898 -15477 -2875 10226 4763 351
1097C51k2233K7923J7961l3021J8078j1670j7260M8001k6541k1473L4250k8116
$$ 351 -21882 6041 24002 -9019 9059 -2611 -19871 28130 1589 -19884 14366 -13750
1109a3750N696K7604k6552L349L835k465J7449j2602k990j078k40K1014k9018
$$ -13750 -8054 19550 -7002 -3653 182 -2283 15166 2564 -426 -1504 -1744 19270 -9748
1122i748l109L1150l1895J0150J7664l6643K9540Q869l3969K8356l089j7688K1053
$$ -9748 -12857 18293 -13602 -3452 14212 -22431 7109 15978 -17991 10365 7276 -10412 10641
1135A0641n817o633k746q15J2833j2666K510L463j8258K7507j989k3875L0665
$$ 10641 4824 -1809 -4555 -5370 7463 -5203 -2693 770 -17488 10019 8030 -15845 14820
1148A4820j6608j4222L8455k0985j2151J8134j9577R870J5622k2795k398J0089
$$ 14820 -1788 -16010 22445 1460 -10691 7443 -12134 -2264 13358 -9437 -11835 -1746
1160a746O903n381n338J4247j2464j482K1762k1510K327J4022k7718J7330J3764
$$ -1746 5157 -224 -5562 8685 -3779 -5261 16501 -5009 -2682 11340 -16378 952 14716
1173A4716l1953J3757J1129j5913J1808o08p389J0926j43p866J03J0970o015j4486
$$ 14716 -17237 -3480 7649 -8264 3544 2936 -4453 6473 6330 -1536 -1433 9537 3522 -10964
1187a0964J7265k067j8417K0808m149j4566K1511r582q253K3670j2813j1688J8599
$$ -10964 6301 4234 -14183 6625 2476 -12090 9421 -161 -8414 15256 2443 -9245 9354
1200I354l242r999N193r58l817M531q67r833R591Q543j7862P588J4288j9254N976
$$ 9354 6112 -3887 1306 348 -3469 1062 195 -9638 -47 8496 -9366 -1778 12510 -6744 -768
1215g68J3229j8197L682R297j5602P230P713j7860L924J5248j1385m253J3356
$$ -768 12461 -5736 -2054 7243 -8359 -1129 6584 -11276 -7352 7896 -3489 -7742 5614
1228E614m294n463J0032n309l851J2612j1227r570J9231n711j4043J4298j334
$$ 5614 1320 -4143 5889 580 -3271 9341 -1886 -11456 7775 2064 -11979 2319 985
1241I85j0908J3588N18r601J0867k372j0231J5319K671k0193O104J0755j1634
$$ 985 -9923 3665 4183 -5418 5449 3077 -7154 8165 10836 -9357 -3253 7502 -4132
1254d132K402M897j1110P289P538j3820Q221J0952j7734K108J6206j2053l173
$$ -4132 -1730 3167 -7943 -654 6884 -6936 1285 12237 -5497 -3389 12817 764 -2409
1267b409Q883j0569r06J1764r255m491J2528p779o911J8257k586j3856J1025L80
$$ -2409 6474 -4095 -5001 6763 -2492 -6983 5545 -2234 -9145 9112 6526 -7330 3695 4075
1281D075o821J1232p591j0490J4597n190q973J3075k724j1362R907N553p385K945
$$ 4075 -2746 8486 895 -9595 5002 -188 -9161 3914 1190 -10172 -265 5288 -2097 848
1295H48L641r386N776R042j7646K942J5618k0017N42J7273j4441J250Q599j1791
$$ 848 4489 -4897 879 9921 -7725 -4783 10835 -9182 -8640 8633 -5808 -4558 4041 -7750
1309g750Q918P639j2189J396O269k541k633L400j687r482R464L555j2809J1198
$$ -7750 1168 8807 -3382 -1986 4283 1742 -891 2509 822 -8660 804 4359 -8450 2748
1323B748k541j1793K4143p039j8042K1887n344q800J4385r576n233P065l149J676
$$ 2748 207 -11586 12557 5518 -12524 9363 4019 -4781 9604 28 -5205 1860 -1289 387
1337C87l47m07n072M82J9551j3421j2075K1501j0755L14J3699k5090Q932J4733
$$ 387 40 -367 -5439 -4957 14594 1173 -10902 10599 -156 158 13857 -11233 -2301 12432
1351A2432k3723J0312P304j5156Q344K91N6L366n303N523l996K021O222j8133
$$ 12432 -11291 -979 6325 -8831 -487 -196 -140 3226 -2077 3446 -550 1471 7693 -10440
1365a0440J3883O429k6008J8264P69j6190K4444j3361j1704K2662j1458L730J1186
$$ -10440 3443 9872 -16136 2128 2897 -13293 11151 -2210 -13914 8748 -2710 1020 12206
1378A2206j9211k31P863J0320k252k5409R294Q061q60J6771k8854p698L5240j5742
$$ 12206 -7005 -7236 627 10947 8695 -16714 -7420 641 -219 16552 -12302 -20000 15240 -502
1392e02M482J0170l1540J4409J4062r182R777k0703p815K1958K454Q81j9245m306
$$ -502 3980 14150 -17390 -2981 11081 1899 11676 -9027 -16842 5116 7570 8451 -10794 -15100
1406a5100K6522q867L303N39k4831K8425M274k5626K1463j4434p940K9412k0720
$$ -15100 11422 2555 5858 6397 -18434 9991 14265 -11361 10102 -4332 -12272 17140 -3580
1419c580p301J3351n015J2326j0100j0090J4493j990J1697j2233k1614L0017o402
$$ -3580 -10881 2470 -2545 9781 -319 -10409 4084 2094 13791 1558 -20056 9961 3559
1432C559p236J8457l3833N178K8437j8592J3913r952k5675L3139P539p120p918
$$ 3559 -3677 14780 -19053 -13875 14562 -4030 9883 -69 -25744 7395 14934 7814 -104
1445a04k2794K4321J2917j1098O72k7933J5731K7746k5913J2227q586k2102M3703
$$ -104 -22898 1423 14340 3242 3914 -24019 -8288 19458 -6455 5772 -2814 -24916 18787
1458A8787p218k0604J7625k1803J1590J9729k5497O347l876j978J8249j8287P502
$$ 18787 11569 -9035 8590 -13213 -1623 18106 -7391 -1044 -4920 -6898 11351 -6936 566
1471E66K406j7605L1068j2195j8127K8664k1403P751J7925m0953K0516J6211k3615
$$ 566 2972 -14633 16435 4240 -13887 14777 -6626 1125 19050 -21903 -1387 14824 -8791
1484h791J5859j7080j080K9779k0107K141j908j0428L0597j6362p209J5041l1074
$$ -8791 7068 -10012 -11092 18687 -1420 721 -1187 -11615 18982 2620 -4589 10452 -20622
1497b0622K6303J3697l7459K3809j1033j0805M1513k8397q657K1028k0595K1793
$$ -20622 5681 19378 -18081 5728 -5305 -16110 25403 -2994 -11651 9377 -11218 10575
1509A0575mk1925J7922j6600J0143J6531l3369J7468j230j3861L5893k9422q277
$$ 10575 10571 -11354 6568 -10032 111 16642 -16727 741 -489 -14350 21543 -7879 -16156
1522a6156L6446l0224J1673J0433l0737L2013q149k2287K7315j6831M451J0042
$$ -16156 20290 -9934 1739 12172 -18565 13448 5299 -16988 10327 -6504 -2053 7989
1534G989k4195K3133p221r717K8510k8623O496J8396l1087L0323m080l3595L6068
$$ 7989 -16206 6927 -294 -10011 18499 -10124 -3628 14768 -16319 14004 9924 -23671 12397
1547A2397j3066p416K4584l2194J1702J4681k0897K3258j3097j0680K3005j8661
$$ 12397 -669 -8085 16499 -15695 -3993 10688 -10209 13049 -48 -10728 12277 -6384
1559f384J5713M75l1508L1967o444j4005K6219l0962Q073K5789l3783J9365N256
$$ -6384 9329 9804 -21704 10263 3819 -10186 16033 -14929 -6856 18933 -14850 4515 9771
1572I771k3245K4786j1729l629J7757k4903J1680N804j6131J8465j6635R58K2437
$$ 9771 -13474 11312 -417 -4046 13711 -11192 488 6292 -9839 8626 -8009 -7051 15386
1585A5386k9590J3860J1476k4654K5817r992j6787K9409j8369k442J5936k2244
$$ 15386 -14204 -344 11132 -13522 12295 2303 -14484 14925 -3444 -5886 10050 -12194
$$ [...]
8191A05
##END NTUPLES=NMR FID
##END=
