##TITLE=1H_LR-721-P3
 CDCl3, 8 sc, 
 29.9.2020
##JCAMPDX= 6.0         $$ Bruker NMR JCAMP-DX V2.0
##DATA TYPE= NMR FID
##DATA CLASS= NTUPLES
##ORIGIN= UXNMR, Bruker Analytische Messtechnik GmbH
##OWNER= root
$$ XWIN-NMR		Version 3.5
$$ Tue Sep 29 11:25:01 2020 Russian Standard Time (UT+4h)  she@DPX200
##.OBSERVE FREQUENCY= 200.1315066352
##.OBSERVE NUCLEUS= ^1H
##.DELAY= (6, 6)
##.ACQUISITION MODE= SIMULTANEOUS
##.ACQUISITION SCHEME= undefined
##.AVERAGES= 8
##.DIGITISER RES= 18
##SPECTROMETER/DATA SYSTEM= spect
##.PULSE SEQUENCE= zg30
##.SOLVENT NAME= CDCl3
##.SHIFT REFERENCE= (INTERNAL, CDCl3, 0, 15.7039)
##AUDIT TRAIL= $$ (NUMBER, WHEN, WHO, WHERE, WHAT)
$$ ##TITLE= Audit trail, XWIN-NMR		Version 3.5
$$ ##JCAMPDX= 5.01
$$ ##ORIGIN= Bruker BioSpin GmbH
$$ ##OWNER= she
$$ F:/spectra/data/she/nmr/H-F/1/audita.txt
$$ ##AUDIT TRAIL=  $$ (NUMBER, WHEN, WHO, WHERE, WHAT)
(   1,<2020-09-29 11:23:59.43 +0400>,<she>,<DPX200>,
      <created by zg, POWCHK disabled, PULCHK disabled
       configuration hash MD5:
       00 E9 B6 7A A2 85 ED C7 34 08 36 98 17 FE 4E 26
       data hash MD5: 16K
       FC 3C A3 18 20 A4 20 A7 D8 40 EE 3C B6 B5 6F CE>)
$$ ##END=
$$ 
$$ hash MD5
$$ 5D 21 20 82 D7 13 A2 49 2E 74 5C 07 3D 64 1B 2F
##$RELAX= 
##$RELAX= 
##$RELAX= 
##$RELAX= 
##$RELAX= 
##$RELAX= 
$$ Bruker specific parameters
$$ --------------------------
##$DU= <F:/spectra>
##$EXPNO= 1
##$NAME= <H-F>
##$PROCNO= 1
##$TYPE= <nmr>
##$USER= <she>
##$AMP= (0..31)
100 100 100 100 100 100 100 100 100 100 100 100 100 100 100 100 100 100 
100 100 100 100 100 100 100 100 100 100 100 100 100 100 
##$AQSEQ= 0
##$AQ_mod= 1
##$AUNM= <au_zg>
##$AUTOPOS= <>
##$BF1= 200.13
##$BF2= 200.13
##$BF3= 200.13
##$BF4= 200.13
##$BF5= 200.13
##$BF6= 200.13
##$BF7= 200.13
##$BF8= 200.13
##$BYTORDA= 1
##$CFDGTYP= 0
##$CFRGTYP= 5
##$CHEMSTR= <none>
##$CNST= (0..31)
1 1 145 1 1 1 1 1 1 1 1 1 1 1 1 1 1 1 1 1 1 1 1 1 1 1 1 1 1 1 1 1 
##$CPDPRG= <>
##$CPDPRG1= <>
##$CPDPRG2= <>
##$CPDPRG3= <>
##$CPDPRG4= <mlev>
##$CPDPRG5= <mlev>
##$CPDPRG6= <mlev>
##$CPDPRG7= <mlev>
##$CPDPRG8= <mlev>
##$CPDPRGB= <>
##$CPDPRGT= <>
##$D= (0..31)
0 1.2 0 0 0 0 0 0 0 0.06 0 0.03 0 0 0 0 0.0002 0 0 0 0 0 0 0 0 0 0 0 0 
0 0 0 
##$DATE= 1601364238
##$DBL= (0..7)
120 120 120 120 120 120 120 120 
##$DBP= (0..7)
150 150 150 150 150 150 150 150 
##$DBP07= 0
##$DBPNAM0= <>
##$DBPNAM1= <>
##$DBPNAM2= <>
##$DBPNAM3= <>
##$DBPNAM4= <>
##$DBPNAM5= <>
##$DBPNAM6= <>
##$DBPNAM7= <>
##$DBPOAL= (0..7)
0.5 0.5 0.5 0.5 0.5 0.5 0.5 0.5 
##$DBPOFFS= (0..7)
0 0 0 0 0 0 0 0 
##$DE= 6
##$DECBNUC= <off>
##$DECIM= 32
##$DECNUC= <off>
##$DECSTAT= 4
##$DIGMOD= 1
##$DIGTYP= 9
##$DL= (0..7)
0 120 120 120 120 120 120 120 
##$DP= (0..7)
150 150 150 150 150 150 150 150 
##$DP07= 0
##$DPNAME0= <>
##$DPNAME1= <>
##$DPNAME2= <>
##$DPNAME3= <>
##$DPNAME4= <>
##$DPNAME5= <>
##$DPNAME6= <>
##$DPNAME7= <>
##$DPOAL= (0..7)
0.5 0.5 0.5 0.5 0.5 0.5 0.5 0.5 
##$DPOFFS= (0..7)
0 0 0 0 0 0 0 0 
##$DQDMODE= 0
##$DR= 18
##$DS= 0
##$DSLIST= <SSSSSSSSSSSSSSS>
$$ [...]
##$SUBNAM2= <"">
##$SUBNAM3= <"">
##$SUBNAM4= <"">
##$SUBNAM5= <"">
##$SUBNAM6= <"">
##$SUBNAM7= <"">
##$SUBNAM8= <"">
##$SUBNAM9= <"">
##$SW= 16.880792210976
##$SWIBOX= (0..15)
0 0 2 0 0 0 0 0 0 0 0 0 0 0 0 0 
##$SW_h= 3378.37837837838
##$TD= 16384
##$TD0= 1
##$TE= 0
##$TE2= 300
##$TE3= 300
##$TEG= 300
##$TL= (0..7)
0 120 120 120 120 120 120 120 
##$TP= (0..7)
150 150 150 150 150 150 150 150 
##$TP07= 0
##$TPNAME0= <>
##$TPNAME1= <>
##$TPNAME2= <>
##$TPNAME3= <>
##$TPNAME4= <>
##$TPNAME5= <>
##$TPNAME6= <>
##$TPNAME7= <>
##$TPOAL= (0..7)
0.5 0.5 0.5 0.5 0.5 0.5 0.5 0.5 
##$TPOFFS= (0..7)
0 0 0 0 0 0 0 0 
##$TUNHIN= 0
##$TUNHOUT= 0
##$TUNXOUT= 0
##$USERA1= <user>
##$USERA2= <user>
##$USERA3= <user>
##$USERA4= <user>
##$USERA5= <user>
##$V9= 5
##$VALIST= <valist>
##$VCLIST= <CCCCCCCCCCCCCCC>
##$VD= 0
##$VDLIST= <DDDDDDDDDDDDDDD>
##$VPLIST= <PPPPPPPPPPPPPPP>
##$VTLIST= <TTTTTTTTTTTTTTT>
##$WBST= 1024
##$WBSW= 4
##$XGAIN= (0..3)
0 0 0 0 
##$XL= 0
##$YL= 0
##$YMAX_a= 457821
##$YMIN_a= -416404
##$ZGOPTNS= <>
##$ZL1= 120
##$ZL2= 120
##$ZL3= 120
##$ZL4= 120
##$ABSF1= 10
##$ABSF2= 0
##$ABSG= 5
##$ABSL= 3
##$ALPHA= 0
##$AQORDER= 0
##$ASSFAC= 0
##$ASSFACI= 0
##$ASSFACX= 0
##$ASSWID= 0
##$AUNMP= <proc_1d>
##$AZFE= 0.1
##$AZFW= 0.1
##$BCFW= 1
##$BC_mod= 2
##$BYTORDP= 1
##$COROFFS= 0
##$CY= 11.3945322036743
##$DATMOD= 1
##$DC= 2
##$DFILT= <>
##$DTYPP= 0
##$F1P= 16.9975609425685
##$F2P= -3.02152046262296
##$FCOR= 0.5
##$FTSIZE= 0
##$FT_mod= 4
##$GAMMA= 1
##$GB= 0.15
##$INTBC= 1
##$INTSCL= 1
##$ISEN= 128
##$LB= 0.24
##$LEV0= 0
##$LPBIN= 0
##$MAXI= 10000
##$MC2= 0
##$MEAN= 0
##$ME_mod= 0
##$MI= 1.114404
##$NCOEF= 0
##$NC_proc= 0
##$NLEV= 6
##$NOISF1= 3.799351
##$NOISF2= 2.8
##$NSP= 1
##$NTH_PI= 0
##$NZP= 0
##$OFFSET= 15.70392
##$PC= 1
##$PHC0= -9967.973
##$PHC1= 9.400891
##$PH_mod= 1
##$PKNL= yes
##$PPARMOD= 0
##$PSCAL= 0
##$PSIGN= 0
##$REVERSE= no
##$SF= 200.130013532006
##$SI= 16384
##$SIGF1= 3
##$SIGF2= 2
##$SINO= 400
##$SIOLD= 16384
##$SREGLST= <1H.CDCl3>
##$SSB= 0
##$STSI= 0
##$STSR= 0
##$SW_p= 3612.71676300578
##$SYMM= 0
##$S_DEV= 0
##$TDeff= 0
##$TDoff= 0
##$TI= <>
##$TILT= no
##$TM1= 0
##$TM2= 0
##$TOPLEV= 0
##$USERP1= <user>
##$USERP2= <user>
##$USERP3= <user>
##$USERP4= <user>
##$USERP5= <user>
##$WDW= 1
##$XDIM= 8192
##$YMAX_p= 0
##$YMIN_p= 0
$$ End of Bruker specific parameters
$$ ---------------------------------
##NTUPLES= NMR FID
##VAR_NAME=  TIME,          FID/REAL,        FID/IMAG
##SYMBOL=    X,             R,               I
##VAR_TYPE=  INDEPENDENT,   DEPENDENT,       DEPENDENT
##VAR_FORM=  AFFN,          ASDF,            ASDF
##VAR_DIM=   8192,          8192,            8192
##UNITS=     SECONDS,       ARBITRARY UNITS, ARBITRARY UNITS
##FACTOR=    0.000296,      1,               1
##FIRST=     0,             0,               0
##LAST=      2.424536,      0,               0
##MIN=       0,             -416404,         0
##MAX=       2.424536,      457821,          0
$$ Real data points
##PAGE= N=1
##DATA TABLE= (X++(R..R)), XYDATA
0@%%%%%%%%%%Qj6J6j6J6k4L2m0M9n7P2q8J05j27J51j78K09k42K79l22L72m28M90
33B61n59O33p15Q08r08J020j144J278j423J582j756J945k154K383k631K902l200
50a678L525l883M278m711N192n729O330p006P777q667R698j0916J2378j4169J6423
65H842j9353K3333k9063L8122p9417M36646l49470k0039J30103n08792O66550
76B97462M5388m48785K11836l51864J42171M40331n14898J11476o5959k02809
86c35651O60866k51145k72115L69018l84100L47258L23690o58110K11728L6832
96D8271k26020M98125l62069k75040L43541j96036K67362N4502m49298L39310
106D2648K084j4055L24619n02966M0258L40491l34440K67239j13567m48220M70563
$$ plain form
0 0 0 0 0 0 0 0 0 0 0 0 8 -8 8 -8 8 -16 16 -24 25 -32 40 -48 57 -70 81 -97 112 -130 149 -173 199 -229 261
33 261 -298 335 -380 428 -480 540 -604 674 -749 833 -923 1022 -1132 1251 -1380 1522 -1678
50 -1678 1847 -2036 2242 -2469 2723 -3006 3324 -3682 4095 -4572 5126 -5790 6588 -7581 8842
65 8842 -10511 12822 -16241 21881 -57536 379110 29640 9601 139704 -369088 297462
76 297462 342850 -105935 105901 -245963 -103792 336539 -178359 -66883 -132842 -335651
86 -335651 325215 74070 -198045 170973 -213127 134131 457821 -200289 11439 48271
96 48271 -177749 320376 -41693 -316733 26808 -169228 98134 152636 -296662 42648
106 42648 44732 30677 355296 -147670 -107412 233079 -101361 165878 52311 -395909 74654
117G4654n2903j40886K65543l86705J17924L45154k28921J52409j39471j74787
127a67989L91059j52400o0076O0649l63898K95930J38883l17616K11296j69705
137a33867o8526M48786k21634p1633J57400k27186K44667P9749k82585J06534
147C1705j14914P945K10401k43482K0218M6857j29477K97191o4782j78785K22888
158A05765j31836O5120J99761l00927M1400R5484j57443J60214r1515j52386J65878
169d85o4112M6692P0803j53510J34145K7838o1940J50059j49230l0950J52542
180A21852j60004M6378L1405j92000J36461K3376j03730J17168p0230k035J38603
191H7244o6262K6723J858o8656J03543m4133n7936L7332j10703N2340O5489j19592
$$ plain form
117 74654 21751 -119135 146408 -240297 -122373 222781 -6140 146269 6798 -167989
127 -167989 223070 70670 10594 71243 -292655 3275 142158 -175458 35838 -133867
137 -133867 -202393 246393 24759 -46874 110526 -116660 128007 207756 -74829 31705
147 31705 -83209 -75264 135137 -108345 -88127 -41270 -170747 126444 61662 -117123 105765
158 105765 -26071 39049 238810 -62117 -20717 74767 -82676 77538 -13977 -166363 -485
169 -485 -64597 -17905 52898 -100612 33533 61371 -569 149490 260 -30690 121852
180 121852 -38152 8226 39631 -152369 -15908 7468 -96262 20906 -49324 -51359 87244
191 87244 20982 47705 49563 -19093 84450 40317 -17619 19713 -90990 -38650 26839 -92753
203i2753O1494Q516n1454J36299k5503m8797P8490n2309K0344M6829q5163O46
215c361j7224k7926M9557m9262j2041L3090l0770P0999K1362n0440O5028r246
227C9766j7424O1176n9501k9842K8402n2528P103M870m7039K5261O989L004L6297
240F534p697K2399K2786j4875K7213j0983k8728J5936l4719j9548J2790l7532
252d6424J862J7986j7772K3748J7727J442L0232L154J154J3074j3130l641j0373
265A9039k5319m987j5967j3749P213o788M567J6905Q163K0307J3401L160J1356
278C7301j004m371m801j9804j1474j0113j7928j840r87o381J1577J4561Q492J6742
292I970J3409L548Q759M568j1728r553n620j8721j5187l093j1348n988J1183L968
$$ plain form
203 -92753 -31259 -22743 -74197 62102 36599 -12198 66292 13983 34327 81156 -4007 -3361
215 -3361 -20585 -48511 1046 -48216 -60257 -27167 -57937 13062 34424 -16016 49012 39766
227 39766 22342 83518 24017 -5825 22577 -29951 -22848 -17978 -65017 -39756 -32767 -29763 6534
240 6534 -1163 21236 44022 29147 56360 45377 16649 32585 -2134 -21682 -8892 -46424
252 -46424 -44562 -26576 -44348 -20600 -2873 -1431 28801 31955 33109 46183 33053 29412 19039
265 19039 -6280 -11267 -27234 -40983 -33770 -40558 -35991 -19086 -10923 9384 22785 25945 37301
278 37301 36297 31926 27125 7321 -4153 -14266 -32194 -34034 -35021 -41402 -29825 -15264 -6772 9970
292 9970 23379 26927 35686 40254 28526 18973 13353 -5368 -20555 -23648 -34996 -40984 -29801 -25833
306b5833O494K2731R687N017K0541M204j1250K710q121k1961n805j0473k2134
319c4193j99M068q355J2229K1252m34J2506K7195m102J554J6064k1907j2475P213
333B0416k8225j4712O645k2772m790J8803J379N052J6991J2831M586J3452J4785
346D4441j9259m381R980l6868k620J2476m7812L526K1865k8049K9967J8979k4833
359b2588L3834J8745n265J4272j3014o472o602q384O287m2636n762K4595l7350
372e0340L2786K1646n2609N9544K3362l9355N9105k0733l6520N1497l3955j7564
384c136Q853m5144J9471k431j2657K7468l9272M0974M5984n6559N7483j242n4353
397a4561R3579m6949o3600P0493o8770j659N6496q9021K2689K9088k4989O8128
$$ plain form
306 -25833 -19339 3392 13079 18096 38637 42841 31591 34301 26180 4219 -1586 -12059 -34193
319 -34193 -34392 -30324 -38679 -26450 -5198 -5632 6874 34069 29967 31521 47585 25678 13203 20416
333 20416 -7809 -22521 -15876 -38648 -43438 -24635 -23256 -18204 -1213 11618 16204 29656 44441
346 44441 25182 20801 30781 -6087 -8707 3769 -44043 -40517 -18652 -46701 -16734 2245 -22588
359 -22588 11246 29991 24726 38998 25984 19512 12910 4526 10813 -31823 -37585 -12990 -50340
372 -50340 -17554 4092 -48517 11027 34389 -4966 54139 33406 -3114 48383 14428 -3136
384 -3136 5717 -39427 -19956 -22387 -35044 -7576 -46848 -5874 40110 -16449 41034 39792 -14561
397 -14561 79018 32069 -31531 38962 -29808 -31467 25029 -63992 -41303 -12215 -37204 30924
409C0924l2504j0670N2934l9703O5443r224j00720Q0151l7176l4368R4544j28550
421f8919j4583J08995q0074O4237J9471j09766J08494K1150k8863N2108j01322
432b9072K5091N7073p2983N9399p7876o6016J42373p3947N798P7645j51295J05187
444A377R4691j22850R1402m9224p2424J54840p6923m4597L4702j02744J02444
455A0694J6021r6768Q2595p6092L7711J40381j50108M4597N0110j17985J63319
466A04475m1908j53175J32372p6791k581J13947j65398L2298O8054o0273J28425
477G9445p3788o6788J28043p4645P6157K7865k02562J23780J6363q9482J41812
488H6200j63144n4561J98595j02927M6121L6920j62515J54344L9509p3374Q0252
$$ plain form
409 30924 -1580 -12250 40684 981 66424 57200 -43520 36631 -545 -34913 59631 -68919
421 -68919 -83502 25493 -54581 9656 29127 -80639 27855 49005 20142 72250 -29072
432 -29072 -3981 53092 -19891 39508 -38368 -104384 37989 -35958 -30160 47485 -103810 1377
444 1377 96068 -26782 64620 15396 -57028 97812 20889 -23708 10994 -91750 10694
455 10694 26715 -70053 12542 -63550 -25839 114542 -35566 9031 59141 -58844 104475
466 104475 62567 -90608 41764 -35027 -37608 76339 -89059 -56761 11293 -48980 79445
477 79445 5657 -61131 66912 -7733 68424 96289 -106273 17507 33870 -55612 86200
488 86200 -76944 -131505 67090 -35837 10284 47204 -115311 39033 78542 5168 85420
499H5420j41571K2788J24392j22344O2401n7819j19881K05000n3979n8410J11058
510E7055j64547R2015J52368j62808O5710k2419r1361J82114p4208q3963N9826
521I782j07863J07555M6596j42533R1882m7978r61J73474j49102m304R4223j27424
533e6653J34755N657j81244J17162l7340k8831J25203j48883N39R3179o3704J09708
545F9548m6061r5269J34279n1010K3379N9268j82715P6457O4213j07479J05002
556D9612q7171q5580J73309n5244m596N9549j26784R2529O6825p8385N7322q7813
568b6427k3105J20380q2996J0601o729j13343J40118J7273q5894Q1488q4805K1828
580c1611J45016j06472m32K2431q0151J09268j3958r3152M7523o0951L7838P2844
$$ plain form
499 85420 -56151 -33363 91029 -31315 31086 -26733 -146614 58386 4407 -54003 57055
510 57055 -107492 -15477 136891 -25917 39793 17374 -73987 108127 33919 -50044 9782
521 9782 -98081 9474 56070 -86463 5419 -42559 -43520 129954 -19148 -23452 70771 -56653
533 -56653 78102 83759 -97485 19677 -17663 -46494 78709 -70174 -69635 23544 -40160 69548
545 69548 23487 -71782 62497 11487 34866 94134 -88581 -12124 52089 -55390 49612
556 49612 -37559 -123139 50170 -5074 -9670 49879 -76905 15624 82449 4064 61386 -26427
568 -26427 -49532 70848 -12148 -1547 -8276 -121619 18499 35772 -50122 31366 -53439 -31611
580 -31611 113405 6933 6501 28932 -51219 58049 44091 -49061 -1538 -62489 -24651 48193
592D8193j00664L6634O358l3736J25237n5371n5392P9689o9875M5206N0088j30659
604e4292L7493J6090m5163Q2584o1948m1640P9780k8601M4475J2106q1450O9728
616B9162N867k5059N0085q9871l826O9697o5389K9897n249p4541Q6726P945l1198
629a5754M8970n6414J8513O8055m9814J2470k1017m3270O9944k5203l3355K0211
641f664n6031M6400M7295n9058L0559o086j5107Q0569l3501l2665K8918m1459
653a6830L1811J5769o5502J7162j0091o815N3819l8544p933L3815j9699M5732
665C2694N953m9180L2688p779q948K8187n3341o384K5313k8104K4111n555k8068
678c8413M2793k505J223K8708l2398J4336K1736k9588J3960j5815k6031K7712
$$ plain form
592 48193 -52471 -15837 -9479 -43215 82022 26651 -28741 50948 -18927 26279 76367 -54292
604 -54292 -16799 -709 -45872 36712 -25236 -66876 12904 -15697 28778 40884 -40566 29162
616 29162 35029 9970 60055 -29816 -33642 36055 -29334 563 -4686 -79227 7499 15444 -15754
629 -15754 33216 -23198 -4685 63370 13556 26026 5009 -38261 31683 6480 -26875 -6664
641 -6664 -62695 -16295 31000 -28058 2501 -3585 -18692 61877 28376 -4289 24629 -16830
653 -16830 14981 30750 -34752 -17590 -27681 -34496 19323 -19221 -27154 6661 -13038 32694
665 32694 38647 -10533 22155 14376 5428 33615 -19726 -26110 -797 -28901 -4790 -10345 -38413
678 -38413 4380 1875 3098 31806 -592 13744 35480 5892 19852 4037 -21994 5718
690E718j8106j0211J3732k1976K2314J5766j5753K3385p240j254L0156k3048m189
703I294O388k7846J5576j190k9600J3476m537j887K2780j0112L878J4041k624
716G637J5028l545r992O043j4821J147K214k5155N409K164j1958J9392o07p133
730a4177K1724J742M91J2402o967m167J843n764o994r250k578l953n061Q935k108
745a3882j472J9097j09l04J7008m095m263R657j0630r834L828j0560j0224L925
759a1858k345o174R247P293k613J0486J0655m756O087O540j1956j052K913j6378
773c911n803M892j1660k614J0486n112J441J6383K32n96J3990j820p498R184m757
788A2837j5282L144l951j5134O508K118j2179J1390R717p386J3154J0703q933
$$ plain form
690 5718 -12388 -22599 -8867 -30843 -8529 7237 -8516 14869 7629 6375 36531 13483 9294
703 9294 15682 -12164 3412 2222 -27378 -13902 -18439 -20326 2454 -7658 -3780 10261 7637
716 7637 22665 19120 9128 15171 350 1497 3711 -21444 -16035 -13871 -25829 -6437 -7044 -14177
730 -14177 7547 9289 9780 22182 15215 11048 12891 7127 133 -9117 -11695 -15648 -20709 -11774 -13882
745 -13882 -15354 3743 3634 3330 20338 16243 11980 21637 11007 1173 5001 -5559 -15783 -11858
759 -11858 -14203 -20377 -11130 -3837 -6450 4036 14691 9935 16022 22562 10606 9554 12467 -3911
773 -3911 -9714 -4822 -16482 -19096 -8610 -13722 -12281 4102 4334 3738 17728 15908 8410 17594 12837
788 12837 -2445 699 -3252 -18386 -11878 -9760 -21939 -10549 -832 -8218 4936 15639 6706
801F706N606P231j1110k894K376j3422p960O662o992q640J4235o56o367K2605
815G380J886r150K0140l568j1648J4968j0581j4969P382q761r462L840N01k024
829a4066Q67J3144Q24j778K1853o879r588K2186j7559j0323K0884k8405r215J8844
843G89k0290N048J1290j5578J2879J1076K633N762o973J0599m000q304J7952k7455
857d572j1636K4081l0342P557K1560l9669K1284K2677k2907K7589k254j8978K6424
870B0814o976k949r30k3370J4448q798q161J9791l4664J2543L2516l4499K8594
883H359J0722l8449M5949k684l1514L2666k8185j0629K8312l0278M131L05j5776
896b7071L3854j4358m62K3170l0431L6527J4343n0315L7648j2329k9107N2435
$$ plain form
801 6706 12312 19543 8433 5539 7915 -5507 -13467 -6805 -13797 -22437 -8202 -8858 -15225 7380
815 7380 9266 116 20256 16688 5040 20008 9427 -5542 1840 -6921 -16383 -12543 -12042 -14066
829 -14066 -13199 -55 769 -1009 20844 13965 4377 26563 9004 -1319 19565 -8840 -18055 789
843 789 -19501 -14453 -3163 -18741 -5862 5214 7847 13609 6636 17235 13235 4931 22883 -4572
857 -4572 -16208 7873 -22469 -14912 6648 -33021 -11737 10940 -11967 15622 13368 -5610 20814
870 20814 13838 10889 9959 -13411 1037 -7761 -15922 3869 -30795 -18252 14264 -20235 8359
883 8359 19081 -19368 26581 23897 -7617 25049 -3136 -13765 14547 -15731 -11600 -11295 -27071
896 -27071 6783 -7575 -8037 15133 -15298 21229 35572 -14743 22905 10576 -18531 33904
908C3904m3884k3604M2529l5337J9906J8940m3978L1964O185k633L2587m0710
920d131O510K1696l2117L8844k5104n0387N4861k3654m940M3147o6907J7607N2811
933B8236l5742L2652j2184l9107N6201j0242j1193Q191n3285L1630J6738l3694
945b1799L2427m1522r192P2301l7762P523K2643o0595N7641K4088n6902K9006
957A7857l1539j1160N8783m4298j0138Q743k7461N9824o783l7276L7026k9838
969a6260K9468M4191p4750J6634J4554l6739O0131l4144n4121N3642k0598J4996
981b996L1267o4407K4249K8548j1545M1194m7279k4042N1519k3788K0657q774
993A4603p4921N4786J7941k7951L5993n6598k564P9200l0111N047j518m9096O1534
$$ plain form
908 33904 -9980 -33584 8945 -26392 -6486 12454 -31524 440 6625 3992 36579 -4131
920 -4131 2379 24075 -8042 30802 5698 -44689 10172 -13482 -18422 24725 -42182 -24575 28236
933 28236 -7506 25146 12962 -26145 30056 19814 8621 16812 -36473 -4843 11895 -21799
945 -21799 10628 -30894 -40086 32215 -5547 1976 24619 -35976 21665 45753 -11149 17857
957 17857 -13682 -24842 33941 -10357 -20495 -11752 -39213 20611 13828 -23448 13578 -16260
969 -16260 13208 57399 -17351 -717 13837 -22902 37229 3085 -51036 2606 -17992 -2996
981 -2996 28271 -36136 -11887 16661 5116 46310 -969 -25011 26508 2720 23377 14603
993 14603 -60318 -5532 12409 -15542 20451 -36147 -38711 40489 10378 15425 13907 -35189 26345
1006B6345J0925l8088J1590m9544J8761N1462m7087Q507j3380k6193Q2025j3421
1018B1902l5539L0010m1141L7856M7036p1461N084q20j8237O1814l7959m0073
1030d1528L3297j9016M1404J5403o2308L3152N975k907M9123n8512j7958M4105
1042B0230l1395K9657o664o5705M7430Q716j1267L3479n2970P016N3563k5323
1054F767K1406j9881m0762N8743q668j9747J3362n6014K9149M1873m3340J8259
1066A147j6093j6683O9696k0698j9646J9085l8145L8442K1479n2363J5345k0336
1078a8770o466N4087l9351j3776K0971k5112M8434Q075m6949K9012r083M139L7368
1091D2579n1426m907J9376k5600L4500j5175l8587L8661j0478O914K9300m4229
$$ plain form
1006 26345 37270 -818 10772 -38772 -20011 31451 -15636 -7129 -20509 -46702 35323 21902
1018 21902 -13637 16373 -24768 13088 60124 -11337 -6253 -7073 -25310 36504 -1455 -41528
1030 -41528 -8231 -27247 14157 29560 -32748 404 6379 3472 52595 -5917 -23875 20230
1042 20230 -11165 18492 11828 -53877 -6447 2269 -8998 24481 -28489 -21473 32090 6767
1054 6767 28173 8292 -32470 26273 17605 -2142 11220 -44794 -15645 26228 -17112 1147
1066 1147 -14946 -31629 38067 17369 -2277 16808 -21337 17105 38584 -13779 1566 -18770
1078 -18770 -25236 28851 -10500 -24276 -3305 -28417 20017 28092 -18857 10155 1072 5211 42579
1091 42579 -8847 -13754 5622 -19978 14522 -653 -39240 -579 -11057 -4143 25157 -19072
1103a9072J6587K4718k3074K8213k0129k6637L5058j8892k50R505l9671K5217
1115h427J3371k0181K6652k1936k495M2016k5084M988Q507l3310L0895K47l0316
1128a5073J8594j9746m13K7913k5202P077P247j3053L1872p417j3464J9283k0983
1141c365J1066J4433l5481J1660m99j8763K7971j3144j4076K3360j0848J0400
1153B714J3928j9673J1017J690n463J2751j9586k439Q002j7568J3367k542j8640
1166b2442K2141m199m583K2828j4158N57J6998j2999M340J058j3760N931n004
1179c292m257K063r291Q360J391m800J5266n736o94J7003j1048j07J0152j5700
1193f90K539M600j4669J848J536n787L500J853J399J925L926O362l410K750M978
$$ plain form
1103 -19072 -2485 22233 -841 27372 7243 -19394 15664 -3228 -3478 6027 -33644 -8427
1115 -8427 4944 -15237 11415 -10521 -13016 29000 3916 8904 17411 -15899 14996 15243 -15073
1128 -15073 3521 -16225 -16638 11275 -13927 -6850 397 -12656 19216 11799 -1665 17618 -3365
1141 -3365 7701 22134 -13347 -1687 -2186 -20949 7022 -6122 -20198 3162 -7686 2714
1153 2714 16642 -3031 7986 9676 4213 16964 -2622 -5061 2941 -14627 -1260 -3802 -22442
1166 -22442 -301 -4500 -9083 13745 -413 144 17142 4143 8483 9541 -4219 1712 -3292
1179 -3292 -7549 -5486 -14777 -6417 -5026 -9826 5440 -296 -990 16013 4965 4858 15010 -690
1193 -690 1849 6449 -8220 -6372 -4836 -10623 -7123 -5270 -3871 -1946 1980 8342 4932 7682 12660
1208A2660r732K518K633j4160K993K109j1301N593L305o861P657O230l478M505
1222D671N698l442j500L870m888o019L025m768p194O328k232n639R781J781l702
1237d230R497K116n034O896P83q160J915n8r555N96K130q109J320O958m202K381
1253d756R435l285J075R090m316l520O044o940o500N224n236p495N629q42m097
1268a0490P923K974l563P128N151n300M228M070r717j32L391j0983J77M182r943
1283a0904J950P470m737L374P475l028J642O470n32m526J436j187q190L404l03
1298a86j1919N442M103q522R978M074q514J0777L620o298P312k653p090K989j617
1313A496l989m420J68J203m646P480J943p510J3588J475q417J3836n025r315J3114
$$ plain form
1208 12660 2928 5446 8079 -6081 -3088 -979 -12280 -6687 -3382 -10243 -2586 3644 166 4671
1222 4671 10369 6927 5427 9297 4409 -1610 1415 -3353 -10547 -4219 -6451 -12090 -2309 -528 -4230
1237 -4230 5267 7383 2349 9245 10028 1868 3783 3725 -5830 -5234 -3104 -11213 -9893 -2935 -7137 -4756
1253 -4756 4679 1394 2469 11559 7243 3723 9767 2827 -3673 1551 -3685 -11180 -5551 -6393 -10490
1268 -10490 -2567 407 -3156 3972 9123 3823 8051 12121 2404 2272 5663 -5320 -5143 -961 -10904
1283 -10904 -8954 -1484 -6221 -2847 4628 1600 3242 9712 9180 4654 6090 4903 -3287 117 -186
1298 -186 -12105 -6663 -2560 -11082 -1104 2970 -5544 5233 8853 2555 9867 7214 124 3113 1496
1313 1496 -2493 -6913 -6745 -5542 -10188 -2708 -765 -8275 5313 6788 -1629 12207 7182 -2133 10981
1328A0981r513p401P719r969J54M797n472L438O30M502O047n812P657l39p042
1343C77J4890j0072j2665J2854j2029l87J2298j9986K716J3938p441J0337q90
1356C940q010J2269RK365p81j5089P944q26o753J1136j9329l744K1450j1674P149
1371E6P246k1138J8777J1121j3630R191j1964n581J7445j1040l035m507j0829
1384a7888K0108k470q211J1333j4885J3092J9805k3578Q052J972j5644K4499r862
1397F323k0171J4270j2198O222J3696k2741O944N704j714K1728j6453q297J7836
1410A1149j1315J4060p97l3131J8876K906j0499J8655k5302n552L0690j0721Q002
1423G021O56k3295K5939N613j0705Q413k7097N527K2584k0650P589j0523j9113
$$ plain form
1328 10981 1468 -5933 1786 -8183 -8029 -3232 -8704 -5266 -4636 -134 5913 101 7758 7419 377
1343 377 15267 5195 -7470 5384 -6645 -7032 5266 -14720 -12004 1934 -5507 4830 3940
1356 3940 -4070 8199 8208 10573 9792 -5297 2647 1821 -4932 6204 -13125 -16869 4581 -7093 56
1371 56 7302 -13836 4941 16062 2432 11623 -341 -5922 11523 483 -2552 -7059 -17888
1384 -17888 2220 -250 -8461 2872 -12013 1079 20884 -2694 5358 7330 -8314 16185 6323
1397 6323 -13848 422 -11776 -5554 8142 -14599 -7655 -1951 -3665 18063 1610 -6687 11149
1410 11149 -166 13894 13097 -20034 -1158 1748 -8751 9904 -15398 -20950 9740 -981 7021
1423 7021 7677 -15618 10321 15934 5229 13642 -13455 -7928 14656 -5994 1595 -8928 -28041
1436b8041L8523m469j2410J4958k4933J9276K6559k9931O170o602j1942L3973
1448B1131j7721j7427J1939j9611K3972J1791l1423J7369m546j624L5517k8097
1460A270q573J8834k1479K4063j70l7468K1830m789k651K5640l3841K458K4426
1473I550j5973K4295r529k7114L3580q598l539J5139l9930J3864J9989k4623J9937
1486G048j5948j6544M0724j4098q92J4081l3096K7132J3680k7030J8544k2930
1498i329p824L7891k6576j807P873k7862L6182N528k6256K1737j8211P013L2635
1511C0994l3875M094M424k2736L5027j2401k6417K4479k0801J1378K5486l6134
1523a6482J3947Q455j5238L4188j7502j8405K3786j9687J3283Q681l7355J9420
$$ plain form
1436 -28041 10482 6013 -6397 8561 -16372 2904 29463 -468 5702 -900 -12842 21131
1448 21131 3410 -14017 -2078 -21689 2283 14074 -17349 20 -4526 -6150 29367 1270
1460 1270 -7303 11531 -9948 14115 13945 -23523 -1693 -6482 -9133 16507 -17334 -14876 9550
1473 9550 -6423 17872 8343 -18771 14809 6211 2672 17811 -22119 -8255 11734 -12889 7048
1486 7048 -8900 -25444 15280 1182 290 14371 -18725 8407 22087 -4943 13601 -9329
1498 -9329 -17153 20738 -5838 -7645 228 -27634 8548 14076 -12180 9557 -8654 -1641 30994
1511 30994 -2881 1213 5637 -17099 17928 5527 -20890 3589 -17212 -5834 19652 -16482
1523 -16482 -2535 5920 -9318 24870 7368 -11037 12749 -6938 6345 15026 -22329 -2909
1535b909P67j1503K9157k7335l996K9782k1108J7490M574l1614K8049k485j3822
1548d953K0536k8715J542K0744k1162J4533n368j8241L2519r560l991J7860k8401
1561a2657J6502J6365k7630J6606j0569j6320L1123j6279q676J4134j9722J8491
1573A368J0501k0279J5253q091l41K2540k1799J019O541k0021K2034l494k2686
1586a7455J9569j1368O60K2776k1842L622J1983j1381J7297n474j3929J2789r801
1599b554M106N509k0931J0526R36q932J9240j3190n088K0804j2655O437Q652j9098
1613f238J0978L144j1116P974r676l411Q896p702N210j692o048J4725l843j585
1627c84J0350j2821N786R426j5566N440l62j1205J0656k933p343P116l063L060
$$ plain form
1535 -2909 -2142 -13645 15512 -11823 -15819 13963 -7145 10345 14919 -16695 11354 8869 -4953
1548 -4953 15583 -13132 -11590 9154 -12008 2525 -2843 -21084 11435 1875 -2116 15744 -12657
1561 -12657 3845 20210 -7420 9186 -1383 -17703 13420 -2859 -11535 2599 -17123 1368
1573 1368 11869 -8410 6843 -1248 -1589 20951 -848 171 6712 -13309 8725 5231 -17455
1586 -17455 2114 -9254 -8594 14182 -7660 -4038 7945 -3436 13861 8387 -5542 7247 -2554
1599 -2554 1552 7061 -13870 -3344 -2408 -11340 7900 -5290 -10378 10426 -2229 4208 12860 -6238
1613 -6238 4740 7884 -3232 4742 -4934 -8345 551 -7151 -1941 -3633 -9681 5044 1201 -384
1627 -384 9966 -2855 2931 12357 -3209 2231 1869 -9336 1320 -1613 -8956 -1840 -4903 -1843
1641a843N219l663L672j658J929N897q842J097K009r708O927p81r909Q513j456
1656b597l464R224k643k086O629o39j06N13k230o36k288Q48j981n231M473j238
1672c452k886P358k395j711Q473k227j619N832m522j899L220m077l034Q34j387
1687c492k294J587J866j709K082M419k304K396L919m314L10L107n449j206K154
1702A072m982r05K833k817l75M618m47m55N067L16j875K993k40l980J537q30n052
1719c522J481K61m126K645K312k852K968L895k027K081K542l264K06K162m089
1734F73k084J618k989k256L277j289j659M766L22j192M841J47k568L289r09l765
1750B22J385j087m435Q31N09k296J160K391j227R40N070j651j61M227l051k043
$$ plain form
1641 -1843 3376 -287 3385 1727 3656 9553 711 1808 3817 -5891 1036 255 -9654 -1141 -2597
1656 -2597 -6061 3163 520 -1566 5063 4424 4318 4831 2601 1965 -323 525 -1456 -6687 -2214 -3452
1672 -3452 -6338 1020 -1375 -3086 5387 3160 1541 7373 2851 952 4172 95 -2939 -2105 -3492
1687 -3492 -5786 -4199 -2333 -4042 -1960 2459 155 2551 6470 2156 2466 5573 124 -1082 1072
1702 1072 -3910 -4815 -1982 -4799 -5174 -556 -1003 -1458 3609 3925 2050 5043 4803 823 2360 1530 -3522
1719 -3522 -2041 -1780 -5906 -3261 -949 -3801 -833 3062 1035 3116 5658 2394 2600 4762 673
1734 673 -1411 207 -2782 -5038 -1761 -3050 -4709 57 379 -813 4028 4175 1607 4896 3987 222
1750 222 1607 520 -3915 -3084 -2575 -4871 -3711 -1320 -2547 -1607 3463 1812 1651 5878 2827 784
1766G84L125l939k173K137l993j619L510j407j56K906L19J135K353J188j005p59
1782B406J802l244r55K075n705j064L894m358K162L272m411L660M481k054K571
1797D532j219k017K741j236j074l167k875L030j637q01L232n044L889N569m852
1812i29M543J317n920O603r66n332K833m993k90L478n116J525k55p56P435l263
1828h6k0M908n319N844J490r873N502k056n121P729q086k463Q071n717M682K531
1844B016o854Q401j22j163N964r777J247N232q142N939m589r411J2433k943k285
1859d054P980j1697O598R902q758O851m673o473J3507p384k939L565j3301R592
1873a284M339j0527R489p129j482J7365r991Q70M751j2263J3388J282j4144Q742
$$ plain form
1766 784 3909 -30 -2203 -66 -4059 -5678 -2168 -3575 -3731 -825 -506 629 2982 4170 3165 2406
1782 2406 4208 964 9 2084 -3621 -4685 -791 -5149 -2987 285 -4126 -466 4015 1961 4532
1797 4532 3313 1296 4037 2801 1727 -1440 -4315 -1285 -2922 -3723 -491 -5535 -1646 3923 -929
1812 -929 3614 4931 -989 5614 4648 -684 2149 -2844 -3134 344 -4772 -3247 -3502 -4258 3177 -86
1828 -86 -106 4802 -517 5327 6817 -3056 2446 390 -4731 2998 -5088 -7551 520 -5197 -515 2016
1844 2016 -4838 3563 3441 2278 8242 -1535 -288 4944 -3198 2741 -1848 -11259 1174 -1769 -4054
1859 -4054 3926 -7771 -1173 8729 -29 6822 2149 -4324 9183 1799 -1140 2425 -10876 -1284
1873 -1284 3055 -7472 2017 -5112 -6594 10771 780 1650 6401 -5862 7526 8808 -5336 3406
1887C406r513N16J4142j6038K507M878r107J7839m260j1496J4836r196M194J0300
1901A3008j9913O546K752j0434J5684j1499q711J6321j0639Q440P078j9905J5041
1914C769K440q015J5844j7498m255J7477j4668P059o00j9014J9688n47o868J2684
1928G496j7703O881J7395j5942R651n418j3518K3566r073q649J0608k0405J1571
1941c540J3723j8827J0258n329o048K5254j1813n393Q215j5231J7264L481k1350
1954i336J1703r233r50K1290k1480j87J1292j3131K0241j330j8997J6456o438
1967a00J651J3785k2864L400P172j0500J6234j1802j2162J9805r617O638Q872
1980A0512k3610J4934P650j2079J4972j5077q158K0953j2222J307K175j7440J7187
$$ plain form
1887 3406 -6107 -5591 8551 -7487 -4980 -102 -9209 8630 4370 -7126 7710 -1486 2708 13008
1901 13008 -6905 -359 2393 -8041 7643 -3856 -12567 3754 -6885 1555 8633 -11272 3769
1914 3769 6209 -1806 14038 -3460 -7715 9762 -4906 2153 1553 -17461 2227 1680 -5188 7496
1928 7496 -10207 -3326 14069 -1873 7778 2360 -11158 12408 3335 -5314 5294 -15111 -3540
1941 -3540 10183 -8644 1614 -3715 -9763 15491 3678 -1715 6500 -8731 8533 12014 -9336
1954 -9336 2367 -6866 -7816 13474 -8006 -8193 3099 -10032 10209 8879 -10118 6338 -100
1967 -100 1551 15336 -7528 -4128 3044 -7456 8778 -3024 -15186 4619 -4998 1640 10512
1980 10512 -13098 1836 9486 -2593 12379 -2698 -10856 10097 -2125 -818 1357 -16083 1104
1993A104L043r022J0920j4274M864J7503j5226O052j996j4345K1686n147j2969
2006g807J0998j4528O135J6005j7723M844J044n043J8417p650p716P952r875J1671
2020F724K632j8342R019l778k906J6322j5421l074J3000r357J1060K284j5162
2033f999J0698J71k522Q168j4150K88O301o511Q244o848p977J4810n164J548P333
2048G390j4385P839Q357j0302O765m961p375J1514m628l830K773p268P147K934
2062A970n053N458n419K658R227r267K229J518q566R705j246r855O379l742l40
2077d344P941o478k99M147r59M869j708l367L140l316L165N72q475M215l09l667
2093d873P343m668k984P831k546R12M055n376J829K625k777M33k686r38J124k140
$$ plain form
1993 1104 4147 -4875 6045 -8229 -3365 14138 -1088 4964 2968 -11377 10309 5162 -7807
2006 -7807 3191 -11337 -5202 10803 -6920 -2076 -1032 -6075 12342 4692 -3024 4928 -4947 6724
2020 6724 9356 -8986 33 -3745 -6651 9671 -5750 -8824 4176 -5181 5879 8163 -6999
2033 -6999 3699 3870 1348 9516 -4634 -4346 1955 -4556 3688 -3160 -11137 3673 -1491 57 7390
2048 7390 -6995 844 9201 -1101 5664 703 -6672 4842 214 -3616 -843 -8111 -964 1970
2062 1970 -3083 2375 -3044 -386 8841 -426 1803 3321 -5245 4460 3214 -6641 -262 -4004 -4344
2077 -4344 3597 -2881 -3180 967 8 4877 3169 -198 2942 -374 2791 3363 -5112 -897 -1206 -4873
2093 -4873 2470 -2198 -5182 2649 103 1015 5070 -306 1523 4148 1371 1804 -882 -1820 -696 -2836
2109b836K128j726k148N773j699m5M760m285R74N080n168O3J715m628J260M57
2125c25k731L58M44L27R74N34J423r03J329K640k940K17J343l833J175P50m557
2142c775J536J022k462K108J528j354J839J458q7J10M20l83j700J144j101k658
2158b355J475o86k022K373N79j514K888Q06j177K282K24j767R06J4k626K1P1j702
2176b210k60J143r80M14K271k28J51K524q23p86J894j144j786O43j258j609Q77
2193a167p06j146J352O91p8J630J198j030J137J048j407r5O9k133o42Q59k073
2210b493j82R61p64L73K123J10K74J612l43l9R25p76j660j15j03j841R8O80j942
2229c102J080J604o15J580J078r09J671N26j211j88p06j075j80p04m7j065k4J321
$$ plain form
2109 -2836 -708 -2434 -4582 1191 -508 -553 4207 -78 896 5976 808 871 2586 -2042 -782 -325
2125 -325 -3056 -2698 -2254 -1927 -953 -419 1004 101 1430 4070 1130 1347 2690 -1143 32 782 -3775
2142 -3775 -2239 -1217 -3679 -1571 -43 -1397 442 1900 1813 1923 2343 1960 260 1404 303 -2355
2158 -2355 -880 -1566 -3588 -1215 -636 -2150 738 1544 367 2649 2873 1106 2012 2026 -600 -579 -508 -2210
2176 -2210 -2470 -1327 -2307 -1893 378 150 301 2825 2002 1216 3110 1966 180 823 -435 -2044 -1167
2193 -1167 -1873 -3019 -1667 -976 -1054 576 1774 744 1881 2929 1522 1427 1496 -637 -1279 -420 -2493
2210 -2493 -2675 -1714 -2478 -2105 18 128 402 2014 1671 1632 2557 1781 121 6 -97 -1938 -1840 -1160 -3102
2229 -3102 -2022 -418 -1033 547 1625 716 2387 2913 1702 1514 808 -267 -447 -1151 -1198 -2263 -2287 -966
2247i66m86J773J040j062J947L14j534J615j285j731J643k425r71J333j844J112
2263a527O27n03J946n38R55K154k225J071M84k761K408k461k650K828k197j52
2279b541K311l270K511K015j544L242j769j096L870l098O59M22m988L068l46k913
2295c467L836l739J00N096k945K531P82m006N692r10k492K606n747J325M125n922
2311c135K210o48l684P585k144j801M530m488L520L865o238L154k352k639O305
2326D040n536j910L853n758O035J796p237O329j146r10P596p503q22M966n744
2341a951N194k292p478P073k643j23N047r096M944M884n187O960m549n013J0358
2356F128n469k74L256j0810N832M069o591N098n384j720J1429n696J573J143p668
$$ plain form
2247 -966 -1452 321 1361 299 2246 2560 1026 2641 1356 -375 1268 -1157 -2128 -795 -2639 -1527
2263 -1527 -900 -1403 543 5 960 3114 889 1960 2444 -317 2091 -370 -3020 -192 -2389 -2541
2279 -2541 -230 -3500 -989 1026 -518 2724 955 -141 3729 631 1290 1712 -3276 -208 -554 -3467
2295 -3467 369 -3370 -3270 1826 -1119 1412 2194 -1812 3880 2970 478 3084 -2663 -1338 2787 -3135
2311 -3135 -925 -1573 -5257 2328 184 -1617 2913 -1575 1945 5810 -428 2726 374 -2265 4040
2326 4040 -1496 -3406 447 -5311 724 2520 -4717 1612 466 -444 7152 -351 -1173 3793 -1951
2341 -1951 3243 951 -6527 546 -2097 -2220 2827 -6269 -1325 3559 -1628 5332 783 -4230 6128
2356 6128 659 385 3641 -7169 -1337 2732 -3859 1239 -4145 -5865 5564 -132 1441 2584 -5084
2371e084J0589j27p394N699q434J525R978j0801J471J828o706J2010j526o932
2385c904O832n056M045O785j0802K912o78l620J0256q282m888P622o763P250L643
2400E352j2783Q285J429k988R578r684k919Q574o189M316j533r717Q527o79j449
2415a880N957j0759M035Q069p016O932m022p614J2639l494m225M576j0178M486
2429b494O966q161L544l219j888J1127m548j665K701p067R685J034r441N708n651
2444c369q84J0711r523j384M708o013R033J110q447N893k083J671O220r126L63
2459a120J683l658P754n541o191P963m052L113N251j0736N010M592m761O617m787
2474A137m772P304l346N12O62p687N391J428k621M610o466J148Q039n427K587
$$ plain form
2371 -5084 5505 5378 -2016 3683 -4751 -3226 6752 -4049 -2578 -750 -7456 4554 3028 -3904
2385 -3904 2928 -2128 1917 8702 -2100 812 134 -3486 6770 -1512 -6400 1222 -5541 1709 5352
2400 5352 -7431 854 2283 -705 8873 -811 -3730 4844 -1345 2971 1438 -8279 248 -431 -1880
2415 -1880 4077 -6682 -2647 5422 -1594 5338 1316 -6298 6341 2847 -1378 3198 -6980 -2494
2429 -2494 4472 -3689 -145 -3364 -5252 5875 1327 -338 2363 -4704 4981 6015 -3426 2282 -3369
2444 -3369 -4253 6458 -3065 -4449 259 -5754 3279 4389 -4058 1835 -248 1423 7643 -1483 -1120
2459 -1120 563 -3095 4659 -882 -7073 890 -3162 -49 5202 -5534 -524 4068 -693 5924 1137
2474 1137 -3635 3669 323 835 1497 -6190 -799 629 -1992 2618 -3848 -2700 5339 -88 2499
2489B499O27p707Q414j81o132L728m545j17O350n098K38O93j868O286j293k079
2505a85K210l887L981K581p237K705j121l178P103l965l824N223k679K733L351
2520C811n748K626J067q12L052l720j402J826k515K788j214m937N026q10n47M813
2536C304m710K95N137l248J645N0m334K607K79j967R90l060Q66K438j703K134
2552G23j544q01N110k493k84K595m512K039K187m744J178l83k026L169j130r35
2568a851J480n03K213L00j337J490j220N00J358l483L39P41k599K507k48l042
2584c355K970Q3n41K608j351k37J938j160O64j057j266O50r65L39J10k206J962
2601h14O09q26K362p67q26K673r48o66O68j673K07L39j236%m45J4O44k7Q07L31
$$ plain form
2489 2499 3126 -4581 3833 3652 -2480 1248 -3297 -3414 2936 -2162 -1924 -1231 -3099 3187 1894 -185
2505 -185 2025 -1862 2119 4700 -2537 168 -953 -4131 2972 -993 -4817 406 -2273 460 3811
2520 3811 -1937 689 1756 944 3996 276 -1126 700 -1815 973 -241 -5178 -152 -962 -1509 3304
2536 3304 -1406 -1111 4026 778 2423 2473 -1861 746 1025 -942 48 -3012 -2146 292 -1411 723
2552 723 -821 -1622 3488 995 711 3306 -1206 833 3020 -1724 -546 -929 -2955 214 -916 -1851
2568 -1851 -371 -874 1339 1639 302 1792 572 1072 2430 -1053 -714 27 -2572 -65 -313 -3355
2584 -3355 -385 -302 -843 1765 414 177 2115 955 1619 562 -704 -54 -1019 -680 -570 -2776 -814
2601 -814 -205 -1031 1331 564 -262 2411 1463 797 1465 -208 -1 338 -898 -898 -1343 -1329 -685 -712 95 426
2621D26m33J671j43o05J150j445j74N42j919l03N09j054M79M97j68P00O94J66
2639E90J71O11q4l57j73M4j018o02J30q24r1N83k66O84P55o9O01L92R9mk28l56
2661E88k60l62l85p17P1q7j01P98M0rQ31N60k98O00j6o34K24m11p67K36p05n03
2683a307K54M3K71J93N40O99L71L56J21p00M82m26o08n9q55j57j66n07O29O9J09
2704f48J028K00j02R37j88l1r4j041K17p83n53L8l94oM42R5O40J97m08J734j68
2725A112k11N55j254K36O1j492N65n34j048J513n87K93Q54n96J201Q11o61P65
2743A583j278J6J012j619k81M00k071K086j10j377K066j156M17K330j832P24N70
2760A480j247J521j144j699J602j889N13R54k414J985M8r11L053j355n81K659
$$ plain form
2621 426 -7 1664 1521 916 2066 621 447 989 -930 -1233 -724 -1778 -1299 -802 -970 -270 424 590
2639 590 761 1372 1288 931 758 802 -216 -818 -688 -1512 -1603 -1020 -1286 -602 153 84 685 1077 1176 1172 944 588
2661 588 328 -34 -419 -1136 -1065 -1152 -1253 -455 -415 -424 407 967 669 1269 1253 619 843 432 -335 -99 -804 -1307
2683 -1307 -1053 -1010 -739 -546 -6 693 1064 1420 1541 841 1323 897 289 230 -625 -782 -948 -1455 -826 -757 -648
2704 -648 380 580 478 1415 1227 1196 1102 61 278 -505 -1058 -1020 -1414 -1420 -978 -883 -243 -46 -454 1280 1112
2725 1112 901 1456 202 438 499 -993 -428 -962 -2010 -497 -1084 -791 63 -533 668 1479 818 1583
2743 1583 305 321 1333 -286 -567 -167 -2238 -152 -262 -1639 427 -729 -312 2018 186 910 1480
2760 1480 233 1754 610 -1089 513 -1376 -863 91 -2323 -338 -290 -1201 1852 497 -84 2575
2776B575k391Q12P86l153J536k0j561J901k418o1K581j561J930m56k125L942r55
2793A362j180K144l614Q05K602l952J494n61k395L912q11j035J884k360K488J667
2809B450k544J839j987o91L855l469p19J412l601L572J114l977L247o06p10M502
2825C687l652k27K115k298K633j365k862K352k135J292K264m946K417J622k469
2840a572M479k072k859M474j951K90J801n125J585K021k557K254k817m07L995
2855A539k080J288N57l773M675K58k988K965m097l74N040m381n5Q33l654N004
2871G57P32l170K140k168J939L545m057J240j100j794N112k953k819K826l451
2886c221K859L116n607K280R98j432M942k634k710L046j725J858K00m926K546
$$ plain form
2776 2575 184 996 1782 -1371 165 145 -1416 485 -1933 -1994 587 -974 956 500 -1625 2317 1362
2793 1362 182 2326 -1288 -483 2119 -1833 -339 -900 -3295 617 -194 -1229 655 -1705 783 2450
2809 2450 -94 1745 -242 -933 2922 -547 -1266 146 -3455 117 1231 -2746 501 -105 -815 3687
2825 3687 35 -192 1923 -375 2258 893 -1969 383 -1752 -460 1804 -3142 -725 897 -1572
2840 -1572 2907 835 -2024 2450 499 789 2590 -2535 -950 1071 -1486 768 -2049 -2456 1539
2855 1539 -541 747 1304 -2469 2206 2464 -524 2441 -1656 -2030 3010 -1371 -1426 -593 -4247 757
2871 757 1489 -1681 459 -1709 230 3775 -282 958 -142 -1936 3176 223 -2596 230 -3221
2886 -3221 -362 2754 -2853 -573 425 -1007 3935 1301 -1409 1637 -88 1770 1970 -2956 -410
2901d10m91j2L272m764K53L800k290K897j70n062N051r5j976K405m773K27L846
2918A708k772J160j197k034M728p35n57J253l468L231K281m240J903k044j965
2933b748N486l058j882K155k978L527K075m117J628j39J15L886l721q95J147k208
2949a727L758j210m230L394j528L89L958m773J74L669k292K773o35l589K945o08
2965D68l58J227m076J155J788j609K408k007j500M648j764N38J611m442K764J875
2981B726l304J752k313o94L178k221j92P38j883L297K11j803K048k070J032K527
2997C029l747Q84K18k554L544j368k524K595j613Q75K479l137J496Q81r99K124
3013B183j968j029J692j682J238K32l275K188J82j241K778k074k97K947j916J107
$$ plain form
2901 -410 -901 -913 2359 -2405 -2152 1648 -642 2255 2085 -2977 2074 1979 3 2408 -2365 -2138 1708
2918 1708 -1064 96 -1101 -3135 1593 858 301 1554 -1914 1317 3598 -642 1261 -783 -2748
2933 -2748 2738 -320 -2202 -47 -3025 502 2577 -1540 88 -51 64 3950 229 -666 481 -1727
2949 -1727 2031 821 -3409 -15 -1543 -1154 2804 -1969 -1795 1874 -418 2355 1720 -1869 1076 468
2965 468 110 1337 -2739 -1584 204 -1405 1003 -1004 -2504 2144 380 918 2529 -1913 851 2726
2981 2726 -578 1174 -1139 -1833 1345 -876 -1068 -330 -2213 1084 1295 -508 1540 -530 502 3029
2997 3029 -718 166 384 -2170 1374 6 -2518 77 -1536 -661 1818 -1319 177 1058 59 2183
3013 2183 215 -814 878 -804 434 666 -2609 -421 -239 -1480 1298 -776 -1073 1874 -42 1065
3029A065L14k243J553Kj015K59j432K86J296j253J111k58q20K576r03j70J270
3046A638j824Q50N64j842O36l03j181J509q24j18P93o38J488L47j287J439l25
3063I22m24J109j619L4N22j615R85j39j358J238j75O2J091o59K18O93m96N15k06
3082F98q82P81j261j97O42j112O99L23n83J121j99q5Q39m76L85L4o71K21l9r17
3102f79J76j36l61M02k25K28Q03l03K83K72J92O3n35K42J78r50Q9k14k73R4J0
3123f44J21L34J77j6Q60k97K57j61k02K86o36p6l82r0K0P8l18K14K36K61N99p5
3145E46l22N01k95J07R0n34o3l97k07R6M5k70k04N74K79J25N01R9L9L7k37n40
3167c0L12n11m12P8m8l05K97O1J81M85R6K3R4L14J2k45Ml19n23Kl0k60K92m50
$$ plain form
3029 1065 1379 -864 689 691 -324 -65 -1497 -1211 85 -1168 -57 -315 -1135 1441 538 368 1638
3046 1638 -186 664 1228 -614 22 -281 -1462 47 -777 -895 -102 -740 748 1095 -192 1247 922
3063 922 498 1607 -12 22 544 -1071 -86 -225 -1583 -345 -520 -458 633 -26 192 885 389 904 698
3082 698 -184 597 -664 -861 -219 -1331 -632 -309 -892 229 30 -55 784 308 693 727 56 277 238 -679
3102 -679 -503 -639 -1000 -598 -823 -595 208 -95 188 460 652 715 180 422 600 -350 -261 -475 -748 -654 -644
3123 -644 -523 -189 -12 -28 832 535 792 631 429 715 79 3 -379 -469 -449 -371 -689 -475 -239 22 621 546
3145 546 224 725 430 537 627 93 30 -367 -574 -478 -433 -703 -907 -333 -54 71 572 671 710 747 510 -30
3167 -30 282 -229 -641 -563 -611 -916 -619 -558 -377 108 204 227 321 635 647 402 406 87 -436 -434 -464 -724 -432 -882
3191h82mJ020k05J51J070o61P2K98n97K05k93n21n8k75Kq9Q9P54k73J89Q95n13
3213C74L04O07j510M91O15j180K16n5r76Q12l46M7K54j82O40M86l08Q90j097L55
3233D37O22j405M83j7j647J614m01j078J241l78K54J202q50J93J68m07J164p40
3251D55l19L82j546O53Q02j489N95J3o14K034p99o06J405p14N34N98j664L80J67
3270B67n74N46j423L27Q26q58J242pj378K192m87o03J464j860k57J929j902P06
3288A50l09j877J981L19p88P36j147J134J323j239Q75r65r29K577j692q05Q58
3305B02k183J676J374k585J101J98q01K742j179j039J221j091J709j03k396R71
3321a83q77N61J787k897j7J893j583K774m17k542K746n56j74J324k998N08J246
$$ plain form
3191 -882 -886 134 -71 80 1150 489 561 859 262 467 174 -347 -405 -680 -678 -767 -678 76 -197 -8 887 374
3213 374 678 1285 -225 266 881 -299 -83 -138 -1114 -302 -648 -601 -347 -529 111 597 289 1179 82 437
3233 437 1059 -346 137 120 -1527 87 -314 -1392 -151 -529 -275 927 77 270 438 31 1195 455
3251 455 136 518 -1028 -375 427 -1062 -467 -454 -1068 966 167 -439 966 252 786 1384 -280 100 267
3270 267 -307 239 -1184 -857 -31 -889 353 346 -1032 1160 673 70 1534 -326 -583 1346 -556 150
3288 150 -159 -2036 -55 264 -524 212 -935 199 1522 283 1158 193 -736 1841 149 -656 202
3305 202 -1981 -305 1069 -1516 -415 -217 -1018 1724 545 -494 727 -364 1345 1242 -1154 -183
3321 -183 -1060 -499 1288 -1609 -1626 267 -1316 1458 1041 -1501 1245 689 515 1839 -1159 -651 595
3338E95j225J140j243j632K813o57K83J097k896K271J411j952J618j969j305L720
3354B069k138n70Q31k742K585J385k278J086r67L25L031k517K86K53j907L251
3370A983j325k054J823k229J114K866l818Q39R71j250L202j165k099K134j375
3385c83J003J270l779J235M94j246K819k683q71L041j746J790M76l560L039N47
3401A446j607K141k803j014K938j905R13l64k132L004j75o49J430k654J538K153
3417B260k736J641q91k159L621j598j353J848k533J638J910k785J316n09o8K759
3433B361k134o37J512k006K145j52l108K175r43l46K896k897J65J857j875K512
3449A525o02j955K325j109k77J561k929P32J057j621J998j130j345K681j060L17
$$ plain form
3338 595 -630 510 -733 -2365 448 -209 74 1171 -1725 546 1957 5 1623 -346 -1651 2069
3354 2069 -69 -639 192 -2550 35 1420 -858 228 -739 -414 2617 100 386 639 -1268 1983
3370 1983 658 -1396 427 -1802 -688 2178 -1640 -801 170 -1080 2122 957 -1142 992 -383
3385 -383 620 1890 -1889 -654 -160 -1406 1413 -1270 -2141 900 -846 944 1420 -2140 899 1446
3401 1446 -161 1980 -823 -1837 1101 -804 109 -255 -2387 617 442 -207 1223 -1431 107 2260
3417 2260 -476 1165 274 -1885 1736 138 -1215 633 -1900 -262 1648 -1137 179 -330 -398 2361
3433 2361 227 -410 1102 -904 1241 1089 -2019 156 -787 -1133 1763 -1134 -969 888 -987 1525
3449 1525 923 -1032 1293 184 -93 1468 -1461 -729 328 -1293 705 -425 -1770 911 -149 168
3465A68J516k810J718N99j524J360j636n27J973j609K71L77j829K289Q9j078J523
3482H70j164K38J844j777M21Kj726K097p51j388J327j319Q05J383j416P61J10
3499C17m64J545r54o31Q58j227Q75Q8j482R83j41n18J313j196J22J077p25J048
3517H88j59r90J307q99j69O87j261K36L17j040R15n0q84J553q5k45L95p34N15
3536B97M31q41K88l27n76Q61p60Q1M58o44N45L86p12Q47r0j3M81m16j61j19n58
3557e42N22l6o75M51o00M96O47m00J88L16j28M69q1n07K34l36k78Q8m63K10N1
3578c74J9J76j25N22J25J9K66lk24K77l13m16p9R4m50P2o4M4R4N37j39J30Q5p
3602B66J82J73k09k97l62K7k42jk0j56L74J41M9K62O6n5L14o4j62O7m11k40j37
$$ plain form
3465 168 1684 -1126 592 1191 -333 1027 -609 -1136 837 -772 -501 -124 -1953 336 425 -653 870
3482 870 -294 -56 1788 11 432 434 -1292 805 54 -1334 -7 -1326 -521 862 -554 207 317
3499 317 -147 1398 444 -187 671 -556 319 407 -1075 -92 -233 -751 562 -634 -512 565 -160 888
3517 888 729 -261 1046 147 -22 665 -596 -360 -43 -1083 -168 -218 -1102 451 366 121 516 -218 297
3536 297 728 -113 175 -152 -728 133 -627 -546 -88 -732 -187 199 -513 334 244 231 712 296 135 16 -542
3557 -542 -20 -56 -731 -280 -880 -384 263 -137 51 367 239 708 627 120 354 18 -260 -172 -635 -425 -374
3578 -374 -355 -179 -304 218 343 362 628 625 401 678 365 -51 -130 -36 -486 -414 -478 -434 -340 197 58 188 273 266
3602 266 448 621 412 115 -247 -220 -462 -463 -483 -639 -265 -124 -75 187 253 198 512 448 286 353 -58 -298 -435
3625d35L09n37K09L10m93O47J79l20K78O40j62k34L71m34l99L01n01MJ31k49k25
3646f10K60o5L28L25J66K5J39R8o15J45M60r74M66j12m92p7K07k02K54L48J96
3667B70j95K72K75m48M34k68n40n7L74n44J64k06k36N32M9k71P45l83R4L20J45
3688E26j97m30M4kj64j9j63n39R19j21n08Q58j0m69J010l76l54O63p63j39J60
3709g4l11J23J35N6Q8n22M95L62n27Q11k53m12J159r97l3O04j412K99Q25j216
3729h00P82l59l58J120k36J09J46l38O46K02r08L98o32pQ48j441K15N96q78J016
3749A21K78j386J408k17k63J243j330P5M88q56J029o83r18R74o75M74Q50j785
3767a173J102R06j068J385o14j247J670r62K85K04j924J120N64r48P56o69j22
$$ plain form
3625 -435 -126 -663 -454 -144 -637 10 189 -131 147 787 625 391 762 328 -71 230 -271 -267 -136 -385 -610
3646 -610 -350 -415 -87 238 404 429 568 666 51 196 656 -318 148 36 -456 -533 -326 -528 -274 74 270
3667 270 75 347 622 174 608 340 -200 -257 117 -427 -263 -469 -705 -173 -124 -395 350 -33 61 381 526
3688 526 329 -101 -57 -59 -223 -242 -405 -944 -25 -146 -654 204 194 -275 735 359 5 668 -95 -234 -74
3709 -74 -385 -262 -127 -71 17 -505 -10 352 -175 636 383 -29 1130 133 100 704 -708 -409 416 -800
3729 -800 -18 -377 -735 385 149 258 404 66 712 914 6 404 -228 -235 613 -828 -613 -17 -895 121
3749 121 399 -987 421 204 -59 1184 -146 -71 417 -439 590 -93 -1011 -37 -712 -238 612 -1173
3767 -1173 -71 835 -233 1152 538 -709 961 -1 284 488 -1436 -316 248 -700 56 -613 -735
3784g35J631j021R33k56j495K361o28j110J152j785K80J686j840N10J10j057K600
3801A336r97p64J103j170Q40J074j938Q31l45o95K025j838o39J364j254J503M29
3818H65j804J278l6k71J856j997o07J564j360J151n43j908K146j001j12J889k249
3835a139N86J517j348J767r55j729K235n48o37P88k195J064J260j777J283p64
3851e92l60J902j066L09R87k179J799N72k313J810j727J37K254k196M19L77j300
3868a167K173k03j531J751j265O03J362k272L41K26j147K533j307j465J677j080
3884g71R49R57k320J242O18m83J461j892m94J364j228Q79M9j931J574M4l73J179
3902H24j341r3J525j174R89q1j733J900l53p90J066j929P64Q80j170P12k75p06
$$ plain form
3784 -735 896 -125 808 552 -943 1418 790 -320 832 -953 -673 1013 -827 -317 -207 -1264 1336
3801 1336 339 -425 678 -492 348 1422 -516 315 -30 -725 1300 -538 -1177 187 -1067 436 865
3818 865 -939 339 303 32 1888 -109 -716 848 -512 639 96 -1812 334 -667 -779 1110 -1139
3835 -1139 -553 964 -384 1383 428 -1301 934 386 -251 537 -1658 -594 666 -1111 172 -592
3851 -592 -952 950 -116 193 1180 -999 800 1372 -941 869 -858 -721 1533 -663 -244 133 -1167
3868 -1167 1006 803 -728 1023 -242 361 1723 -549 -208 18 -1129 1404 97 -1368 309 -771
3884 -771 178 1135 -1185 57 675 192 1653 -239 -733 631 -597 282 331 -1600 -26 18 -355 824
3902 824 -517 -610 915 -259 730 649 -1084 816 463 -327 739 -1190 -426 454 -716 -4 -279 -985
3920i85K115m95o52O15j091Q40O30j696Q68n76n52J637j287J01N51q41J245M17
3938H44j309O58r6K9R59j138l81P64r52Q39k87p34R16l48O5R80j167P43J11o60
3958a64J177r32n76Q54l12k24M34r44L18N05l17O33n87k14R51k51Q6l1n38K44
3978A12k1o80O42o17k6Q18o51J4M06k36N98Q6l60L03k84m1K25o00L22k30j98L44
4000g4n58j38R09n27L02N40l79K79J29l52M72m81k49J57k14K39l86pJ12%L71O2
4022B07O1J93k0j95J50R3n77K35j46l14L36l60j4M51l62J77J65j23N9J30K27l50
4044B3R1m5k00k21L87k80l79M57n5O9J78j11k9N70J4j49j09pl40l9J51j74k12
4067d10N5%L34J20k60o0Q33l63N9N2m05K02P7k19k77L08n23K27J71J65j39J62
$$ plain form
3920 -985 1130 635 -17 598 -493 347 977 -719 149 -427 -979 658 -629 -528 23 -818 427 844
3938 844 -465 193 97 126 1085 -53 -434 330 -622 217 -70 -804 112 -236 -171 809 -358 385 496 -164
3958 -164 1013 81 -495 359 47 -177 257 -687 -369 136 -181 452 -135 -349 602 351 437 406 -132 112
3978 112 91 -589 53 -564 -590 228 -423 -409 -3 -239 359 445 85 388 104 63 288 -312 10 -220 -418 -74
4000 -74 -632 -770 139 -388 -86 454 75 354 483 131 603 122 -127 30 -184 55 -331 -338 -226 -226 145 207
4022 207 268 461 441 246 396 489 -88 147 1 -313 23 -337 -351 100 -262 -85 80 -43 16 146 373 23
4044 23 114 69 -131 -352 35 -245 -624 -167 -222 -153 25 -86 -115 455 469 320 211 204 -136 -175 -24 -198 -410
4067 -410 -355 -355 -21 99 -161 -221 612 249 308 360 -45 157 234 15 -262 46 -477 -250 -79 86 -53 109
4089A09J59j30J59K54n37J20K15l18n9J10m31RL83l26K16J65k79K03K54k00J75
4110B51J03L9l90m4M4k96J3M1j49J18J09Q0K00K98k86jM6k25J32p9K07j20j95
4133a04l46N6N04l94J5L20l0j59M50M7k95L40m01k29K38p6j01Q1l49p6M64j81
4155b26L9K13M62j54k54L74k47l26N67l92L7j47n54M34L84o06J49J15L3N29j03
4176C27m8j75K8jj00l93J70j60J70K39l97N9M71o55O41M5m29N50j91J67K33o30
4198g9k35J46j05K88l10k64P57q09P41L23q17Q22j47n03R24n59n47O94n51K3K44
4219C6o64N72k09J18M29m41N2P46q34O35N1q01R79n50l80L59o89K03Q61r69N70
4240G4J42n77J141m15m89N07p50Q51L38j478R13l58l08J208j151l76J179p80M77
$$ plain form
4089 109 268 138 297 551 14 134 349 31 -28 82 -349 -340 43 -283 -67 98 -181 22 276 76 251
4110 251 354 393 3 -41 3 -293 -280 -239 -388 -270 -161 -81 119 417 131 130 176 -49 83 4 211 91 -104
4133 -104 -450 -394 110 -284 -269 51 21 -138 312 359 64 404 3 -226 12 -64 -165 -84 -433 -509 -45 -226
4155 -226 -187 26 488 334 80 454 207 -119 448 56 93 -54 -608 -174 210 -396 -247 -132 -99 430 327
4176 327 279 104 132 131 31 -362 -192 -352 -182 57 -340 -281 190 -465 176 221 -208 342 151 318 551 -79
4198 -79 -314 -168 -273 15 -295 -559 198 -611 130 453 -364 458 311 -192 732 173 -374 320 -231 -208 36
4219 36 -628 -56 -265 -147 282 -159 -107 639 -195 440 491 -310 669 119 -261 98 -591 -388 473 -496 74
4240 74 216 -361 780 365 -124 383 -367 484 822 -656 257 -101 -409 799 -352 -728 451 -329 148
4259A48K20o78Q17n43O4Q29j042j17M33q40J294o93j025J338o27L16O76j118N04
4278d4O81p91R33q93m95J056p73J27K45j110R06L87o44R41j197J64J441q79N0
4297A05J62p80Q21K12j033O59q48L88R24j116L00R2n64J435m99m98Q06r13O54
4316C07P74j910P57J69n39J266r90m78P69j36M94J31r54O99k20k60R06j228j14
4335e57Q76o67M32k9j044R13K90m40P81q73j26J056o18M42l95p27J128n65j19
4354b42L71j040O13Q26q85O54l63m54J368n06l53M60q54L61M37p56K32m09r0J027
4374C97o13n1M91n07R71o2r68Q62j81l30Q79j034o9M45p06O41j49p64O22L32O
4395B12M86q95N76J78p00P19m99o22P59m63J14M76p88K56N36l98J91Oj69M93l22
$$ plain form
4259 148 368 -310 507 -36 28 857 -185 -302 131 -709 585 -108 -1133 205 -422 -106 570 -548 -44
4278 -44 637 -154 779 -114 -609 447 -326 -199 46 -1064 -158 229 -415 526 -671 -507 934 55 105
4297 105 267 -513 308 520 -513 146 -702 -314 610 -506 -206 -114 -678 757 258 -240 566 -347 307
4316 307 1081 -829 -72 97 -442 824 -166 -644 125 -11 483 614 -340 359 139 -121 785 -443 -557
4335 -557 319 -348 84 55 -989 -76 214 -226 555 -318 -444 612 -6 436 41 -686 442 -123 -242
4354 -242 129 -911 -298 528 -357 297 -66 -520 848 342 -11 449 -405 -44 393 -363 -131 -540 -630 397
4374 397 -216 -267 224 -283 688 626 -342 520 339 9 888 -146 -215 230 -476 165 16 -748 -126 206 212
4395 212 698 -197 379 557 -143 576 77 -545 214 -249 -135 341 -447 -191 345 -53 138 144 -25 468 146
4416A46R5K6p61L91J43m70N12m44j55N82k56J95L25n80M23K90l70j38l55M27N3
4437G9k39j18Lk9M81l08l66O90l75L18M92q36M01jn03N65j94o41L71N3J19O3n24
4460d99M74K12L8J59l45L7M62n60J33J08n50M66j2n12K08j30J07L89o4j3Q0j35
4482E3Q3J84k06m3j5j37P4k93K54j03m55O84m0m25O08n2n5M5j03j69J48Q8j49
4505b4J5m91M92l89K04p9o7L21J51k71L37k98O0L90l05j56M91o24K46k19J11p5
4527a80J74j52m6K84J43J30j99j00m6j58J88j78J41J0k26j1J47Rn9K96j20M4K6
4550A17P1j27N2m3l32L87j78j45rK34l85J68M66m52K33J09o9K90m5j34k33J88
4572A63m73J00L79l69L1j97K37l8R5L20l03J81P5m12L77j63k77L52n0l63J97R8
$$ plain form
4416 146 241 267 -494 -103 40 -430 82 -362 -517 65 -191 4 329 -251 172 462 92 -46 -401 26 79
4437 79 -160 -278 -275 -304 177 -131 -497 193 -182 136 628 -208 193 192 -311 254 60 -581 -210 -157 -38 25 -499
4460 -499 -25 187 225 384 39 76 538 -22 111 219 -331 135 123 -389 -181 -311 -204 185 121 108 188 53
4482 53 136 320 114 71 56 -81 -7 -300 -46 -149 -604 80 40 -385 223 171 116 161 58 -111 37 125 -24
4505 -24 -9 -500 -8 -397 -193 -272 -339 -18 133 -138 199 -99 -39 351 46 -110 381 -243 3 -216 -105 -180
4527 -180 -6 -158 -204 80 223 353 154 54 8 -150 38 -140 1 11 -215 -226 -79 -70 -129 167 47 91 117
4550 117 188 61 113 70 -262 125 -53 -198 -207 27 -358 -190 276 -176 57 166 97 387 342 208 -25 163
4572 163 -310 -210 169 -200 -169 -366 -129 -167 -72 248 -55 126 201 -211 166 3 -274 78 28 -335 -138 -40
4594d0j00l1L13j87o8L47J41k86R2o0j81J66j16j50k5p7r3K19R4J60o7J96o7k40
4618f0J21J10r1J01p9k33N1K6k7J13q9j51M41j51J70r0k66N48j71k81j75K13j6
4641A4M9r4K64m20O2M15l74L29k5l73K16Qj08K69l37M3K35l01n0K1k65L04J68
4664E0q0L29n71L30K10m30L76O9m07K83j10n08K97k13L17J90o5l11J47K2O68n34
4686E9L81j26m99N85m9r16M73m3k59Q60o11j02N84o30O52K77o95K98m32L09L77
4707D93o71RL58o75O29k02p11J074k37r5N83p86L52L44l71K66n11l73O89j71k4
4728c0J8r32J018M01p47N54o11J55Q85p30K4K2n82P28J9q16M66k20l7Q44n45N0
4750f6K03o76R51j65l00N74p74M82L21r24p1L51j75O14k88m44M00K5K19L06q61
$$ plain form
4594 -40 -140 -171 142 -45 -113 234 375 89 181 121 -60 106 -10 -160 -185 -262 -355 -136 -42 118 51 247 180 -60
4618 -60 61 171 80 181 102 -131 -80 -54 -81 32 -57 -208 233 82 252 162 -104 444 273 -8 -183 30 14
4641 14 63 -31 233 -187 -125 290 -84 245 220 -153 63 71 -37 232 -105 -62 173 -128 -178 -157 -422 -118 50
4664 50 -30 299 -272 58 268 -162 214 283 -124 159 49 -459 -162 -375 -58 132 67 -244 -97 -75 593 59
4686 59 440 314 -185 400 351 -565 -92 -135 -394 466 -145 -247 337 -293 359 636 -59 239 -193 116 493
4707 493 -178 -169 189 -486 143 -59 -770 304 67 -28 555 -231 121 465 94 360 -151 -524 165 -6 -30
4728 -30 -12 -944 74 475 -272 282 -329 -174 711 -19 5 27 -555 173 192 -624 -158 -378 -415 429 -116 -66
4750 -66 137 -539 412 247 -53 521 -253 229 550 -374 -445 -94 -269 345 57 -387 13 38 257 563 -298
4771b98L78L26l94M31n68n48P32m72K42M91j278R87K43m69R68q80l58J206m96
4790B43k35J95r39P49J71k65K48r38M12Q12q23N45J8q65J105J15r06K67k17K01
4810a07Q08r65J20j07l44J172m74l22L55o35R55L77j531Q24J18n44Q27q79k45
4829e97Q64o90N83O6p72P24j06K03L25q71L23M74m94M80m84r14J024j97l17P02
4849C26q91K07J154o54R3L4l90O54k22m65L15o13J44N68p65M82n21k2J056l51
4869A39l54N87p77O58M68r29Q4j69J69M72p82J76J35j63M80j17q73J236n83J46
4889CO39j070J96O25p55O29k91o73P06l1l02K31l01O62L17o30O23n45j97N73m51
4910d2J80J15j067Q55L86q88L88K8n79R13j0j10J08m46N28j95j65K96p43K50N17
$$ plain form
4771 -298 80 406 12 443 -125 -673 59 -413 -171 320 -958 29 272 -197 771 -109 -467 739 243
4790 243 8 203 -736 13 184 -81 167 -771 -359 453 -370 175 193 -672 433 548 -358 -91 -308 -107
4810 -107 701 -264 -144 -251 -595 577 103 -219 136 -499 456 833 -698 126 244 -300 527 -352 -597
4829 -597 267 -423 160 226 -546 178 72 275 600 -271 52 526 32 512 28 -886 138 -59 -376 326
4849 326 -565 -358 796 142 235 269 -121 533 311 -154 161 -452 -308 260 -505 -23 -544 -566 490 139
4869 139 -215 372 -405 253 721 -208 -124 -293 -124 348 -434 -258 -123 -286 194 77 -796 440 -143 3
4889 3 642 -428 -232 393 -362 267 -24 -697 9 -22 -324 -93 -394 268 585 -45 578 33 -164 409 -42
4910 -42 138 253 -814 41 427 -461 -73 -45 -624 289 279 169 277 -169 359 164 -1 295 -448 -198 319
4931C19r89M50K07l15Q56k97p12R10l49N1L15l50q8K23k40o5k88L6L7k5L15K43
4953B44p29O97j96k93O12k39k59L24k11k49N94p47J47J6P8K87j82M06Jj95K27
4974C33k96l01L20k19K09J48o59K11L62m99K3L21k7L39l1j31rPn1J40j22J3k19
4997a38K0L11n88M87L4l21K14L85m41m9L75j26k14K95l26j09L30l45j34J4J22
5018b04k15N80k5l61K92K49l81O8J25j13J32j77k27p5K26m9j49o4M50k53J93K18
5040B40o4M4M5m14K72J6k98K69r4m48M00k70J42J91J43k58L47%k9J04j98j4j11
5063A5n2J94l53j3l3P3J61m2J6L71j81O0r8n1J58j81k27k2J91P7j08l7Q6r8PK96
5089B09l8k5m5j50K50N6k60jj55j86L80k12j55K75l56M09r0J83J69l29J39M75
$$ plain form
4931 319 -670 -220 -13 -328 528 231 -481 429 80 131 446 96 8 231 -9 -74 -362 -326 -289 -314 1 244
4953 244 -485 212 16 -277 335 96 -163 161 -50 -299 295 -452 -305 -289 -211 76 -106 300 301 106 333
4974 333 37 -264 56 -163 46 194 -465 -254 108 -391 -368 -47 -74 265 234 103 94 101 50 190 68 81 -138
4997 -138 -118 193 -395 92 126 -195 19 404 -37 -86 289 163 -51 244 -82 -191 139 -206 -340 -326 -204
5018 -204 -419 161 136 -225 67 316 -65 3 128 15 147 -30 -257 -332 -106 -155 -304 -368 82 -171 22 240
5040 240 176 220 265 -149 123 139 -159 110 16 -432 -32 -302 -160 31 174 -84 263 263 234 338 140 126 15
5063 15 -37 157 -196 -209 -242 -169 -8 -50 -34 337 156 216 118 67 225 44 -183 -205 -14 63 -45 -82 4 -94 -87 209
5089 209 171 146 101 -49 201 257 -3 -4 -159 -345 35 -177 -332 -57 -413 -4 -94 89 258 -71 68 543
5111E43n90K02j7q08P70l4m41J4J17n3M63o3J80j86J61J3n4k49J52l50J33L44
5133B47r40P61j70j90O51l39k89N07k77L99k76l5J12j54K2L39p67o1O66m04K16
5154A8j5o75J086l04j31M76o87O3L63l25O0j35j21K26o4m7L09m81M87K55n92P22
5176D88k68k24P12n29k75m6j57L62m8o44M31q7OP02q33L00N50n33P94l66q10Q18
5198C43p97J14J095j197J67L04k89N88j96m89O99k39J08K32q63N84K0k94P76j168
5218e02q7P77m69K80N08j389R67N12m46Q8l69k5P15n39j7M1o63R05k17m72M27
5239B5o07L67J215j355N61J18p72J099k27p20K70l84L67M43r53L68k6k3R44o67
5259D3l13Q72r99J054mj529R13P4l68Q12j031l62J091n42M87J80o98P53n3l16
$$ plain form
5111 543 -47 155 138 -670 100 66 -375 -361 -244 -297 166 103 283 97 258 271 217 -32 120 -230 -97 247
5133 247 -693 68 -102 -292 359 20 -269 238 -39 360 84 49 161 7 29 368 -399 -460 206 -198 18
5154 18 3 -672 414 110 -21 455 -232 -169 194 -131 -71 -206 -327 -101 -165 -212 97 -384 103 358 -234 488
5176 488 220 -4 708 179 -96 -142 -299 63 15 -629 -198 -285 -279 423 -410 -110 440 -93 701 335 -475 343
5198 343 -454 -340 755 -442 -275 29 -260 328 132 -357 342 103 211 443 -420 164 184 -110 666 -502
5218 -502 -589 188 -281 -1 507 -882 85 597 151 239 -130 -155 560 21 4 45 -618 287 70 -402 25
5239 25 -582 -215 1000 -355 206 324 -448 651 424 -296 -26 -410 -43 400 -553 -185 -211 -234 710 43
5259 43 -270 602 -397 657 653 -876 37 111 -257 555 -476 -838 253 -289 198 378 -320 433 380 64
5279F4O11j262M28R63j273R24p69q55J493k33n14Q46j097L77J391j131L34l05
5297hk74R43p28k84M99r13J149J05j138R10r22n9J737r13m82Q29p57P76J53j201
5317e78O16k83k12P65r01N02j77k15R83m32m89J081q82L92P47j641N80O12r48
5336d80P51m22o59R38m25M84K28q03P42J80m76P09r59l2R36j271N15K33j017Q10
5356a8J56n76P29q38L34Q71m57J60m40k84R17n53p7L80j060Q10K66j235J000J63
5376B48o70J248o12l97N68m17O6L05p65L17N6l19O96p73M63J55o23P79m5p76R12
5397D16m37m7N20r05q1Q11o64o5M62o67M84L44J36j13j32M93l46l11N90n71l19
5418d02R52n53o1L66o67K07N54o21M90lm0p3k19K59l28O6L45m97K1J42k30R9K07
$$ plain form
5279 64 675 -587 -159 804 -469 455 -314 -1169 324 91 -423 423 -674 -297 1094 -37 297 -8
5297 -8 -282 661 -67 -351 148 -765 384 489 -649 261 -661 -720 1017 104 -378 451 -306 470 623 -578
5317 -578 38 -245 -457 308 -593 -91 -268 -483 500 68 -421 660 -222 170 917 -724 -144 468 -480
5336 -480 271 -151 -810 128 -297 187 415 -388 354 534 58 767 -192 -224 712 -559 -44 189 -828 -18
5356 -18 138 -438 291 -547 -213 658 201 361 -79 -363 554 1 -76 304 -756 54 320 -915 85 248
5376 248 -422 826 214 -183 385 -32 34 339 -426 -109 -53 -372 324 -449 14 169 -454 325 280 -496 416
5397 416 -21 -68 452 -453 -534 277 -387 -452 10 -657 -173 171 307 194 62 555 209 -102 488 -83 -402
5418 -402 550 -3 -64 302 -365 -158 396 -225 265 262 222 149 -70 189 -139 -73 272 -225 -204 -62 -292 -193 14
5441A4j39K18J99n18L52K86l23K92j06l49K32l00j40J32p9L17m35L56o2k7L35
5462B55K33l97K57k67p7K36k26k78L21j72k68M12j60m2K8L0K09l5K44p0l39K26
5484A20j30q1N2k34l12L84j15JJ00J8j18L71K32k73K12q2K2j21j96J43l79M79
5506I3j98j17K33l0Q6Qp2O4P6k11J91l2R4k30K1j96R6q2p4J11m3M65k17p4L70
5531C32k51J40J67l86kp5l8j24J37l38O6q4L60j02m2L98NK41j83jn9qm08J61J00
5556Fm50J18J05j56M85l0J5o6j1K85P9k75O6k02j7q7k11L1M14n06K99L14l15K01
5580I2J48k41K29q0K79k74k30K14k93o1L62o85M23J74l51M14P0k43M25j81j25
5601F6N92o58q1J13n9j08k00K4J98m3J74j10j67Q45j29q51P34j68k36M55o73o1
$$ plain form
5441 14 -125 93 292 -226 126 412 89 381 275 -74 158 -142 -282 -150 -229 88 -347 9 -53 -80 255
5462 255 488 91 348 81 4 240 14 -264 57 -115 -383 29 -131 -173 -145 -115 94 59 303 233 -106 120
5484 120 -10 -91 -39 -273 -585 -201 -316 -315 -215 -197 -315 56 288 15 227 145 167 46 -150 -7 -386 93
5506 93 -105 -222 11 -19 67 75 3 67 143 -68 123 91 185 -45 -24 -220 -124 -206 -280 -169 -212 253 36 -38 332
5531 332 81 221 388 2 0 -75 -113 -237 -100 -438 -372 -456 -96 -198 -240 158 163 404 221 220 161 153 -255 -94 6
5556 6 -444 -326 -221 -377 108 78 93 27 16 301 380 105 171 -31 -48 -135 -346 -315 99 -407 -108 206 -109 92
5580 92 240 -1 228 148 427 153 -77 137 -156 -217 145 -540 -117 57 -294 120 190 -53 372 191 66
5601 66 658 0 -81 32 -27 -135 -335 -311 -113 -156 18 -92 -259 586 457 -394 340 172 -64 391 -282 -343
5623c43K49l86M27K15m08K77j72J28N39n21J13J64m65N82l06n32L91l54J23O95
5643D16q97Q2N50m71N37q9k82M46k76J33K24p00L51Mm57Q58p56j51P23p20P73
5664B98o7p27J025R4r17N98p06L02N39p45L53l40k69J047p07J4N97p40L17P03
5684F69j123M01K87p18J025k88r28P10o08N79M08r75M62J9J29O74p28j29N64o74
5704b44Q40l28j252J122k32j70R38j283J49R67o77K23Q4m80Q63l65K42K84j575
5723h94J011K17q99Q22p02n53J802q18k84N36r33Q40Q14j185O59o62j13Q91p93
5742b44J79j56o52J422j98j216J479j161N27J331j518J16N75q20R69n31q20Q98
5760A80p63N51O72j630Q96K31m15J445j533J13J188j344O68K64j427R44r3l45
$$ plain form
5623 -343 -94 -480 -53 162 -246 31 -141 -13 526 5 118 282 -183 399 93 -439 -48 -402 -279 416
5643 416 -481 -399 151 -320 217 128 -154 292 16 149 373 -327 24 28 -429 429 -327 -478 245 -475 298
5664 298 231 -496 529 623 -294 304 -402 -100 439 -306 47 -293 -562 485 -222 -208 389 -351 -34 669
5684 669 -454 -53 234 -484 541 253 -675 35 -573 6 414 -561 -99 -80 49 723 -5 -134 430 -244
5704 -244 596 268 -984 138 -94 -264 674 -609 -460 507 -170 53 137 -343 520 155 397 681 -894
5723 -894 117 334 -565 257 -445 -998 804 -14 -298 238 -695 145 959 -226 433 -229 -342 549 -244
5742 -244 -65 -221 -873 549 351 -865 614 -547 -20 1311 -207 -91 484 -336 633 102 -718 180
5760 180 -583 -32 640 -990 -94 137 -278 1167 -366 -253 935 -409 259 523 -904 40 -53 -398
5778c98R89q71l39J050m23M88l14q97J256m32j81N94j160K31R34j086P50l67q51
5797a027J499k66m15N77p43N46N21q32K23j25j6O84q52k90N38j142J196J96p85
5816e13O51n2l03J403j299j25Q10r05N98k34o28L16j10M01L94j078O31K60p00
5835d83J160m62n14P95m83NN03r96J66N27m89K47l68m9P93k43K82k59n37R41l33
5856B03k95M76o45n5O48o31J3L30p59J079n3m44K06J23K36j59l70K09j73l21N66
5877A84j61l61L57n84N05O17r29K87L05l21M80k68l71M07l17J73p7o3j80J46J26
5898d5L28n04L44R1l69L17O0m99P27l29m27L86m3k48l0L08j06J15j20K97k51%
5920BK45k28K45m8k78O9n3k56M88m11k92N81k20l04N71r8R8j50K39J91m68K67
$$ plain form
5778 -398 591 -280 -619 431 8 496 182 -715 541 109 -72 522 -638 -407 527 -559 191 -176 -1027
5797 -1027 472 206 -209 368 -375 171 692 -140 83 -42 -58 626 -226 -516 22 -1120 76 272 -513
5816 -513 138 86 -217 1186 -113 -238 572 -333 265 31 -597 -281 -391 10 404 -674 -43 217 -483
5835 -483 677 215 -299 496 13 18 521 -475 -309 218 -271 -24 -392 -441 352 109 391 132 -405 536 203
5856 203 -92 384 -261 -316 332 -299 -286 44 -715 364 311 -133 73 196 432 273 -97 112 -61 -382 184
5877 184 23 -338 19 -565 -60 557 -372 -85 220 -101 379 111 -260 147 -170 3 -74 -137 -317 -171 -45
5898 -45 283 -221 123 214 -155 162 222 -277 450 121 -306 80 37 -211 -241 67 -39 76 -44 253 2 2
5920 2 247 19 264 216 -62 7 -46 -302 186 -225 -517 64 -156 -460 111 13 111 -39 200 391 -77 190
5942A90k41m2J04j41k48K89l7Q1J32k01j41N91j4k21K43k30j22m6L2r7m6P0P7
5965a8k95K83j4J32K43j45j41K69l99k6J55k23O9J29j45m7%R6j00J31J17O8l8
5988A01K27P0l56M52o33J03L02l83j53M14m08J17J19N9q5K93M4k02K13k53r1J19
6010F9J78o63Q7L88n25M80l09qM18j09r6K38o9n9oJ49m9l99K02K5p7lo6q2J31
6035a55J15Q0K44rk73L41Ol79J38l48R2j05j69K73j80R9K89N1j90K52m49N64J03
6058C90o43M91k79m02N81m67J40M8N5o9L56l45Q7K98o7J99n02M69k04k33L18l72
6080a51j58N03n13l0O97r29M04L73l67N78l85j7J55l33J07j6l89O99l60J60K83
6101C11r10N15P65q07J30K62n28P71j10o16L42m94J44L21n26N09k33j09O85o42
$$ plain form
5942 190 -51 -93 11 -130 -378 -89 -126 -45 87 -114 -255 336 322 101 344 114 -8 -54 -22 -119 -165 -95 -18
5965 -18 -313 -30 -44 88 331 186 45 314 -85 -111 44 -179 -110 19 -126 -173 -173 -77 -177 -46 71 139 101
5988 101 328 398 42 494 -139 -36 266 -117 -270 144 -264 -147 -28 31 -54 239 283 81 294 41 -50 69
6010 69 247 -416 -329 59 -466 14 -295 -303 115 6 -90 148 79 20 14 163 114 -285 -83 -58 -135 -138 -204 -286 -155
6035 -155 -40 40 284 275 2 343 349 -30 108 -240 -148 -253 -422 -149 -329 -230 59 110 -80 172 -277 287 390
6058 390 -253 238 -41 -443 138 -329 -189 -141 -86 -155 201 -144 -57 241 174 373 -129 340 136 -97 221 -151
6080 -151 -309 194 -319 -349 348 -581 -177 196 -171 407 22 5 160 -173 -66 -82 -471 228 -132 28 311
6101 311 -599 -84 681 -126 4 266 -262 509 399 -217 125 -369 -225 96 -430 79 -154 -263 422 -220
6121b20J85M25p72Q72K44j250R07l67k40O65p55R6j00l21Q51J8n61M06j58K35
6141A60Q07j510N40N15q97O58m54l91Q84n90K01L83o81O1P67n53M86r4m91P92
6161E93o58J61j03q29P75J70n71P50p01k0J255q52l03O53p28Q92k51k73K4l48
6181c64N11K62r94O08l31l21J284n97n54J022q16M59R17j671M44R4q7M89m80l64
6201d89Q93p78Q42M3j069P82k32j26R37j072j78R56j152O67K12j549J145J36l92
6220d24R29j079J98Q23l28J66l25k79J088n51j78J57j144O67Q27j259Q67n03k94
6239f42J363n23j76L9j09O34j07p64M47o23K37P37j070J68L93m33R51j00j108
6258f86J083m70Q5Q38q74L7K28p37R22m96m72P14n46M18M30j025P28K72m36N63
$$ plain form
6121 -220 -35 390 -382 490 734 -516 391 24 -216 449 -306 -210 -310 -631 220 238 -323 83 -75 160
6141 160 967 -543 -3 512 -385 273 -181 -572 312 -278 -77 306 -375 -314 453 -100 386 292 -199 593
6161 593 -65 96 -7 -836 -61 109 -462 288 -413 -433 822 -30 -333 320 -408 484 233 -40 -16 -364
6181 -364 147 409 -585 23 -308 -629 655 58 -496 526 -290 169 1086 -585 -141 -47 -134 355 -125 -489
6201 -489 404 -374 468 511 -558 224 -8 -134 803 -269 -447 509 -643 24 236 -1313 -168 -32 -424
6220 -424 505 -574 -376 447 119 285 -40 -319 769 218 40 197 -947 -280 547 -712 155 -348 -642
6239 -642 721 198 22 61 -48 586 479 -285 162 -461 -224 513 -557 -389 4 -429 522 422 -686
6258 -686 397 -73 12 850 -24 13 241 -496 426 -70 -542 172 -374 44 474 -551 177 449 13 576
6278E76o94l19P96m22qL91q67N37L29n65O19m39rL81l77N35l32k48L27K8p61P55
6300B33p57K46N56p21R0L07l25N30K28o35M91l15J53K23n08j05jj05O75l96l25
6321d61L22j48L09M69p23O48M4l27K36l13m82O98l40j86J2m11N59n6J60L21o03
6342b72J61M82n01N57j09q56N64J17k68J46k30N0K52l28J55K33k13N21k72k2K4
6363A91o03M68K45n64O5jk89M25j12k18M01J20J31O2l04J89n8j17J63m14r7L64
6385D7n57M19l9k51M14R1p5K30j57j25N08n91p7P9j07L13j33j56l3j38L56J16
6407A34k04J65k6j43N05j50n24M49l30J26J66k94m7p1J08J70j24j50K23P2K17
6428B72j87j29K81j2j98m7k60J21K53j72k94N24m42K92K93m04L17N3J88l26j18
$$ plain form
6278 576 -118 -437 359 -63 -71 320 -547 -10 319 -246 373 -66 -75 306 -71 464 132 -116 211 239 -522 233
6300 233 -524 -278 278 -443 -353 -46 -371 159 387 -248 243 -72 81 304 -204 -309 -310 -415 260 -136 -461
6321 -461 -139 -287 22 491 -232 416 460 133 369 56 -426 272 -68 -254 -242 -653 -94 -150 10 331 -272
6342 -272 -111 371 -130 427 318 -538 26 143 -125 21 -209 -159 93 -235 -80 153 -60 461 189 167 191
6363 191 -412 56 301 -263 -198 -199 -488 -63 -175 -393 8 128 259 321 17 206 148 31 194 -220 -317 47
6385 47 -510 -91 -130 -381 33 124 49 279 122 -3 505 -86 -163 -84 -191 122 -11 -167 -200 -338 18 134
6407 134 -70 95 69 -74 431 281 -243 206 -124 2 168 -126 -173 -244 -136 34 -90 -240 -17 55 272
6428 272 85 -44 237 225 27 -20 -280 -159 94 -78 -372 152 -290 2 295 -109 208 261 449 123 5
6449EK09l50R5N4m00J51M38n23K03L12k83M05k19M0J27p4l18J95j7k28J1Lq6L22
6473G2kj12k0J75J72j79J95Q9k47j60Q8l29J58j57K11j59N5J42p4N58k55j96J68
6496A93J70m61N28m02k25M25k13l9J16m98K35LJ07K9L80j41p1j54L65k55k0L2
6518A04j79k42O02m34m41Q36l57j61L76m0J95o2j38J31j97j23K02k85J39l93R7
6539c70O06o48L80M71r30O56K54m15K43N3k43M2J89l82j99j57N12j59m0K43l60
6560b54L76K61m96K54K93o22N86j41o10K99j04r1N73o07J71K38k63M53m43m4P61
6581E90q34N35K09j154P95j18k33L15l85k78O63k05J20K40o58N98K4j8Q6l77j26
6602b11O54r32N43j89n53Q74l36n5L16k86J25P44p40l7J20l02N76l92J5L7p94
$$ plain form
6449 5 214 -136 -41 13 -387 -236 202 -321 -118 194 -89 316 97 137 264 190 -128 67 50 -178 -167 -164 -250 72
6473 72 70 -42 -62 113 285 106 301 390 143 -17 71 -258 -100 -257 -46 -205 -150 -8 -82 476 221 25 193
6496 193 363 -98 430 28 -197 228 15 -24 92 -406 -171 -168 -61 -32 348 207 136 -18 347 92 72 104
6518 104 -75 -317 285 -149 -590 246 -111 -272 104 64 259 197 59 190 -7 -130 72 -213 -74 -467 -370
6539 -370 236 -412 -32 439 -491 165 419 4 247 300 57 99 288 -94 -293 -450 62 -97 -137 106 -254
6560 -254 122 383 -113 141 434 -188 398 257 -353 -54 -158 -249 324 -283 -112 126 -137 316 -127 -171 590
6581 590 -244 291 500 -654 141 23 -210 105 -280 -558 105 -100 20 260 -398 200 224 206 292 -85 -211
6602 -211 443 -489 54 -135 -688 186 -150 -205 111 -175 -50 694 -46 -83 37 -265 311 -81 -66 -29 -823
6623h23Q43K02n70N33j73K0O68q53L1P17p59L87K37r57K95K19j61L41l71j61M63
6644A28k00N01l28o54J197p46rN71j132M41M57n27L21j47o90J038m5k43M06m26
6664h7K02J51m73N45o60o3P73q17N23j70q33J074K3q62J037l24l45J063k76m85
6684dm0k87O27r6p25O41p43Q98K3n31J71K30k58P38n59m40R87o27R0N36j336L57
6706c48L16k23O13m05k39L53J24O1L69j085R95j97k92M73o95l25O62l84K08r1
6726a10n47O34M25m69L43n19K65O21m26k48M9j66M32n9n61M79p03L89O57q82N13
6747A17Q2m95Q19l94l10M36n47Q24m52p56N29r9p6O49p19PO69m34M50L7o54N14
6769A97J96m52K96n14N2M21k16j20R5n23P45j01o7J79n80L86M20p57P11m26l70
$$ plain form
6623 -823 20 222 -348 185 12 32 700 -153 -122 595 -164 223 460 -497 -202 17 -144 197 -174 -335 128
6644 128 -72 429 101 -553 644 -102 -111 460 -672 -231 226 -301 20 -127 -817 221 176 -67 339 -87
6664 -87 115 266 -207 338 -322 -385 388 -429 94 -76 -909 165 188 -674 363 39 -306 757 481 -4
6684 -4 -44 -331 296 200 -525 116 -627 271 294 -237 -66 164 -94 644 85 -355 632 5 95 631 -705 -348
6706 -348 -32 -255 358 -47 -286 67 191 252 621 -464 531 334 42 515 -180 -505 157 -227 -19 -110
6726 -110 -657 -23 402 -67 276 -243 22 643 217 -31 18 -148 284 225 -336 143 -560 -171 486 -396 117
6747 117 199 -296 523 129 -181 255 -292 532 80 -676 -147 -246 -322 327 -392 -385 284 -150 300 337 -317 197
6769 197 393 -59 237 -277 -225 196 -20 -140 -45 -568 177 76 9 188 -392 -6 414 -343 368 -58 -428
6790d28P76k65l56L00k10K11K58k92L14l68L9M08m02Mmn95P76o5l87K92k57J76
6812g5L47k22k84M87m23M56j69j76P7l07J08L66p96O01J21o86J033n13o7L41j88
6833C1L2J98k65lK47qm17M5R1L78o63M07k6j28M37k19k54M23m20J6L73j22j16
6856C7L4m00M26q9k66M91j72j05J39qK35k55P6J87l31l84O37l68j60M22n98K27
6878b25K29p3Q0J02L0m3J30L4j90K5o0o3n3J60n27K75N7k92K44L46l50N67j56
6901B47n23N69j12k91Q8K40j58j39jJ51l28O7J19k12L13K94n23L79Ol46J01R5
6923C6n8O0n8j27L12k15j54J27M05q1j24J21j9j86m2k67J43R8q3J0R4j72P9Q9
6947a2j94L00j02J8j39J36r4k5J74m6n4l84O07l64j04J85k83J48M67j54K9J54
$$ plain form
6790 -428 348 83 -273 27 -183 28 286 -6 308 -60 -21 387 -15 -11 -15 -610 166 101 -286 6 -251 -75
6812 -75 272 50 -234 253 -170 286 117 -59 18 -289 -181 185 -611 -10 111 -575 458 -55 -122 219 31
6833 31 63 261 -4 -7 240 232 -185 -140 -49 329 -334 73 47 -81 356 137 -117 306 -114 -98 275 153 37
6856 37 71 -329 97 8 -258 233 61 -44 95 87 322 67 143 330 -1 -385 252 -116 -276 146 -452 -225
6878 -225 4 -69 11 113 143 100 230 264 74 99 39 -24 -77 83 -444 -169 -112 -404 -160 186 -164 403 247
6901 247 -276 293 181 -110 -22 218 60 -79 -80 71 -257 -190 -71 -283 30 324 -199 180 186 -160 -59 36
6923 36 -22 38 -20 -147 165 -50 -204 -77 328 247 123 244 225 39 -3 -270 -127 -29 -112 -102 -8 -180 -101 -12
6947 -12 -206 94 -8 10 -129 7 -87 -112 62 16 -38 -422 185 -179 -283 -98 -381 -233 234 80 109 263
6969B63k81J50NK10o58M32o4l25K15P8m77K93L16k53J81M32m70K54j22l65K27
6990D1l8k16J49k63L01m06K36L04k95L09j57M2R7L84o18M40k84p2J98j05l23K32
7012d4q4J39P5j84n2K55K52J8k35N8J93m29M10n83k33L54K16p03R11o46K06L50
7034B44j8k01L35l84L70k00k90J58j89J61Q5m45N10m60J7P63m02j31M38l36l8
7055a3L83n69J65q6KL21m15k90M95k41O98m29j17L97l82j35N99n83K80K42k22
7076A00J68k33o32M69K52o4J05m07K44m3J84K92m85m8M20m20j31L44q32O01L72
7097B56q22M22l17J82P13j51l38L66m66K89L63q09L45l40J8N23o91O20k08n89
7117f34R89L8p52P84n22J21N33q01p6K65q4N30o83k38N92l66M88K83r21N57r0
$$ plain form
6969 263 -18 132 137 347 -311 121 57 -268 -53 25 -452 -159 157 -96 85 517 47 301 179 -186 41
6990 41 3 -213 -64 -327 -26 -432 -196 108 -187 122 -35 7 104 488 -130 310 26 -46 152 47 -276 -44
7012 -44 -128 11 86 -98 -150 105 357 375 140 198 391 -38 372 -211 -444 -90 126 -577 334 -312 -106 244
7034 244 226 25 360 -24 346 146 -144 14 -175 -14 71 -374 136 -324 -307 456 54 -77 361 25 -13
7055 -13 370 -199 -34 -120 -118 203 -212 -502 -7 -248 450 21 -96 301 -81 -216 383 -200 80 322 100
7076 100 268 35 -597 -128 124 60 165 -242 2 -41 143 435 -50 -98 322 -98 -229 115 -717 -116 256
7097 256 -566 -144 -461 -279 434 283 -55 311 -155 134 497 -312 33 -307 -289 234 -457 163 -45 -634
7117 -634 355 393 -359 425 -97 24 557 -244 -320 -55 -139 391 -292 -530 62 -304 184 467 -454 103 13
7138A3m3M61m71l77O53n05L49j16o81Q39m1k36M95o16q6J051r07O20m46o02J111
7159D65l83k74P50j330M91N96n10Q0J15m36Q24k32m84O34q14Q23M8n74N30n51
7179b32k63Q93q04O9P28p58O57K28q33L18M3j0M41p96R0L88m60N70m24m92O25
7200b2j97K36O56j154O82L34p56P29m01o62Q18k03j08P3n58N49K95o69P91n73
7220a40q2Q98r72K48M96r15O28K2n68M42n01J29M92m28K81M0l43Q35k28k86J38
7241A86m25M98K62j000M95j11l28Q79n31m58O01k34L02L06o76M66j8n3K73p40
7261c06R8K74n71P64m08n33O86q6j22P20o72K79L54n49L68j90l73M05r6P3m9m94
7283d28L14K71m87L81q5j03N01m35m2L08k41k8L70n92R3K14j41k1l2J30Q2l6l4
$$ plain form
7138 13 -30 431 -40 -417 236 -269 80 -36 -717 122 81 -155 340 -276 -362 689 -218 402 -44 -646 465
7159 465 82 -192 558 -772 -281 315 -195 -115 0 -436 388 156 -328 306 -508 315 363 -211 319 -232
7179 -232 -495 398 -406 -337 391 -367 290 518 -315 3 46 36 477 -319 -229 159 -301 269 -155 -647 -22
7200 -22 -219 17 673 -481 201 535 -221 508 107 -555 263 60 -48 25 -533 16 311 -358 433 -140
7220 -140 -222 676 -296 -48 448 -467 161 183 -385 57 -444 -315 177 -251 30 70 -273 562 334 48 186
7241 186 -239 259 521 -479 16 -95 -423 456 -75 -533 68 -166 136 442 -234 232 214 161 434 -306
7261 -306 -208 66 -505 259 -149 -682 4 -82 -204 516 -156 123 477 -72 296 106 -267 138 42 115 66 -428
7283 -428 -114 157 -330 51 -34 -137 364 -71 -113 195 -46 -74 296 -296 -203 11 -130 -151 -183 -53 29 -7 -41
7306d1J50j85N16o62J52j05J8o7M01m85M33r7l29K15K60j20%K29k74K7n6J37j19
7329bj17K74l87k7K34l03J68J50J07J90k15j40M53k93N4j05l2J99n88K92j63r7
7351c48L08k4j04q7K55K7L40j86m88O11k83l90N32m13R6J42p6j89J55L18P8l01
7373b7L24p1j48j18L2N7j61m2o8K67m1j42l1N2J42O3J03J62j3k42j0R1k57o0n6
7398a94M1l48L36J65m04L18L87l84J55P8J75p4Lk77r5J3r7J24j28L75k97K48k8
7421I2k69L09O4k72L36J74l70J01n1j19l12P9M7J02rM4n4N3k01L35o3P2J5N0N6
7446B09k80l0K85m46R6K40l13L48k32K81J5j34q6J80o5m9M9L2k20r4L01j20m27
7469d60M64Q4j57J35j70L9L79j05m31O23m11j9Q1k30J86l00K95j2n5N2K41p5o4
$$ plain form
7306 -41 109 -76 440 -222 -70 -175 -157 -224 177 -308 125 28 -301 -86 174 54 54 283 9 36 -20 117 -2
7329 -2 -119 155 -232 -259 -25 -328 -160 -10 97 287 72 -68 385 92 146 41 9 208 -380 -88 -251 -348
7351 -348 -40 -64 -168 -255 0 27 367 181 -307 304 21 -369 163 -250 -154 -12 -88 -277 -122 196 274 -27
7373 -27 297 226 78 -40 -8 49 -112 -154 -222 45 4 -138 -169 -117 25 88 191 353 340 98 88 179 -78 -138 -194
7398 -194 -153 -501 -165 0 -404 -86 301 -83 72 150 325 251 254 -23 -118 -105 -202 -78 -206 169 -128 120 92
7421 92 -177 132 196 -76 260 434 64 165 114 -5 -317 -238 -191 -89 -98 -54 -108 -55 -256 79 16 88 103 153 209
7446 209 -71 -101 184 -262 -166 74 -239 109 -123 158 173 39 -47 133 68 19 68 100 -120 -214 87 -33 -460
7469 -460 4 88 -69 66 -104 -65 314 209 -222 401 -10 -29 52 -178 8 -292 3 -9 -64 -12 229 154 90
7492I0p0n8K96l21K33Ql41j2j0J15J23j89k5J12J23J22M7o2K13n69M21j92l57
7515c03J61J6j89L93j83m17Q54l83L37j03l08J28J90j66L04o24M5N30n43L98j18
7536A9n43N15J08k75L89k74L05J68l54J0k5K1L01m58l09J53j53L44L13o20O68
7557C03k18k54P51l86k48L68m70N05j50m86L44P4l17L78l16p6L80k49M39j79o52
7578d59O97p1j31L47p46qN53m86M97k99k05N75j80K3K53n68M11M65o60L96n83
7599a79k41J001r34K8M22p90R15J16p23M39J37j92O26p77J82J27n82Q69l33n02
7619c91N33m87K39P83j113L67M83q44P84k53k41L81n11K04L94o91K31N0l43Q55
7639D30n71j45N32l21K94R1o93N95J72o94L92l52q4N75q65P15qn83Q17m38K79
$$ plain form
7492 90 20 -38 258 -63 170 178 -163 -175 -185 -70 53 -136 -161 -49 74 196 243 181 394 -175 246 54 -303
7515 -303 -142 -126 -315 78 -105 -522 332 -51 286 183 -125 3 193 27 331 -293 -248 282 -261 137 19
7536 19 -524 -9 99 -176 213 -61 244 412 58 68 43 64 365 -93 -402 -249 -402 -58 255 -365 303
7557 303 85 -169 582 196 -52 316 -154 351 201 -285 59 133 -184 194 -122 -198 182 -67 372 193 -459
7578 -459 238 167 36 383 -363 -371 182 -304 193 -106 -311 264 84 107 360 -208 203 668 8 404 -179
7599 -179 -420 581 -353 -325 97 -693 222 338 -385 54 191 -1 625 -152 30 157 -425 444 111 -391
7619 -391 142 -345 -106 677 -436 -69 414 -430 354 101 -140 241 -270 -66 328 -363 -132 -82 -425 430
7639 430 -141 -286 246 -75 219 310 -383 212 384 -310 82 -270 -354 221 -644 71 63 -520 297 -141 138
7660A38L03r49P89J13j71Q0m73n53R25k65q4L50n60L97M41o75L50q0m07Q79n63
7681a5j99M68n68M23J75p59M85R6m08N57l33j68L39l37P87n8q41M78r4J97l3n91
7703c99M70p5l18P95n27k66P63m62J82J42l84K34k5k04J95k68l75Q72n16J4Q0
7724g2k37N89j74j36L49m93K96L98o99K59j90j63L74j98l28L78rJ14Q5k35J83
7745I1N4r2L09o27J81M3j79K67L27p70L51m4p7L32l11P9J74qq8N9j28P9J77k67
7769f8J50k77KJ38M7o4J61m17N82p2l14L36k73J95k56K20j44k41j6K49j05K93
7791A26Q2l89J22L67l38K87J54n76L21k26j17K39j25mP4q2p6K11j5J6j06M6L9
7814C0k8J01r8k77M13j25m6M05o71j00N89k70J45P9l69L87p3q7L65K7k34j60J64
$$ plain form
7660 138 441 -508 281 394 223 303 -170 -723 202 -63 -147 203 -357 40 481 -194 156 76 -331 548 -15
7681 -15 -214 254 -314 109 284 -475 10 106 -302 255 -78 -246 93 -244 543 485 -356 122 28 225 192 -399
7703 -399 71 -4 -322 473 -54 -320 443 -19 163 305 -79 155 130 -74 121 -147 -522 350 -166 -152 -72
7724 -72 -309 280 106 -30 319 -174 122 520 -179 80 -110 -273 101 -97 -425 -47 -56 58 143 -92 91
7745 91 145 53 362 -265 -84 -41 -220 47 374 -396 -45 -89 -166 166 -145 -66 108 100 12 71 -57 22 199 -68
7769 -68 82 -195 -193 -55 -8 -72 89 -328 254 182 -132 204 -69 126 -130 90 -54 -295 -311 -62 -167 126
7791 126 208 -181 -59 308 -30 257 411 -165 156 -70 -187 52 -73 -77 -3 -85 -161 50 35 51 -55 -9 30
7814 30 2 103 5 -272 141 16 -30 375 -296 -396 193 -77 68 147 -222 165 92 5 370 397 163 3 167
7837A67N5m63J10K56j27j47j5L3J24L07k38rJ44r1j09N6J02k97n3K37j52mj3J44
7861A7K5K06k87J48J67j69M6k6k39K13k37o5J22Q3l40J68J03P5J19Kr2L2j50L68
7885B89k83J84r1j18qj06J7K1R5k6L99k13j59J48j72J24J43k15K7m27L82j06k1
7908a16L85n56J57J17kK0J10m0RJ22k36j85M57l96J09l98M32l60J13L25j48j72
7930b53N96o7L4R2m76Q9O0j55N3P5l84J83M29l99R1PL4J39l9J56m17K98K72m96
7954g8K37p0l51L66o2k80J28J57p3K59q3n2mr5J57k29j73J97j68J33J02j77J17
7977d2J77l64L68j40J31m0j44K37j34j09kJ73j87K04j44M9K7j59J30J78l82J98
7999B5q1j6L91l09j21K92o23K94J72j73J70K1M2L52p79M36J43k39L24k93m14Q18
$$ plain form
7837 167 222 -241 -131 125 -2 -149 -164 -131 -7 300 62 53 197 106 -3 53 155 -142 -195 42 -110 -114 -127 17
7861 17 42 248 -39 109 276 107 153 127 -112 101 -136 -201 -79 4 -336 -168 -65 10 129 131 39 71 -79 289
7885 289 6 190 99 -19 -27 -133 -116 -95 0 -26 373 160 1 149 -23 101 244 29 56 -371 11 -95 -116
7908 -116 269 -287 -130 -13 -15 5 115 75 84 206 -30 -215 242 -154 -45 -443 -11 -371 -258 67 -81 -253
7930 -253 343 276 310 402 -74 15 75 -80 -27 48 -336 -153 276 -123 -32 -25 9 148 109 265 -152 146 418 -78
7954 -78 159 89 -262 104 42 -238 -110 47 -26 233 150 98 94 -1 156 -73 -246 -49 -217 -84 18 -159 -42
7977 -42 135 -229 139 -1 130 90 -54 183 49 -60 -62 111 -76 128 -16 33 60 -99 31 209 -173 25
7999 25 -56 -72 319 10 -111 181 -442 -148 24 -149 21 42 84 436 -343 93 236 -3 321 28 -386 432
8021D32o23L20k7l91L88K8j95j2Q7j84M63k19M9q1l02M04J38n75L28k33r8N48
8043B45m83K86R0m20M50N2k65L08n97L33M19m66J28j65j40N14l99q4L25o29N67
8064F9N0k67J86K14m81P35m55k74J96k94L43p4j38L87lk19L16o69K76N63o98O85
8086D48m59l17L20k08o2J96m38K21N55j93m6k38R0M65j83j56J40n79N99o1l14
8107b20J65j82k59N50m52M69j29k27N98k31j78K75k51J66L04o71J81J4k59O56
8127C19j19n05M86j74L6N66r25M75L1lM8j43j48K20k42oJ70m94O01l0n0L00m63
8150e0l3M53m54J46K93p71R30m00j16j71L6j2K10L4Ko9k14L42J10l81J87k59L62
8173A75R2p38M40k21qL48j06p1Q9J87k15L39k56K4k88L03O1l55
$$ plain form
8021 432 -191 129 102 -289 99 127 -68 -80 7 -177 286 67 116 35 -267 137 275 -300 28 -205 -303 245
8043 245 -238 48 138 -282 168 220 -45 263 -334 -1 418 -48 80 -85 -225 289 -110 -194 131 -498 69
8064 69 119 -148 38 252 -229 506 51 -223 -27 -321 22 -52 -190 197 194 -25 291 -378 -102 461 -237 448
8086 448 -11 -328 -8 -216 -278 -82 -520 -299 256 63 17 -221 -131 334 151 -5 135 -444 155 94 -220
8107 -220 -55 -237 -496 54 -398 71 -58 -285 313 82 -96 179 -72 94 398 -273 -92 -78 -337 319
8127 319 200 -305 181 7 43 609 -316 159 190 187 235 92 -56 164 -78 -84 86 -408 193 163 113 413 -50
8150 -50 -83 370 -84 62 355 -416 514 114 -2 -173 -137 -149 61 95 97 28 -186 156 266 -115 72 -187 175
8173 175 267 -471 -31 -252 -260 88 -18 -89 0 187 -28 311 55 79 -209 94 155 -200
8191b00
$$ Imaginary data points
##PAGE= N=2
##DATA TABLE= (X++(I..I)), XYDATA
0@%%%%%%%%qJ6j6J6k4L3m1N6p2Q8j04J21j45J76k09K48k90L36l92M54n24O05o91
31c67P87q96J012j140J285j444J618j811K022k249K495k768L068l393L748m138
47b171M565n030N538o099O721p407Q170r023R984j1077J2326j3778J5485j7520
61i316K0003k3107K7112l2498M0157n1947P2537j18347L88727k5994n23947M31632
73A95012m29748L46259K99885o88301J36103M7191j21733N44543m26558j54948
83b52295L19060k39302M53165J4059n86592M30723j12069n6972M52568o32206
93b09861o1363M19594l39330L14779o9197m71026M74004Q680m6107K22999m54783
104b11611J92448K70315k71396K35066k95388k13006N18877k75182m0762J74163
$$ plain form
0 0 0 0 0 0 0 0 0 0 -8 8 -8 8 -16 17 -24 32 -40 48 -56 65 -80 96 -113 135 -155 181 -211 243 -281 324 -367
31 -367 420 -476 536 -604 681 -763 855 -956 1066 -1183 1312 -1456 1612 -1781 1967 -2171
47 -2171 2394 -2636 2902 -3197 3524 -3883 4287 -4736 5248 -5829 6497 -7281 8204 -9316
61 -9316 10687 -12420 14692 -17806 22351 -29596 42941 -75406 313321 287327 -236620 195012
73 195012 -234736 111523 411408 -276893 -140790 -93599 -215332 329211 -97347 -252295
83 -252295 66765 -172537 280628 294687 -291905 138818 26749 -30223 422345 -209861
93 -209861 -271224 148370 -190960 123819 54622 -416404 57600 66280 20173 243172 -211611
104 -211611 -19163 251152 -20244 214822 -80566 -293572 225305 -49877 -90639 83524
114H3524m59680L69700K38366l79364K57220j52266r8796M63895k49498r2386
124a9285P4455k54074L23308n365k95297J72776k06445J23843L30028l78277Q2867
135e1466J11424j95629L94720r5243l11750K52230j37984L8636J90034l47151
145a52179L7124R0924r3353K26806j50175j05145K09859j09758J61002O3598k96995
156a18292J88978J2912j23459K10426k37373j02013K37376j51306N4145N2875
166B4269j95460J80628M8482o9786J15805j28922M0228J16201j42742P9449n6472
177A1680j33406J82397r3893o9314J29787j51479P3089J39312j44978Q2206K4572
188D9973p5403J38156n2100o8605M5846q2647N4863R474j11183N9235l4718L801
$$ plain form
114 83524 -376156 -6456 231910 -147454 109766 -42500 -141296 322599 73101 -19285
124 -19285 55170 -198904 124404 119039 -176258 -3482 -209927 -86084 243944 -134333 -51466
135 -51466 59958 -135671 259049 163806 -147944 104286 -33698 4938 194972 -152179
145 -152179 -115055 -24131 -117484 109322 -40853 -145998 63861 -45897 115105 178703 -118292
156 -118292 70686 83598 -39861 170565 -66808 -168821 68555 -82751 -28606 24269
166 24269 -171191 9437 57919 -11867 103938 -24984 15244 131445 -11297 68152 11680
177 11680 -121726 60671 -33222 -102536 27251 -124228 -51139 88173 -56805 25401 49973
188 49973 -25430 112726 60626 -7979 37867 -44780 10083 19557 -91626 -32391 -67109 -63308
200f3308J20521r8474J1271Q9908p0805Q5719J7429j16337O4963j7199m6411N7176
212C4453p7644k7213M1025k6376N0589m756l1577O5706q495K7009M1181p5684
224H218K5567J8798o2439L7032l4878o3051N0601k1401r527M2184k9284K4122
236a4058M0908q686K9046m408r979J8284l1449m795n059m5090J0619r115k4880
249e8662L1651p289N00M2027m564J2692K7653j2258R744k324k4016k05j8409j8145
263b1605l683j9041K142P291j661K1764J1629O532K2852O390N132L835j3775o431
277B1371r740j8437r150j4790q666N322k092R655J6640N440J5708J8395L346M084
291C7086J972j1082q316p339j9364j5508k387q369o328J1203P158N188K1019J3638
$$ plain form
200 -63308 57213 -41261 -29990 59918 -10887 74832 92261 -24076 40887 23688 -22723 34453
212 34453 -43191 -70404 -29379 -55755 -5166 -9922 -41499 24207 15712 42721 83902 8218
224 8218 33785 52583 -9856 27176 -7702 -70753 -20152 -41553 -51080 -8896 -38180 -14058
236 -14058 26850 18164 47210 42802 32823 51107 19658 14863 9804 -35286 -24667 -33782 -58662
249 -58662 -27011 -34300 -33800 8227 3663 16355 44008 31750 41494 39170 15154 14949 -3460 -21605
263 -21605 -25288 -44329 -42187 -34896 -36557 -14793 -3164 3368 26220 32610 37742 41577 27802 21371
277 21371 11631 -6806 -15956 -30746 -39412 -34090 -36182 -26527 -9887 -4447 11261 29656 33002 37086
291 37086 39058 27976 19660 12321 -7043 -22551 -24938 -33307 -39635 -28432 -21274 -16086 4933 18571
305A8571L900J5224L892j1245J866o988k5228q978n811k0112k348O014o461J0843
319b6861K1726L737J2086K2868j910l367J4322j2740k1112L505k0940k4102J1131
332b1657j1979j3241K2489p8R67L1460R462j24J3377M786o079m783k90k3559k0659
347a9908J0706k2065j2738K9823k3239j181M8539j2947J1967L4339k9891J2644
359B6049K2785k8773m163j3388j9581J468j0568O593j5913q776M6773j2303P946
372a851M5944m6809K3783M7995o3569K0173O293o6867M0315p470m6057L0302k1476
385c9294R709L3581j9998L1084q578N122N9435n9685L033L5457p9483M9964J618
398B1965j03488P1809p982m6132Q4875n2391j0943Q0894l3644L5020Q57n3921
$$ plain form
305 18571 22471 37695 41587 30342 32208 25220 -8 -8986 -14797 -34909 -37257 -31243 -37704 -26861
319 -26861 -5135 -1398 10688 33556 31646 28279 42601 29861 8749 12254 -8686 -32788 -21657
332 -21657 -33636 -46877 -24388 -24466 -23499 7961 17423 17299 30676 35462 29383 24600 24310 751 -19908
347 -19908 -9202 -31267 -44005 -14182 -37421 -38602 9937 -3010 8957 43296 13405 26049
359 26049 48834 20061 15898 2510 -17071 -15603 -26171 -19578 -35491 -44267 2506 -9797 -1851
372 -1851 44093 -2716 21067 69062 5493 25666 31959 -34908 5407 -2063 -48120 -17818 -39294
385 -39294 -29585 3996 -16002 15082 6504 11626 71061 11376 14409 49866 -29617 20347 21965
398 21965 -81523 -9714 -17696 -63828 21047 -31344 -42287 38607 4963 39983 40840 -13081
410a3081N8244k7719l864K3575j11395M9051L8022q0737Q6555m9512o5557J54032
422E7614m1966k0507P4919j09888N8126P4077r6295K9436n2048l0447R9521p3799
434c1257L829J1644q6213J40587K139q4512J10956r4098J2136J53583j48616L759
446f063M4590j18390J25062j1990j25067Q4060m7921L9280Q7056j25941N7909
457B585J9887m2239J43220j13497o3381J28567j18075O2067N0337k02320J13204
468a9645L8888r1282J34209r9363m2376J55177p1979M8487L194j31213J31452
479E5549j8049m8378P7408j79622N1384J34960j45595R0492l2724j24915K30992
490I1502l6376q5931J06926j39214P2089J20563j56608M0579m6580n4821J68385
$$ plain form
410 -13081 45163 17444 13580 37155 -74240 -25189 12833 -67904 18651 -30861 -96418 57614
422 57614 15648 -4859 70060 -39828 18298 92375 -3920 25516 -26532 -56979 42542 -31257
434 -31257 -27428 -15784 -101997 38590 40729 -43783 67173 -26925 -14789 138794 -9822 -6063
446 -6063 38527 -79863 45199 33209 -91858 -7798 -55719 -16439 70617 -55324 2585
457 2585 22472 -19767 123453 9956 -53425 75142 -42933 19134 69471 -132849 -19645
468 -19645 19243 -72039 62170 -37193 -79569 75608 3629 52116 55310 -75903 55549
479 55549 37500 -10878 66530 -113092 -61708 73252 -72343 18149 -14575 -139490 91502
490 91502 55126 -30805 76121 -63093 8996 129559 -27049 13530 -33050 -87871 80514
501H0514j01808l4017N9231j24146J64538M7771j62806J22851o5684k2152J98849
512A63141j65838m5675Q8716j20109J26080O511j66901J00116k7708K3633J12687
523I4653j55225M1366O5926p3986J45241q7585j14365J54314r3805J7509Q7781
534H1824k01671P4994Q3247j00985J17805p0323p2979J60235n4429J7465K5259
545F0442j37540J13562J7873q3257Q0248j31650K542J52494j23405L6112K4371
556A1792j21417J67592J5402j06003Q8015q3529J6156J18012j18899K530n964
567a6313o6438J30166m2786o6394O3885q1258Q9248Q7531j37868N4754K364m8000
579c1109J42964q4298q7283Q2264o7071M9518M2495j28633M9612J6265j2412R5496
$$ plain form
501 80514 -21294 -55311 3920 -120226 44312 92083 -70723 52128 -13556 -35708 163141
512 163141 -2697 -48372 40344 -79765 46315 52826 -114075 -13959 -41667 -18034 94653
523 94653 -60572 -19206 46720 -27266 117975 30390 -83975 70339 -23466 -5957 81824
534 81824 -119847 -44853 38394 -62591 55214 -15109 -88088 72147 17718 35183 60442
545 60442 -77098 36464 54337 -28920 51328 -80322 -77780 74714 -48691 -12579 11792
556 11792 -109625 57967 73369 -32634 55381 -28148 -11992 106020 -12879 -10349 -16313
567 -16313 -82751 47415 4629 -61765 2120 -79138 10110 97641 -40227 14527 16891 -31109
579 -31109 111855 27557 -59726 22538 -44533 4985 47480 -81153 -31541 -15276 -27688 67808
591F7808q2472j5105P4503n4002P4819q866j16943Q5479j9837l1850P8114j11697
603f0049n457R0859n9129N1245k384p4885R5570J674k1314L5549q3377L2395M9445
616E0142o9769L1436m0392m1025R9210m1442j9521M6739o5268O0610N2691p3004
628i593L5064j7207k5169P5482n0367l3659J9523m4878N4215J0879o3445L8551
640a0604j3655J4711P0437o2367l701L5132l5638N2267j3472p2558L8749j4891
652a5590l476L7802o1224N694L6678j7343M6237j3667l4912N0000j1528N201J8287
665D2159o2761J4495J9722l3464K3536k7601k2884N0796j4227M276K1302l1007
677a5658L3940J6768k6987K2468k3470j3465L0662l3235o442P445k8840K7987
$$ plain form
591 67808 -14664 -29769 44734 -9268 65551 56685 -60258 25221 5384 -26466 51648 -60049
603 -60049 -65506 25353 -33776 17469 15085 -59800 35770 37444 16130 51679 -31698 697 50142
616 50142 -19627 11809 -28583 -69608 29602 -11840 -31361 15378 -49890 10720 63411 -9593
628 -9593 25471 8264 -16905 58577 8210 -25449 -5926 -50804 3411 14290 -49155 -10604
640 -10604 -24259 -9548 60889 -1478 -5179 29953 -5685 46582 33110 -39448 -699 -15590
652 -15590 -19066 18736 -42488 -36794 -116 -17459 28778 15111 -19801 30199 18671 23872 42159
665 42159 -20602 -6107 13615 -19849 3687 -23914 -46798 3998 -10229 -5953 15349 -15658
677 -15658 18282 35050 8063 30531 7061 -6404 24258 -8977 -15419 -7974 -36814 -8827
689h827N096k0962K6775o328Q072K7838k3779P230N366k0361K0936j7232k4590
702b0766J7144j8738L405J7681k6544J3549J7556p772K2313l455r651J6385p619
715A3488r65k113k0298M174o766o335J1246j5610L691K0037q242J4427J0795j3744
729C785J5185M464j4028N113q715j3038J934n192n433k442K094O201R83J0282
743A193O950l388J4479K719j1843Q701m853j5928M843p495j3902O308j539o958
757b0713J0216P274j926R759J0633l317K699P117r861n722L229j3984p468N698
771f366j0636n763J2644r81j593J5876K341k012J4304o4r494O155l041j5152K629
786a153j580j6209L071O420r708P788J2612o869Q172J4960q412K578R680j3941
$$ plain form
689 -8827 -3731 -24693 2082 -4246 3826 31664 7885 15115 20481 120 21056 3824 -20766
702 -20766 -3622 -22360 -18955 -1274 -27818 -14269 3287 -4485 17828 14373 4722 21107 13488
715 13488 12523 10410 -9888 -5714 -12480 -18815 -7569 -23179 -19488 549 -7693 6734 17529 3785
729 3785 18970 23434 9406 14519 5804 -7234 -5300 -10492 -15925 -18367 -16273 -10072 -9089 1193
743 1193 8143 4755 19234 21953 10110 18811 13958 -1970 2873 -4622 -18524 -12216 -13755 -20713
757 -20713 -10497 -3223 -5149 4610 15243 11926 14625 21742 11881 6159 9388 -4596 -12064 -6366
771 -6366 -17002 -22765 -10121 -11102 -12695 3181 5522 3510 17814 17750 8256 14411 11370 -3782 -1153
786 -1153 -2733 -18942 -15871 -9451 -19159 -11371 1241 -5628 2544 17504 9092 11670 21350 7409
800G409n032O084j3053q300N147o875n565J1678L675o078J5099Q292r678J4721
814A7524O173j9286Q739P04k1880P960k386j9340R697K557p594J0100O968J262
828A198L231R787L296r011J0282k710k2234J4271p038k3444K1396j2085j7663
841c0724L0162o039m731K2933j1205M669J6941p608p88q357j489J656j6767J0217
855a130j0466k1035L1814r374r467L5573k6103K473M0291k7370N356J2001l1628
868i065J7687J836k1402O011j7272Q515J1500j6038K1642j1473n375M5694k7421
881D839k135L0318m3509J9591J9574n1247K2009j623k9312L7147j5110j1516K4306
894C332j4757K5223M389k2715K8405j9693L182K9075n6408J1873K1738m6450M0031
$$ plain form
800 7409 2377 8461 -4592 -12892 -7745 -14620 -20185 -8507 -4832 -10910 4189 12481 2803 17524
814 17524 23697 4411 13150 13854 -8026 -66 -2452 -21792 -12095 -9538 -17132 -7032 -64 1198
828 1198 4429 14216 17512 8501 18783 16073 -6161 8110 1072 -22372 -976 -13061 -30724
841 -30724 -562 -6601 -11332 11601 396 5065 22006 14398 13610 5253 3764 5420 -11347 -1130
855 -1130 -11596 -32631 -817 -10191 -19658 15915 -10188 -7715 32576 5206 10562 22563 -9065
868 -9065 8622 10458 -10944 -4933 -22205 -13690 -2190 -18228 3414 -8059 -13434 32260 4839
881 4839 2704 33022 -10487 9104 28678 -22569 -560 -2183 -31495 5652 -9458 -20974 3332
894 3332 -11425 13798 18187 -4528 23877 4184 7366 36441 -19967 -8094 13644 -32806 7225
907G225q623m6304N6751r122j1112L9555l9946J2329L1088k6870K0173k4897k1410
920b1163L9689l1143P846Q545n7587N0425J7198l7657M7892l4988j4666P5494
932D9885l6701r064J7149n0278M1230J3050m5963J7102k9912J1210M6261m2695
944a8726J5579J877k9120P2839j6205l9765M2152m6115J7809N0140p4720O760
956a7495J3937l1642N8380k1140l9496M0528j5431L2264J8376o0254L2072K626
968A2725j2751M8160o5469j8715N4834m0954K8190N498o9851N8043J8244k4509
980f555M0339m8077k466N7621k9948J0943j9688m5792O0259o706k2272J6949n9890
993e5283L7589N7564n2199K0116j2661k6925Q3919k0156m2938K2246m0110L4495
$$ plain form
907 7225 -1398 -47702 9049 -73 -11185 28370 -11576 753 31841 4971 25144 247 -21163
920 -21163 18526 -12617 -4771 3774 -53813 -3388 13810 -23847 24045 -10943 -25609 49885
932 49885 13184 4120 21269 -29009 12221 25271 -20692 -3590 -33502 -22292 23969 -18726
944 -18726 -3147 -1270 -30390 42449 26244 -13521 28631 -17484 325 50465 -24255 -17495
956 -17495 -3558 -35200 23180 2040 -37456 3072 -12359 19905 38281 -21973 10099 12725
968 12725 -26 48134 -17335 -36050 18784 -22170 6020 11518 -58333 -290 17954 -6555
980 -6555 33784 -14293 -16759 40862 10914 21857 2169 -43623 16636 9930 -12342 4607 -55283
993 -55283 -17694 39870 -12329 7787 -4874 -31799 52120 31964 -10974 11272 -28838 5657
1005E657L4195o4824O634q041j983O5099m0246k1182K8259k5732N8521J0215p1600
1018b5028L1859q117k820N4729o9372k3211M3031k3376M0868q137o0280M9894
1030D0Q540L604K9324o3157J2144M0738l0447K9030l3416m4614O2571j4693r289
1043i625K1929n9308L4976M5621l7630K3489k3217j8900O6063k5043j8735P609
1055G229m4742M5126J7427n1226K0426k2476O424O2672m4748q065K1625k6795
1067a7123N3424k510n5236K8289j7399O448L6882n8564n15K0521j9143M8919j7305
1080F688l9051M2580j0362J6221K4456n9786J5073J9774k2345L0274l5223k7101
1092c8802M4306j7870J0952J1432m4550L6734J7377k0825L0151l1473q378M1569
$$ plain form
1005 5657 39852 -24972 -18338 -26379 -28362 36737 -3509 -24691 3568 -22164 36357 46572 -25028
1018 -25028 6831 -1286 -4106 50623 -18749 -41960 1071 -22305 18563 10426 -49854 40
1030 40 8580 12184 41508 -21649 -9505 31233 786 29816 -3600 -48214 14357 -336 -9625
1043 -9625 12304 -47004 -12028 33593 -4037 19452 -3765 -22665 43398 18355 -380 7229
1055 7229 -37513 7613 25040 -26186 -5760 -28236 -21812 40860 -3888 -11953 9672 -17123
1067 -17123 36301 33791 -21445 6844 -10555 -4107 32775 -25789 -26304 -5783 -24926 23993 6688
1080 6688 -32363 10217 -145 16076 40532 -19254 -4181 15593 -6752 23522 -11701 -38802
1092 -38802 5504 -12366 -1414 10018 -34532 2202 19579 -1246 28905 -2568 -10946 30623
1104C0623k9668K573K309l7978L4125K181k3566K2978k4279J0159L5525k8699
1116c717J2724J465k1088M0199j6339k3997K2210k7977J1543J9957l9459J4571
1128i908O129j2892L3004j4382j0311K3480j5216J5918M244l0666J7296p803q876
1141i983K2327k9966j650K2476k0237K0071N285k4451K5837J296p599J7078k0688
1154b04j720J1426j4551P253r439j2164J8277j0081M006J2375j8349J6703J0411
1167A3943j6096J8288n843j4539J8431j1773q053P153j4037L469M718o787P327
1180c799k562N313R422p786R894J199j0607J3396p561j2301J1436j1670n582J1170
1194c8j1132q6J0341l839L840N779j10K641P30K441m623l986L785r216l600O644
$$ plain form
1104 30623 955 3528 5837 -32141 1984 4165 -19401 3577 -20702 -10543 24982 -3717
1116 -3717 9007 10472 -10616 29583 13244 -10753 11457 -16520 -4977 14980 -24479 -9908
1128 -9908 -3779 -16671 16333 1951 -8360 15120 -96 15822 20066 -10600 6696 -1107 -9983
1141 -9983 12344 -17622 -19272 3204 -17033 3038 8323 -16128 9709 11005 3406 20484 -204
1154 -204 -1924 9502 -5049 2204 -7235 -19399 -1122 -11203 -7197 5178 -13171 3532 13943
1167 13943 -2153 16135 10292 -4247 14184 2411 -5642 1511 -12526 -9057 -4339 -11126 -3799
1180 -3799 -6361 -1048 8374 588 10482 11681 1074 14470 6909 -5392 6044 -5626 -11208 -38
1194 -38 -11170 -11256 -915 -4754 -914 4865 4755 7396 8126 10567 5944 1958 5743 -3473 -7073 -429
1210d29j0738k88J0202p247L639J0133n678M031Q039n973o40L878n755n558K018
1225c66l326o667L807Q75n568P541M841n268Q079N677o942N127K868r095J025
1240B608J590r852q87L366o743J53P314l131P41J0387j024j537Q415l131m959
1255C310N826m491q949M446l607q123O354P27n857P506M700l539O577N376n692
1270D564K321M309p798k205L589r366l930O521o540j846R125m337M69J1344k467
1285C753j209P581l643l261M204k979p552n89O33n986J754M869p643M038J0970
1300D940o916M679Q962j0607M233O167j0979J388j59r546K213J566l242p22K049
1315e974M751n71M231N720p937O879O004j4016O230P80j5323R920j987j2641J0860
$$ plain form
1210 -429 -11167 -11455 -1253 -8500 -4861 5272 -406 3625 11664 5691 5051 8929 3174 -2384 -366
1225 -366 -3692 -10359 -6552 -5677 -11245 -3704 1137 -4131 3948 9625 2683 7810 10678 1583 2608
1240 2608 4198 -5654 -6541 -3175 -9918 -9765 -2451 -5582 -4841 5546 4522 2985 11400 8269 3310
1255 3310 9136 4645 -4304 142 -3465 -11588 -5234 -4507 -10364 -2858 1842 -1697 4880 10256 4564
1270 4564 6885 11194 3396 1191 4780 -4586 -8516 -1995 -8535 -10381 -1256 -5593 -5124 6220 3753
1285 3753 2544 10125 6482 3221 7425 4446 -3106 -3695 -3062 -9048 -7294 -2425 -10068 -6030 4940
1300 4940 -1976 2703 11665 1058 5291 11458 479 1867 1708 -7838 -5625 -4059 -7301 -8023 -5974
1315 -5974 -1223 -1794 2437 8157 220 7099 13103 -913 5317 6097 -9226 694 -1293 -13934 -3074
1330c074k072k854J0272k925J652N138j42M881o439p02L660j1202P141j930j8289
1345a6885J3751M27q932J6486j0244m309K2020o691j47N056j2419Q325K679q765
1359C52O94j2428L386R094j0710Q509n289q861K5815m057p721J3985j7349O474
1373A894J8640k1783n24k41j1461J8135n281j2193O896o218J5511P498j6702J1149
1387E320l534q00K1884k3299p093J4796j7690J2654L656k7824J6549L785n463
1400g059J9044j6937k246J9038p773J0926p727j9782K1119n645m541Q782k9727
1413b2528J0889K1818j9300J2687o286j5249L6007m415j2635J0076k1258J4247
1425D053J5985k5584M480j1263m808L0743j7231p437J0126j7425L0259J0222l0684
$$ plain form
1330 -3074 -5146 -8000 2272 -653 999 6137 5995 10876 4437 3735 7395 -3807 3334 1404 -16885
1345 -16885 -3134 -2707 -11639 4847 -5397 -9706 12314 5623 5476 10532 -1887 6438 9117 352
1359 352 1046 -11382 -7996 1098 -9612 -1103 -6392 -15253 10562 6505 -1216 12769 -4580 1894
1373 1894 20534 -1249 -1773 -2014 -13475 4660 -621 -12814 -5918 -12136 3375 10873 -5829 5320
1387 5320 1786 986 22870 -429 -7522 7274 -10416 2238 5894 -21930 -5381 -1596 -7059
1400 -7059 11985 -4952 -7198 11840 4067 14993 7266 -12516 8603 2958 -1583 7199 -22528
1413 -22528 -11639 10179 -9121 3566 -2720 -17969 18038 13623 988 11064 -10194 4053
1425 4053 20038 -5546 -1066 -12329 -17137 13606 -3625 -11062 -936 -18361 11898 22120 -8564
1438h564J5216q329n45L1661l1419j2010J4297j5828K4700k936l1345K1724l131
1451f509O191K3037l3469N876J7242j5621K5664j5898k7976K9309j2051J069J5472
1464A2336l8804J5055K0106j7400K3291j7610j4390L8084j4371N15O930l4558
1476b0816K6329Q984k5812J7581k2789k545L7808k5533K922R014k4074L6564R33
1489A8566k6038K0788k2290N946K9208l6995N195K809k0471L9017j2570k3100
1501a9935K5606j7754J7525K2391l9005J3760L882j3507L2577k6523j8213K5051
1513E855k1221J8233Q345l8209K5868K671r230L2096k9102n752K8324k1664J6635
$$ plain form
1438 -8564 6652 -1677 -2222 29439 -1980 -13990 307 -15521 9179 6243 -25102 -3378 -6509
1451 -6509 -318 22719 -10750 -4874 12368 -3253 22411 6513 -21463 7846 -4205 -3136 12336
1464 12336 -26468 -11413 8693 -8707 14584 -3026 -17416 20668 6297 6812 13742 -20816
1476 -20816 5513 14497 -11315 6266 -16523 -19068 18740 -6793 -3871 5143 -18931 17633 18566
1489 18566 -7472 13316 -8974 -3028 26180 -10815 -5620 -2811 -23282 15735 3165 -19935
1501 -19935 5671 -12083 5442 27833 -11172 2588 6470 -7037 25540 -983 -19196 5855
1513 5855 -15366 2867 11212 -26997 -1129 1542 -7688 24408 -4694 -10446 17878 -3786 12849
$$ [...]
8191d57
##END NTUPLES=NMR FID
##END=
