##TITLE=1H_LR-721-P2
 CDCl3, 8 sc, 
 29.9.2020
##JCAMPDX= 6.0         $$ Bruker NMR JCAMP-DX V2.0
##DATA TYPE= NMR FID
##DATA CLASS= NTUPLES
##ORIGIN= UXNMR, Bruker Analytische Messtechnik GmbH
##OWNER= root
$$ XWIN-NMR		Version 3.5
$$ Tue Sep 29 11:43:53 2020 Russian Standard Time (UT+4h)  she@DPX200
##.OBSERVE FREQUENCY= 200.1315066352
##.OBSERVE NUCLEUS= ^1H
##.DELAY= (6, 6)
##.ACQUISITION MODE= SIMULTANEOUS
##.ACQUISITION SCHEME= undefined
##.AVERAGES= 8
##.DIGITISER RES= 18
##SPECTROMETER/DATA SYSTEM= spect
##.PULSE SEQUENCE= zg30
##.SOLVENT NAME= CDCl3
##.SHIFT REFERENCE= (INTERNAL, CDCl3, 0, 15.7039)
##AUDIT TRAIL= $$ (NUMBER, WHEN, WHO, WHERE, WHAT)
$$ ##TITLE= Audit trail, XWIN-NMR		Version 3.5
$$ ##JCAMPDX= 5.01
$$ ##ORIGIN= Bruker BioSpin GmbH
$$ ##OWNER= she
$$ F:/spectra/data/she/nmr/H-F/1/audita.txt
$$ ##AUDIT TRAIL=  $$ (NUMBER, WHEN, WHO, WHERE, WHAT)
(   1,<2020-09-29 11:42:52.14 +0400>,<she>,<DPX200>,
      <created by zg, POWCHK disabled, PULCHK disabled
       configuration hash MD5:
       00 E9 B6 7A A2 85 ED C7 34 08 36 98 17 FE 4E 26
       data hash MD5: 16K
       D2 EC D7 53 8A 89 3D FF D8 E9 7D 52 A4 26 01 AD>)
$$ ##END=
$$ 
$$ hash MD5
$$ 48 48 60 99 88 E9 BC 3D 67 DD 56 F1 E4 AB EA 47
##$RELAX= 
##$RELAX= 
##$RELAX= 
##$RELAX= 
##$RELAX= 
##$RELAX= 
$$ Bruker specific parameters
$$ --------------------------
##$DU= <F:/spectra>
##$EXPNO= 1
##$NAME= <H-F>
##$PROCNO= 1
##$TYPE= <nmr>
##$USER= <she>
##$AMP= (0..31)
100 100 100 100 100 100 100 100 100 100 100 100 100 100 100 100 100 100 
100 100 100 100 100 100 100 100 100 100 100 100 100 100 
##$AQSEQ= 0
##$AQ_mod= 1
##$AUNM= <au_zg>
##$AUTOPOS= <>
##$BF1= 200.13
##$BF2= 200.13
##$BF3= 200.13
##$BF4= 200.13
##$BF5= 200.13
##$BF6= 200.13
##$BF7= 200.13
##$BF8= 200.13
##$BYTORDA= 1
##$CFDGTYP= 0
##$CFRGTYP= 5
##$CHEMSTR= <none>
##$CNST= (0..31)
1 1 145 1 1 1 1 1 1 1 1 1 1 1 1 1 1 1 1 1 1 1 1 1 1 1 1 1 1 1 1 1 
##$CPDPRG= <>
##$CPDPRG1= <>
##$CPDPRG2= <>
##$CPDPRG3= <>
##$CPDPRG4= <mlev>
##$CPDPRG5= <mlev>
##$CPDPRG6= <mlev>
##$CPDPRG7= <mlev>
##$CPDPRG8= <mlev>
##$CPDPRGB= <>
##$CPDPRGT= <>
##$D= (0..31)
0 1.2 0 0 0 0 0 0 0 0.06 0 0.03 0 0 0 0 0.0002 0 0 0 0 0 0 0 0 0 0 0 0 
0 0 0 
##$DATE= 1601365371
##$DBL= (0..7)
120 120 120 120 120 120 120 120 
##$DBP= (0..7)
150 150 150 150 150 150 150 150 
##$DBP07= 0
##$DBPNAM0= <>
##$DBPNAM1= <>
##$DBPNAM2= <>
##$DBPNAM3= <>
##$DBPNAM4= <>
##$DBPNAM5= <>
##$DBPNAM6= <>
##$DBPNAM7= <>
##$DBPOAL= (0..7)
0.5 0.5 0.5 0.5 0.5 0.5 0.5 0.5 
##$DBPOFFS= (0..7)
0 0 0 0 0 0 0 0 
##$DE= 6
##$DECBNUC= <off>
##$DECIM= 32
##$DECNUC= <off>
##$DECSTAT= 4
##$DIGMOD= 1
##$DIGTYP= 9
##$DL= (0..7)
0 120 120 120 120 120 120 120 
##$DP= (0..7)
150 150 150 150 150 150 150 150 
##$DP07= 0
##$DPNAME0= <>
##$DPNAME1= <>
##$DPNAME2= <>
##$DPNAME3= <>
##$DPNAME4= <>
##$DPNAME5= <>
##$DPNAME6= <>
##$DPNAME7= <>
##$DPOAL= (0..7)
0.5 0.5 0.5 0.5 0.5 0.5 0.5 0.5 
##$DPOFFS= (0..7)
0 0 0 0 0 0 0 0 
##$DQDMODE= 0
##$DR= 18
##$DS= 0
##$DSLIST= <SSSSSSSSSSSSSSS>
$$ [...]
##$SUBNAM2= <"">
##$SUBNAM3= <"">
##$SUBNAM4= <"">
##$SUBNAM5= <"">
##$SUBNAM6= <"">
##$SUBNAM7= <"">
##$SUBNAM8= <"">
##$SUBNAM9= <"">
##$SW= 16.880792210976
##$SWIBOX= (0..15)
0 0 2 0 0 0 0 0 0 0 0 0 0 0 0 0 
##$SW_h= 3378.37837837838
##$TD= 16384
##$TD0= 1
##$TE= 0
##$TE2= 300
##$TE3= 300
##$TEG= 300
##$TL= (0..7)
0 120 120 120 120 120 120 120 
##$TP= (0..7)
150 150 150 150 150 150 150 150 
##$TP07= 0
##$TPNAME0= <>
##$TPNAME1= <>
##$TPNAME2= <>
##$TPNAME3= <>
##$TPNAME4= <>
##$TPNAME5= <>
##$TPNAME6= <>
##$TPNAME7= <>
##$TPOAL= (0..7)
0.5 0.5 0.5 0.5 0.5 0.5 0.5 0.5 
##$TPOFFS= (0..7)
0 0 0 0 0 0 0 0 
##$TUNHIN= 0
##$TUNHOUT= 0
##$TUNXOUT= 0
##$USERA1= <user>
##$USERA2= <user>
##$USERA3= <user>
##$USERA4= <user>
##$USERA5= <user>
##$V9= 5
##$VALIST= <valist>
##$VCLIST= <CCCCCCCCCCCCCCC>
##$VD= 0
##$VDLIST= <DDDDDDDDDDDDDDD>
##$VPLIST= <PPPPPPPPPPPPPPP>
##$VTLIST= <TTTTTTTTTTTTTTT>
##$WBST= 1024
##$WBSW= 4
##$XGAIN= (0..3)
0 0 0 0 
##$XL= 0
##$YL= 0
##$YMAX_a= 510234
##$YMIN_a= -467861
##$ZGOPTNS= <>
##$ZL1= 120
##$ZL2= 120
##$ZL3= 120
##$ZL4= 120
##$ABSF1= 10
##$ABSF2= 0
##$ABSG= 5
##$ABSL= 3
##$ALPHA= 0
##$AQORDER= 0
##$ASSFAC= 0
##$ASSFACI= 0
##$ASSFACX= 0
##$ASSWID= 0
##$AUNMP= <proc_1d>
##$AZFE= 0.1
##$AZFW= 0.1
##$BCFW= 1
##$BC_mod= 2
##$BYTORDP= 1
##$COROFFS= 0
##$CY= 11.3945322036743
##$DATMOD= 1
##$DC= 2
##$DFILT= <>
##$DTYPP= 0
##$F1P= 16.9975609425685
##$F2P= -3.02152046262296
##$FCOR= 0.5
##$FTSIZE= 0
##$FT_mod= 4
##$GAMMA= 1
##$GB= 0.15
##$INTBC= 1
##$INTSCL= 1
##$ISEN= 128
##$LB= 0.24
##$LEV0= 0
##$LPBIN= 0
##$MAXI= 10000
##$MC2= 0
##$MEAN= 0
##$ME_mod= 0
##$MI= 1.114404
##$NCOEF= 0
##$NC_proc= 0
##$NLEV= 6
##$NOISF1= 3.799351
##$NOISF2= 2.8
##$NSP= 1
##$NTH_PI= 0
##$NZP= 0
##$OFFSET= 15.70392
##$PC= 1
##$PHC0= -9969.857
##$PHC1= 12.40089
##$PH_mod= 1
##$PKNL= yes
##$PPARMOD= 0
##$PSCAL= 0
##$PSIGN= 0
##$REVERSE= no
##$SF= 200.130013532006
##$SI= 16384
##$SIGF1= 3
##$SIGF2= 2
##$SINO= 400
##$SIOLD= 16384
##$SREGLST= <1H.CDCl3>
##$SSB= 0
##$STSI= 0
##$STSR= 0
##$SW_p= 3612.71676300578
##$SYMM= 0
##$S_DEV= 0
##$TDeff= 0
##$TDoff= 0
##$TI= <>
##$TILT= no
##$TM1= 0
##$TM2= 0
##$TOPLEV= 0
##$USERP1= <user>
##$USERP2= <user>
##$USERP3= <user>
##$USERP4= <user>
##$USERP5= <user>
##$WDW= 1
##$XDIM= 8192
##$YMAX_p= 0
##$YMIN_p= 0
$$ End of Bruker specific parameters
$$ ---------------------------------
##NTUPLES= NMR FID
##VAR_NAME=  TIME,          FID/REAL,        FID/IMAG
##SYMBOL=    X,             R,               I
##VAR_TYPE=  INDEPENDENT,   DEPENDENT,       DEPENDENT
##VAR_FORM=  AFFN,          ASDF,            ASDF
##VAR_DIM=   8192,          8192,            8192
##UNITS=     SECONDS,       ARBITRARY UNITS, ARBITRARY UNITS
##FACTOR=    0.000296,      1,               1
##FIRST=     0,             0,               0
##LAST=      2.424536,      0,               0
##MIN=       0,             -467861,         0
##MAX=       2.424536,      510234,          0
$$ Real data points
##PAGE= N=1
##DATA TABLE= (X++(R..R)), XYDATA
$$ [...]
2843F472j5354Q794L469j3840J5148l078o470J2454j1642M277R895j4231O074
2856A968n6o339J0399j0320n87R539j3755J0137M083j2542J2982o205l759J7316
2870A2861j4734j761R125j0818R721k139j2002J2195o033Q69R234j3414O658L163
2884B925p316J5561j0082r063J5305q995L213M712j8053J0638N499r775R277p880
2898d034k016J2487p297N873j368j1698J3794j314n406N861j5060O990J2413j4920
2912e695M404n7o538J5676m557o353P066q135P606N321j0670K107m718K188J1515
2927I160j3399k332O256m735J1468k546j2076J0646p73p74Q195j1521k013O234
2941A790k360N347o522p549Q849L34L123j449j0354J0234M409n292M578p125k589
$$ plain form
2843 6472 -8882 -88 3381 -10459 4689 1611 -4859 7595 -4047 230 10125 -4106 1968
2856 1968 1912 -4427 5972 -4348 -4935 4604 -9151 986 5069 -7473 5509 -696 -4455 12861
2870 12861 -1873 -3634 5491 -5327 4394 2255 -9747 2448 -3585 -2716 6518 -6896 -238 2925
2884 2925 -4391 11170 1088 -7975 7330 -1665 1548 6260 -11793 -1155 4344 -5431 3846 -4034
2898 -4034 -6050 6437 -860 5013 3645 -8053 5741 4427 -979 4882 -10178 -3188 9225 -5695
2912 -5695 -1291 -1348 -7886 7790 3233 -3120 3946 -4189 3417 8738 -1932 175 -4543 -2355 9160
2927 9160 -4239 -6571 -315 -5050 6418 3872 -8204 2442 1669 895 9090 -2431 -4444 1790
2941 1790 -570 4777 -1745 -9294 -445 -111 3012 1563 -8791 1443 5852 560 5138 -1987 -4576
2956d576J0516m814j270K6q326P200N365n062j348k813N434O284n149r73j120
2971f26m19P414m868m548L172m594L289N725p966p68L432L43N248k453n214L152
2987C19L241L78k951l235J658k22J15J780m679l33M273r80L048m00n202M683M354
3004E847m248j150r93p16K879j376k871K99L49R71N77P78j89k048L295L084l402
3021A086j023R12j633K946j811m810L149P89k433K609p1j261K037M90Q85K34j532
3038E63KL06J010j640l579K730Q56l368K529k24j402L744j150o40L879k816j216
3055d16L113j196j485j010l98J064j324q7L37J57K390j358l32M213k677j462L619
3072C148j902j177O94k599P11J358k961M84J975Q7n43M36K374q83r83K228j130
$$ plain form
2956 -4576 5940 1126 -144 -118 -8444 -1244 4121 -941 -2289 -5102 332 6616 1467 494 -626
2971 -626 -1045 6369 1501 -3047 125 -4469 -1180 4545 -3421 -4189 -757 -414 4834 2381 -2833 319
2987 319 3560 3938 987 -2248 -590 -812 -697 1083 -3596 -3929 344 -636 2412 2012 -3190 1493 5847
3004 5847 1599 449 -544 -1260 1619 243 -2628 -2329 -1980 -1009 -432 346 157 -1891 1404 4488 1086
3021 1086 63 975 -658 2288 477 -4333 -1184 -395 -2828 -219 -290 -1551 486 976 1861 2095 563
3038 563 565 871 1881 241 -3338 -608 248 -3120 -591 -815 -2217 1527 377 -263 3616 800 -416
3055 -416 2697 1501 16 -994 -1392 -328 -1652 -1739 -1402 -1245 1145 -213 -545 3668 991 -471 3148
3072 3148 1246 69 763 -1836 -1125 233 -2728 -2244 -269 -182 -725 -289 2085 1202 219 2447 1317
3089A317l93K77l074J571R47l940J160K348j612K43J049j63J680j7n40O38M80
3106A971r05k331J534N06l472Q35J256j235R63K89o04K795R6k214K370P28k163
3123D19l32N99n38j267n18J06L41P37p57q9K958k76j605J957O21j724P37r19p67
3142c17N82j747p41J646j0j571J096K060n13l88J659k07k07L78j620R6J020k582
3160a366j171K320o42j240J209O15O55K18M5N55Q16l33j725O07J206l106q73K279
3178F9j872r2Q43q64K018R65j942K309O82j160KL5P15j971j344J684j255k67N00
3197i45j950L159J117l325L255J101k489J857p76q57J539k753O32N55j728N72
3213a036j197J997J861m115K636K636l116L296j540k424L965l119j480L249l763
$$ plain form
3089 1317 924 1201 -1873 -302 645 -3295 -2135 213 -1399 -1156 -107 -270 1410 1393 853 1491 1971
3106 1971 1066 -1265 269 775 -2697 -1862 -606 -1841 -878 -589 -1193 1602 1698 -516 1854 2582 419
3123 419 87 686 148 -1119 -1637 -1531 -1190 -453 -1210 -1299 1659 1383 -222 1735 2356 632 1369 450 -317
3142 -317 265 -1482 -2223 -577 -587 -2158 -1062 998 485 97 1756 1549 1342 1720 100 196 1216 -1366
3160 -1366 -2537 -217 -859 -2099 -890 -275 380 598 643 1198 2014 1681 -44 563 1769 -1337 -2210 69
3178 69 -1803 -1895 -1052 -1916 102 1067 -875 1434 2116 956 958 993 1708 -263 -1607 77 -1178 -1445 -945
3197 -945 -2895 264 1381 -1944 1311 2412 -77 1780 1004 147 1686 -1067 -435 120 -1608 -1036
3213 -1036 -2233 -236 1625 -2490 146 2782 -334 2962 1422 -1002 2963 -156 -1636 1613 -2150
3228b150N4J407r18K510k506m0M087k169J813j61l953N631k661l842N459m621
3244b060r97M528m648K899P10m318N856J79k582K420k764L410K82n479M424k579
3260g19k396N406n277O74M611p106N242L476o428M601o97j442M593n490M85K529
3276B062m982L956k267k292N944o134K413N859p818M335J992n086P156m066m504
3291c432P341m933j15K521n496M208j130k013O292m918L16M732n232N852q23q046
3307d876Q037k019l870N703o719N66N224n353M215J50m619N636j304J513J252
3322C536p626N542K271o028M550n178j987Q456n706K79L839o460N239L571m714
3337d16K496l481Q71N873n330q37j100j760P232m020m009M867l489L503N090p339
$$ plain form
3228 -2150 -2096 -689 -1607 903 -1603 -1643 2444 275 2088 1927 -2026 3605 944 -2898 2561 -2060
3244 -2060 -3057 1471 -3177 -278 432 -3886 1970 2149 -433 1987 -777 2633 2915 -2564 1860 -719
3260 -719 -3115 2291 -2986 -2312 2299 -4807 435 3911 -2517 2084 1387 -55 4538 -952 -467 2062
3276 2062 -2920 1036 -1231 -3523 2421 -3713 -1300 4559 -3259 1076 3068 -2018 5138 1072 -3432
3291 -3432 3909 -1024 -1139 1382 -4114 94 -1036 -3049 3243 -1675 -1359 3373 -1859 3993 3170 -4876
3307 -4876 3161 1142 -2728 2975 -3744 -3178 2046 -3307 908 1058 -3561 2075 771 2284 3536
3322 3536 -4090 1452 3723 -2305 2245 -2933 -4920 3536 -2170 -1891 1948 -4512 727 4298 -416
3337 -416 2080 -1401 -530 5343 13 -824 -1924 -3684 3548 -472 -4481 386 -3103 400 5490 -1849
3353a849J513J811k090O298l524o547L623P21K286j612n952L144K180J209K164
3368C375n998P01N248k124K761k159p053N727K942l138m11m722J070O549p78l266
3384a276j152J116M672N4k382j298k674M345L035n380r37j531M44P005k766o082
3400d807L148K193J974J397m928j110L543R93k6k881l028J632J490K583k347n220
3416e394L903M012r54P80l882j034P280j973l092Q57l249J657L469l281j155o36
3432b692P35M677r19k362k58L5N487j572n230K759j466K53L748n878m83L174k790
3449b782M175M84n216L150J740N24J161m833J211K154j680J352l616j220M758
3464A362l767J691K669n435L590K572l210L417k601k098N097k899j308M05k167
$$ plain form
3353 -1849 -336 1475 -615 5683 2159 -4388 -765 -44 2242 630 -5322 -2178 2 1211 3375
3368 3375 -2623 -1922 3326 1202 3963 1804 -5249 478 3420 282 -129 -4851 -3781 2768 1990 -1276
3384 -1276 -2428 -1312 3360 3414 1032 -266 -2940 1405 4440 -940 -1877 -3408 -2964 4041 1275 -4807
3400 -4807 -1659 534 2508 3905 -1023 -2133 1410 2403 2377 -504 -3532 -1900 -410 2173 -174 -5394
3416 -5394 -1491 2521 1567 2347 -1535 -2569 4711 2738 -354 503 -2746 -1089 2380 -901 -2056 -2692
3432 -2692 -1957 2720 1801 -561 -819 -784 4703 3131 -2099 660 -806 -553 3195 -2683 -3166 8 -2782
3449 -2782 1393 1877 -3339 -189 1551 2075 3236 -1597 -386 1768 88 1440 -2176 -3396 1362
3464 1362 -2405 -714 1955 -3480 110 2682 -528 2889 288 -1810 3287 388 -920 -515 -2682
3479b682L278j490j529L550l081J327L382l877L339n13l970N837j753m241L429
3494A006k370J18J794l370K249O00j570L078j384J012J183l951M081N0m564L072
3510A034j263j650L684m437L16L786l516K000J440j594J876j313N73J716l148
3525d96O76j64j451K519k991r31L906k852J43K952k288J769J040k264K623o76
3541A515k094J209o72K6j368j179K814j368p41K370j683J609J523k417K119L51
3557B014k742J609j4j396J76j286N78P93j003M89K10R37J063j755J428J161k513
3574b51J431k35j626P79r59q56J724o92j065J580P44k44j56Q03N26m76J74l79
3592H22q14M76j262r49J753j193j156J988N4k65J240l39L54J024r57l51N51l65
$$ plain form
3479 -2682 596 -894 -2423 1127 -1954 -627 2755 -1122 2217 1704 -2266 3571 1818 -2423 1006
3494 1006 -1364 -1246 548 -2822 -573 27 -1543 1535 151 1163 2346 -1605 2476 2526 -2038 1034
3510 1034 -229 -1879 1805 -2632 -2316 1470 -2046 -46 1394 -200 1676 363 936 2652 -496
3525 -496 180 16 -1435 1084 -1907 -2838 1068 -1784 -1641 1311 -977 792 1832 -432 2191 1515
3541 1515 -579 630 -42 -16 -1384 -2563 251 -1117 -1858 512 -1171 438 1961 -456 1663 2014
3557 2014 -728 881 867 -529 -353 -1639 -1061 -268 -1271 -782 -572 365 1428 -327 1101 2262 -251
3574 -251 1180 945 -681 98 -861 -1717 7 -685 -1750 -170 574 330 174 977 1503 1027 1201 822
3592 822 8 484 -778 -1727 26 -1167 -2323 -335 -281 -546 694 355 709 1733 776 425 976 611
3610F11j511k09P46p03o15P60L04L9J345j190R37J520j382k11J187j214j190L42
3628d34j21l03m00M6K8J136J38p83J332J157j650M10J146j290n6Qj380J180q04
3647f40j544J312J033o33l87J229J034r54N55L19q68N31k92k109J713l87k413
3664b501J925K38o55Q07K01O74P80p50K00k4K72n97j454J483o84k462K322l08
3682e33j244K127j311P06K619k409K55J785j161J62o46m21K34j548O39K22j196
3699a720J602r33n4L649k882j68L275k212M21M91k603J741m89k012J535q27L03
3716h83j33O5K206j264o85K951j682L63R83l213K177Q08m093K352m5j936J618
3733d11k52K14J136j395J724M19k58K34k276J459J231l644J585L30k923K842J0
$$ plain form
3610 611 -900 -1109 -363 -1066 -1681 -921 -617 -578 767 -423 514 2034 652 441 1628 414 -776 -434
3628 -434 -555 -858 -1258 -1212 -1184 -48 90 -693 639 1796 146 556 1702 412 356 364 -1016 164 -640
3647 -640 -2184 -872 161 -472 -859 370 1404 450 1005 1324 456 987 695 -1414 299 -88 -2501
3664 -2501 -576 -338 -993 -186 15 689 1469 719 919 895 1167 570 -884 599 -85 -2547 -225 -533
3682 -533 -1777 350 -961 -255 2364 -45 210 1995 834 996 350 -71 163 -1385 -746 -524 -1720
3699 -1720 -118 -1051 -1105 2544 -338 -506 2769 557 978 1469 -1134 607 118 -1894 -359 -1186 -883
3716 -883 -1016 -951 1255 -9 -694 2257 575 938 1921 -1292 885 1693 -2400 -48 -93 -2029 -411
3733 -411 -663 -449 687 -708 1016 1435 1177 1411 -865 594 1825 -1819 -234 96 -2827 15 25
3750B5j633K749j751j05L255j191j081J67m80J408j251r59M43j669J855K55j951
3767a914K179r68q29M252j319k625K328q85J262N32l836J50J709l44j95p81q7
3784a371Q92L57K028r97k134K273N95l2L76l791k73L770j426j442j30j686K775
3801b16K012j835n8l33P35K349l03j796k065J13L934j198l466L86n31K371K634
3818B733m706J83K650q59K970n17m691J807J217N26M01m639k39K843J315L79l781
3835b408q06N082p93P28K18n086L598K782l705J519l127k061O380j510k418O5
3851a542j662N268J008l566R45j817K479L307n645Q81l09k632O397k072n260L808
3867d12j762K856L577o486J292K751r04L066m378j906L721k772L121n76o381N315
$$ plain form
3750 25 -1608 1141 -610 -715 2540 1349 268 435 -45 1363 112 -847 -404 -2073 -218 37 -1914
3767 -1914 265 -703 -1532 2720 1401 -1224 1104 219 1481 2013 -1823 -1673 36 -308 -503 -1284 -1371
3784 -1371 -479 -122 1906 909 -1225 1048 1643 1611 1987 -1804 -2077 1693 267 -1175 -1305 -2991 -216
3801 -216 1796 -39 -97 -430 305 2654 2351 555 -1510 -1397 2537 1339 -2127 -1741 -2272 99 2733
3818 2733 -1973 -1790 860 1 2971 2454 -2237 -430 787 1313 1714 -2925 -3164 -321 994 1373 -2408
3835 -2408 -3214 1868 1075 1803 2021 -3065 533 3315 -390 1129 -1998 -4059 2321 811 -1607 -1542
3851 -1542 -3204 2064 3072 -494 451 -1366 1113 4420 -1225 -344 -653 -3285 3112 1040 -4220 -412
3867 -412 -2174 682 4259 -2227 -935 1816 912 3978 -400 -2306 1415 -1357 1764 1188 -5193 122
3883A22r5j129M876o740N74O848m016J444q21m408N630o77k787J954m414K414
3899a225K601l357L335k681j865P858m138o69K536n392N032J454p091M285j566
3914h83j903N142m400Q13J913l047N219j200l235M215l660J676L592p759L421
3929i6J467m739M991k328k810N611l686J585L177m722K631Rj296L525m854J83
3945a352L545m785K979qm550N861k052j917N649m424N58L453l645K490o97l465
3961b360M084k229m73J546l914L338O55l109M412j669j750M619l435O94K260m808
3977b139K861Q32l597K260j641MK240k703J754N17j727L325j242j139K953l812
3993a254J089K594m176J201M54j984K657j264j230K470p86Q01M12p09J252j313
$$ plain form
3883 122 27 -1102 3774 -2966 -2392 4456 440 1884 1063 -3345 2285 1608 -1179 775 -3639 -1225
3899 -1225 1376 -1981 1354 -1327 -3192 4666 528 -141 2395 -2997 2035 3489 -3602 683 -883
3914 -883 -2786 2356 -2044 -1231 682 -2365 2854 1654 -1581 2634 -1026 650 4242 -3517 -96
3929 -96 1371 -3368 1623 -705 -3515 2096 -1590 -5 3172 -1550 1081 1090 -206 3319 -1535 -1352
3945 -1352 2193 -2592 387 379 -4171 1690 -362 -2279 3370 -1054 -496 2957 -688 1802 1105 -2360
3961 -2360 1724 -505 -978 568 -3346 -8 647 -2462 1950 281 -1469 3150 -285 409 2669 -2139
3977 -2139 722 1554 -2043 217 -1424 -1420 820 -1883 -129 388 -1339 1986 744 -395 2558 -1254
3993 -1254 -165 2429 -1747 -546 -92 -2076 581 -683 -1913 557 -229 572 984 275 1527 214
4009B14k59K108l198K62J147k112J967j13k418L038R1j391J791n20J86N36q58
4026D71N51o99r61M17j012R50j50j742K253N11j726K149m99k90J626j407k89R01
4044A054j065q45L39q4l61m27Q45M88o31O98J60J01J597j344m54J267j096j041
4062g99J069n88n76L03n58N25N47l00o8R68P89r58n3J054j084k73K14p40q2L87
4082b23j174R58O42j284M56J378k23m52Q69j00k02k11o36n15Q50k79j443J068
4100e21L28o08M69N80Q6M22K12n38O43R7j312J05N03j045o75P19l1l34L68J65
4120c67J93J241n28m94J605p98j129P88k12j041L17k13n11O12l16P8N75J058j089
4139b31J90J570m56j030R07p02o65R03j615P2J187j363R6J503k67k44L78P26l11
$$ plain form
4009 214 -45 2063 -1135 -873 274 -1838 129 16 -2402 636 727 -664 1127 607 793 1329 471
4026 471 1022 323 -638 -221 -1233 -283 -433 -2175 78 589 -1137 1012 513 223 1849 442 153 1054
4044 1054 -11 -856 -517 -601 -962 -1389 -544 -56 -687 11 171 272 1869 525 71 1338 242 -799
4062 -799 270 -318 -894 -591 -1149 -624 -77 -377 -445 523 1312 354 301 1355 271 -2 212 -528 -610 -223
4082 -223 -1397 -439 203 -1081 -625 753 530 78 947 847 645 434 -202 -717 133 -146 -1589 -521
4100 -521 -193 -801 -332 248 334 756 968 430 1073 1170 -142 -37 466 -579 -1254 -535 -566 -900 -532 -367
4120 -367 -174 1067 539 45 1650 852 -277 511 299 -742 -425 -638 -1149 -537 -853 -775 -200 858 -231
4139 -231 -41 1529 1073 43 950 248 -417 486 -1129 -1057 130 -1233 -1137 366 99 -145 233 959 648
4158F48j0K27p78P0N65j583K00Q08j479K66J135p83O52P91o17R28K17j289K49
4177B17Q07p16j293N23k9n28L69L76l44O85K52p36J703J77j809Q82O44j360K34
4196E4m29j164J216j52o33J169m59m63Q27J241q5j253O04O33q34J69n08j420J380
4215a07J01j596J562m54j097K283K37r31M72m87J144L73j350m20q19J261M59k237
4233a606P39N33r61K604q88j769K479j186Q40K066l505k84J628q69J330k105j134
4250b088J798l49J265l09k381L256J5q27K687m265l58M091k695O74q64l318M021
4267C53R46k301J231k169K013K267k311J450k088q57M751k755j749J265l560M226
4283G12J892n892K823l78l56N034m089j129K857k178L298q64m153K740j975J497
$$ plain form
4158 648 638 865 87 157 722 -861 -661 147 -1332 -1066 69 -714 -62 729 112 1040 1257 -32 217
4177 217 1024 308 -985 -462 -491 -1019 -650 -274 -618 67 319 -417 1286 1463 -346 536 1180 -180 54
4196 54 -375 -1539 -323 -475 -1108 61 -398 -861 -34 1207 1122 -131 473 1106 272 441 -67 -1487 -107
4215 -107 -6 -1602 -40 -494 -1591 692 929 -2 470 -17 1127 1500 150 -270 -1089 172 631 -1606
4233 -1606 -867 -334 -1295 1309 421 -1348 1131 -55 785 2851 -654 -938 690 -179 1151 -954 -2088
4250 -2088 -290 -639 626 317 -2064 1192 1207 380 3067 -1198 -1556 2535 -160 514 -350 -3668 353
4267 353 1299 -1002 229 -1940 73 2340 29 1479 -609 -1466 3285 530 -1219 46 -3514 712
4283 712 2604 -3288 -465 -843 -1199 3835 -254 -1383 1474 -704 2594 1730 -2423 317 -1658 -161
4299a61K928o895K359K811k366M485l295l360O690k486Q1K023n791K872J570k449
4315i84K498m460l21N822l546J799k76m410P525j057l932L986m834J435M828o130
4331b057J503L09l536O160j824k502K955l726M660J741n996L923j696j492N994
4346D416o363m03M564n463M101Q16n482M782j048m85M509n707J396K944l683L624
4362B518k831k974N805m214O49L315o462M428J789m102M960k914k025N521l346
4377A17L16J261m664M275p88l028M132l964J061L693m753L854J17m539N989j811
4393A268k480L902m329J006L077m904K583l50k284M370k912O32K426m393L911
4408A523R81m069L906k751j080M449m482K8K710l604K707J71k465L346k081N48
$$ plain form
4299 -161 2767 -4128 -1769 1042 -1324 3161 -134 -3494 3196 710 791 2814 -2977 -105 1465 -984
4315 -984 1514 -2946 -3267 2555 -991 808 532 -3878 3647 2590 -1342 2644 -2190 -755 4073 -2057
4331 -2057 -554 -245 -3781 2379 555 -1947 1008 -2718 1942 3683 -2313 1610 -86 -1578 4416
4346 4416 -1947 -2350 2214 -3249 852 1668 -3814 968 -80 -565 3944 -1763 -367 2577 -1106 2518
4362 2518 -313 -3287 2518 -1696 -1047 2268 -4194 234 2023 -2079 2881 -33 -2058 3463 117
4377 117 433 1694 -2970 1305 517 -2511 1621 -2343 -1282 2411 -2342 1512 1629 -2910 3079 1268
4393 1268 -1212 2690 -1639 -633 2444 -2460 123 -227 -2511 1859 -1053 -421 2005 -2388 1523
4408 1523 2504 -1565 2341 -410 -1490 2959 -1523 -1495 1215 -2389 318 489 -1976 1370 -711 -163
4424a63K583l281J393Q7j887L708k970j852L702l068J274J562l439K863L36j898
4440a050L149j643j009J945j819J488o94k473K618q76o14J950l140J698K082k482
4456h70J787M27k049K411q59r46J165k257Q38Q87j231K13q02M77J970j886Q41
4473A16J142j562J531R1j835J750j516o73J983j512o74N79j11Q32l09l10J027
4490E49j38M93K2j223J212m65j362J504j158n87J005l41k65J002j042N07J087
4507H00m12k71K85L67r9p92M03p08k96M92o79M58Q99j214K39J544q55l2P32j54
4527G07l36K71j000K40J07m11n58M83K80n54L33Q68n07L64O45p20O21J47j275
4546b95L05L50j099p7O94o83j47N57L08J08L89oj47J063p27q23Q65k08r68K91
$$ plain form
4424 -163 2420 -861 532 619 -1268 2440 -530 -2382 1320 -1748 -474 1088 -2351 512 848 -1050
4440 -1050 2099 456 -553 1392 -427 1061 367 -2106 512 -364 -978 972 -2168 -470 1612 -870
4456 -870 917 1344 -705 1706 847 -99 1066 -1191 -353 534 -697 -484 -1286 -809 1161 -725 116
4473 116 1258 -304 1227 1318 -517 1233 -283 -956 1027 -485 -1159 -580 -691 141 -168 -478 549
4490 549 411 904 926 -297 915 450 -912 592 -566 -1153 -148 -489 -754 248 -794 -287 800
4507 800 388 117 402 769 670 -122 281 -427 -723 -231 -910 -452 447 -767 -528 1016 161 129 861 707
4527 707 371 642 -358 -118 -11 -422 -980 -497 -217 -771 -438 430 -77 287 932 212 833 980 -295
4546 -295 10 360 -739 -816 -122 -805 -952 -395 -87 21 410 404 257 1320 593 -230 635 427 -541 -250
4566b50j33m13L74k2m63J277M6n25M53P24n16l18M46l20n74J11l95k65N85o29
4586h07p4J045j72m89J139Q3o80M75P8m09L09n31r45Q25K16j088M77O19j88l3
4606a50O04k11q7O73o40r9P69q95p03P85l58q23J144n01K03L34j31M32M04k8n04
4627B18K31O05j147l32O10o32l75O78p55L47P15j058J147P34o93J72j4J13M9n60
4647E3J3l85j67l1m71N39P35j327R00J248j700J169M57j071J859j547j285J363
4665C52n80l47M13r75Q81k43L02J171j890J067Q63j276K060j034k411K750p87
4682C16j441J534j835M87J737j560R02o1o79J970p59K75O8k533L027m62k364K233
4700H55k502L90L084l170O78J426j802K642j84j914J383j651J467J476l917J298
$$ plain form
4566 -250 -383 -796 -422 -444 -907 370 416 -109 344 1068 552 234 680 360 -214 -103 -498 -763 -178 -807
4586 -807 -881 164 -8 -497 642 725 45 520 598 189 498 -33 -978 -153 63 -1025 -548 71 -117 -150
4606 -150 454 243 156 829 189 90 859 -36 -739 46 -312 -1135 9 -492 -289 45 -86 346 750 722 218
4627 218 449 1054 -93 -425 185 -447 -822 -144 -899 -552 163 -895 252 986 293 465 451 564 613 53
4647 53 66 -319 -486 -517 -988 -449 286 -1041 -141 1107 -593 576 1033 -38 1821 274 -1011 352
4665 352 -228 -575 -162 -1137 -256 -499 -197 974 -916 151 1014 -262 1798 764 -1647 1103 316
4682 316 -1125 409 -1426 -939 798 -762 140 79 -600 1370 611 886 954 -1579 1448 986 -1378 855
4700 855 -1647 -1257 1827 -1343 -665 761 -1041 1601 1417 -497 886 -765 702 2178 -1739 -441
4716d41k42q71L767l506r21L479k482K362Q91l945L008k8j454K796l464p18K555
4733G86j543J793j531k679M706j619j01K052m227K937J974l711L161j820k880
4748b702M979k429r25J424l483L474J349l530K641k122J140L614m286J023J050
4763A217l694N050j693l560L902l194J152L721n103J395J533k004M298k730j726
4778a436L521l297K124O05m983M183p42j868M471m796J4M693l682K696Pm123M595
4795A982q82j432K178m390K117J918l549L168k062j769N453k981N1K453m702L760
4811A313J435m769L475k047j157M157l922P02J417l262M017q42k335L942l147
4826a023J133L390n042J869P77l428M247k156k013L615l052J363J996l374K145
$$ plain form
4716 -441 -683 -1554 2213 -1293 -2214 1265 -1217 1145 2036 -1909 1099 1071 -383 2413 -1051 -1769 786
4733 786 -757 1036 -495 -3174 1532 -87 -188 1864 -2363 574 2548 -1163 1998 178 -2702
4748 -2702 2277 -152 -1077 347 -3136 338 1687 -1843 798 -1324 -184 3430 -856 167 1217
4763 1217 -2477 2573 880 -2680 1222 -1972 -820 2901 -2202 -807 726 -1278 3020 290 -1436
4778 -1436 2085 -1212 912 1517 -3466 717 -25 -1893 2578 -2218 -2204 2489 -1193 1503 1510 -2613 1982
4795 1982 1100 -332 1846 -2544 -427 1491 -2058 1110 -952 -2721 2732 -249 -198 2255 -2447 1313
4811 1313 2748 -2021 1454 -593 -1750 2407 -1515 -813 604 -2658 1359 517 -1818 2124 -1023
4826 -1023 110 3500 -1542 327 1104 -2324 1923 -233 -2246 1369 -1683 -320 1676 -1698 447
4841D47o1p68L305k991l00J892k926K631n19l516L762j215j272L427l123J95K425
4858A393k327K245m2k359J982j045M15Q09l272K140L81j809K749k013o43L320
4874A924k093N38J258l072J765J268k236J123j608Q8J912j858O41J43j031K610
4890A372j207n81J814k080R50J571k511O95M7j250K027q84j195Q93k82P37J15
4907B31o16R41n64M93J147j811N1Q36j638J700n91k018J465K00m57Q92q16K24
4925c31R98N0l5n31N3K58m81K63l65r97R01M43r60Q03k17m40J678p79m71P49l51
4946B38l11O16n38o14L16Pj47k15L70p7J31J171m42q06J190l87l27L16o72k59
4966d40N74m60l10M93m36o6O67MJ19o8M20p5j0q9m17R9K68r98J25M90o19K03N63
$$ plain form
4841 447 386 -382 2923 -68 -368 1524 -1402 1229 710 -2806 956 -259 -1531 1896 -1227 -1032 1393
4858 1393 -934 1311 1269 -1090 892 -153 262 1071 -2201 -61 320 -1489 1260 -753 -1396 1924
4874 1924 -169 369 1627 -1445 320 1588 -648 475 -1133 -1045 867 -991 -350 -207 -1238 1372
4890 1372 165 -416 1398 -682 268 1839 -672 23 70 -1180 847 -37 -1232 -339 -621 116 231
4907 231 -385 556 -8 485 1632 -179 -128 708 -930 770 179 -1839 -374 -174 -631 261 -555 -331
4925 -331 667 717 682 151 204 462 -19 244 -121 -1118 -217 226 -734 69 -148 -588 1090 311 -160 589 238
4946 238 -73 543 5 -609 -293 -286 -433 -648 -278 -355 -224 947 505 -301 889 502 175 491 -181 -440
4966 -440 134 -326 -636 -143 -579 -645 22 26 145 77 497 422 412 323 -94 5 273 -725 -600 -110 -729 -526 37
4989C7k69K59N38m49K72L53j69n91N54l12q10L02j84N9j9K45n51Q40P1m15O93
5010D54Jl46R1M93o39j81J53o88K74P7l00J74P17n28rQ47m7n64M47kn42L65k18
5033B9p58L77L48j220Q58M88n90M87K52q7J9M84m14j57M46m96l14L25m98k99N76
5054a44r5l61O97k9k19Q53k49n70Q94m11n56J80M5l40j39J45l03J00N71p09N88
5075e2J021p47l47J094o70l74O23r41q9L95l07k43K49k2p0K94R57j015J57J060
5095I73q16J66N14j310L66L55j515R87J93q52O57J22J62J72k29N71l11L05K55
5114G65j402O79M98j605R37J86j256J413k87l82J201j013O16N25p42L06l68k62
5132a91Q63j369n0O05j104J631l74j146J826o97m78K317j916n7R76j294J210o08
$$ plain form
4989 37 -232 27 565 116 388 741 572 -19 535 223 -587 -285 -469 -410 -429 -184 -735 105 176 -239 454
5010 454 455 109 200 693 54 -127 26 -662 -388 -311 -611 -437 280 -248 -257 590 543 -21 426 424 -118 247 29
5033 29 -729 -352 -4 -1224 -366 122 -468 19 271 184 203 687 273 116 562 66 -248 77 -421 -720 -144
5054 -144 -239 -600 97 68 -151 702 453 -117 777 366 -190 -10 35 -305 -444 -299 -602 -502 69 -640 -52
5075 -52 969 222 -125 969 299 -75 548 -393 -482 -87 -394 -637 -388 -410 -480 -186 771 -244 -87 973
5095 973 157 323 837 -473 -107 248 -1267 -280 -87 -939 -282 -160 2 174 -55 516 205 510 765
5114 765 -637 42 540 -1065 -128 58 -1198 215 -72 -454 747 -266 350 875 133 439 71 -191
5132 -191 672 -697 -747 -142 -1246 385 11 -1135 691 -6 -484 1833 -83 -140 836 -458 752 144
5150A44j048J164o65K75M30j926J782K78p73J819j703m48K556k213P44M17k556
5167a723K087L60j866J091j104K81J711j388J128l02j018K348j239l81J222k768
5183a561J776J311l151J292j60j188L102j786o63J747j469J889l4k445K319j363
5199c84J96K120l604R27J327k272K975j099k588L825j208l07J659k761J460R63
5215A229j910J882j620j021K511j799J062J55k975L578l9k069K747k641K32L318
5231B640l215P33K88k398L014r87j395J697j888J597J596k993K012n81j031L711
5247B800l199o77K178k639J689O40k983K213m02q46K805k065j90J433j280K135
5263A612q45j868K260j586mJ904l221J294J209k090K447r37j460K376j052L66
$$ plain form
5150 144 -904 260 -405 -130 300 -1626 156 434 -339 1480 -223 -671 1885 -328 416 833 -1723
5167 -1723 364 724 -1142 -51 -1155 -874 837 -551 577 275 -743 1605 366 -15 1207 -1561
5183 -1561 215 1526 -1625 -333 -493 -1681 1421 -365 -1028 719 -750 1139 1105 -1340 979 -384
5199 -384 -188 1932 -1672 -745 582 -1690 1285 186 -2402 1423 215 -92 1567 -1194 266 1229
5215 1229 -681 1201 -419 -1440 1071 -728 334 489 -2486 1092 1053 -1016 1731 -910 -678 2640
5231 2640 -575 158 446 -1952 1062 75 -1320 377 -1511 86 1682 -1311 701 120 -911 2800
5247 2800 -399 -1076 1102 -1537 152 792 -2191 22 -380 -1226 1579 -486 -676 757 -523 1612
5263 1612 767 -1101 1159 -427 -431 1473 -1748 -454 755 -1335 1112 175 -1285 1091 39 405
5279D05J126k557J461l9j067J684k214K14K012k093J272N47k327K504l04p90J667
5296A501k025J94J544j490K39j63r76J493p42J63O17j664J781M19j324J398q94
5313G1o74K393j656o87Q68j267R98N09j355K68Q6L49R80j093L03J21m82J515n94
5332F53j434Q83o42K11J442k144M0J259l97M85L6p58O14L51O8K32j383N04J24
5351A44l4K50j472O2J443p24R4L73q09J100Q31r05Jj92m95P62k16p11l46N41K99
5372dn8l64Q4J7Q93M87j322L75L60n09M02J98j425M48K91j26K66l05l86O84O19
5393F25l30j70j46N40k54N8R5j197L80N67q36O78m9r16J203R2n58N01j03J12K95
5414E87k21l86L6j74J94l06K4j05l90Q32N2n45N34J00RR42j072k37Q06n16m75
$$ plain form
5279 405 1531 -1026 435 396 -671 1013 -1201 -987 1025 -1068 204 751 -1576 928 624 -166 1501
5296 1501 -524 -330 1214 -276 -37 -200 -1176 317 -425 -262 355 -1309 472 891 -433 965 71
5313 71 -603 1790 134 -553 315 -952 46 555 -800 -532 -446 -97 883 -210 93 214 -268 1247 653
5332 653 -781 102 -540 -329 1113 -1031 -991 268 -129 356 392 -366 248 599 667 899 -484 20 144
5351 144 110 360 -1112 -1050 393 -331 -237 136 -673 427 1258 353 354 162 -333 429 213 -498 -844 -303 -4
5372 -4 -62 -426 -342 -325 568 1055 -267 108 468 -41 361 559 -866 -418 -127 -253 13 -292 -678 6 625
5393 625 295 125 -21 519 265 323 418 -779 -399 168 -668 10 -39 -955 248 340 -218 283 180 292 587
5414 587 366 -20 16 -158 36 -270 -246 -351 -741 91 143 -402 132 232 241 1183 111 -126 680 164 -311
5435c11L63k75k28L84m15M17l6J56L7O2P96n64l98R14r17k24M33p76J43M10q31
5456h60N32L74kr4K44R2n2j0K80k26j65j28k48J08K0n28R7P25p68O31M69p12L36
5479A15K92m41N26l98k73K30k44L2o06M15K40l96M29M31n39O42l00R0N67k38q74
5500c00L20J14k93q9j43L9J00K17k94M26Q1J12k68R72o49m85P13n27k57M38p05
5521d78J2N61l41k1O41m56K35O4L88k72m7J63m06j59K56p82J99N63o76J70P16
5542C30m79R2M54m29M53p7l97P7L9J87n34j49N56o58N7P39r04N80M45n50O38K39
5564G09j121Q25k64q3M8m85K91l44J62K67m48M62L12p52R60R9r65Q63k38o99Q01
5585D00o52l51N54k40j72K30j69P29m14M38j00n89R12k8r45R87q56m95J458j321
$$ plain form
5435 -311 52 -223 -451 -67 -482 -65 -101 55 92 154 950 386 -12 902 -15 -239 194 -582 -439 -29 -860
5456 -860 -328 46 44 -50 194 286 234 224 504 278 113 -15 -263 -155 -135 -663 -566 159 -609 22 491 -221 115
5479 115 407 -34 492 94 -179 51 -193 -161 -767 -352 -112 -508 -79 352 -187 455 155 245 812 574 -300
5500 -300 20 134 -159 -248 -391 -352 -252 -35 -329 97 178 290 22 994 345 -140 573 46 -211 227 -478
5521 -478 -466 95 -246 -267 374 -82 153 217 605 333 286 449 43 -116 140 -642 -443 120 -556 -386 330
5542 330 -149 -57 397 -32 421 344 -53 24 63 250 -284 -433 123 -535 -478 261 -643 -63 382 -168 470 709
5564 709 -412 413 149 66 114 -371 -80 -424 -262 5 -443 19 331 -421 539 638 -327 536 298 -401 400
5585 400 -252 -603 -49 -289 -461 -231 -400 329 -85 353 253 -336 576 548 -397 590 -266 -761 697 -624
5605f24j5N22o72R22N04j111P60k56J86N18j021M92k42m71J184q00j099J571j395
5624a047J080Q52j928J079M92p73R26n38n96J161j011N78j70j294J084N8k40R10
5642F23j796Q55J379j455R72K2j546J838m79p05J072j730N43R35j182O36n32k0
5660e70J690j183L35K97j412J967l92j374J323j148k05J698j552j71R64j021J456
5677G02l59p87J049o00O35N12k023J098m7j128J921j516o46J446r51N84Q51j675
5695i34J100N33n17P73j502L08O42q69O05l21q46J151l21k24J099j711O58J222
5713H46r35P85n15p77J213k49l09J26r62N17L85l93M87o06K42Q65o73J43L89r75
5733c96R30L12j650O00R9l66Q73n39l45L87q3O17l31k61J40n5O61P3j104J22N76
$$ plain form
5605 -624 -639 -117 -789 133 637 -474 286 30 216 734 -287 205 -37 -508 676 -124 -1223 348 -1047
5624 -1047 33 885 -1043 36 528 -245 681 143 -453 708 -303 275 105 -1189 -105 -47 -287 623
5642 623 -1173 -318 1061 -394 578 600 -946 892 413 -292 780 -950 -407 528 -654 -18 -550 -570
5660 -570 1120 -63 272 569 -843 1124 732 -642 681 -467 -672 1026 -526 -697 267 -754 702
5677 702 343 -444 605 5 640 1152 -871 227 180 -948 973 -543 -1189 257 -694 -110 741 -934
5695 -934 166 699 182 955 -547 -239 403 -466 139 -182 -1028 123 -198 -422 677 -1034 -376 846
5713 846 -89 696 181 -596 617 368 59 185 -777 -260 125 -268 219 -387 -145 720 47 190 579 -396
5733 -396 534 846 -804 -204 -105 -471 402 -137 -482 -95 -178 439 108 -153 -13 -68 593 666 -438 -316 260
5754B60j034R70k08j000R35j77K59O56o78j95Q48Q2l34k97n81M02J02L9m61o71
5774a083O76N06l28M51l65m27J507l37n93N05r94M82M52m34o15j11K28R15l38
5793I7m71lJ80P84L7n40M35p08K56R51j379o07R85j88rN41p83K79M48L4N68j023
5815a16j03O29p4L21p79r00J228k35r1L51j223R26J149j280L87K53p30J099k29
5834E83n56J1o41N79K54p91N67p48K93J175j304L83P04r94J198j09j132Q17k28
5853F1j58N37q29l70N02N4M73l10o17J146l20O00mj308J054J23r74N84n19o51
5873i26R78m34K15M24q80R09J57l37J19l79M85J20q04P86k28r12J247p06p59J395
5893D70q24R2J079p78j9M10m44M68j45n24R2j06L6k49j50P19l43k15Q41p01J05
$$ plain form
5754 260 -774 196 -12 -1012 -77 -254 5 661 -17 -212 636 718 384 87 -494 -92 10 49 -412 -1083
5774 -1083 -407 99 -229 222 -143 -570 937 600 7 512 -482 0 452 18 -597 -708 -480 435 97
5793 97 -374 -377 -197 587 624 84 519 -189 67 1018 -361 -968 17 -171 -180 361 -422 -143 305 339 907 -116
5815 -116 -219 410 336 657 -122 -1022 206 -29 -120 231 -992 -66 1083 -197 190 443 -287 812 583
5834 583 27 38 -603 -24 230 -561 6 -742 -449 726 -578 -195 509 -485 713 604 -528 289 61
5853 61 -97 440 -389 -759 -257 -203 270 -40 -657 489 169 769 765 -543 511 634 -340 244 -275 -926
5873 -926 52 -382 -167 257 -623 286 443 106 225 -154 331 451 -353 433 205 -707 540 -166 -925 470
5893 470 -354 -262 817 39 20 430 -14 454 309 -215 -123 -229 -193 -442 -592 127 -216 -431 410 -291 -186
5914a86Q54p05K40M61j047L39K75m82K76l60p9L38k14M83k58L09K88q26O67M87
5934H60j349O71K34j086N34j29m26O58j07j45K47j40K01K27J14q3l17L83J73o73
5954a53K02m4l77L19j77j87N27q8k45N58j45p8K85J86k91r4p5l30j95K99j21j37
5976c61N24l35N9N16m04J31K28p7P6L4m29j60M51l66j92J32Lj1P8M73k84L4N51
5999F71l08k26N90p17k65N46n36P9Q4j89J47L7J99k44J81K23l32J32N47n57j43
6020h1J38l91M55j25p28N69K33k11L65P8m76L32l3K43k25O0m8n13L12J74p85M53
6042b04L30o29O49J00n56Q60l79K6J19kn25L2K53J0o04M20J56m74M37k46k6O40
6064C87l69p9P75p00j21O21m20k76L9j93K01j50L62k74j92O38k07l65J057j081
$$ plain form
5914 -186 668 -37 203 664 -383 -44 231 -251 25 -335 -414 -76 -290 193 -65 244 532 -294 373 860
5934 860 -489 182 416 -670 -136 -265 -691 -33 -140 -285 -38 -178 23 250 364 281 -36 347 520 -153
5954 -153 49 5 -372 -53 -230 -417 110 22 -223 335 190 112 397 583 292 198 123 -207 -402 -103 -224 -361
5976 -361 163 -172 -113 403 -1 130 358 281 357 391 -38 -198 253 -113 -305 -173 -170 -181 -103 370 86 120 671
5999 671 363 137 727 10 -255 291 -245 -166 -82 -271 -124 -87 112 -132 49 272 -60 72 619 62 -81
6020 -81 57 -334 121 -4 -732 -163 70 -141 224 302 -174 158 125 368 143 203 155 -358 -46 128 -657 -204
6042 -204 126 -503 146 246 -310 550 171 197 316 314 -211 -179 74 84 -520 -100 56 -418 19 -227 -253 387
6064 387 18 -61 714 14 -107 514 94 -182 -143 -336 -135 -285 77 -197 -389 249 42 -323 734 -347
6084c47M83O15q74n0K29m18L81J15o97M12m3K74O19o54K36J32m42Q95n98l69L51
6105B50p24P48j24p93M38K09k31P62m60k03L98LK84l13m06K63q2K74j24q80K44
6126d67N96l98M89l57l07R41j7k05R9m35j05M91n20Q4m44P7N00k26J1L7k56J031
6148F19o3p89N70j93k27O25n86n77Q20k92l12O56o21J08j9L80J48J8J86j94K5
6169B82N55q34l39L28r3o00Q78n19l11J009k06R9J08m68K82L82m36j28L6j0K34
6190B49n27J26j94l04R91j54k62L03n88L63J096q41m28K58n04P79j60n10J15m25
6210f17M62L84k91L4k9p6J126q96l06N40p78Q90L8j260M99L75p27J176o16n76
6230f48Q21j24N48nq23N95k59J12L13j548P22P07j101J041l75p81J341j73o99
$$ plain form
6084 -347 136 751 -123 -173 56 -362 19 134 -563 -151 -194 80 699 45 281 413 -29 866 268 -101 250
6105 250 -474 274 150 -643 -205 4 -227 535 75 -128 270 273 557 244 -162 101 19 293 169 -711 -467
6126 -467 129 -269 220 -137 -444 497 480 275 374 -61 -166 325 -195 -111 -555 -478 22 -204 -193 -156 -412 619
6148 619 556 -233 337 144 -83 542 -44 -621 199 -93 -405 251 -370 -262 -281 99 247 265 451 257 282
6169 282 837 3 -336 -8 -101 -701 177 -342 -653 356 150 249 357 -111 171 553 117 -11 25 15 249
6190 249 -278 -152 -346 -650 341 187 -75 228 -360 3 1099 258 -170 88 -416 363 203 -307 -192 -617
6210 -617 -155 229 -62 -28 -57 -133 993 97 -209 331 -447 443 481 -779 -280 95 -632 544 -72 -648
6230 -648 173 49 597 592 -231 364 105 217 530 -1018 -296 411 -690 351 -24 -805 536 363 -336
6249c36J214j109J99Q00q04M49p19r6R55p77O1Q4p63J507j07j075J164r42L34
6268C9J202j272k05O63r76R37J3j252R90o86N71O00j534J099J03o26J319j050
6286f5m99J233j059N63M19j807R48N64p60O42m90j69J117o22O73l41j029J487
6304H05r14p0P65j481N12J009j340J100n50o52J583n94m12P53p51L46M41q75Q83
6323E58j036P4Q61j077O51P8o49J350k52j267J326o00k46J237j190J25N31j012
6341e38M64j14k91P05n29L69L60q99Q64j90l73Q03o00n19J185o88j40L27o66K49
6361b21J1r4O22k77J06K65n54N62l31j21Q61q01k99Q17j192L14N05m22K35R0m91
6382d15P70n3j44j3j38J96q0l53M59n57J33K62o45N00J28l71M73K38p84P09l3
$$ plain form
6249 -336 878 -231 -32 768 -36 413 -306 -402 553 -224 -163 -79 -842 665 558 -517 647 -295 39
6268 39 1241 -31 -236 427 -549 388 401 -851 139 -547 24 624 -910 189 292 -334 985 -65
6286 -65 -564 669 -390 173 592 -1215 -267 297 -463 179 -311 -480 637 15 688 347 -682 805
6304 805 -109 -179 586 -895 -383 626 -714 386 -164 -816 767 173 -239 514 -237 109 550 -325 558
6323 558 -478 -404 457 -620 31 109 -540 810 558 -709 617 17 -229 1008 -182 -57 474 -538
6341 -538 -74 -188 -479 226 -303 66 426 -473 391 201 -172 631 31 -488 697 9 -131 196 -470 -221
6361 -221 -210 -304 318 41 147 412 -142 420 89 -32 829 28 -271 546 -646 -332 173 -249 -14 76 -415
6382 -415 355 302 158 145 7 203 123 -230 229 -328 -195 67 -578 -78 50 -321 152 390 -394 315 282
6403B82Lo4l73n6L9J68O7n31L85q8l05P60j40l21M12J58l69L34j43j82R7l18p5
6426b60J72n7k07L10Q0j4l4K57K99n49K58M8m18J18j61j90N74m75j98M78j83j06
6448b58L59j31Q9K60k83J64l09K80k99q1K53j92k54M58l25K69k0J2J85j04J10
6469A83q2P9o1n8J27l22k89J65L14j16k14J80j60M66On65K86M01k95K79k5k25
6491G4rq1k22N2K65k84O8M22k00j99L89k48p8L05j82k14oO3k93K30J16k68J40
6514a60L69j2j13M0L8J14O7j28l49J96j15j61J87j13l56M40j16R1J89j36p4L71
6536B69P2j70o9J71k03k70J81o14L41L38j20j22J54p9K38L96n32P3K54k82O7P
6558A00k36k44K23q2N9K11j14K65k62N16j94L6J03k22k7K24n57J1K21k89K66J2
$$ plain form
6403 282 285 221 -152 -208 -169 -1 66 -465 -80 -168 -473 287 147 -174 238 396 27 361 218 36 133 -185 -260
6426 -260 -88 -145 -352 -42 38 24 -10 247 546 -3 255 303 -115 3 -158 -348 226 -249 -447 31 -152 -258
6448 -258 101 -30 59 319 36 200 -109 171 -128 -209 44 -148 -402 56 -269 0 -20 -8 177 73 183
6469 183 101 180 119 61 188 -134 -423 -258 56 -60 -274 -94 -254 212 218 -347 -61 340 45 324 299 74
6491 74 65 -16 -238 -186 79 -205 -137 285 85 -114 275 27 -51 254 72 -142 -148 -85 -378 -148 -32 -300 -160
6514 -160 209 197 84 124 162 276 343 215 -134 62 -53 -214 -27 -140 -496 -56 -172 -81 108 -28 -102 269
6536 269 341 171 102 273 70 -200 -19 -633 -292 46 -74 -196 -42 -121 117 513 -19 54 308 26 93 100
6558 100 -136 -380 -157 -239 -180 31 -83 182 -80 436 242 278 381 159 132 356 -201 -190 31 -258 8 20
6580B0m32N92J78q5k84Pk7J6J77l29J37j88K39m23L09K75p51M76K76m28P82k48
6602B89k10N59n30j12L43n14j20J29j77K11m74M25M91m37O1K59m98P87j42n91
6622b51Q26o20l73Q79n76j11K80m60O76O6o80M43l54N49K73j017O89m36n9Q11
6642E55o92n12R30q05L28P86j113Q38m7j93N46p15P1M64o19O89p57l23Q97o59
6662c31J81Q46j339L81J031r30N30l89n07J173n89K06j89p14P53J9q62J337j369
6681g62L00J408j446O03M19j368J543k09r37R92j153L32J056j444N82On03J407
6699H26r23k15O34p35Q35M42j630R57p8n67J417j462o08J482p61Q49r0r89R53
6718C37q8j48N50r92L28M94j144J173o54r04J504m64l48P44j246Q18P49j051O71
$$ plain form
6580 20 -412 180 358 273 -11 -4 -31 -15 162 -167 -30 -218 21 -402 -93 182 -569 -93 183 -245 537 289
6602 289 79 638 108 -4 339 -175 -295 -166 -343 -132 -606 -181 310 -127 -66 193 -305 482 340 -251
6622 -251 575 -45 -418 461 -115 -226 54 -406 270 336 -344 99 -255 294 567 -450 239 -197 -256 555
6642 555 -137 -649 281 -524 -196 590 -523 315 268 75 621 -94 -23 441 -178 511 -246 -569 328 -331
6662 -331 -150 696 -643 -262 769 -161 369 -20 -527 646 57 263 74 -640 113 132 -730 607 -762
6681 -762 -462 946 -500 103 522 -846 697 488 -449 543 -610 -278 778 -666 -84 -78 -581 826
6699 826 -97 -312 322 -413 422 864 -766 191 113 -454 963 -499 -1107 375 -386 463 373 -616 337
6718 337 249 101 651 -341 -13 481 -663 510 -144 -1048 456 -8 -356 388 -858 -40 709 -342 329
6737C29m60j89R58p10J30m3r49J286l6j012J027n66l4J086j522O61M05q50J453
6756I64p75q71R75n57J42O06j278P80j17k59J075j110O4J018q86N99J62j224J002
6775C10j67o18P50q22J81O49o95O79l23j83O60k37j14L16q04N64K61j083J022
6794C46k83p34J010m42m94P62p84O88L78n31L97o18N35j7m84L51L7p84R81m45
6814a31l90R13n95K85O00q48K01L08n16K89Q9m03J37k91L35ql36M46m08K98O34
6835F09j014K13O73m37Kj4n30K93K40l28M94k95oO0j68L31k17J87J59p5P6Qo98
6858d37L58K87o13N06J19m75J49K33m64K73LJ92j11rJ94k55K13rl55p9K16j88
6880b52L06j81k68N44k36q0K74j10R9j40L63l15j64j48J10J23p6j47n2N80l27
$$ plain form
6737 329 -131 -320 638 -72 58 15 -934 352 316 -696 331 -235 -269 817 -705 -44 361 -489 964
6756 964 189 -682 293 -264 -122 484 -794 -14 -131 -390 685 -425 -361 657 -229 370 532 -692 310
6775 310 143 -475 275 -547 -366 283 -412 267 -56 -239 421 184 70 386 -418 146 407 -676 346
6794 346 63 -671 339 -103 -597 165 -619 69 447 -84 313 -305 230 213 -271 80 117 -667 314 -131
6814 -131 -521 392 -203 82 682 -166 35 343 -173 116 205 -198 -61 -352 -17 -25 -361 85 -323 -25 609
6835 609 -405 -192 481 44 46 32 -498 -205 35 -293 201 -94 -100 -40 -208 123 -94 93 252 177 253 261 -437
6858 -437 -79 208 -405 101 220 -255 -106 127 -337 -64 -61 131 20 11 205 -50 163 154 -201 -280 -64 -252
6880 -252 54 -127 -395 149 -87 -167 107 -3 96 -44 319 4 -160 -308 -198 -75 -151 -298 -350 230 -97
6901i7M1O4J15j99K79J4m9j45M5l04K04j43q8j38K34Q0k0Q1k9J01L58m65m7M18
6925C10l96j14K26k4j71K13m21K41K27L9J27m9Qpm8k38K5K7J17k75O3O1nM1J0
6950a3L29k96J61p6qm0Or3K18j12l05L15k07n7J31j62K82j11J79l07J99QJ31k49
6974g7J70j32J49k48J40k59J22j86M46j59K57l53K35K42m57M08k19m45N91k43
6994a8j29LJ75l79O30l16NK82j30R6j2P3k69P8J14r0m44L07q8r3L00k25j33M21
7018A58K2j79K61l46L04K21k92l66k8L6J45Q5k29P5j7N40k00m84L10o5k02O64
7040D13p39M41J6n67M00n4k19K81l0J6J46r9K16m00k3P21q44L63J83o68O51N6
7062B60p24N24j94p8M35m37k7L57j06L22k47j53O07o16K40M87j166O59K11r39
$$ plain form
6901 -97 -56 8 123 -76 203 217 168 23 68 -236 -32 -175 -263 -401 -167 -87 -107 -26 -55 46 404 -61 -108 310
6925 310 -86 -200 26 2 -169 44 -377 -136 91 130 257 208 216 209 161 -77 -52 -25 92 -183 -120 -59 -64 -23 -13
6950 -13 316 20 181 105 97 57 63 -30 188 76 -229 86 -121 -178 -47 -209 73 -38 141 -166 33 41 172 -77
6974 -77 93 -39 110 -138 2 -257 -135 -321 125 -34 223 -130 105 347 -110 298 79 -366 225 -18
6994 -18 -147 -144 31 -348 282 -34 -29 253 123 219 207 280 11 89 203 113 -331 -24 -112 -205 95 -130 -263 158
7018 158 180 1 262 -84 220 441 149 -217 -245 -209 -64 21 -208 -133 -150 390 190 -294 16 -49 -251 413
7040 413 -326 115 131 -436 -36 -90 -309 -28 -58 -42 104 5 221 -179 -202 519 -325 38 221 -447 204 260
7062 260 -464 60 -134 -212 223 -214 -241 116 10 332 85 -68 539 -77 163 650 -516 143 354 -585
7082e85Q70m32k03P66n40J21K72p42O56J64n23K16m91J31N60p94O59j74q64J311
7102C78l27l32Q80j043K61J050j131J64K14n04Q15p49j59N43o59R93K7r64J118
7121E75o59m36J604j416J67O53q45N93Or97Q42k68O2Q70j179O26J0l49R14p79
7141fl97R03p26M45R7j380R01M87p00R71j028J9J106o47K48j29p87R10j95j11
7161a9N77j306M95O77j064R71k54o99J344o31k47M99p67N94M20q43M78n32L7Q00
7181E30p97j66N76j021J543l61r50Q67j46O6O64j005P7M26r93J114l24r62J099
7200B37m34K02L57o30N12j60k17Q33p20j82P82r26J77L73j000R07l9l85P50n29
7220i2r4P06n55L00j57o35J037o41J40M43q96L49L10r68P68J02m93J000m10l29
$$ plain form
7082 -585 285 -147 -350 416 -124 -3 269 -473 183 347 -176 40 -451 -320 240 -554 105 -69 -933 378
7102 378 51 -281 599 -444 -183 867 -264 -100 114 -390 425 -324 -483 60 -599 394 421 -543 575
7121 575 -84 -520 1084 -332 -165 488 -357 236 242 -755 87 -181 -119 751 -428 198 208 -141 773 -6
7141 -6 -403 500 -226 219 316 -1064 -163 324 -376 595 -433 -414 692 45 293 164 -623 287 92 -19
7161 -19 558 -748 -253 424 -640 331 77 -622 722 91 -156 343 -424 170 590 -253 225 -307 -270 530
7181 530 -267 -433 143 -878 665 304 -646 221 75 141 805 -200 -123 303 -690 424 100 -862 237
7200 237 -197 5 362 -268 244 84 -133 700 -20 -202 580 -346 -169 204 -796 111 72 -313 437 -92
7220 -92 -186 520 -35 265 108 -527 510 -131 9 452 -444 -95 215 -753 15 117 -376 624 214 -115
7240a15O69p52J85J80m49M89n41N3P96j075L33M09p04R27l56k82O19k19m3L58
7260D82o99n7L80k02K14q8k41K50m8J06l22O9M41M2l00L12l82k64O71n23l2O6
7282a25j55j03L42k09M44k34L4K06n7N4k29M0K99l27j64M11m50J73L54n24K99
7303G9R4J1j86J49J17k23J75J67n12J55j7k73L89K3l56n5K31M9K19L3l41K08J60
7326B96k32J12k66j20J6R0k23m9L49Lj28J7L59k36L41j74j97J4P7p8O3k30l08
7349e04M10K13m52M87j44j20J44K19j82J07Q7k08j69J66k29r0K55O2k42j7L23
7370A16j80O9K3o6L62k94K7Q0r2j64K20m5k33J08KP4m8J98J41m24M89l09lJ02
7394A53j50k56K62k79J56J52k45J7J68N7L9l0K53j73j85L01l88L1K62l47m0L11
$$ plain form
7240 -115 554 -198 -13 167 -282 207 -334 -281 515 -560 -227 182 -522 405 49 -233 386 167 124 482
7260 482 -217 -274 106 -96 118 30 -211 39 -9 97 -225 -156 285 327 27 339 -43 -307 364 -159 -191 -125
7282 -125 -280 -383 -41 -250 194 -40 -6 200 143 197 -32 8 307 -20 -184 227 -223 -50 304 -220 79
7303 79 173 184 -2 147 264 41 216 383 -129 26 9 -264 125 148 -208 -263 -32 17 236 269 -72 136 296
7326 296 64 176 -90 -210 -194 -104 -327 -376 -27 -24 -152 -135 224 -12 329 155 -42 -28 49 -29 34 -196 -504
7349 -504 -94 119 -333 154 10 -110 34 253 71 178 265 57 -112 54 -175 -265 -10 52 -190 -207 116
7370 116 -64 5 28 -38 324 30 57 137 45 -119 101 56 -177 -69 -67 7 -41 157 298 -126 363 54 51 153
7394 153 3 -253 9 -270 -114 38 -207 -190 -22 35 74 44 297 124 -61 240 -148 -117 145 -202 -242 69
7416F9l7k36L82k86m4M77l01J67r2q5j40M15k63j04kJ98k76J9K09k79R4K66l75
7439b24K97J2J02J8l19Mn3J9P8j6j66K98k13L59j09M0M3P0j50J78j70l82J54m9
7463a79J64p2j9j2K17k64K40o8R1l0j80M46j32m10M30l14kQ5j81j1L82l34J10
7486d3O7j14P2L7J19j06kK4j60%L07l90l20P34k53nM45o95M08J02k66M13l98J6
7510hK47l97L49j19l09M23l71j58P22n80K45J18n10P47k99k47M67l33J0J60m85
7531c28K52Q4k02N18l84k49P93r56M99N93r69Q93l99m71Q31p95J24O83r84L94
7551g3P8l48P74l47m65Q16m56L97p2q17Q26k88k57N44p88q1R34q51O06pq03J088
7573D10k77r8L00p50M58K21n91P54p59j24Q02p64K48N42j026O49M00o21M03m34
$$ plain form
7416 69 32 -204 178 -108 -152 325 24 191 99 14 -126 289 26 -78 -80 118 -158 -139 70 -209 -115 151 -224
7439 -224 73 85 187 205 -114 -110 -163 -144 -66 -82 -248 50 -163 196 87 127 170 240 90 268 98 -284 -130 -179
7463 -179 -15 -87 -106 -118 99 -165 75 7 98 68 -112 334 202 -208 222 -92 -94 -9 -190 -201 181 -153 -43
7486 -43 24 -90 -18 19 138 32 30 54 -106 -106 201 -189 -509 225 -28 -33 412 -283 125 227 -39 374 -24 -8
7510 -8 239 -158 191 72 -237 186 -185 -343 379 -201 44 162 -348 399 100 -147 320 -13 -3 157 -328
7531 -328 -76 8 -194 324 -60 -309 484 -472 27 620 -349 544 145 -326 505 -290 -166 517 -467 -73
7551 -73 5 -343 431 84 -381 435 -21 376 304 -513 313 25 -232 312 -476 -557 377 -474 132 125 -678 410
7573 410 133 35 335 -415 43 264 -327 427 -332 -456 346 -418 -170 372 -654 -5 395 -226 177 -257
7593b57J03O44l93J60q7p98Q44k83m27L91k95O25L65j252P32K28r77J216k64n20
7613b45M88m15K27K98p47K67p1n4P94q47K41M15n82N34J24j006R28m22l34J016
7633F09j110K08M37l18L16Mm13Q25n51J62J82q74O66K27p45P12o81m4J044j179
7653e23J43O47m87N34K92p32J51L6k0K36n51l4K61m69Q14m49j47O15n94M60N2
7674B35n67M35J41k86N36j77n53K96l80M08j9n14M88q8j7N53m73q2L07q8J95k06
7696A44n50N46j49m24N27m58L64L05l11nK61j41J87k13N0l17k01P15j06n16L00
7717Hl23j5O00j04k63M0M23n1j41j01k6j76K89L4l80R0P4k17J37J27l24K85J86
7740A72r2L00r7m85K76K07m00J09k90J91J84k26j6J9J56l7J5R2j02J07J80j89
$$ plain form
7593 -257 -154 490 97 257 170 -628 216 -67 -494 -103 -398 227 592 -660 72 300 -677 539 275 -245
7613 -245 243 -172 55 353 -394 -127 -198 -252 542 -305 -64 351 -231 303 427 -579 349 -73 -407 609
7633 609 -501 -293 144 -174 142 146 -267 558 7 169 351 -523 143 370 -375 337 -344 -388 656 -523
7653 -523 -380 267 -220 314 606 -126 25 61 41 277 -274 -308 -47 -516 298 -151 -298 317 -277 183 235
7674 235 -332 103 244 -42 494 317 -236 60 -320 88 69 -445 43 -45 -62 491 18 -64 243 155 350 144
7696 144 -406 140 -9 -433 94 -364 0 305 -6 -11 250 109 296 83 133 -184 -385 330 224 -292 8
7717 8 -315 -330 270 166 -97 -57 366 315 174 73 47 -129 160 194 -186 -96 -22 -239 -102 25 -299 -14 172
7740 172 80 380 283 -202 74 281 -119 -10 -300 -109 75 -151 -167 -148 8 -29 -14 78 -24 83 263 74
7762G4o5r8J68n49O51k52k82P7N8K83N7k01lJ59n8J07L5Mj67k21L45k97K1K6k79
7787d07L24J32Q4l25P0N1L27n6m17L40k62J9J63l45L5O7K7L10l30J24L92j44O8
7810B47j9l47n9L91m12J60r8k42K44R6kl5J36K28l71K34J14Qq6k67j94L54j05
7833b5k04L34j95m2J38k5K39o2J91M3m11J02J81l35J09n4l44M85k37j46K74j0
7855Fj24K60j46k14J65J32j27l8J39On8j02J18k44L18l99P3N80k17j50L00j82
7877I6oL0j04k8L6k11k3K50k08l3J60p7QJ35L54n23J87L05l40Kj04k55M00k06
7901a55j23L85l79j51O71j38j96K19P7N9j74Q3J38m58J92N5l16K80P5j95J45n4
7923D0k32O29l71m8j23L51k87K65l09J33l30K20J03l44K78k96L83L65m00l7M13
$$ plain form
7762 74 9 -89 79 -470 181 -71 -353 -276 -218 65 122 -79 -82 77 19 126 161 165 -2 -223 122 -175 -154 -128 -407
7787 -407 -83 49 133 -192 -122 -71 256 200 -217 123 -139 -120 43 -302 -267 -200 -173 137 -193 -69 323 179 247
7810 247 228 -119 -178 213 -199 -39 -137 -379 -135 -39 -41 -76 60 288 -83 151 265 273 187 -80 -274 80 -25
7833 -25 -229 105 -90 -132 6 -19 220 158 349 392 -19 83 264 -71 38 -16 -360 125 -112 -258 16 6
7855 6 -118 142 -4 -218 -53 79 -48 -86 53 59 1 -101 17 -227 91 -308 -235 345 128 -22 278 96
7877 96 90 120 16 -12 24 -187 -210 40 -168 -201 -41 -118 -110 25 379 -144 43 348 8 10 -94 -349 51 -155
7901 -155 -278 107 -272 -423 248 110 -86 133 210 269 95 178 316 -142 50 105 -211 69 144 -51 94 40
7923 40 -192 437 66 18 -105 246 -41 224 -85 48 -282 -62 41 -303 -25 -321 62 427 27 -10 403
7944D03l78J5J00l13J52p7R0j64N7j31J38lJ55n0j47O20n07k81P21n91L47k31
7966g5k00L12j57j99M61k97L10j47K84j41j40J50L69q21J67M80n04K57j13j77
7986a81K92K2l14N63l82J52o0j39J21J07k0K50n66J05K64o54O09j12k70L62j38
8007A1M4N91n47K9M1m94N35k6j98J53o40L08M72m87L21k91n4P63m40m54O20n52
8029b95M22K61q55N48J1l28M48j23l07J38p7O95m29l27N93m73J88M16q44M32m4
8050E0j82K55m3n99P45j73J42j17l07K25K44k20J52l20M6N97p62N32m65l24O16
8071I2K30p08N26j13j14L51j28k71J37n4K11j16j46j51K1N38o3q34O32Q3j66M92
8093D49l62k84L47q8M6j9l36J34j17J93J66m03Q1J56n7L13P2m51L26R1l24M58
$$ plain form
7944 403 25 40 140 -173 -21 -98 -8 -172 -115 -246 -108 -111 44 -6 -153 467 -40 -321 400 -191 156 -75
7966 -75 -275 37 -120 -319 142 -155 155 8 292 151 11 161 530 -291 -124 356 -148 109 -4 -181
7986 -181 111 133 -181 382 0 152 92 -47 74 181 161 411 -155 -50 214 -440 169 57 -213 149 11
8007 11 55 646 99 128 169 -325 210 184 -14 139 -501 -193 279 -208 113 -178 -232 531 91 -363 257 -295
8029 -295 127 388 -467 81 92 -236 212 89 -218 -80 -157 538 109 -218 375 -98 90 506 -338 94 50
8050 50 -132 123 80 -519 226 53 195 78 -229 -4 240 20 172 -148 -102 495 -267 265 -200 -524 92
8071 92 322 -386 140 27 -87 264 136 -135 2 -52 159 43 -103 -254 -233 305 242 -592 40 123 -43 449
8093 449 87 -197 150 62 108 89 -247 -113 -230 -37 129 -274 -193 -37 -94 219 291 -160 166 257 -67 391
8115C91o83J59K22j76K13k44k16J82L69O5m26J77J25K16l06j9k15N9J91k00L12
8136A96k21k31K00N68p18J32L35k23M4l3j75k5J65l4K30l83j2p6J87R6L8k41L99
8159B18j98j06R0j26L8L71m10K78l43k73M86nq0R5k16K92J51n2j4j99Q1L37n48
8182a33J8p2k2L04q7l96L31J04j79
$$ plain form
8115 391 -292 -133 89 -87 126 -118 -334 -152 217 282 -144 33 158 374 68 49 -166 -107 84 -116 196
8136 196 -25 -256 -56 512 -206 -74 261 38 82 49 -126 -151 14 -20 210 -173 -185 -261 -74 22 60 -181 218
8159 218 20 -86 4 -122 -84 287 -123 155 -188 -461 25 20 -60 35 -181 111 262 210 196 -3 78 415 -133
8182 -133 -115 -187 -209 95 8 -388 -57 47 -132
8191a32
$$ Imaginary data points
##PAGE= N=2
##DATA TABLE= (X++(I..I)), XYDATA
0@%%%%%%jRj6J6j6K4l2M0n6P2q8J06j30J60j92K26k69L19l74M38n11N90o78P78
30D15q92J020j157J308j474J659j866K092k340K611k905L226l579L964m383M845
46B544n348N893o492P151p875Q675r563J0550j1652J2893j4300J5913j7788J9992
60A0593k2624K5833k9844L5020m1980N1875o7105R3688j52730M98297n2762p04577
72c56316N71558n03827M73942K91599q87451L07458L5232j93959P02225n83027
82a42566j44969L83557l35125O48831p8811p98778O24917j03176j6527M29034
92D66387q76962J48735N36480m92307L84308j91774m33065O43923j57973L0402
102E8154K18143o37589M01836K68377l47345K84993m94612m3948O92128n19466
$$ plain form
0 0 0 0 0 0 0 0 -1 8 -8 8 -8 16 -16 24 -32 40 -48 58 -72 88 -104 122 -147 172 -202 236 -275 315 -363 415
30 415 -477 543 -614 694 -780 879 -987 1105 -1235 1376 -1529 1697 -1882 2082 -2301 2544
46 2544 -2804 3089 -3403 3748 -4127 4548 -5015 5535 -6117 6776 -7524 8389 -9399 10593
60 10593 -12031 13802 -16042 18978 -23002 28873 -38232 55456 -97274 401023 348261 -356316
72 -356316 215242 -288585 185357 476956 -410495 -103037 -67805 -261764 440461 -142566
82 -142566 -287535 96022 -239103 409728 330917 -467861 157056 53880 37353 466387
92 466387 -410575 -261840 274640 -217667 166641 -25133 -458198 185725 27752 58154
102 58154 276297 -361292 40544 308921 -38424 246569 -248043 -291991 400137 -119329
112a19329P20J66730m50947N69418K5717m11799M01457k96690L6829M64578m21490
123c4806M0335j9951k03069N06773k76484k82400L14502k56638K69349J51132
133B08743m95183L55251K4703k21590M29453k70433j52872K66858k45187J93655
143I3398K4147l82833K43647L65l5240J68677l06070J66018J96751k65364K40664
154A44160n3265k02046K85533j86456k7048K03275l35489P8084J70505j82630
164a05377J14682q0630k8881K33116j55109K5154R9375j35065J46780p8337j05628
175f9920K07318j98766n7312J91587j65114M6054M7818j30195J84438r352j12035
186f5479J38152l1044m844K1645p9353R1278o3368j01318J14248n8938j3499M3566
$$ plain form
112 -119329 -118609 48121 -402826 166592 192309 -219490 181967 -114723 -77894 386684 -34806
123 -34806 5529 -14422 -217491 289282 12798 -269602 44900 -211738 57611 208743
133 208743 -286440 68811 93514 -128076 301377 30944 -121928 144930 -100257 93398
143 93398 117545 -265288 -21641 -21276 -56516 112161 -193909 -27891 168860 -96504 144160
154 144160 90895 -111151 174382 -12074 -39122 164153 -171336 -93252 77253 -105377
164 -105377 9305 -71325 -100206 132910 -22199 2955 102330 -32735 114045 35708 -69920
175 -69920 137398 -61368 -118680 72907 -92207 -46153 1665 -128530 55908 46556 -65479
186 -65479 72673 41629 36785 58430 -20923 70355 6987 -94331 19917 -39021 -52520 -8954
198h954j08505J25337O6425j42613R4100M4243n9877N4977m0231q330K6968q5897
210d2357J2333L1446l0517j6738m2029P6665O2919r4096L5122O2033k8726M1494
222F7549l0406l7845O1740n6913n3105O0539k2494n7544O734M0177K8991k5788
234a8365n707M1320L1362J1760l9123q579N5811m2703o1950M1300p751n1225N418
247d8432P993J6359J8206k8161J5719P0391n080m6885K5979L9901l4857l9733
259h600O775j413j6728j9106j9237K8494K6771m0745P648P6108l908l8496L1923
272B9486K4391j5794j9528k4998L006J5522m4136l5590M5869J8872m4324J1634
284c5590N4686L352j1493J1878J2655J5800j4504m6751J2960K8601n5560l7013
$$ plain form
198 -8954 -117459 7878 74303 -68310 25790 70033 10156 65133 24902 16572 43540 -42357
210 -42357 -30024 1422 -29095 -45833 -87862 -11197 51722 -42374 -7252 54781 26055 67549
222 67549 37143 -702 61038 4125 -48980 11559 -10935 -68479 -61745 -21568 7423 -18365
234 -18365 -24072 17248 48610 60370 21247 12668 68479 25776 -36174 5126 -2625 -53850 -48432
247 -48432 -40439 -24080 -5874 -34035 -18316 52075 46995 110 26089 65990 31133 -8600
259 -8600 -1825 -3238 -19966 -39072 -58309 -29815 -3044 -43789 -36141 39967 36059 -2437 29486
272 29486 53877 38083 18555 -6443 -3437 12085 -32051 -67641 -21772 -2900 -47224 -35590
284 -35590 19096 22448 10955 22833 35488 51288 36784 -9967 2993 31594 -23966 -60979
296f0979M3040P359l1488R772K6212J9226J2273j5169Q285M5266j8561n3480K2690
309A4446K1604n2450k7428K0072N25o457o629r38M3707K2483l7098J7009N6719
322F5565k2961m0322K0182R061l0765k2097j1547L360J5520k5349j9023N9593
334A217J8707m6659L1408M8448k1253r775k006k635J3515l3143l8565K2420J1810
347f511l4749j4783M6836J7628l6559K7097L7105j0928J5237k3839j3779N7545
359F0300m9032n8860N2270j1512l4019J0061j407K7220k644j1904M1021Q418N942
372C5854j7309j9937O9424m1858p6403P0908k6635l6774M1761n7076L5855N0509
384B8319p8920N2727M6979m2499K2783j6453K6879J2007q8417M3827L568n4339
$$ plain form
296 -60979 -17939 -10580 -42068 -32296 -6084 13142 25415 10246 18531 63797 45236 -8244 14446
309 14446 36050 -16400 -43828 -23756 -23231 -29688 -36317 -37255 6452 28935 -8163 8846 65565
322 65565 42604 2282 22464 31525 760 -21337 -32884 -29524 -14004 -39353 -58376 1217
334 1217 19924 -26735 4673 53121 31868 22093 20087 17452 30967 -2176 -40741 -18321 -6511
347 -6511 -41260 -56043 -9207 8421 -28138 -1041 36064 25136 40373 16534 2755 60300
359 60300 11268 -47592 4678 -6834 -40853 -30792 -32199 -4979 -7623 -19527 21494 29912 35854
372 35854 18545 -1392 68032 26174 -50229 20679 -5956 -42730 -969 -58045 -22190 28319
384 28319 -50601 2126 49105 6606 29389 12936 39815 51822 -36595 7232 10800 -43539
396d3539N0806p1401J4038J00705j16255M1042R2464r7043O1003J1950n2539Q7827
408G9058q2145l4205Q3098p2185J3807j9200m5218J15271p7880j6560J23965j10771
420d2965N1639O7572j15205J23167m5341j27331J68263o4127o8973O8158j05937
431i1080Q9233L3649j17557J15810m4895j6815J28005j21246O8322L0046j76416
442a02944J85278r949j64010J28093j10984K3640J59905k07176N1456Q9523j02842
453f0010J47665o2220o7154J26922j32855Q9764P0307k18931J12038j7469o0121
464g2064J96221k13920m0188K26488j41898Q6080K8190j87699J96772j8983q0909
475b1910J34518j93813K4410J27394j27086J17819j19841j20826K92032r8146
$$ plain form
396 -43539 7267 -64134 -50096 50609 -65646 -24604 67860 -29183 31820 43770 -8769 79058
408 79058 -3087 -37292 45806 -26379 -12572 -31772 -76990 38281 -39599 -56159 67806 -42965
420 -42965 8674 76246 -38959 84208 38867 -88464 79799 15672 -53301 14857 -91080
431 -91080 -1847 31802 -85755 30055 -14840 -31655 96350 -24896 43426 73472 -102944
442 -102944 82334 72385 -91625 36468 -74516 -50876 109029 -98147 -46691 42832 -60010
453 -60010 87655 25435 -41719 85203 -47652 42112 112419 -106512 5526 -11943 -72064
464 -72064 124157 -89763 -129951 96537 -45361 40719 68909 -118790 77982 58999 -21910
475 -21910 112608 -81205 -56795 70599 -56487 61332 -58509 -179335 112697 14551
485A4551m6740R8805k07569K01414J05590k44233J37634p6839p6281K34612j60500
496a9556l8381N2670j48628K29593P831j91491J25913r2193J05616J71559k93107
507i0174O6945Q4027j33668K16526j25283j73609J93329j06681P4279J10172k61328
518a45465R5047Q8213k8968J44081k13598l4230K14638j17527P1725m7865k01902
529a75851K33696k7675r5063J47743k08062L8580K09678j37126O4970n4624j12937
540a16671K47158n2952j01134M1160j32498J55514N0591j92978J08374o7299k1615
551h2350K13871j52424k1701Q6460j25135J77749K2931k06800Q8388j7656K2262
562E595R0706j88296K1350Q0022n8607J14319p6245o8987J35054p5501O2285P0815
$$ plain form
485 14551 -32189 66616 -140953 60461 166051 -78182 59452 -17387 -93668 140944 -19556
496 -19556 -57937 -5267 -153895 75698 83529 -107962 17951 -74242 31374 202933 -90174
507 -90174 -23229 60798 -72870 143656 18373 -155236 38093 -68588 5691 115863 -145465
518 -145465 -50418 37795 8827 152908 -60690 -94920 119718 2191 73916 26051 -175851
529 -175851 57845 30170 -64893 82850 -125212 -86632 123046 -14080 50890 -3734 -116671
540 -116671 130487 77535 -23599 17561 -114937 40577 91168 -101810 6564 -60735 -82350
551 -82350 131521 -20903 -42604 43856 -81279 96470 119401 -87399 989 -16667 5595
562 5595 96301 -91995 -70645 9377 -49230 65089 -11156 -80143 54911 -20590 41695 112510
574A12510j91460O9911O1609o8948Q3384j16763n5124J51214n7578m967J7008
585G96o8574J01278l998l4083P4859r3715J4322P7403q1522M2907l6728q3935
597i0990J30562l0301p1872O7935m2093L5001M9160o9649M7168P236m0928M9865
609D1094k7777n224K039o4423O2154R778p3806M5255p608k125N8578n4794J0493
622f366N6985n2240J1285K6690l1094L64k5307J931L1610l5551j1389J0629O384
635a6069L5160k3842r169M7937k5262n287L8853l0397j5360J584j8224K8300m232
648C992n3193J4346L6635K506q832p098J9710J4352m760Q759q679j4866J861j0553
662e820J1348K935n3604N284N0428j2522j2556L929J665L7051M114k9907J4658
$$ plain form
574 112510 -78950 -9039 52570 -16378 67006 -49757 -104881 46333 -11245 -16212 796
585 796 -67778 33500 29502 -4581 70278 -23437 -9115 68288 -13234 29673 -7055 -90990
597 -90990 39572 9271 -62601 5334 -36759 -1758 47402 -22247 24921 32157 -8771 41094
609 41094 13317 8093 10132 -54291 7863 17641 -56165 -10910 -18518 -20643 37935 -16859 -6366
622 -6366 50619 -1621 9664 36354 5260 5624 -19683 -17752 13858 -21693 -33082 -22453 -16069
635 -16069 19091 -4751 -13920 34017 8755 3468 42321 11924 -3436 -1852 -20076 8224 3992
648 3992 -49201 -34855 1780 4286 -4546 -11644 8066 22418 17658 26417 17738 2872 4733 -5820
662 -5820 5528 8463 -45141 -39857 10571 -1951 -14507 -10578 -8913 28138 32252 2345 17003
675A7003N554j6428j21r12n722k4722p518L3415n464j7632P915K850L5076Q277
689C1571m3807K4325K5459l0203K399l135j6405M714j5130K122J4740j6839m207
702b4396J5402K3758M397l1131J8247L1336k4942m105k765j4341J7393j9251k1240
715c1638K9510r864j8838K3435J4329q79p472N685K2664l407j3666p708l06J3925
729A5770k3832k3324K8816m401k3122J9925Q455J086Q661p465J3600J8567j8848
742A3888j5578J5573N327k6421j3771J6023k610j3093M108K530J3789R818j6914
755g331J3132K8459j9331j4336J8525j360j9176o628k752J040O40j4273j272K6927
769B264J212j9309J9476K3462j4313o251R590k319l293j0619j5906J0680M885
$$ plain form
675 17003 22557 6129 6008 5096 -626 -25348 -32866 549 -4915 -22547 -14632 -11782 23294 31571
689 31571 -12236 12089 37548 7345 9744 6609 -9796 -5082 -20212 -18090 -3350 -20189 -24396
702 -24396 -8994 14764 19161 -11970 6277 37613 12671 8566 5801 -8540 8853 -10398 -31638
715 -31638 -2128 -11992 -30830 -7395 6934 6055 -1417 4268 26932 23525 9859 2151 1845 15770
729 15770 -8062 -31386 -2570 -6971 -30093 -10168 -1713 -627 8034 569 14169 32736 13888
742 13888 -1690 13883 19210 -7211 -20982 -4959 -7569 -20662 -16554 -14024 -235 9583 -7331
755 -7331 5801 34260 14929 593 19118 17758 -1418 -8046 -10798 -9758 -9118 -23391 -24663 2264
769 2264 3476 -15833 3643 27105 12792 6541 16131 13812 10519 -100 -16006 -5326 -441
782d41k7019J169K7913n981j2619J7842J2882j227O72n187L079J1667k0144k0437
796a7831K1453r52l0221P817J5910o663K746K761N707J9099m756j4314J3730J2850
810B7336k2438j6699J8174l304k4443O969K184j507J5636j6013L837L8313j8167
823I878j3679K7808l169j2323n950l968P056j2512j1417J262M300J4170j9773
836a8317j70M4532k1582j2235L7421j7996j64P914l4231K4387L044m3187J5941
849a4643P874n797J484j0732L0167P01j9575L2738j1811J277J7522m9708K9315
862H812K2740o7553K6152J2099l3653L4714j9486l298M0661l2838J4429K2927
874B5706j9476J6939l0983Q845M0485o6648Q705K6150m5552M6800j6734l9286
$$ plain form
782 -441 -27460 -26291 1622 -4359 -16978 864 13746 12519 13191 8004 11083 22750 2606 -17831
796 -17831 3622 2670 -27551 -19734 -3824 -10487 -7741 -4980 727 19826 15070 756 14486 27336
810 27336 4898 -11801 6373 3069 -21374 -14405 -12221 -13728 1908 -14105 -10268 28045 9878
823 9878 -3801 24007 20838 8515 2565 -1403 5653 -6859 -18276 -17014 -12714 1456 -18317
836 -18317 -18487 26045 4463 -7772 29649 11653 11489 19403 -14828 9559 12603 -30584 -14643
849 -14643 -6769 -12566 -11082 -21814 8353 9054 -10521 22217 10406 11683 29205 -20503 8812
862 8812 31552 -36001 -9849 2250 -31403 3311 -16175 -19473 21188 -11650 2779 25706
874 25706 6230 23169 -7814 1031 41516 -25132 -16427 9723 -35829 10971 -5763 -45049
886d5049P3573l1880j5923O2831m3063L823J6562k8944M4652l4851l6949M5572
898A0354k7331J9425j129n9853P6629k147m6345P2316m6666j0216O6856o0115
910h222K4645J0651p8335O1401Q232m1131K0646m8705M4686M5131o8477L8569
922I091q604k0294Q3886o0116j6163M9981q1914N2237M1493r5972K8565n857l109
935b6776P9523p2729k2180N6233j5992N2261l1092n6418O7983l5428R049M7182
947E1616j03784K1359M0761m0334P1304n2188o5509J05413l778p749P995o9979
959d4873O1036K9628m6966K4012n8579K147O7478n0364K1915j5247o4836J09600
971C4951J1060o2799L0211m4371M1396O9077r0308r442J5394j5856N6308l7309
$$ plain form
886 -45049 28524 -3356 -19279 43552 489 4312 20874 -8070 36582 1731 -35218 10354
898 10354 -16977 2448 1319 -58534 18095 15948 -30397 41919 -4747 -14963 51893 -8222
910 -8222 16423 27074 -51261 10140 18372 -22759 -2113 -50818 -6132 38999 -29478 9091
922 9091 487 -19807 64079 3963 -12200 37781 -44133 8104 49597 -46375 -17810 -23667 -26776
935 -26776 52747 -19982 -42162 14071 -1921 50340 19248 -37170 30813 -4615 4434 51616
947 51616 -52168 -30809 9952 -30382 40922 -11266 -76775 28638 24860 17111 25106 -44873
959 -44873 16163 45791 -1175 22837 -35742 -33595 33883 -16481 5434 -9813 -74649 34951
971 34951 46011 -16788 13423 -30948 10448 79525 -10783 -20225 -4831 -20687 35621 -1688
983a688l5540K5821k6568N8981K2610p5556K4700L584J6754O2922q8148l4051
995d6179O6305j7843J7584j5622o4420M6316J8732o147K1551m6728M204M1417
1007A9170K637K1404n0006l3583O9010n258k1348n571m8824M2233L7104m6475
1019a9507J1701j933j3751M7562K203j7466n924j7907L4315J5630l7212j4699
1031a6988r985K4354K5720m4910n587K7267j0175K3153P589k8318J6311K033n732
1044D732K5779k3421l1668J8727J0164j102j4542j7533K1749J1763m085O687j0358
1057c108Q377J2948j6654J7806r27m1227J9495J3918k0193O444j9221j148L7475
1070A3985j5943p687J7875q005J0282J513l744J3398l0369l791K6006j8888J851
$$ plain form
983 -1688 -37228 -11407 -37975 21006 43616 -31940 -7240 -3656 13098 76020 -12128 -46179
995 -46179 20126 2283 19867 4245 -60175 -13859 4873 -1274 20277 -26451 -22247 19170
1007 19170 21807 43211 -6795 -40378 28632 23374 2026 -3545 -52369 -10136 26968 -19507
1019 -19507 -7806 -9739 -23490 24072 26275 8809 2885 -15022 19293 34923 -2289 -16988
1031 -16988 -26973 -2619 23101 -21809 -27396 -129 -10304 12849 20438 -7880 8431 10464 4732
1044 4732 30511 7090 -24578 -5851 4313 3211 -11331 -28864 -7115 4648 563 7250 -3108
1057 -3108 5269 18217 1563 19369 18442 -22785 -3290 10628 -9565 -3121 -22342 -23490 13985
1070 13985 -1958 -9645 8230 225 10507 12020 8276 21674 -8695 -12486 13520 -5368 -3517
1083c517j1444k0562M7672n342k9424L2505j1122N94K8121k3717O992k13k7312
1096a6769K9139k553k3036J195j7315L1826J2405m2189K5012O814r113L6218k7581
1109D053p553K9398l5243J5410J8021m4660P589K797J492K3298l7083J602L2318
1122A1439j0289J8693j5903j5999M2820k4913q567K7615m3510N706J9995k4254
1134a7167K2142j6352k1812M6224k845r865M364j3316L1489l828k6339K1656k0620
1147f269l989K1804k9919J2590M473l2863M0550Q989k9641J8089k787R804J5373
1160B6204l0914M799Q921j1776P035j7525K348J2557k6346K1296J4884k6683J7957
1173B757M022m224K4433k5299q853K7044j5059r579q0m453P593j0391k11J3546
$$ plain form
1083 -3517 -14961 -35523 12149 6807 -22617 9888 -1234 -640 27481 3764 10756 10543 -16769
1096 -16769 12370 9817 -13219 -12024 -29339 2487 14892 -27297 -2285 4529 -4584 31634 4053
1109 4053 -3500 25898 -9345 6065 24086 -20574 -12985 -10188 -8696 14602 -22481 -20879 11439
1122 11439 1150 19843 3940 -12059 30761 5848 -2719 24896 -18614 -12908 7087 -17167
1134 -17167 4975 -11377 -33189 13035 10190 325 4689 -8627 22862 19034 -7305 14351 -6269
1147 -6269 -10258 11546 -18373 -5783 -1310 -34173 6377 15366 -14275 3814 1027 10831 26204
1160 26204 -4710 89 9010 -2766 4269 -13256 -10908 1649 -24697 -3401 11483 -15200 2757
1173 2757 6779 2555 26988 1689 -7164 19880 4821 -4758 -4838 -9291 -1698 -12089 -12300 1246
1187A246q690P728K991j973K0599j5998j1631K7151j1313j6749P938q585K669
1200d617K128j5236R136R933n359j287Q636J0665p792o044J4544n232q357J144
1214B262q922M922K572j9770O354J7033j2073j881J3548K576o43J2n3L279J171
1229A0387j0736p144J0704l345j7775P760J0542r429J396P505J222P507j197p240
1243A57J1443L638j8084r77J1255r678j0728N304J451m34K705l774O070J4061
1257A2409p739o495J6894p2j5456L307K875p683j800n363k456R490k099r635J1624
1272b199J2677r734j584J4923k562p063K929o401R60L189j7672m5J5644j2051
1286h989n953J3414L150j803J256M934M352p97l532o206N529L981k1912J700J5501
$$ plain form
1187 1246 -7444 284 3275 1302 21901 5903 -5728 21423 10110 -6639 1299 -7286 -4617
1200 -4617 -2489 -17725 -8589 1344 -4015 -5302 3334 13999 6207 163 14707 9475 1118 2262
1214 2262 -6660 -1738 834 -18936 -12582 4451 -7622 -9503 4045 6621 5978 5990 5937 9216 10387
1229 10387 -349 -7493 3211 -134 -17909 -10149 393 -9036 -7640 -135 1087 8594 7397 157
1243 157 11600 15238 -2846 -3823 7432 -2246 -12974 -7670 -6219 -6653 -3948 -7722 -1652 12409
1257 12409 4670 -1825 15069 14997 -459 2848 5723 -1960 -3760 -9123 -11579 -2089 -4188 -13823 -2199
1272 -2199 10478 744 -840 14083 11521 4458 7387 986 1946 5135 -12537 -12582 3062 -8989
1286 -8989 -14942 -1528 1622 -181 1075 6009 10361 9564 6032 -174 5355 9336 -12576 -10876 4625
1301D625j7214n4J1371o998J0277J592r346J8163J756j4645M246M082r23j1736
1315d804n101J0499q915j383O720r530J5136K508j7622K6182K644k3033J6987
1328A0288p60p464M990j7350L999R595j3010Q77m29P152P598j5186J7797O890
1342A4987k1952J9764k26j3697J4745k3486j659K7936k6408q377J4292m665J3541
1355D795n372o635J6162p214Q022N483j6394J0766j3216n660K9717k8996j6928
1368b5470K4834r761J3198L344k8901K4410J3614j1973J0089j2116k329Q756p114
1381E81J1792j7869k0533K5285j092J228K126l0784K8063K8010k8006N404j456
1394B749p774K5137j0377j4036K285j4109J3430J1185j4029n575j0538K2272K6720
$$ plain form
1301 4625 -12589 -12643 -1272 -8270 2007 3599 -5747 12416 14172 -473 3773 7855 6932 -4804
1315 -4804 -9905 594 -8321 -9704 -2984 -12514 2622 5130 -12492 13690 16334 -6699 10288
1328 10288 9528 2064 7054 -10296 -6297 3298 -9712 -8835 -9264 -2112 5486 -9700 8097 14987
1342 14987 -6965 12799 12573 -1124 13621 -9865 -11524 16412 -9996 -18373 -4081 -8746 4795
1355 4795 -577 -7212 8950 1736 9758 15241 -1153 9613 -3603 -9263 20454 -8542 -25470
1368 -25470 -636 -10397 2801 6145 -22756 1654 15268 3295 13384 1268 -1061 7695 581
1381 581 12373 -5496 -26029 -744 -1836 -608 1518 -29266 -1203 26807 -1199 4205 2749
1394 2749 -5025 20112 9735 -4301 -2016 -16125 -2695 8490 -5539 -11114 -21652 620 27340
1407B7340k8327p365J0522O31K3509j3791l0652J6753J348k249J2554k2140j1834
1420b3701J6750J2827R846j6219j6605J8510J8250L501j9017k3701J9344J4814
1432A4599j3554k136j4712p891K7225M833j0257j147j2980J5602L0905j5200k3831
1445h544l89J2166J7018j3079k3594R65O228J3058J325j8972M860M597L698K6002
1459B5339j6187k4958K0675M503M010j171l5406R572K4145j4116J19q782l197
1472a5454K2456m337M796J569k1714K1234R115j4253Q196k8041K869L6349k9972
1485g187o903J1479j5835K7686o13k0874K3943j2527O77K2183k2044O025o339
1498c29j6383L5871k0709k0228K6500k2036J7062J5874l7137L0146L336k5231
$$ plain form
1407 27340 -987 -8352 2170 2801 26310 12519 -18133 -1380 -32 -2281 10273 -11867 -23701
1420 -23701 -6951 5876 15722 -497 -17102 1408 19658 23159 4142 -19559 -215 14599
1432 14599 1045 -1091 -15803 -23694 3531 8364 -1893 -3040 -16020 -418 30487 15287 -8544
1445 -8544 -8933 3233 20251 7172 -16422 -15457 -9229 3829 5154 -13818 -8958 -4361 -663 25339
1459 25339 9152 -15806 4869 9372 13382 12211 -23195 -13623 10522 -3594 -3475 -12257 -15454
1472 -15454 7002 2665 7461 9030 -12684 8550 17665 3412 11608 -16433 -13564 22785 -7187
1485 -7187 -14090 -2611 -18446 9240 8627 -12247 11696 -831 -154 22029 -15 6010 -329
1498 -329 -16712 19159 -1550 -21778 4722 -17314 -252 15622 -21515 8631 11967 -13264
1510a3264L5353j5126j1400J7593k8676K0707P742l6694K3188q068m410L0684
1522A7629l4702J2657K3836l7514L3326M941l3359K9400k2495k550L5637m4787
1534a7981K295J9050k0657K9783j7411j5998L8786k5129J1770K1662m1868K5656
1546I958n32k3441M2332l6768k0706M3138k5090J1374N325l6947M1673J194j8678
1559g168K7784k9538Q801K2573l2129K5380j3895l3359M7802j5181j4698K1369
1571G741l6899K9761K6869m2937K0551o29j0875L3427k7489l452J3640l0031K8392
1584H069J069k9899K2713j9121R992L5773m4493P387K3609k1134K7269j3566k4541
1597a6873L1034j7490j813J6202k9603J1531L418p022K7234k6502n149L2846j7517
$$ plain form
1510 -13264 22089 6963 -4437 13156 -15520 5187 12929 -23765 -577 -8645 -13055 17629
1522 17629 -17073 -4416 19420 -18094 15232 20173 -13186 16214 -6281 -8831 26806 -17981
1534 -17981 -15686 3364 -17293 12490 -4921 -20919 17867 -7262 4508 26170 -15698 9958
1546 9958 9426 -14015 28317 -8451 -29157 13981 -11109 265 5590 -31357 10316 11510 -7168
1559 -7168 20616 -8922 -121 22452 -9677 15703 1808 -31551 16251 1070 -13628 7741
1571 7741 -29158 603 27472 -15465 5086 4457 -6418 27009 -480 -3932 9708 -20323 8069
1584 8069 9138 -20761 1952 -17169 -7177 28596 -15897 -8510 15099 -6035 21234 7668 -16873
1597 -16873 14161 -3329 -5142 11060 -18543 -7012 -3594 -10616 16618 -9884 -15033 17813 296
1610B96J1248m61k8908L2859m180k4256K1353j7173l607J8177j6198J0532O4j3531
1624a3785K3832k701l918N237j6789K0395L566k8444J5468l872j0743J8543j6642
1637i853o40J6639j6182R396J1996j1970M556j731M572O496j8053L160M106p884
1651e392P822j1642k609J8366j3888J99J7017j1211K728O158n723P559n270r107
1665d993P011j53m551o147R54R724p435j691J1153m395L111L999p263Q991K97
1680H612j4041O998L908j0905j357K283N10K12j281J385M460M275l090k001J0144
1695A0112j830j0793N481K260q354M4j649j841N642l947m009J0574L768p465L605
1710A598P927l477l592J716j788r85r49p659J753O606p649l327J1353N61n095
$$ plain form
1610 296 11544 11083 -17825 15034 10854 -13402 7951 -9222 -12829 5348 -10850 -318 -254 -13785
1624 -13785 10047 7346 3428 8665 -8124 12271 15837 -12607 2861 -1011 -11754 6789 -9853
1637 -9853 -10493 6146 -10036 -640 11356 -614 3942 2211 6783 13279 -4774 -1614 2492 -5392
1651 -5392 2430 -9212 -11821 6545 -7343 -7144 9873 -1338 1390 7548 1825 9384 4114 -4993
1665 -4993 2018 1865 -2686 -8833 -7879 1845 -5590 -7281 3872 -523 2588 6587 -676 8315 8612
1680 8612 -5429 1569 5477 -5428 -6785 -4502 -3992 -3780 -5061 -3676 784 5059 1969 -32 10112
1695 10112 8282 -2511 2970 5230 -3124 -3080 -4729 -6570 -928 -4875 -8884 1690 5458 -2007 1598
1710 1598 9525 6048 2456 4172 2384 1399 450 -7209 -5456 1150 -6499 -9826 1527 2088 -3007
1725c007N346K791p0J826m510j621N489m730r277N107L488q683K38O688j093P93
1741a225K339j339N932K871r108K474O665q419n558M510j004l745J01J96K244
1756c066M283k800j336J0368O71r679N386M626q393n20m15l505L393l700m614
1771i301P746K951n920K707P951m65m208L158K222m036J97m873k106P221p754
1786d510p495J1472J25n496O384J067K73L708k041R20L035n254n318L305L970
1801D145q754o551Q227J688k865L178k602L395Q295o441N27P136q248k789O730
1816E071k654o753k859J284M809M95n123j397P722O687n538q81N610m526k99N571
1832G219p374m044J191l336O517J740j3265L396J3266l51l560k222J880O705n59
$$ plain form
1725 -3007 2339 5130 5060 6886 2376 755 6244 1514 -7763 -2656 832 -7851 -7613 -925 -2018 -1225
1741 -1225 1114 -225 5707 8578 -530 1944 8609 190 -5368 -858 -1862 -5607 -5506 -5310 -3066
1756 -3066 1217 -1583 -2919 7449 8120 -1559 3827 8453 60 -460 -875 -4380 -987 -4687 -9301
1771 -9301 -1555 1396 -4524 -1817 6134 5669 1461 4619 6841 2805 3002 -1871 -3977 3244 -4510
1786 -4510 -12005 -533 -408 -5904 480 1547 1820 5528 3487 4407 7442 2188 -3130 175 4145
1801 4145 -4609 -11160 -2933 -1245 -4110 -932 -3534 -139 8156 1715 2242 9378 1130 -1659 5071
1816 5071 2417 -4336 -7195 -5911 -1102 -607 -5730 -7127 595 7282 1744 863 6473 1947 1648 7219
1832 7219 -155 -4199 -3008 -6344 173 1913 -11352 -7956 5310 4959 1399 -823 1057 7762 7203
1847G203m246m117k312L070j730R77R40j3110N167J7339o518l755K14k306J6684
1862A3500q23j7140M211P13m65M699r202k419r47L32J5212o235q667O643j094
1877a682J5200J581k5842J0631Q149r111R131j4915p454J6789p873M832L540j6267
1891a3291J2310O346Q29O470k2727P212J9249j6810M261q169j2695K7349j1120
1904g86j1975J7523j7649R323J7151j7036R861o713o896K7102j6368q148O966
1917B355j6091K2806l808k5837K5038j0163l180K6513k5169N768J3794k2397K5968
1930A5597l631k5239J9793j1415M365J2231l2433J7985P491j9008K7391j6538
1942c411o078K8535k8289J4005J7304l7477J9695J394j7372K6830k6504m483K7100
$$ plain form
1847 7203 2957 -1160 -3472 -402 -2132 -1155 -215 -13325 -8158 9181 2663 -1092 -878 -3184 13500
1862 13500 12677 -4463 -252 461 -4 4695 -4507 -6926 -7873 -7541 7671 1436 -7231 -588 -1682
1877 -1682 13518 15099 -10743 -112 8037 -1074 8057 -6858 -14312 2477 -5396 -564 2976 -13291
1891 -13291 -981 5365 6194 12664 -10063 -2851 16398 -412 3849 -4320 -17015 10334 -786
1904 -786 -12761 4762 -12887 -3564 13587 -3449 6412 -301 -7197 19905 3537 -4611 2355
1917 2355 -13736 9070 5262 -20575 4463 -5700 -8880 17633 -7536 -1768 12026 -10371 15597
1930 15597 11966 -13273 6520 -4895 -530 11701 -20732 -2747 4744 -14264 13127 -3411
1942 -3411 -9489 19046 -9243 4762 22066 -15411 4284 5678 -11694 15136 -11368 -15851 11249
1955A1249k4355J5480L918k1994L0021j4869m889L1100l5811O311J8551k9150
1967a4438K6977j1928k7560L9093j6979n173K2962k9747J8921R993k2288K9744
1979A9577j9297j3111L1790k5192J0255M875l8478L6801J751k7231K8648k2886
1991a2498K829L3211l2213J2736O956k6901L2075q001j6160J7142k9417J9391
2003h50J9885l8236J8489k870j0401L9693k8852q823K8999k6460J9077R022l4956
2016a6283K0177p248m345K6761l3146m76J8953j3536K5684j5378k1573L6850j3813
2029B627j218J7598l5942J6371J2688k3644K1908j5925j6777L1155j0061J919
2041F99K789k2109K8677L753j7482J4378j9189O211K0949k9114R872K344k2400
$$ plain form
1955 11249 -13106 2374 6292 -15702 14319 -550 -5439 25661 -10150 -3839 14712 -14438
1967 -14438 12539 611 -26949 12144 -4835 -10008 12954 -16793 2128 12121 -10167 19577
1979 19577 280 -12831 18959 -6233 4022 8897 -29581 7220 8971 -18260 10388 -12498
1991 -12498 -9669 23542 -8671 4065 11021 -15880 16195 8194 -7966 9176 -20241 -850
2003 -850 19035 -19201 -712 -3582 -13983 25710 -3142 -11965 17034 -9426 9651 18673 -16283
2016 -16283 3894 -3354 -7699 19062 -14084 -14560 4393 -9143 16541 1163 -20410 16440 2627
2029 2627 1409 19007 -16935 -564 12124 -11520 10388 -5537 -22314 8841 -1220 699
2041 699 3488 -18621 10056 13809 -3673 10705 -8484 -2273 18676 -10438 -566 1778 -20622
2054b0622K8281l202j6633J5836j3396J1009J7416k3784N032L454l378J5062j9562
2067d487l214J3161j6316J3333J654j9724J8346m484k887K0814j9262l409J7312
2080A0837q408M910n461j1750J4267m740l111L500j0662J0544J439p392J5109
2093I082r340o369J8024p859j778M153j3987R966M305j3890L751O41k86M319m948
2108d216N070J321m470Q800l166j615M100j0347N583N902j4968K890N629o145
2122e632M733j307k095P246j219j192L135Q29m74m902K617L058r078N43K903m055
2138d890L680j755l295R693o72n561O677J945l815M37N38r44j282k356j754R57
2154b397K008m571m84P790j630l645O074J253k099J901k411p26L152n492l590
$$ plain form
2054 -20622 7659 4457 -12176 3660 -9736 1273 18689 -5095 -63 3391 13 15075 -4487
2067 -4487 -7701 5460 -10856 2477 4131 -15593 2753 -1731 -4618 16196 -3066 -6475 10837
2080 10837 2429 7339 1878 -9872 4395 -345 -3456 44 -10618 -74 1365 -6027 9082
2093 9082 -258 -6627 11397 3538 1760 5913 -8074 1892 6197 -7693 -3942 -3301 -3587 732 -4216
2108 -4216 854 2175 -2295 6505 3339 1724 5824 -4523 1060 6962 -8006 -5116 513 -5632
2122 -5632 -899 -2206 -4301 2945 1726 534 3669 4498 4024 -878 1739 4797 -4281 -3738 -835 -4890
2138 -4890 -1210 -2965 -6260 3433 2761 -2800 3877 5822 2007 2444 2982 2038 756 -1600 -3354 -2397
2154 -2397 -389 -4960 -5444 2346 716 -2929 3145 4398 2299 4200 1789 1063 4215 -1277 -4867
2169d867M910p66n296K318M094j800M38K171j68K942N21m805K509L136o738k067
2185c468M177k541l347K225K85P12K534k356J529N802k496m019M591R78n411r2
2201h97O50k015M2j339j697M634J217m261L417N368l647n01L245p96j538o24k954
2218a696O26J376m902j034N609r06l381L924L300j643J381P34p80K205k731m283
2234b201L627M78o953O38L526j712k81J676P28K133J243j863J512L081m233l244
2250a845M560j063o162J568P52r52K293k280n4O440j539k400M521K84k627n28
2266I68J186q75l552q05M86K57J851m307k97R157k570l372N659j834K7L000m795
2283A84N56%m850K947Q25k674j747l21Q136k77o032N277q1J098N039r794J288
$$ plain form
2169 -4867 43 -723 -6019 -3701 393 -1407 -969 1202 1034 3976 4497 -308 2201 5337 -1401 -3468
2185 -3468 709 -1832 -5179 -2954 -2669 -1957 577 -1779 -250 5552 3056 -963 3628 4606 -805 -897
2201 -897 -247 -2262 -2220 -3559 -5256 -622 595 -3666 -249 5119 1472 971 4216 3420 1882 1258 -1696
2218 -1696 -1070 306 -4596 -5630 -21 -927 -4308 -384 2916 1273 2654 3388 2608 4813 2082 -2201
2234 -2201 1426 1904 -5049 -4411 -885 -2597 -2878 -1202 -474 1659 2902 1039 2551 5632 1399 -1845
2250 -1845 2715 1652 -4510 -2942 -2190 -3142 -849 -3129 -3183 3257 1718 -682 3839 4123 1496 968
2266 968 2154 1279 -2273 -3078 -2592 -2335 -484 -4791 -5088 4069 1499 -1873 3786 1952 1979 4979 184
2283 184 740 740 -4110 -1163 -338 -3012 -4759 -5080 3056 2779 -3253 2024 1943 3041 8080 -1714 -426
2300d26N254r334M853J347q934M082M24K327M781q824K708O611j449M111q773
2315a242j556J0885r647N54M115j3203Q410K867p261J0152q204k993J5874n498
2329C253q69j21p135J3371m345r092P647j0556N701P828j5761J0444o38r853K0701
2344A0575p189q304J1262r926R322M572j9770R579k42m215J0821j5827L559J0943
2358E160j4417J5901q68j5712J8483p872p18J4889k4301N014J3266j5716J0815
2371C924p154r053K0019j2116K275J0872j8273J4896J727j2084J9159j7702n535
2384i045K2973k0388M257O337k0111K1024k445j3884K0283j3390J560J4578j7399
2397e650J4366l799j6844K4182j2484o828J5256k3194J3868J0834k5092K0162
$$ plain form
2300 -426 4828 -4506 347 1694 -7240 -3158 -2734 -407 4374 -4450 -1742 4869 3420 7531 -1242
2315 -1242 -2798 8087 -1560 -1006 3109 -10094 -1684 1183 -6078 4074 -4130 -7123 8751 3253
2329 3253 2384 2263 -4872 8499 4154 -4938 2709 -7847 -2146 5682 -10079 365 -273 -10126 10575
2344 10575 3386 -4918 6344 -3582 5740 10312 -9458 121 -121 -4336 6485 -9342 -5783 5160
2358 5160 -9257 6644 5776 -9936 8547 675 -43 14846 -9455 -4441 8825 -6891 3924
2371 3924 -3230 -12283 7736 -4380 -2105 8767 -9506 5390 7117 -4967 14192 -3510 -9045
2384 -9045 13928 -6460 -2203 4134 -15977 5047 2602 -11282 9001 -4389 -2829 11749 -5650
2397 -5650 8716 4917 -11927 12255 -229 -7057 8199 -14995 -1127 9707 -15385 4777
2409D777k744j2860K4466j4690j46J2939k2676J6328M080j9365J5565j3876N02
2422g700K1211k5686Q590J0526k0261K4176m593j6277K2490j7079K482J9666k6738
2435i193O372L950j0945K1782j6541r024K1071j4723J2286N325k4071K1711l344
2448D656j0431K3665k3510m967J9786j6671J2599k592k2341K4264j174n204J0807
2461H887k0283J2578J1784j7356J4566j1356j1837K5141j3753k164Q614k3706
2473a8885J9541J1130k0112J0612o534L73K0732j7552r09N824j1875J7112n665
2486C792j3342J1996j3342Q269J5767k3869O059O959o932J8559j1604j2390J7317
2499G239n965K293K380j6191R013N05l190J1030j5363M30J3017o963R699m896
$$ plain form
2409 4777 2033 -10827 13639 -1051 -1197 11742 -10934 5394 9474 -9891 5674 -8202 -7700
2422 -7700 13511 -12175 -3585 6941 -13320 10856 6263 -10014 12476 -4603 -2121 17545 -9193
2435 -9193 -2821 1129 -9816 11966 -4575 -13599 7472 -7251 5035 10360 -13711 8000 4656
2448 4656 -5775 17890 -5620 -10587 9199 -7472 5127 2535 -19806 4458 3284 -1920 8887
2461 8887 -11396 1182 12966 -4390 10176 -1180 -13017 12124 -1629 -3793 4821 -18885
2473 -18885 656 11786 -8326 2286 -4248 -3875 16857 -695 -1604 4220 -7655 9457 3792
2486 3792 -9550 2446 -10896 -2627 13140 -10729 -4670 2289 -4643 13916 2312 -10078 7239
2499 7239 1274 3567 5947 -10244 -1231 -726 -3916 7114 -8249 -7819 5198 -1765 7934 3038
2513C038j4482J9710p31q769O399j2261L775J0060j1038L021j254m959J1357k277
2527A589m80J090q484J2377L019j2011N350n196p3J0872j2340k305P908o639N673
2542C50L030o401L856p17K438M673p294k29P38l34M854r106l063Q828m900J058
2558b219L819o115N179K975m387N337j620m550L619O52j475l478k087L933r09
2573a326j241O29j852M854K109n157N038J191n266L517J189m003M56k059k91K433
2589B21j986k725K478K877o51j627L774N68j884J588n06j624J344k761k087M189
2605A188k339l930M124J373j958J531O86Q22J399j018j388J951k77l715j36K651
2621I64k584k605K849N0l98K094r73J420L173k771j011L573j616l435J441k20
$$ plain form
2513 3038 -11444 8266 7535 -1234 5165 -7096 -3321 6739 -4299 -1278 -2532 -7491 3866 1589
2527 1589 1109 2199 -6285 6092 9111 -2900 2450 -2746 -2819 8053 -4287 -6592 1316 -5323 350
2542 350 3380 -3021 835 118 2556 7229 -65 -294 444 110 4964 -4142 -7205 1623 -3277 -2219
2558 -2219 1600 -4515 664 3639 -748 4589 2969 -1581 2038 2690 1215 -2263 -4350 -417 -1326
2573 -1326 -2567 -1938 -3790 1064 3173 -1984 3054 4245 -1021 2496 3685 -318 138 -1921 -2212 221
2589 221 -1765 -4490 -2012 865 214 -1413 2361 2929 1045 2633 2127 503 1847 -914 -3001 1188
2605 1188 -1151 -5081 -957 416 -1542 -11 675 1497 2896 1878 490 2441 2164 -1551 -1687 964
2621 964 -1620 -4225 -1376 -1326 -1724 370 -603 817 3990 1219 208 3781 2165 -1270 171 -49
2637d9j738m31n85K00K223j11j627K901K482k590l9L290j856j624L35j902O44
2654d77j02l119Q65L046k422o95L953Q18j112R22R28n69K67j530j685J909r16
2671H1m163J981K048k355K71K307J44P93O09j013K124P86l587m6K021k253k431
2688b683J072N12j446R76J11O19K727r15j634M107q0l724J099Q70j758j014j061
2705b222K13J026r26o11J431K666j148j352L886J32k901J715r47j243J061l483
2721b703K84L409l872r14L471Q18l3q39J438J700j276J103j191j426K253m091
2737a869m19M240n764l30M712j917K017j91k314N537n19k618J723j762J628j736
2753D18l031M393m782j630O049l905J655J782n189P943J460p290M737j190n02
$$ plain form
2637 -49 -1787 -2218 -2803 -2603 -380 -491 -2118 783 3265 675 636 3926 2070 446 781 -1121 -477
2654 -477 -579 -3698 -2833 213 -2209 -2904 1049 1867 755 1677 2605 2036 2303 773 -912 997 81
2671 81 -4082 -2101 -53 -2408 -2137 170 314 1107 1716 703 2827 3613 26 -20 2001 -252 -2683
2688 -2683 -1611 -1099 -2545 -1569 -1458 -839 1888 973 -661 3446 3366 -358 741 1611 -147 -1161 -2222
2705 -2222 -2009 -983 -1909 -2520 -1089 1577 429 -923 2963 3095 194 1909 962 -281 780 -2703
2721 -2703 -2419 990 -2882 -3796 -325 493 460 -379 1059 2759 1483 2586 1395 -31 2222 -1869
2737 -1869 -2288 1952 -3812 -4142 570 -1347 670 479 -1835 3702 3183 565 2288 526 2154 418
2753 418 -2613 1780 -3002 -4632 1417 -2488 -833 949 -4240 3703 5163 -2127 2610 1420 918
2768I18K891o761K251P87m693N277k481j572N160n936O055M558j0767O647J747
2783D081n099O866p921k786Q896p857K105K244o497P076k008p55P914r924L137
2798e28P050q066O676m542p834J3694p379m803Q725r411N099N157q921R159l383
2813F93m087J1202p359R51K399j0575J1927k407j1178J1895p869l72J1357j3229
2827f652O498N876j2050J2434j969p217R368r561L979N983j4196P975p18o955
2841g205J3294j0541k45J2908j4724Q253O636j4045J0780l593o270J3813j2510
2854c449j754Q647r450Q179j953q467J4009q533M07J2684j5546O506M501j2181
2868f400J5196p194j2152J5401p596O11O581j4426R945L762p718J1310r049j454
$$ plain form
2768 918 3809 -2952 -701 86 -4607 670 -1811 -3383 1777 -4159 1896 6454 -4313 2334 4081
2783 4081 -1018 5848 -2073 -4859 4037 -3820 -1715 529 -5968 1108 -900 -1655 6259 -3665 -528
2798 -528 6522 -1544 5132 590 -7244 6450 -929 -5732 2993 -6418 -1319 3838 -5083 4076 693
2813 693 -3394 7808 449 1400 3799 -6776 5151 2744 -8434 3461 -4408 -4780 6577 -6652
2827 -6652 -154 5722 -6328 6106 4137 -3080 6288 -3273 706 6689 -7507 468 -250 -7205
2841 -7205 6089 -4452 -4697 8211 -6513 1740 8376 -5669 5111 1518 -4752 9061 -3449
2854 -3449 -5203 3444 -6006 2173 220 -8247 5762 -2771 -2364 10320 -5226 1280 5781 -6400
2868 -6400 8796 1602 -10550 4851 -2745 -2134 4447 -9979 -34 3728 -3990 7320 -1729 -3183
2882c183J1117j0578P608m70j6237J5708j051q398J0127j3599L855J4333j2715
2895c483M781R69q016J3673m380m302N148j2036Q946N904j3295O180n703r69J7421
2910A0838j3045l573R784q017J0468J468j3894P958k328n60Q684j2324j116M137
2924a520j921J0719q834q242J3089k879L895K522j4575Q633N563p934O170p098
2938b412o033J0961k320M6j610p520R931M132l832Q46p763O244Q551r655M35j164
2954a163m981J0126j608p176L946m295M223Q313p403k229J336K816N694o386m161
2969b948K451j072N007k511p455N090j50j63O933o368l185O806M61J327j842o133
2985c752L383L674j966l022k844K511K221j272J693k613o85N316k61n12Q14n201
$$ plain form
2882 -3183 7934 -2644 4964 4494 -11743 3965 2914 -5484 4643 -8956 -5101 9232 -3483
2895 -3483 1298 2267 -5749 7924 3544 -758 4390 -7646 1300 7204 -6091 89 -5614 -6583 10838
2910 10838 -2207 -5780 4004 -4013 6455 7923 -5971 1987 -341 -901 7783 -4541 -5657 -1520
2924 -1520 -3441 7278 -1556 -9798 3291 412 4307 6829 -7746 887 6450 -1484 4686 -2412
2938 -2412 -8445 2516 196 242 -1368 -8888 1043 5175 1343 2189 -5574 670 9221 -434 1 -1163
2954 -1163 -6144 3982 2374 -4802 -856 -5151 -928 7385 -18 -2247 -911 1905 7599 1213 -2948
2969 -2948 -497 -1569 3438 927 -6528 -1438 -1588 -1751 5182 -1186 -4371 2435 2896 4223 2381 -3752
2985 -3752 -369 3305 1339 -1683 -4527 -2016 205 -1067 626 -1987 -2672 2644 2383 1871 2685 -2516
3001b516K774N167n662l004J510l62K217j03l280J272K297P63N46k0m25j434J653
3018A393K784m151k335J904r58R50L27m630L239L305l001J620J599j959J320Q01
3034B208p34J17k238l68Q31J04q51k665K101K894l300J720K305k462K575L55k796
3051b04K836j684l259L004m71k526N50K19R72Jl13J497l96J741k13j882L182r28
3069B126m491L383m86l249J775j055L55K556k634J92L323l12p71K53J424l89k391
3086c91J232n16j956J316k235M44K830l105J76L835r41p07J865l54J50O5j668
3103D0K04k01n70j585N93J627k380M01K935j010K11J383j107J337N79k765P93
3120D85J202k685p05J329l42r33P4Q98P10N81K41n59K074o0k602J218Q11k551
$$ plain form
3001 -2516 258 5425 -237 -3241 -1731 -2093 124 21 -3259 -1987 310 1073 1619 1599 1174 -260 1393
3018 1393 4177 26 -2309 -405 -1363 -413 -86 -4716 -1477 1828 -1173 447 2046 87 1407 2208
3034 2208 1474 1591 -647 -1015 -184 -80 -931 -3596 -1495 1399 -1901 -181 2124 -338 2237 2592 -204
3051 -204 2632 948 -2311 693 222 -2304 -1754 -1535 -563 -562 -875 622 226 1967 1754 -128 3054 2126
3069 2126 -2365 1018 532 -2717 -942 -1997 -1642 914 -1720 -1528 1795 1483 712 965 2389 2000 -391
3086 -391 841 325 -1631 -315 -2550 -2106 724 -2381 -2205 1630 689 -18 1847 1493 1643 1708 40
3103 40 244 43 -527 -2112 -1519 108 -2272 -1871 1064 54 265 1648 541 1878 2457 -308 485
3120 485 1687 -998 -1703 -374 -716 -1649 -1575 -677 33 614 855 296 2370 2310 -292 926 1737 -814
3138h14k53M12j168O93Q9r98K286M88j562J099K037n19j557R06J29j654J48q67
3156a105q12J618j255j212K931L43j611J593R07J2j4M3l70qq35j363o2J293j946
3175a853j271L172n62r71K112j76N84J635k587P19J485k006j005O27n4j009j355
3192b515K002J66r31J660q31J363K568l952J284K869m040Q12K14k351J545j406
3208a543q91K384j424O65K13P73K601l262K98L970l620L94N72l854L345m33m159
3225c971M309j462j634L850j503J891l69k317M332j238j775J255l995L146O37
3240A156n681M789n87l844O454k724q03M017m239L347K291m877J846j235l05K365
3256A970n503K071K274n015N275r63l090O654m619L91O477p253J328L233m883
$$ plain form
3138 -814 -1067 -655 -1823 -1130 -1041 -2039 247 735 -827 272 2309 1790 233 1139 1268 -386 -238 -1105
3156 -1105 -1917 -299 -1554 -2766 165 508 -1103 490 1397 1409 1395 1438 1068 1060 225 -1138 -1200 93 -1853
3175 -1853 -3124 48 -514 -1485 627 451 1035 2670 83 802 2287 281 -724 -97 -151 -1160 -2515
3192 -2515 -513 -347 -1278 382 -449 914 3482 -470 814 3683 -357 455 669 -1682 -137 -1543
3208 -1543 -2434 -50 -1474 -809 -596 177 2778 -484 -186 3784 164 558 1130 -2724 621 188 -3971
3225 -3971 338 -1124 -2758 1092 -411 1480 1111 -1206 3126 1888 113 1368 -2627 519 1156
3240 1156 -4525 264 -323 -4167 2287 -437 -1240 2777 -1462 1885 4176 -701 1145 -90 -395 1970
3256 1970 -3533 -1462 812 -4203 1072 109 -2981 3673 -946 -555 5922 -1331 -3 3230 -1653
3271a653L932l076k961N433m024R88K181m365N816j650k548P661n962j085O037
3286D724o980L604R33q092O874o04m510N732m232J472L385m396N337j397m344
3301b494O549m010O2L338r071N334L323q050N766j848l149P755l779k53L801n573
3317b299L862J995l722K446n882J684O003p327J812P86m261Q778k167m817O662
3332C553m640R57O307o752Q7M49k052N826m130l974K830r88N036o27o666O081
3348A297Jr86N708o752j998N682l321K302p81p527M562L318j023l66m696L160
3364a420N095j667O70l874j232O842k628j628L53o383M345N608n365j421q4M13
3380b376P277j427n285P38J532L249p62m102o31q63K747L299n308k253K496P06
$$ plain form
3271 -1653 2279 -797 -3758 1675 -2349 -1361 820 -3545 2271 621 -1927 5734 -228 -1313 4724
3286 4724 -2256 1348 2281 -5811 1063 459 -4051 1681 -2551 -1079 2306 -2090 3247 1850 -2494
3301 -2494 4055 45 107 3445 -5626 -292 3031 -5019 747 -1101 -4250 3505 -274 -527 3274 -2299
3317 -2299 1563 3558 -164 2282 -3600 -1916 4087 -3240 -1428 -642 -4903 3875 1708 -3109 3553
3332 3553 -1087 -130 6177 -575 -488 -39 -2091 3735 -395 -4369 -1539 -2527 2509 1882 -4784 1297
3348 1297 1298 312 6020 -732 -2730 2952 -369 1933 1152 -6375 -1813 1505 482 116 -4580 -1420
3364 -1420 3675 2008 2678 -1196 -2428 4414 1786 158 511 -5872 -1527 4081 -1284 -2705 -2789 -2376
3380 -2376 4901 3474 -1811 -1073 459 3708 2946 -1156 -1787 -2650 97 3396 -1912 -4165 -1669 -963
3396i63M931j279o883L451M236q37k2m369j777M911K75j652k008j807K354K970
3412A531K95j396l997L710M784k615j325k076j445N994r10n890J560m15K92M690
3428B787l193k295J985Q36L689r64m233J078P38K765q61o484K567J814k392M118
3444A955l346k775N799j470O97K632n408J627L605j815k15l310l32L907k455K48
3460f56r02k133N455j220k087M439l952M42N064m655Q06R8l861M911j214l682
3476c147K095q00J666J185k727L437r67j070M351l747m15K475m903L337J407o283
3492d106L547M04k025L459k171J49L238k677K035k67j770J981l139J104K291n411
3508c358K052J606l271L813j441k027N378k255p61L065k391M99j07j267J795k460
$$ plain form
3396 -963 3968 2689 -4194 -743 3493 2656 2634 -1735 -3512 1399 1674 22 -1986 -3793 -1439 1531
3412 1531 1826 430 -3567 143 4927 2312 987 -1089 -2534 3460 2550 -3340 -1780 -2195 -1903 2787
3428 2787 -406 -2701 -716 120 3809 2845 -1388 -310 428 3193 2332 -4152 -1585 229 -2163 1955
3444 1955 -1391 -4166 1633 163 860 3492 -1916 -289 3316 1501 1286 -2024 -2356 1551 -904 -656
3460 -656 -1558 -3691 1764 544 -1543 2896 -1056 -614 4450 -205 601 699 -3162 1749 535 -3147
3476 -3147 -1052 -1852 -186 999 -1728 1709 742 -328 4023 276 -139 2336 -2567 770 2177 -4106
3492 -4106 -559 -155 -2180 1279 -892 -743 2495 -182 1853 1586 -184 1797 -1342 -238 2053 -3358
3508 -3358 -1306 300 -2971 842 -599 -2626 2752 497 -264 2801 410 909 802 -465 1330 -1130
3524a130p37J801j915J898l55k523M842p35k193L697k184l67K057k961J098L53
3540F46k742J429p1o25M20j112K347P54k010K551o47o19K145k600K05J694l379
3557a614P31J485k345O73J85j60J699o14K79P07L24M45j466lJ461k542l01J395
3575C39k237M78P34j056K137J17j372J941O68o06n94O01l28j135m16J79o19K53
3593i16m39n83J924K72j489J920Q36r25M58J1p43O69j088j190R25M2j389QJ182
3612e15J15p16J701K44m33Q49m00k68J014j644j136J583q98r97M42N36l46K80
3630e89L48M73M19N58p00L34J332j947r40J695j492p30P59n17K27Q90j414J348
3648E4R10j58m98Q55N70j283m60N59q88l06K65j321Q85J016k031J677J637j915
$$ plain form
3524 -1130 -1867 -66 -1981 -83 -438 -2961 1881 1146 -1047 2650 466 99 2156 -805 293 646
3540 646 -2096 -667 -738 -1363 -943 -2055 292 1046 -964 1587 940 321 2466 -134 71 1765 -1614
3557 -1614 -883 602 -1743 -1070 -885 -1045 654 40 319 1026 1350 1795 329 326 1787 -755 -1056 339
3575 339 -1898 -1420 -686 -1742 395 512 -860 1081 1749 1143 549 1150 822 -313 -729 -550 -1169 -916
3593 -916 -1355 -1938 -14 258 -1231 689 1525 600 1058 1069 326 995 -93 -1283 -358 -316 -1705 -1697 -515
3612 -515 -400 -1116 585 829 396 1245 845 577 1591 -53 -1189 394 -504 -1501 -1059 -523 -869 -589
3630 -589 -241 232 651 1209 509 843 2175 228 -712 983 -509 -1239 -480 -997 -770 120 -1294 54
3648 54 964 806 308 1163 1733 450 -10 549 -339 -645 -380 -1701 -816 200 -1831 -154 1483 -432
3666d32J001M71j78N61j111l68K1l2n81j301Q01J078k228J771J450j829J816K57
3684A167j084K447j802j701K156j214j046L80n01L98o73O04J256j161J228N30
3700I84j065K486j510k008L350j541j964J880k254P04J166k294J498N90n25J381
3716H78m40J195k54k263K893q81k014K178l085M37K553l638J399J970k274J756
3732D10O40p64J065j038Q3J214j381L10j696k28K513l067J90K675k928J742K195
3749A935k917K196j78j810L067q80k668R59l05O52m91j640J359m49J036J576k221
3766g79J259P65j686L098p48m052K499L76r43Q11k891k21L076l71m03m90L07J622
3784A229m4J023q84k736J830J079j434K9k204r62M766j012k693J225j02J499K465
$$ plain form
3666 -432 569 1040 862 1423 312 -56 -35 -67 -648 -1949 -1148 -70 -2298 -527 923 -906 910 1167
3684 1167 83 2530 728 -973 1183 -31 -1077 -697 -1198 -800 -1473 -869 387 -774 454 984
3700 984 -81 2405 895 -1113 2237 696 -1268 612 -1642 -938 228 -2066 -568 22 -503 878
3716 878 438 1633 1379 -884 2009 1128 -886 1292 -1793 -1356 1197 -2441 -1042 928 -1346 410
3732 410 1050 286 1351 313 396 1610 229 539 -1157 -1385 1128 -1939 -1749 926 -2002 -260 1935
3749 1935 -982 1214 1036 -774 2293 1413 -1255 -296 -601 51 -440 -2080 -721 -1170 -134 1442 -779
3766 -779 480 1245 -441 2657 1909 -2143 356 732 -211 600 -2291 -2512 564 193 -210 -700 -393 1229
3784 1229 1185 2208 1324 -1412 418 1497 63 92 -2112 -3074 1692 680 -2013 -788 -890 609 3074
3801C074k403r32O16Q6J655r97k545q58P55K925m23l964J335J742Q40K618m059
3818e35j856M688j174M7P18m846R38L358j399J64k880n19M846K52n97k359j185
3835b339N384j90k814J212l922J639M579m748n03M93k357N758M35n057J844R2
3851d94K711J992n285L17Q05q6L798n323j844L510k622L991J149p084M108K346
3867A989j182L522n712j429O067k337L24j985l515N196j136n01K023n708L695
3882f89M034m256L627k983l366Q540l169l121K309m556M061J925n396K794j637
3897a883J29N041l934P75J026l776O654j447n573M875l827R28M631p830K137L289
3913A215l767M830j870k458M436l058K189J636n472L455m91k255M918o143l00
$$ plain form
3801 3074 671 -261 355 441 2096 1099 -1446 -2304 -1549 1376 953 -3011 -1676 66 906 3524 -535
3818 -535 -2391 2297 1123 1170 1888 -2958 -2020 1338 -61 103 -2777 -3296 1550 1802 1205 -1154 -2339
3835 -2339 3045 2855 41 1253 -2669 -1030 3549 -1199 -1702 -1209 -3566 2192 2627 -2430 -586 -494
3851 -494 2217 4209 -1076 -759 46 -40 3758 -1565 -3409 101 -2521 1470 2619 -4465 -357 1989
3867 1989 807 4329 -1383 -2812 3255 918 1242 -743 -4258 938 -198 -699 1324 -4384 -689
3882 -689 3345 -911 2716 -267 -3633 4907 1738 -1383 926 -3630 431 2356 -3040 -246 -1883
3897 -1883 -1754 3287 -647 128 1154 -2622 4032 2585 -2988 1887 -1940 -1012 3619 -4211 -2074 1215
3913 1215 -2552 2278 408 -2050 2386 -672 1517 3153 -2319 1136 645 -1610 3308 -2835 -3135
3928c135N593n053K781J537n208N697l69k782M565m298L3L000l584K427k273k105
3944c174M866k904l32L498m874L848J882m673M531j584l143M732k766m59J652
3959A100m294K951O77k831K734k040J186K977l990K820R58m059M156j241k660
3974a556L098l629M11L545m243J072J458j523L172j965j79K129k253J844J02k681
3990a198K366j871j347L951l867j66L043k399K067M28k219K801m30j005J456j800
4006a90P83k38j473J902j850j160K813j617O69J456k224J837J351k505J369K17
4022A140j352R55j158r2K16j068N07J22K37R70j592J448J452k128J130N67j602
4039b48R86m50j537J249n60j028J154o4j17o0J037N22p26K08N96n09Q06r57j212
$$ plain form
3928 -3135 2458 -2595 186 1723 -3485 2212 1843 -939 3626 -672 -639 2361 -1223 1204 -1069 -3174
3944 -3174 1692 -1212 -1544 1954 -2920 928 2810 -1863 2668 1084 -2059 2673 -93 -552 1100
3959 1100 -3194 -243 434 -2397 337 -1703 -517 2460 -1530 1290 2248 -1811 2345 1104 -1556
3974 -1556 1542 -2087 -1676 1869 -2374 -1302 156 -1367 1805 -160 -339 1790 -463 1381 1483 -1198
3990 -1198 1168 -703 -2050 1901 -1966 -2132 911 -1488 579 1007 -1212 1589 1159 154 1610 -190
4006 -190 593 355 -1118 784 -1066 -2226 587 -1030 -361 1095 -1129 708 2059 -446 923 1140
4022 1140 -212 743 -415 -507 -291 -1359 -852 -730 -493 477 -1115 333 1785 -343 787 1354 -248
4039 -248 738 288 -1249 0 -560 -1588 -434 -498 -615 -675 362 884 158 366 962 453 1259 302 -910
4058i10J332o84j533J423j41n17Q39J07j7J008k11m22N65L58j020l10N68p68p40
4077a073O99l54j75J027o58K76J448p00n49J384n62m36J45k83l73K0m12m59M97
4096e38M77p69M17J379r30J18J261j184L08K75j157J69K37j145j52Q78m55n78
4114a389J168N14n88P78M42l59O27k70j483J303M4k151P48L65j277O79M86j4Q41
4133D64N9k24N34N67p93o69J092k21j540M48n7p76J009o25j16J523p21k88J424
4152A090M1p94M83R3k96p10o1m24M7M80j234L26J498j062M1J758p72l13R43o14
4172E20q8M17j412j43Q51q95o89O89M86j85J94P10l59K23Q42r00M52N15k007J93
4192e86J279j408n42Q40j053R60O99q22J050K76n28M19O12M9j576j84J202j154
$$ plain form
4058 -910 422 -262 -1795 -372 -513 -1030 -191 -84 -101 907 696 274 839 1197 177 -133 435 -333 -1073
4077 -1073 -374 -728 -903 124 -534 -258 1190 490 -59 1325 763 327 472 189 -184 -164 -576 -1035 -538
4096 -538 -61 -830 -413 966 36 154 1415 231 539 814 -343 -174 63 -1082 -1234 -356 -811 -1389
4114 -1389 -221 293 -295 483 925 566 1193 923 -560 743 787 -1364 -616 -251 -1528 -849 -363 -377 464
4133 464 523 299 833 1400 607 -62 1030 809 -731 -283 -340 -1116 -107 -732 -848 675 -46 -334 1090
4152 1090 1131 337 820 913 617 -93 -154 -578 -531 -51 -1285 -959 539 -523 -482 1276 504 191 1134 520
4172 520 432 849 -563 -706 145 -750 -1439 -750 -264 -449 -255 455 96 319 1161 261 713 1228 -779 -586
4192 -586 693 -715 -1257 -417 -1470 -510 189 -633 417 693 165 584 1196 1245 -331 -515 687 -467
4210d67n31N42j166J236J017j907J423O51j483K098K86j989P86m47J92O13j452
4227e98r44O99O73P55j900N80J613j157K046m6k752J717L75j642K345k646j671
4244b553L002n34k13k84j654K820O03o13N06k380J909J786k749J681k124k241
4260c038N006j593j849J453k785K837L200m252R34K26J22K977l198q30R15k226
4276b101L901j069m369L431j658J378M193o151R20L548k482L537k108l866M583
$$ plain form
4210 -467 -998 -456 -1622 -386 631 -1276 147 798 -685 1413 1699 -290 496 49 241 854 -598
4227 -598 -1542 -843 -170 585 -1315 -735 878 -279 1767 1721 -1031 686 1061 -581 1764 -882 -2553
4244 -2553 449 -85 -298 -582 -2236 584 1187 574 1080 -1300 609 2395 -354 1327 -797 -3038
4260 -3038 1968 375 -1474 -21 -2806 31 3231 -1021 -87 139 261 3238 40 -790 125 -2101
4276 -2101 1800 731 -3638 -207 -1865 -487 3706 -2445 -1525 2023 -459 3078 970 -2896 1687
$$ [...]
8191D25
##END NTUPLES=NMR FID
##END=
