##TITLE=1H_LR-721-P1
 CDCl3, 8 sc, 
 29.9.2020
##JCAMPDX= 6.0         $$ Bruker NMR JCAMP-DX V2.0
##DATA TYPE= NMR FID
##DATA CLASS= NTUPLES
##ORIGIN= UXNMR, Bruker Analytische Messtechnik GmbH
##OWNER= root
$$ XWIN-NMR		Version 3.5
$$ Tue Sep 29 11:30:58 2020 Russian Standard Time (UT+4h)  she@DPX200
##.OBSERVE FREQUENCY= 200.1315066352
##.OBSERVE NUCLEUS= ^1H
##.DELAY= (6, 6)
##.ACQUISITION MODE= SIMULTANEOUS
##.ACQUISITION SCHEME= undefined
##.AVERAGES= 8
##.DIGITISER RES= 18
##SPECTROMETER/DATA SYSTEM= spect
##.PULSE SEQUENCE= zg30
##.SOLVENT NAME= CDCl3
##.SHIFT REFERENCE= (INTERNAL, CDCl3, 0, 15.7039)
##AUDIT TRAIL= $$ (NUMBER, WHEN, WHO, WHERE, WHAT)
$$ ##TITLE= Audit trail, XWIN-NMR		Version 3.5
$$ ##JCAMPDX= 5.01
$$ ##ORIGIN= Bruker BioSpin GmbH
$$ ##OWNER= she
$$ F:/spectra/data/she/nmr/H-F/1/audita.txt
$$ ##AUDIT TRAIL=  $$ (NUMBER, WHEN, WHO, WHERE, WHAT)
(   1,<2020-09-29 11:29:52.21 +0400>,<she>,<DPX200>,
      <created by zg, POWCHK disabled, PULCHK disabled
       configuration hash MD5:
       00 E9 B6 7A A2 85 ED C7 34 08 36 98 17 FE 4E 26
       data hash MD5: 16K
       A3 EF 3D 73 17 B3 23 A0 03 5F 41 4C C5 18 C3 01>)
$$ ##END=
$$ 
$$ hash MD5
$$ AA EF D3 EB 02 78 88 CA FD AB A6 BB F8 4F F0 B8
##$RELAX= 
##$RELAX= 
##$RELAX= 
##$RELAX= 
##$RELAX= 
##$RELAX= 
$$ Bruker specific parameters
$$ --------------------------
##$DU= <F:/spectra>
##$EXPNO= 1
##$NAME= <H-F>
##$PROCNO= 1
##$TYPE= <nmr>
##$USER= <she>
##$AMP= (0..31)
100 100 100 100 100 100 100 100 100 100 100 100 100 100 100 100 100 100 
100 100 100 100 100 100 100 100 100 100 100 100 100 100 
##$AQSEQ= 0
##$AQ_mod= 1
##$AUNM= <au_zg>
##$AUTOPOS= <>
##$BF1= 200.13
##$BF2= 200.13
##$BF3= 200.13
##$BF4= 200.13
##$BF5= 200.13
##$BF6= 200.13
##$BF7= 200.13
##$BF8= 200.13
##$BYTORDA= 1
##$CFDGTYP= 0
##$CFRGTYP= 5
##$CHEMSTR= <none>
##$CNST= (0..31)
1 1 145 1 1 1 1 1 1 1 1 1 1 1 1 1 1 1 1 1 1 1 1 1 1 1 1 1 1 1 1 1 
##$CPDPRG= <>
##$CPDPRG1= <>
##$CPDPRG2= <>
##$CPDPRG3= <>
##$CPDPRG4= <mlev>
##$CPDPRG5= <mlev>
##$CPDPRG6= <mlev>
##$CPDPRG7= <mlev>
##$CPDPRG8= <mlev>
##$CPDPRGB= <>
##$CPDPRGT= <>
##$D= (0..31)
0 1.2 0 0 0 0 0 0 0 0.06 0 0.03 0 0 0 0 0.0002 0 0 0 0 0 0 0 0 0 0 0 0 
0 0 0 
##$DATE= 1601364591
##$DBL= (0..7)
120 120 120 120 120 120 120 120 
##$DBP= (0..7)
150 150 150 150 150 150 150 150 
##$DBP07= 0
##$DBPNAM0= <>
##$DBPNAM1= <>
##$DBPNAM2= <>
##$DBPNAM3= <>
##$DBPNAM4= <>
##$DBPNAM5= <>
##$DBPNAM6= <>
##$DBPNAM7= <>
##$DBPOAL= (0..7)
0.5 0.5 0.5 0.5 0.5 0.5 0.5 0.5 
##$DBPOFFS= (0..7)
0 0 0 0 0 0 0 0 
##$DE= 6
##$DECBNUC= <off>
##$DECIM= 32
##$DECNUC= <off>
##$DECSTAT= 4
##$DIGMOD= 1
##$DIGTYP= 9
##$DL= (0..7)
0 120 120 120 120 120 120 120 
##$DP= (0..7)
150 150 150 150 150 150 150 150 
##$DP07= 0
##$DPNAME0= <>
##$DPNAME1= <>
##$DPNAME2= <>
##$DPNAME3= <>
##$DPNAME4= <>
##$DPNAME5= <>
##$DPNAME6= <>
##$DPNAME7= <>
##$DPOAL= (0..7)
0.5 0.5 0.5 0.5 0.5 0.5 0.5 0.5 
##$DPOFFS= (0..7)
0 0 0 0 0 0 0 0 
##$DQDMODE= 0
##$DR= 18
##$DS= 0
##$DSLIST= <SSSSSSSSSSSSSSS>
$$ [...]
##$SUBNAM2= <"">
##$SUBNAM3= <"">
##$SUBNAM4= <"">
##$SUBNAM5= <"">
##$SUBNAM6= <"">
##$SUBNAM7= <"">
##$SUBNAM8= <"">
##$SUBNAM9= <"">
##$SW= 16.880792210976
##$SWIBOX= (0..15)
0 0 2 0 0 0 0 0 0 0 0 0 0 0 0 0 
##$SW_h= 3378.37837837838
##$TD= 16384
##$TD0= 1
##$TE= 0
##$TE2= 300
##$TE3= 300
##$TEG= 300
##$TL= (0..7)
0 120 120 120 120 120 120 120 
##$TP= (0..7)
150 150 150 150 150 150 150 150 
##$TP07= 0
##$TPNAME0= <>
##$TPNAME1= <>
##$TPNAME2= <>
##$TPNAME3= <>
##$TPNAME4= <>
##$TPNAME5= <>
##$TPNAME6= <>
##$TPNAME7= <>
##$TPOAL= (0..7)
0.5 0.5 0.5 0.5 0.5 0.5 0.5 0.5 
##$TPOFFS= (0..7)
0 0 0 0 0 0 0 0 
##$TUNHIN= 0
##$TUNHOUT= 0
##$TUNXOUT= 0
##$USERA1= <user>
##$USERA2= <user>
##$USERA3= <user>
##$USERA4= <user>
##$USERA5= <user>
##$V9= 5
##$VALIST= <valist>
##$VCLIST= <CCCCCCCCCCCCCCC>
##$VD= 0
##$VDLIST= <DDDDDDDDDDDDDDD>
##$VPLIST= <PPPPPPPPPPPPPPP>
##$VTLIST= <TTTTTTTTTTTTTTT>
##$WBST= 1024
##$WBSW= 4
##$XGAIN= (0..3)
0 0 0 0 
##$XL= 0
##$YL= 0
##$YMAX_a= 760398
##$YMIN_a= -707725
##$ZGOPTNS= <>
##$ZL1= 120
##$ZL2= 120
##$ZL3= 120
##$ZL4= 120
##$ABSF1= 10
##$ABSF2= 0
##$ABSG= 5
##$ABSL= 3
##$ALPHA= 0
##$AQORDER= 0
##$ASSFAC= 0
##$ASSFACI= 0
##$ASSFACX= 0
##$ASSWID= 0
##$AUNMP= <proc_1d>
##$AZFE= 0.1
##$AZFW= 0.1
##$BCFW= 1
##$BC_mod= 2
##$BYTORDP= 1
##$COROFFS= 0
##$CY= 11.3945322036743
##$DATMOD= 1
##$DC= 2
##$DFILT= <>
##$DTYPP= 0
##$F1P= 16.9975609425685
##$F2P= -3.02152046262296
##$FCOR= 0.5
##$FTSIZE= 0
##$FT_mod= 4
##$GAMMA= 1
##$GB= 0.15
##$INTBC= 1
##$INTSCL= 1
##$ISEN= 128
##$LB= 0.24
##$LEV0= 0
##$LPBIN= 0
##$MAXI= 10000
##$MC2= 0
##$MEAN= 0
##$ME_mod= 0
##$MI= 1.114404
##$NCOEF= 0
##$NC_proc= 0
##$NLEV= 6
##$NOISF1= 3.799351
##$NOISF2= 2.8
##$NSP= 1
##$NTH_PI= 0
##$NZP= 0
##$OFFSET= 15.70392
##$PC= 1
##$PHC0= -9970.036
##$PHC1= 12.80089
##$PH_mod= 1
##$PKNL= yes
##$PPARMOD= 0
##$PSCAL= 0
##$PSIGN= 0
##$REVERSE= no
##$SF= 200.130013532006
##$SI= 16384
##$SIGF1= 3
##$SIGF2= 2
##$SINO= 400
##$SIOLD= 16384
##$SREGLST= <1H.CDCl3>
##$SSB= 0
##$STSI= 0
##$STSR= 0
##$SW_p= 3612.71676300578
##$SYMM= 0
##$S_DEV= 0
##$TDeff= 0
##$TDoff= 0
##$TI= <>
##$TILT= no
##$TM1= 0
##$TM2= 0
##$TOPLEV= 0
##$USERP1= <user>
##$USERP2= <user>
##$USERP3= <user>
##$USERP4= <user>
##$USERP5= <user>
##$WDW= 1
##$XDIM= 8192
##$YMAX_p= 0
##$YMIN_p= 0
$$ End of Bruker specific parameters
$$ ---------------------------------
##NTUPLES= NMR FID
##VAR_NAME=  TIME,          FID/REAL,        FID/IMAG
##SYMBOL=    X,             R,               I
##VAR_TYPE=  INDEPENDENT,   DEPENDENT,       DEPENDENT
##VAR_FORM=  AFFN,          ASDF,            ASDF
##VAR_DIM=   8192,          8192,            8192
##UNITS=     SECONDS,       ARBITRARY UNITS, ARBITRARY UNITS
##FACTOR=    0.000296,      1,               1
##FIRST=     0,             0,               0
##LAST=      2.424536,      0,               0
##MIN=       0,             -707725,         0
##MAX=       2.424536,      760398,          0
$$ Real data points
##PAGE= N=1
##DATA TABLE= (X++(R..R)), XYDATA
$$ [...]
2766b799L317k239M697K995j0118N988J669o812O915n130j792O850j0213N847
2780h25O164j1333N499J660r83O700j0578J987Q443q440L957k987m887J1065r693
2795d251K89J0245j3450N794N989q271R772p694l767J5355j0002k122M313p808
2809e608J1078n668p992J3684r743J652Q560j2531J0547j147j0513J7844r084
2822A079p710J2667j0058N958J924j4897J5033j970p602J0634j0400O646O066
2835G370j5150J3743k304j1539J5933j0223j076R752j7054J2271N276j6780J2436
2848B655l131j378J1657j6663O481Q761j4054J1339o033o993J5621j4451L544
2861b645J0645j9703J2218M475j0473J3351j2641m70J8363j5566J894K625r168
$$ plain form
2766 -2799 518 -1721 2976 5971 -4147 1841 3510 -3302 3613 -1517 -3309 3541 -6672 -825
2780 -825 5339 -5994 -495 1165 182 6882 -3696 -1709 6734 -1706 2251 -736 -5623 5442 -4251
2795 -4251 -3962 6283 -7167 -1373 4616 -3655 6117 -1577 -5344 10011 9 -2113 2200 -5608
2809 -5608 5470 -198 -8190 5494 -4249 -2597 5963 -6568 3979 2832 -7681 10163 1079
2822 1079 -6631 6036 -4022 1936 3860 -11037 3996 2026 -5576 5058 -5342 1304 7370
2835 7370 -7780 5963 3659 -7880 8053 -2170 -3246 6506 -10548 1723 6999 -9781 2655
2848 2655 -476 -1854 9803 -6860 -379 8382 -5672 5667 -366 -7359 8262 -6189 -2645
2861 -2645 8000 -11703 515 4990 -5483 7868 -4773 -5243 13120 -2446 -552 2073 -7095
2874g095J5703r425p552J3957j3426P050Q758j6355J1828l892n367K0208j5646
2887a254o201J2930r130J0323m111j5568J6750l172k960Q333j4944Q555O315j0506
2901d640J3792j0051q725J8237p878J024J185j6903J7302M683j3597O834p540
2914f277M654J1817j3467M306j70p351J5739o184o981N730j0847J2693O205j8927
2928i060N639J980R20J0620j4644j062J0379n465O918m367q920Q988m425M381
2942A882M198j6224N913P332k984O119j1787j631J5723n747j619p82o644J0076
2956C825r91m670L195q078L894P389n395K112n941p9J4143o514n773L053k723
2971b553Q100j471r260M353j032P01M189n483Q12j58K05Q403n442n230M710l32
$$ plain form
2874 -7095 8608 -817 -8369 5588 -7838 -788 7970 -8385 3443 -449 -5816 14392 -1254
2887 -1254 -7455 5475 -3655 6668 2557 -13011 3739 567 -2393 5940 -9004 -449 5866 -4640
2901 -4640 9152 -899 -9624 8613 735 1759 2944 -13959 3343 8026 -5571 1263 -6277
2914 -6277 -1623 10194 -3273 1033 863 -6488 9251 3067 -3914 1816 -9031 3662 9867 -9060
2928 -9060 -3421 -1441 -521 10099 -4545 -5607 4772 -693 6225 1858 -7062 1926 -2499 1882
2942 1882 6080 -10144 -4231 3101 117 6236 -5551 -7182 8541 2794 1175 393 -6251 3825
2956 3825 2834 -1836 1359 -6719 -2825 4564 -831 1281 -4660 -4739 9404 2890 -2883 170 -2553
2971 -2553 5547 4076 -5184 -831 -1863 -1162 3027 -2456 -1644 -1802 -1597 6806 1364 -3866 844 512
2987E12M818l048r186P296J864l540K070l761J622K560j941L396k016l144M068
3002A570j74K070k949o013P093J132m927J234k244K906L018m981K345J490k267
3017f97K358n71L06r80l611M565L85m357J155j357L074K612o625K927L788l013
3033d1J358m52l96J735l587J381J153k919L34n29J721J865n190K570L943l240
3049b94J527r42R7L174l979j009L544k330j229j39P29J698k962N03L239j540N11
3066E98l20r1L717m064j758M459k475j450N26n71K110j136j868K623Q03q23m45
3083a65N34K636k999j580L382j109j820M64j291K729n62l363K892K147k185K9
3099b61Q38J515j000j823J120M25j032j019r96K757k88l247K571K275k097J06
$$ plain form
2987 512 5330 2282 -6904 392 2256 -1284 786 -2975 -1353 1207 -734 2662 646 -2498 1570
3002 1570 1396 3466 517 -5496 1597 2729 -2198 -964 -3208 -302 2716 -2265 80 1570 -697
3017 -697 1661 1090 1396 416 -3195 1370 1755 -2602 -1447 -2804 270 2882 -3743 -816 2972 -41
3033 -41 1317 865 469 2204 -1383 -2 1151 -1768 -1434 -1963 -242 1623 -3567 -997 2946 -294
3049 -294 1233 291 388 3562 -417 -1426 2118 -212 -1441 -1580 -851 847 -2115 -1612 1627 87 598
3066 598 278 187 3904 -160 -1918 2541 66 -1384 -858 -1429 681 -455 -2323 300 1103 280 -165
3083 -165 369 3005 6 -1574 1808 699 -1121 -657 -1948 781 219 -3144 -252 1895 -290 -261
3099 -261 577 2092 1092 -731 389 814 -218 -1237 -2233 524 236 -3011 -440 1835 -262 -156
3115a56O16J030N40k161j94J738o88k352Q6K133r30j940J350J501j83n07j99J563
3133A247J699k935n42K801j206k331M67P84k64j235l63J763J006j147p29K033
3149A048J664k915m84K849r68j794r2j07R52p95j984K207J873k408m05K391P37
3166A769j362n82J303J2p35j040o30J999r04k988K912J829k831P77N48R20O04
3183A601k204L90J863j478j010m5J264k45l028K335J800k821J527k0O06K667m353
3200a151P98L792l383p28J73l13J358k477K32K862k366P59M32j08L698m588l20
3217a330N618m196j048J503k660L864k249l573M958j641n64K206j985L310k025
3232A88j802N944l950j513K459l730M377j052o628O996q37l148M561l594J849
$$ plain form
3115 -156 460 1490 2030 -131 -325 1413 725 -1627 -1541 592 -338 -2278 -928 573 390 -117 -316 1247
3133 1247 2946 11 -531 2270 1064 -1267 -800 -16 -280 -1515 -1878 -115 891 -256 -985 1048
3149 1048 2712 -203 -687 2162 1194 -600 -692 -799 153 -642 -2626 -419 1454 -954 -1359 1032 1769
3166 1769 407 -175 1128 1140 405 -635 -1265 734 -170 -3158 -246 1583 -1248 -471 77 997 1601
3183 1601 -603 -213 1650 172 -838 -883 381 136 -2892 -557 1243 -1578 -51 -71 535 3202 -1151
3200 -1151 -353 3439 56 -672 -499 -812 546 -1931 -1699 1163 -1203 -444 -12 -120 3578 -1010 -1330
3217 -1330 4288 92 -956 547 -2113 1751 -498 -4071 887 -754 -1318 888 -1097 2213 188
3232 188 -1614 4330 380 -1133 1326 -2404 1973 921 -5707 1289 452 -2696 1865 -1729 120
3247A20K592n042M838o21m051L910l038K166Q59p321O630J328o385N684l387P06
3263a012O001q131L317M134o685M313j337k493M616o635L097L837p087M529o40
3278a76j726P255q174J187P860q290L113O80n716P538m350l060P037o263K065
3293a020K897m431N888m309j635R380p867J3L965o303P373l204p614R941l608
3308e34j884N138o781M508K086n241P174m271l134O650m732L400j388q643J0412
3323B760m93n801M986n738L661O472q827L612Q95m576P624l380k116J741n861
3338e041P606J364q832L915j584K973O229j0849J708N711m318N541l432n082N726
3353A635k444K189J629q662L520K694J275K544r519J951Q926m691J425l246m301
$$ plain form
3247 120 2712 -2330 2508 1887 -2164 1746 -1292 874 1733 -5588 1042 2370 -4015 1669 -1718 -1012
3263 -1012 4989 -3142 175 4309 -2376 1937 600 -1893 2723 -3912 -815 3022 -4065 464 -176
3278 -176 -1902 5353 -2821 -1634 6226 -2064 1049 1729 -3987 3551 -799 -3859 3178 -3085 -1020
3293 -1020 1877 -2554 3334 -975 -2610 6770 -1097 -1084 2881 -3422 3951 747 -6867 3074 -534
3308 -534 -2418 2720 -4061 447 2533 -2708 4466 195 -2939 3711 -1021 2379 991 -7652 2760
3323 2760 2267 -3534 1452 -4286 -625 5847 -2980 632 1527 -3049 4575 1195 -921 820 -5041
3338 -5041 2565 3929 -4903 -988 -2572 401 6630 -4219 -2511 3200 -1118 4423 991 -4091 1635
3353 1635 -809 1380 3009 -5653 -2133 561 1836 4380 -5139 -3188 5738 1047 2472 -774 -5075
3368e075R339k402l140K133o216M204M669l329K4n020K836Q900m903k489j541
3383b010m35R135m670o373L923k591L883K635o617J448l17J465O458n433l450
3398b949K042J670N726o203n896N643J49J703k14p705N151K275j908M158n120
3413a478j633N290q0J924m720m591P414M0j576j396n192P180K342n943L758k802
3429a463k70O225l609r6o00m134O780J11m756L13k174N420J782p452L672N06p72
3446e17N234n924J30L599n158M484Q77o445L153r93J750K730p030K887L405k284
3462a02L040m451M85N455n926J572K124n708L957m76k718N047n329O97N667l891
3478e57J374n64j266N397m973j080M289m531K150q7m068O178l317k167O419m038
$$ plain form
3368 -5075 4264 1862 -1278 855 -5361 -1157 3512 183 207 -4813 -1977 6923 2020 -469 -2010
3383 -2010 -2445 6690 2020 -4353 -430 -3021 862 3497 -3120 -1672 -1989 -524 5934 501 -2949
3398 -2949 -907 763 6489 286 -5610 33 182 1885 1671 -6034 -883 1392 -516 3642 -1478
3413 -1478 -3111 2179 2099 4023 -697 -5288 2126 2166 590 -806 -5998 1182 3524 -2419 1339 -1463
3429 -1463 -1733 4492 883 787 187 -3947 2833 2944 -1812 -1499 -3673 1747 3529 -3923 -251 255 -517
3446 -517 4717 -1207 -1077 2522 -2636 1848 2725 -3720 -567 -1560 190 2920 -4110 -1223 2182 -102
3462 -102 2938 -1513 -1028 4427 -1499 73 2197 -3511 446 -30 -2748 2299 -3030 -2333 3334 -557
3478 -557 817 253 -1013 4384 -589 -1669 2620 -1911 239 152 -3916 2262 -1055 -3222 3197 -841
3494h41Q7K448k885M215j764l538M611k188o21Q09l504N045j681m078N674j920
3510a31p38L122l834K824J642n353M158l82k818J860k139K068O56m258L570O19
3526H66j640K248k990K181K678n305K518J261l593K231j465l01K462l433R97K780
3542A495j719M38q49J400K015l555N00K054k588Q63p52j405L332k460j012L919
3558A676j587q65J216o2J433j229j009J676n00l39j117p73K230j542j397K784
3574E95o58p26J117l04J153K88j944J175J577k399n93L61P23o20j493J547O06
3591D05o35j34j52J886j12k166J600J378k038n56M62J16k7j281k28K050m51j199
3609a082P55J748l95j380P33R43r90p97m5N1Q61j509p07K239l12j349J332Q88
$$ plain form
3494 -841 -754 1694 -1191 3024 1260 -2278 2333 145 -476 333 -3171 1874 193 -3885 1789 -131
3510 -131 -869 2253 -1581 1243 2885 -2468 1690 1308 -1510 350 -1789 279 935 -3323 247 866
3526 866 -774 1474 -1516 665 3343 -1962 556 1817 -1776 455 -1010 -1311 1151 -2282 -1285 1495
3542 1495 -224 214 -635 765 2780 -775 -275 1779 -809 54 -698 -2103 1229 -1231 -2243 1676
3558 1676 89 -776 440 378 1811 582 -427 1249 749 410 -707 -1480 750 -792 -2189 595
3574 595 -63 -789 328 24 1177 1465 -479 696 2273 -126 -719 -358 365 -255 -1748 -201 405
3591 405 -230 -364 -516 1370 1258 -908 692 2070 32 -524 -62 54 27 -1254 -1482 568 117 -1082
3609 -1082 -327 1421 1026 -354 379 1322 332 -465 -510 -459 402 -1107 -1814 425 113 -1236 96 984
3627I84J06r65N5Q54M9r47j006Q34Q93k148o98K492l03j124R56J31R26j64j491
3646e66J580Q23k210o36J205P75j709j407K239m79l63M89n76J935K50k444K568
3663A474K60k482J060o1K19k90j950J084R04j045J32m29K043L15k038J674Q33
3680A703k418J582p87n23J513k958N81K288j911l6M50N71J328k325J016J615j766
3697g7R36q36q07K461l319N8L264l255N28J342j282K737j778r37K933j180p57
3714C1J17n80K118k613j039L407k732J86J874k464L186o49k705M190j302k019
3730i94K087j172J404j152k638K922o28q51J061k170L336K21l502M118r97k317
3746a272L445k173J49Q96l642K858P83k813P00n51K250J050l768K383P20j103
$$ plain form
3627 984 1090 125 180 1034 1083 136 -870 -36 857 -1291 -1989 503 200 -924 32 163 1089 925 -566
3646 -566 1014 1837 -373 -1009 196 971 -738 -2145 94 -385 -748 -259 -835 1100 1350 -1094 1474
3663 1474 1734 -748 312 251 470 180 -1770 -686 218 -827 -695 -1124 919 1234 -804 870 1703
3680 1703 -715 867 80 -443 1070 -1888 -1307 981 -930 -966 -516 55 1383 -942 74 1689 -77
3697 -77 859 23 -784 1677 -1642 -1584 1680 -1575 -1047 295 -987 1750 -28 -965 1968 788 31
3714 31 148 -432 1686 -927 -1966 1441 -1291 -1105 769 -1695 1491 842 -1863 2327 1025 -994
3730 -994 1093 -79 1325 173 -2465 457 -171 -1022 39 -2131 1205 1426 -2076 2042 1045 -1272
3746 -1272 2173 0 149 1045 -2597 261 1044 -1769 -1069 -1620 630 1680 -2088 295 1015 -88
3762h8K565l056k80K713l694K334J041m557J963O50P11J302m004J477K914q33
3778A158M92l206N44L798l365Q91J01l663L544P56j940J722l454J412N009k788
3794A011j162j326J162M028l838j440Q36j402M133j226l285L110k358J909M348
3809D500n149p71J232M39M262m912l138L315J14K175k293m344N028k88N8L219
3825C447o345J597L724k019L496m880l920O778n92q47j386m271O601Q85l442K376
3841A202m297K868M811n109K200k231l768Q559k214m443J808l602N944K001p546
3856c817K897n3J419M592o861J067K227m159P082l125n678N455l281L206L159
3871D130r588M071L802k628L906n761o84P118n024J986l46n805P030k475r05M569
$$ plain form
3762 -88 2477 -579 -859 1854 -1840 494 1535 -3022 -1059 -409 302 1604 -2400 -923 1991 1158
3778 1158 1650 -1556 -1012 2786 -579 312 413 -3250 294 1050 -890 832 -2622 -1210 3799 1011
3794 1011 -151 -1477 -315 3713 -125 -1565 -729 -2131 2002 776 -2509 601 -1757 152 4500
3809 4500 -649 -1420 -188 251 4513 -399 -3537 -222 -108 2067 -226 -4570 458 170 228 3447
3825 3447 -2898 -1301 2423 404 3900 -980 -4900 1878 1286 439 -947 -5218 1383 2268 -1174 1202
3841 1202 -3095 -227 4584 -525 1675 -556 -4324 4235 2021 -2422 -614 -4216 1728 3729 -3817
3856 -3817 -920 -973 446 5038 -1823 -756 1471 -2688 4394 1269 -4409 1046 -2235 971 4130
3871 4130 -5458 -1387 2415 -213 3693 -2068 -2752 4366 -658 1328 982 -4823 2207 -268 -1173 3396
3887C396q395L735O065o562L415k098k531Q814n713k113L834m939M558j56m894
3902c584N736m289r7O689p123K821J489m617P927m177m790P377m490Q05K782o993
3918d534N285J19m401O305m116K87M201n530N289p39o016P371k929k674N111o634
3934c605K956K945o905N420R5k886M883m148J354L368o121M396q3m201N056m478
3950a954M68M601o789L181K659m871M371j622j552N716n347K33L431m243L228
3965A510j821j846M230m058Q66L687n080K979O75l135N403l334k459N056l249
3980e76N40P21l369L436p22k181L563k562O90J830k833L636j550k968M903j927
3996F31j410J998l494K370J175l980K605L10j186K003j406J319M28k483L081r41
$$ plain form
3887 3396 -4999 -1264 4801 -1761 1654 -444 -2975 5839 126 -1987 1847 -3092 1466 1310 -3584
3902 -3584 2152 -2137 -2234 4455 -2668 153 1642 -2975 4952 775 -4015 3362 -1128 -323 2459 -4534
3918 -4534 751 870 -3531 2774 -1342 -1055 3146 -2384 2905 2166 -3850 3521 592 -2082 3029 -3605
3934 -3605 -649 2296 -4609 811 906 -1980 2903 -1245 109 3477 -2644 1752 1669 -2532 2524 -1954
3950 -1954 -1486 3115 -3674 -493 2166 -2705 1666 44 -1508 4208 -1139 -906 2525 -1718 1510
3965 1510 -311 -2157 2073 -1985 -1119 2568 -2512 467 1142 -1993 3410 76 -2383 2673 -576
3980 -576 -36 685 -2684 752 30 -2151 1412 -1150 -460 1370 -1463 2173 623 -2345 2558 631
3996 631 -779 1219 -2275 95 1270 -2710 -105 205 -981 1022 -384 935 1363 -1120 1961 1020
4012A020j523J267j779J061J285l723J481J890k225J367l32QJ909j659J12J124
4028A283j128L24p27K61R26k615O48J717j463P91l23j87J907j122j076J876j47
4045I45j176J99j95N11j171k65J177l22J1N7j07J531q72j063J979l91j217N68
4063A99k45n5j29p37J41J176p53m75R52P33l05p38J101O2m09m10o96Q31J99j760
4083a318L64J350r44m02J189J42J51l13j21O37J83q18l90Q74l59j609O46R03j131
4102i66K09L71M19Q92p73l44J367j5j424L50P89p85p86K5O91n39K55n96M21J411
4122I72j132n26J851k90j150M77j16K3p4q83N13L11l03o44P55J056j212p0J455
4141A013n55l8k29n96R51l46j565J265L57j050M1L14P74m16l40J033k8L6N6j122
$$ plain form
4012 1020 -503 764 -1015 46 1331 -2392 -911 979 -1246 121 -211 -203 1706 47 159 1283
4028 1283 155 479 -248 13 939 -1676 -1028 689 -774 17 -306 -493 1414 292 -784 1092 945
4045 945 -231 -32 -227 284 -887 -1152 25 -297 -286 -229 -336 1195 323 -740 1239 848 -369 199
4063 199 -46 -101 -230 -967 -826 350 -403 -878 74 807 502 -236 865 927 518 108 -588 243 442 -1318
4083 -1318 -954 396 -548 -950 239 381 532 219 98 735 918 100 -290 584 225 -1384 -738 165 -966
4102 -966 -757 -386 33 925 152 -192 1175 1160 -264 86 875 90 -696 -671 20 -519 -264 -860 -439 972
4122 972 -160 -686 1165 875 -275 202 86 109 35 -848 -335 -24 -327 -971 -216 840 -372 -442 1013
4141 1013 458 420 191 -405 546 200 -1365 -100 257 -793 -752 -438 336 -80 -420 613 585 621 677 -445
4161d45J413o55j723J285M30j315O26l09P13P50j078L94P47J7o11l63J222p00
4179C98j784J450l99o67Q38q93J061J008j984Q17J444r07R5m46N40K12j485P24
4197B2l5p42Q55j370R55J122k589J697J516j181M24j057j60K671k214q97Q76o89
4215g96J207j265K5J661k541J769J793k742J824j329J00L440l781j283K732j302
4231d88J318j017k206K925q54L56J484k827J761M87j181L480m055j638M830k741
4247c66O01j31l868M894N30k967K337k504J547K583l390K381k168k071N947l475
4263a20j123J484m431N921J128o222L612r14M47M315n578P49K108l131M686k627
4279C04l380M106l358L579J497p829M817J758k255M911o509m02O900n175K495
$$ plain form
4161 -445 968 313 -1410 -125 305 -1010 -384 -693 20 770 -308 86 833 850 239 -124 1098 398
4179 398 -1386 64 -335 -1002 -164 -1057 4 1012 -972 -155 1289 382 477 31 571 783 -702 22
4197 22 -13 -755 100 -1270 -315 807 -1782 -85 1431 250 674 -383 -543 2128 -86 -983 -107 -796
4215 -796 411 -854 -829 832 -1709 60 1853 -889 935 -394 -294 3146 -635 -1918 814 -488
4231 -488 830 -187 -2393 532 -322 34 1518 -1309 452 939 -242 3238 -817 -2455 2375 -366
4247 -366 235 104 -3764 1130 1660 -1307 1030 -1474 73 2656 -734 1647 -521 -2592 3355 -120
4263 -120 -1243 241 -4190 1731 2859 -3363 249 -665 -218 4097 -1481 -732 1376 -1755 2931 304
4279 304 -3076 1030 -2328 1251 2748 -5081 -264 1494 -761 4150 -2359 -2761 4139 -1036 1459
4294A459l81n189N969j256j798L184o567L757M299m873L639l776j276Q342n891
4309c58r27L262n909O439k2o138N199l677O37O070o720K004R47l297P501m478
4325E33m289O488m999L552J713q466O549J28m390P232n746o08N873n591M831j080
4341A730o111P576k763j535M026p894M985L216p611O433k523l049Q153o067P81
4356f53L988p017N739L82n300N061m437Q35N127p826L648J897m511O760m349j767
4372b423O943o633K341L277o571M719j217l482O297n347j63N038n100L575n58
4387F96l435P040m769j327N374n812L076J184o125O237j920l609O243m310L55
4402a102L228m263M403j066l877N494k992l78K380m968M263M72n136N049k057
$$ plain form
4294 1459 1078 -4111 1858 602 -1196 1988 -4579 -822 3477 -1396 2243 -1533 -2809 5533 -358
4309 -358 -1285 1977 -3932 2507 2485 -3653 1546 -2131 -1494 4576 -2144 -140 807 -2490 5011 533
4325 533 -3756 2732 -2267 1285 2998 -5468 1081 1209 -3181 4051 -1695 -2303 3570 -2021 2810 1730
4341 1730 -4381 3195 432 -1103 2923 -4971 14 3230 -4381 2052 -471 -3520 4633 -1434 -653
4356 -653 3335 -3682 2057 2439 -2861 2200 -2237 -1402 3725 -4101 -453 1444 -3067 3693 -656 -2423
4372 -2423 4520 -2113 228 3505 -3066 1653 436 -3046 3251 -2096 -2259 2779 -2321 1254 696
4387 696 -2739 4301 -468 -1795 3579 -2233 843 2027 -4098 2139 219 -3390 2853 -1457 -1102
4402 -1102 2126 -2137 2266 1200 -2677 2817 -175 -553 1827 -3141 1122 1594 -3542 1507 -550
4417e50j076M311m146J350K351m272L656l05l066L088k989J463K265n048K612
4432c56P94k007L692l059o19M347l970J752J689m290L048p35j412K585l043K97
4448a287K310j975J606j083j029L554k189n13K377k929J826O20k301J886j362
4463d89j396L289j990k70J098j057K321q72j585J895o06K82L35k339J999o36j529
4480a550K227q33j067J359m34O58N74j804J212O93q13j46q50P69L30j406J054
4497b7l79n98J173q60O59J076j730P64J660j282l80N4j93L40q73j65M79J30j59
4516c11l82O22P89r35L87J091j257J62O4k92M85q02m89N32N37p15l0N67L41m42
4536g8J52M90k91k9l26L39J149j513r21J746k20j334L08L24J41J16l83N18Q54
$$ plain form
4417 -550 -1626 2685 -1461 -111 2240 -2032 1624 1319 -1747 1341 -1648 -185 2080 -2968 -356
4432 -356 438 -1569 2123 -936 -1555 2792 -1178 574 2263 -2027 1021 286 -1126 1459 -1584 -1287
4448 -1287 1023 -952 654 -429 -1458 2096 -93 -606 1771 -1158 668 1288 -1013 873 -489
4463 -489 -1885 1404 -586 -856 242 -815 1506 634 -951 944 338 620 955 -1384 615 -21 -1550
4480 -1550 677 -156 -1223 136 -298 360 934 -870 342 1035 222 76 -774 -5 325 -1081 -27
4497 -27 -406 -1004 169 -691 -32 1044 -686 78 1738 456 76 130 -63 277 -596 -761 -282 -152 -311
4516 -311 -693 -71 718 -217 170 1261 4 166 230 -62 423 -379 -868 -336 201 -514 -544 23 364 -78
4536 -78 74 564 273 244 -82 257 1406 -107 -1028 718 498 -836 -528 -204 -63 53 -330 188 1042
4555A042m84q06O41N05r61m81N00n1m65J53j87N20M14n80L04R65p60k73M25J91
4575F12p68j71Q0j47K57j36p43R20O38j020L61Q87n26Q5p8%Jp80J01O4J43n00
4597g20m49J472O7j158J311p4l4L88q32J94Q51q91o23N53k55n65R6N47L29m78
4617b71K63M43p1N00j109M72J039j675O2O97q58K04k04l51R91n07k14P90n1M09
4637E59q68N00J286k145M66O31j037R73q70j121K269q37p86J705j080P27q1l52
4655f1J414j365l78R49j070Q82m63j907K712p77j160J895j118L33J496k163J531
4672G50j01j721K286j357n8K89k080K759j52k211K334j498P63K333l725J341J763
4689A715l071K573l94k616K363j716R99J344l363K163L17o35K469l671P19L645
$$ plain form
4555 1042 558 -248 393 898 -63 -544 -44 -95 -560 -407 -594 -74 340 -240 64 1029 269 -4 421 612
4575 612 -156 -327 -247 -394 -137 -273 -1016 -96 542 -478 -117 770 244 329 251 251 252 -528 -427 -363 -220 -720
4597 -720 -1169 303 370 -788 523 449 415 803 -29 165 1016 125 -498 55 -200 -765 -669 -122 207 -271
4617 -271 -8 435 364 864 -245 227 1266 -409 -347 350 -508 -304 -508 -859 132 -375 -589 201 150 559
4637 559 -309 191 1477 -668 -202 429 -608 365 -505 -1626 643 -194 -980 725 -355 372 291 -61
4655 -61 1353 -12 -390 559 -511 371 -92 -1999 713 -64 -1224 671 -447 -114 1382 -781 750
4672 750 649 -1072 1214 -143 -201 88 -1992 767 615 -1596 738 -760 3 2336 -1389 -48 1715
4689 1715 -1356 1217 823 -1793 570 -1146 -147 1197 -2166 -3 314 -321 2148 -1523 -804 2841
4705B841l520J875m01l567M379j678j217K958l964J488K816l147K068j815o50
4720a534M911l395l82J405l251M163o13m187M375l134K4N025m990J195J248k642
4736a782N075k288l345L853k430K091P32n614M021q1k139M962n022L50M268m461
4752a810L842l11n563N808j103j542L008n555K574L060m648L775k648j220N863
4767C530m437R62K557n871N134O22m802M372l957K94N406o371J566J855l304N272
4783B828k975k028M947m610K616K217o113M620j556k282N666n236p79N129m522
4798b078K993k5m047N769k310j508L953m894K600J470m552M706k504k509N846
4813B910m286O85K870n368N220l44m405M953k519n48L261m848K804R61m168M419
$$ plain form
4705 2841 -679 1196 795 -2772 1607 -71 -1288 1670 -2294 -806 2010 -1137 931 -884 -1534
4720 -1534 3377 -18 -400 1005 -2246 1917 1304 -2883 1492 -1642 -1618 3407 -1583 -388 860 -1782
4736 -1782 3293 1005 -2340 1513 -917 1174 1906 -3708 313 232 -1907 3055 -1967 -1617 2651 -1810
4752 -1810 2032 1721 -3842 1966 863 -679 2329 -3226 -652 2408 -2240 1535 -1113 -2333 3530
4767 3530 -907 55 2612 -3259 1875 2497 -2305 2067 -1890 -1596 3810 -2561 -995 860 -2444 2828
4783 2828 -147 -2175 2772 -1838 778 2995 -3118 1502 -54 -2336 3330 -1906 -2685 2444 -2078
4798 -2078 915 890 -3157 2612 302 -1206 2747 -2147 453 1923 -2629 2077 -427 -2936 2910
4813 2910 -1376 -691 2179 -3189 2031 1687 -2718 2235 -284 -832 2429 -2419 385 1346 -2822 1597
4829A597k239j127M051m638K755K065n123M433m61l353M379l536J77L320m530
4844b230J856J053k449L502k484l07L290l569K399O21l509L368j470j248L393
4859B216m072O12L111l339K114n85j938L901k122k47J656k589K070K20k337K787
4875A458k635m01L267k757M98J116k258L264o09k411K444j002Q37N45k730J500
4891A26p9j019K101j949m53J946j772K363l42k520K399J36q90J092j960N55J172
4908I06j362M32m47n85J666j259R70Q2j576J898L43j166P31j259M91J488j786
4925d33j36L44m54Q87n91J09L33m03P20K38n90K23m80L32Q97j530l49Q59m11O05
4945A70n41l02P96n6J30M6j69K23k80K52L96j390L49L06k91L19m17m68J400k88
$$ plain form
4829 1597 -642 -1769 2282 -2356 399 2464 -2659 1774 1313 -2040 2339 -1197 -1020 2300 -2230
4844 -2230 -374 679 -1770 1732 -752 -1059 2231 -1338 1061 1682 -1827 1541 71 -1177 2216
4859 2216 -1856 -1244 1867 -1472 642 57 -1881 2020 -102 -349 1307 -1282 788 1008 -1329 1458
4875 1458 -1177 -1578 1689 -1068 -570 546 -1712 1552 943 -1468 976 -26 811 1356 -1374 126
4891 126 47 -972 1129 -820 -1273 673 -1099 1264 922 -1598 801 937 47 1139 -821 -266 906
4908 906 -456 -24 -471 -1056 610 -649 321 403 -1173 725 1068 -98 633 -626 -135 1353 -433
4925 -433 -569 -225 -679 208 -383 -274 59 -344 376 614 24 247 -233 99 996 -534 -883 -24 -435 170
4945 170 -371 -673 123 67 197 243 74 297 17 269 665 -725 -376 -70 -361 -42 -459 -927 473 185
4965A85n90R48k97k6K22j9k76k36j38j26L94k1n32j96J090n15j67M62NK96Q7n05
4987D5J72L62p32k56N48k5j065J65R43m00J07M47j67M79j06o75M11L89o98k52
5007c08M39p0m04o1J78K50J7j81J78N83n76k60J021k90j017L94R5l99J37j00j02
5028d76O79k33o08M98Q04m87k06K75k8j17O9m45J80L10p38O9O28l48j68Q07k79
5049A86k06M40j70K05J5m06q2J6k8m83j14P71l60j23O23n26N01M86r12P60J13
5070G06r33J70K49j76l65p8J33p5Q2J27k76L89O92j238J157J64j197Q31j16n17
5090b71O02j002L51N65q15M45L35K09j61q03J025O5q77P43l01m78Q67j182J32
5109e51J367j675N55O51p70O82m47j17J296j101J03K97p98P42p79k98J657j958
$$ plain form
4965 185 -405 543 246 220 442 423 147 -89 -227 -353 41 20 -512 -708 382 -133 -300 162 167 463 550 45
4987 45 217 579 -153 -409 139 114 -951 -786 157 -243 -136 311 144 623 517 -158 253 642 -56 -308
5007 -308 131 61 -343 -404 -226 24 41 -140 38 621 45 -215 806 516 -501 -107 -12 -411 -274 -374 -476
5028 -476 203 -30 -638 -140 664 177 -29 246 218 101 170 -275 -95 215 -523 -454 174 -174 -342 465 186
5049 186 -20 420 250 455 470 64 -18 -2 -30 -513 -627 144 -216 -339 284 -242 259 745 -167 593 706
5070 706 -227 -57 192 16 -349 -427 -294 -369 -287 -160 -436 -47 645 -593 564 728 -469 362 246 -271
5090 -271 331 -671 -320 245 -570 -125 210 419 258 -545 480 545 -332 411 110 -368 499 -683 -551
5109 -551 816 -859 -304 347 -423 259 -188 -305 991 -110 -7 290 -508 234 -545 -843 814 -1144
5127a144O70J429j412R53k94q96J935q82n44P54j253J178k45j308J680j340j14
5144h33J464j383P88N51j788K688r44j912K527j318K58Q44k458J432K50j163J802
5161H05j416p6J636j618J524j7k489K845q88p89J747k962J129K157l202J807l17
5178a24j313K853j654p5J216k275K259J08k074K301k430K94K979l504R54Q91k129
5195a723L341j382j813K759j713R57J046k933K114l30j304K831l059j72K615k479
5211a245K332l43k923L754j046j282K571l219J164J675k562J775o56j803L170
5226A362j939K41J184k854L309j18k592K997k085p6K748l818J604Q09k470K730
5242A032j003j572K520k411J711J377l164K371m99j075K520k687K83J937k564
$$ plain form
5127 -1144 -474 955 -457 496 202 -694 1241 359 -185 569 -684 494 249 -1059 621 -719 -833
5144 -833 631 -752 36 587 -1201 1487 543 -1369 1158 -160 98 942 -1516 -84 166 -997 805
5161 805 -611 -687 949 -669 855 838 -1651 1194 306 -483 1264 -1698 -569 1588 -1614 193 -124
5178 -124 -1437 1416 -238 -313 903 -1372 887 995 -1079 1222 -1208 -914 2065 -1439 -485 406 -1723
5195 -1723 1618 236 -1577 1182 -531 426 1472 -1461 653 323 -981 1850 -1209 -1381 1234 -1245
5211 -1245 1087 744 -2179 1575 529 -753 1818 -1401 -237 1438 -1124 651 -5 -1808 1362
5226 1362 -577 -336 848 -2006 1303 1185 -1407 1590 -495 -571 2177 -1641 -37 772 -1698 1032
5242 1032 29 -1543 977 -1434 277 1654 -1510 861 362 -713 1807 -880 -597 1340 -1224
5257a224J323M67k459K875j324o15K574k547R40J227j985J894j292o68K326k427
5273i15O01J300k306J816l21j541K880j701k81J846k057J483N6j763J773j247
5289c77l59J369j500J061J46j627K579r87j245K105j414M50J168k448J040M82
5305D43j210J456j117k81J044j086J403m52j202J789m11R0N10j953Q64Q76j485
5322g22J113p76q29J515l10J10O8r44J114N2k4j49j017R21P70j404L11k9l82J288
5342F76q98l34P00p09J134J30r36L36m60R91L49j471K66o9J1J009j132l77J177
5361C93p49N19K51j117P84J24O3L78j201K06M51o8J88j083J87J145o74M81J25
5380D03j075J281j31m30P04j137LO52m30r3l06J49N69l54J64J80p97J296k07p15
$$ plain form
5257 -1224 99 566 -1893 982 -342 -957 1617 -930 10 1237 -748 1146 -146 -814 1512 -915
5273 -915 -314 986 -1320 496 175 -1366 1514 -187 -468 1378 -679 804 860 -903 870 -377
5289 -377 -736 633 -867 194 340 -1287 1292 305 -940 1165 -249 201 1369 -1079 -39 443
5305 443 -767 689 -428 -709 335 -751 652 200 -1002 787 376 466 976 -977 -113 763 -722
5322 -722 391 -385 -1214 301 -9 101 169 -775 339 391 367 218 -799 122 892 -512 -201 -230 -612 676
5342 676 -222 -556 144 -565 569 699 -237 99 -361 630 979 -492 -226 -295 -284 725 -407 -784 393
5361 393 -356 163 414 -703 81 205 268 646 -555 -349 102 34 222 -861 -674 471 -203 278 403
5380 403 -672 609 478 48 752 -385 -382 270 -160 -253 -559 -410 159 -195 -31 149 -648 648 441 -274
5400b74Q14n35j55O58o56m16M26l66N34J49m58R0M46J44j69m95Q64l46l01M36
5420C90q36M0O38p16M69J07p71P81J9J76j14j61K66O3m43L27l88J51M31r17M23
5441f5K75o89M45K27l21L70j71j40N09l42k28R6j46M83p58K95K77l55L20j12k10
5462b40O12l60k17P87l87o61M34j3j32P7m87N82j17l4J59O6K33l06j31M04Kl05
5484c4J77l03J54O5l24N6K58k32l57O86j3J2J66j91J32k22K50m99K70J83l53j40
5506b59L71m84K89K61l69K82j09J8J24J84l30P7p0j17K0O6J95n23J02K57l27L83
5528D1J4k79L54O7m33K01L6M8n4j82O2lq0Q9J7L11k70j99O63j98j88J34k96Q8
5552e7M41p65M67k6l97K84k04L33j43j21N90k58m09O35n65L68K20j185Q19K84
$$ plain form
5400 -274 540 5 -150 508 -148 -564 -138 -504 30 179 -279 -189 257 401 232 -263 601 255 -46 390
5420 390 -446 -406 232 -484 -15 92 -679 102 121 297 183 22 288 351 -92 235 -153 -2 429 -488 -65
5441 -65 210 -479 -34 193 -128 242 71 -69 440 98 -130 -34 -180 303 -455 -160 117 -238 82 -30 -240
5462 -240 372 12 -205 582 195 -466 -32 -45 -177 -100 -587 -5 -122 -156 3 69 302 -4 -135 269 271 -34
5484 -34 143 -160 -6 59 -265 -209 49 -183 -540 146 133 145 311 120 252 30 280 -219 51 234 -119 -259
5506 -259 112 -372 -83 178 -191 91 -18 0 124 308 -22 55 -15 -132 -112 -46 149 -374 -272 -15 -342 41
5528 41 55 -224 130 197 -236 -35 1 49 -5 -187 -125 -128 -208 -119 -102 209 -61 -260 403 205 17 151 -145 -57
5552 -57 384 -381 86 60 -337 -53 -257 76 -67 -188 402 144 -265 370 -195 173 393 -792 27 311
5572C11r80P34L5m75P83n40M18k7k39J66J36j66J19p69M56J34p48N12Q0p25J280
5593D95l86l91Q77p69L26L20l87O9k12r4L38m87Q7J85l89R54n31o13J269p06J28
5614H3N68j264J063j73o32R26o64o56J154r75J075n74n85J085m47k50J179j445
5632e32M19R51j505J060o04p35J362l16l69N65q34J058P4q75P63o40M9R15j507
5651g01J023L7j193J388n03r13R93p12N13J117j617P69L4n06J170j015l87R60
5669D57j070Q51L9j128J330n76k26J196j445O15Q32j076P61n07p13J350p95k0
5687a25K16p88J045m86k91R65p95J63Q89j059O06j24r87J280k56o57N58k95q5
5706b26L38o33Q56j33m30P36p05O92j09r63J121n52q13J292r18J37O23r63O96
$$ plain form
5572 311 -669 65 100 -375 408 -132 286 259 20 186 322 156 275 -494 -38 96 -652 -140 -60 -785 495
5593 495 109 -282 595 -174 152 472 85 154 -58 -152 186 -301 -214 -29 -418 536 5 -608 661 -45 83
5614 83 651 -613 450 277 -355 571 -93 -749 405 -570 505 -69 -654 431 -16 -266 913 -532
5632 -532 -113 838 -667 393 -211 -946 416 100 -269 296 -538 520 594 -281 482 -158 -109 806 -701
5651 -701 322 359 -834 554 51 -862 131 -581 -68 1049 -568 201 235 -271 899 -116 -503 457
5669 457 -613 238 277 -851 479 -97 -323 873 -572 43 875 -201 560 53 -660 690 -105 -125
5687 -125 91 -697 348 -138 -429 536 -259 -96 793 -266 340 216 -771 509 253 -404 154 -141 -226
5706 -226 112 -521 335 202 -228 508 -197 495 386 -577 544 -8 -821 471 -447 -310 313 -650 46
5725D6K14m50M29j70j2M27r63R00l35m86O51q32K65O94j111R53K62j081J026l11
5745A16k24L68o23M84K57l50R1n45N7R82q66M3L41p95J080k8m79L73n43K67P51
5766G57j002q5J33j61R28r62JN12l85R64l28j141J020k17N6M75r53L22L18m22
5786a70N54q54j29Q88l51J46k13l71J059k90j60M93j316P44M40q45K68j08n91
5805h06J314m28j28Q9m48J023m5q44M42l56J58R72j474L94K49r87J461m43p25
5824e82N99j89K75O27r38K74L31l96M62q54J24P11j041Q61k68p55J082m39J55
5843C9N60q16K19Q25r68L28l82P2N26o84J08J97p13R44l25j38N49o52L31R26j154
5864b08O22q2r41Q53k10m14M35l33L45J85o71O45k44l15R05o74R3K79p71N58J30
$$ plain form
5725 46 260 -190 239 69 57 484 -479 421 86 -400 251 -581 -316 378 -733 220 482 -599 427 116
5745 116 -108 260 -363 121 378 28 119 -426 -369 613 -253 -210 131 -664 416 388 -91 282 -261 6 757
5766 757 -245 -330 -197 -358 570 -392 -391 121 -264 700 372 -769 251 34 90 565 -388 -66 252 -170
5786 -170 384 -470 -599 289 -62 84 -129 -500 559 269 109 602 -714 30 470 -375 -107 -215 -806
5805 -806 508 80 -48 41 -407 616 571 -273 169 -187 -29 943 -531 -137 112 -875 586 143 -582
5824 -582 17 -172 103 730 -208 66 397 1 463 -391 -267 444 -597 264 -4 -759 323 -116 39
5843 39 599 -217 2 827 -141 187 -195 -123 403 -281 -173 24 -689 255 -70 -208 341 -311 20 946 -208
5864 -208 414 332 -609 244 34 -380 55 -278 67 252 -419 226 -18 -333 572 -102 -9 270 -501 57 187
5885A87q22N61R3l43N84l95LN43o06N44l17m7M16o36J54R7o23O14Jl45N43k07
5907aj57N68o75N37J00m22K90m3q9k0l77J37K44m31P7k58L59N18l02k65O44p47
5929c13N29J04o80L39q3k25K85P1j10M7k24K61j04M7J50q0J57J70l61J8M4k36
5951a94M9K83n87L13J5o2L46l08M55o5R4J15l50L17l44l22N46j57l21J51M7j97
5973a76M04k94j02M66m47o9L34j35p1J38j49J30k41L38k49k7M48m76J75K97k80
5994A4j67L40j08K21j54j95j23J60o4k53L33K67m04J53K72k74o8K27n3k04J3k86
6016c53K62nl90L44J09k06k9K75n1L4K29J23m09K79j15j16J95j93l46M41j57k68
6038c47L44j42K13L55n46L32j9J5k86j34L11j59k17M14j49j59M6k53L49K99k55
$$ plain form
5885 187 -635 -74 19 -324 260 -135 -132 411 -195 349 32 -15 401 -235 -81 16 -607 7 8 -337 206 -1
5907 -1 -158 410 -265 272 372 -50 240 197 108 88 -289 -152 92 -339 -262 -520 -161 357 55 -210 434 -313
5929 -313 216 320 -360 -21 -104 -329 -44 27 -83 -36 -260 1 -103 -56 94 14 171 341 -20 -2 42 -194
5951 -194 -145 138 -449 -136 -121 -183 163 -145 310 245 339 454 104 421 77 -245 301 144 -177 -26 21 -176
5973 -176 228 -66 -168 298 -149 -218 116 -19 -90 48 -101 29 -212 126 -123 -150 298 -178 -3 294 14
5994 14 -153 187 79 300 146 -49 -172 -12 -76 -329 4 271 -133 20 292 18 -50 177 124 -80 -67 -353
6016 -353 -91 -96 -486 -142 -33 -239 -268 7 -44 -10 219 342 -67 212 97 -19 176 -17 -363 78 -79 -347
6038 -347 -3 -145 68 423 -123 209 190 205 -81 -215 96 -63 -280 134 -15 -174 -128 -381 -32 267 12
6059A2J03J89j70M5j19j29J05k74J67q5p3L15l51K41N61p55L56m8J3K79l11j29
6081e8p4j33J19J13m25L38J3M7K87l85J50n9KN04m59l82Q33n94J86j9m35M83j32
6104h0m9L61l21j48K90j44L21l33O5N71m16l99O18m83P1J41m36K41L3L0K46J15
6126B94m21J50j36K96j88l14N96p20L62K29n32M33N5k76M56m35j1L98j15J48r7
6147A72k46J54k16J66nl06L26p4k15L70j59q4L25k62o6K88m45J5J47P7K81n49
6169c06L88L7l54L95l07J52M21q71P03j1n31N52l74n94P50l11J47n0k86O57n9
6190A48l79O68n97K50N64j197O28J13n97O67m17k13P31p00K31R7n36O21j03k33
6210b54R06r07K4N87m32L10k63n73J088l37l54O56q58N18N01j113P15k49Q3L35
$$ plain form
6059 12 115 304 134 179 60 -69 36 -238 -71 -156 -229 86 -265 -24 537 -218 138 90 103 382 71 -58
6081 -58 -132 -265 -146 -33 -458 -120 -107 -60 227 -158 -8 -67 -65 439 -20 -402 431 -163 23 4 -431 52 -80
6104 -80 -129 232 -89 -237 53 -91 230 -103 -38 533 117 -282 336 -147 -76 65 -371 -130 -97 -67 179 294
6126 294 -127 23 -113 183 -5 -319 277 -443 -81 148 -384 49 104 -172 284 -151 -162 236 121 269 172
6147 172 -74 80 -136 30 25 -281 45 -29 -244 126 -33 -117 208 -54 -120 168 -277 -262 -115 -38 243 -306
6169 -306 82 119 -235 160 -147 5 426 -445 258 247 -284 268 -106 -700 50 -261 -114 -164 -450 207 148
6190 148 -231 437 -160 90 654 -543 85 198 -399 268 -149 -362 369 -331 -100 -3 -539 82 -21 -254
6210 -254 652 -255 -231 356 -76 234 -29 -602 486 149 -205 451 -407 111 612 -501 214 -35 48 383
6230C83n36J40J2o41J108l68o18Q50o99L14O56q56K55L21n42P64o25k05N96n93
6250b84O32j94j075J342l36j25O27j026N21Q37j071N64m10m37Q52m91j28L04o23
6269e21M41M74p11P26o79N1R88p99PL64p33R04k86r70R28m36K73K65o01M64j67
6290a8l09R00p72j4L93m30M61N8o12R61q16P0N16q21J53O06o53P39n09l74J094
6311F23o50K1L33p48M18L7k98L92m67J15N26m05j65N81q26Q74m74j13Q05q17J74
6332f4L94r56O39n4l67Q30q80M68L56p42O58k21m43L55Jn4M32p15K54M00n87M75
6354A79k26k4L86l3k94J71l76K29J08k17K57k29k56N58n78O00L5o94O45j80p4
6375a3L12k00m3J35l72L44k95J55r0j34M06P8n54J24M04j17o9J46j38K21k87l55
$$ plain form
6230 383 -153 -13 -1 -642 466 98 -520 330 -369 -55 601 -255 0 321 -221 543 -82 -287 309 -284
6250 -284 348 154 -921 421 85 -40 587 -439 82 919 -152 412 2 -435 417 -74 -202 102 -521
6269 -521 -80 394 -317 409 -270 -219 769 -30 -23 341 -392 512 226 -744 184 -252 21 286 -315 149 -18
6290 -18 -327 573 -199 -213 180 -250 211 269 -343 618 -198 -128 388 -433 -280 326 -327 412 -97 -471 623
6311 623 -27 -6 327 -421 -3 34 -264 128 -339 -224 302 -103 -268 313 -513 361 -113 -226 579 -238 -64
6332 -64 330 -626 13 -41 -408 422 -458 10 366 -376 282 61 -382 -27 -26 -80 352 -363 -109 291 -296 179
6354 179 -47 -71 315 282 -12 159 -217 12 120 -97 160 -69 -325 233 -345 255 290 -404 241 61 -13
6375 -13 299 99 56 191 -181 163 -132 23 -67 -201 205 283 -271 -147 257 140 71 217 79 300 13 -342
6397c42M73r5j02j15J00n8K52l22J65j65J91q7J72J98k51k50M86k85k05J7J40
6418h3k0J29k71M67l64k2J97j7p7N8k55J62J21k5j4j95r6M49k47L08j21j24r0
6441a30J48K3j38J86k21K76j78j32J58R3j38k78K28K7p5P1K52r8K33l36l8J89
6463A22k24J42k08J72n8L1L44k75l2j34K43l3K50o8n05N09l86QJ32j49j81K54
6485d6R0n7NK3j37J45K93l80k3k9nO8Qo9MK08k61J36R4k06J77J59l13L19L4Mk72
6512c1r9J15j66Q7J03m01M00R1j37M8P4L0R9k56O1J87j93j91r4n2L98k89K34P3
6536I1k66M04k0j52O3k61K27o5j55l4L35l50J80j56J61q5J3M15o39M47K01m83
6558a29L30j37j15Q1k37L33j6k71o9K21J40o9j50o3K34k24K45l09J2K23K0j82
$$ plain form
6397 -342 131 36 -66 -181 -81 -139 113 -209 -44 -209 -18 -105 67 265 14 -236 250 -35 -240 -223 -83
6418 -83 -103 26 -245 222 -142 -164 33 16 -61 -3 -258 -96 25 0 -14 -209 -305 144 -103 205 84 -40 -130
6441 -130 18 41 -97 89 -132 144 -34 -166 -8 85 -53 -331 -103 -76 -151 -80 172 74 307 -29 -67 122
6463 122 -102 40 -168 4 -54 -23 321 46 14 -120 123 90 340 272 -233 276 -110 -102 30 -119 -300 -46
6485 -46 44 -13 -8 15 -122 23 316 -64 -87 -116 -121 -53 -45 -114 -110 98 -163 -27 67 -139 38 197 -116 203 237 241 -31
6512 -31 -130 -15 -181 -94 9 -392 8 99 -38 10 84 114 213 -43 18 205 12 -179 -273 -325 73 -216 18 91
6536 91 -175 229 209 57 120 -141 86 21 -134 -168 167 -183 -3 -159 2 -83 -70 345 -294 153 354 -129
6558 -129 201 64 -51 30 -207 126 110 -161 -230 -9 131 62 -88 -151 83 -141 104 -205 -193 30 50 -132
6580a32J95j05o0J92k1k7J07k0J36l65J01m0pK8K7k6L26m34l09Q19m74K03J88
6603C02n51M06k62R9L6j75K09M2m01M11k66j22L93m10J60N01n88M84j99j02N63
6624E30o74K91J45l76J06j5j07L21m14mK30k61M32J49o74M60k07mP63q01j21N07
6646B76q32O89j0l52M36o47L27M48q04M76K25l52L71m81r7O52n95Q6N86r39R32
6667C95m25j42M85n45k1P09m72L04j44n69Q56n55J3N12p92M31K67o99M03q6q0
6688a55N09k98PN9p37J023k11m45M37n45L05L43r64O69L81p04J018p92k22P84
6708D62n45L93q7o01N84o2k43K16n10K3N30o69Q00J7p95J018m66pM03j203P44
6729BK58o52L58j5l43N78k69p6m9m32J146l10k08L37o34K45K91m69J53q3M4N80
$$ plain form
6580 -132 63 -42 -102 90 69 42 149 129 265 -100 1 -39 -46 -18 9 -17 309 -125 -434 385 -89 114 302
6603 302 -249 157 -105 -6 30 -145 64 106 -295 116 -150 -272 121 -289 -129 372 -216 268 69 -33 530
6624 530 -144 147 292 -84 22 7 -100 221 -193 -197 33 -228 204 353 -321 139 -68 -72 691 -110 -231 276
6646 276 -556 133 123 -229 207 -440 -113 335 -469 7 232 -120 251 -230 -327 325 -270 -184 402 -537 395
6667 395 -30 -172 313 -232 -253 456 -16 288 144 -425 431 -124 -111 401 -391 40 307 -392 11 -75 -155
6688 -155 354 56 63 122 -615 408 197 -248 189 -356 -51 292 -672 -3 378 -326 692 -100 -322 462
6708 462 -83 310 223 -378 206 144 -99 117 -393 -370 160 -509 291 308 -487 531 65 58 461 -742 2
6729 2 260 -392 -34 -49 -392 186 -83 -159 -208 -640 506 196 -12 325 -309 -64 227 -242 -89 -172 -128 452
6751D52m60j88N03n74L39J97o57N29j38l3L13o03p8N94m37M73J29o90O80j15m06
6772a70N37l55j63L64m38L30j87j76M08j59K75j45m88M33J11m43L41p3j09L84
6792B77m54K69rk40J42m3oK03j55K16K0o16R01m03j97K51k23o6N22o82L59j39
6814g3k96K42K95l72J99LJ44J45l45J7J02p5o0R4K2K72p12L77p3k05N22j63j1
6837D9K4l28K83R9j17K4K76j41p2k62L59L2k95n6L6N1L23l78K34n4k37j54N13
6860B09p3l8k97J64P3r4J00k77K3L49k97L22r2j10j35R7P0P0K9j08r0p0q8J09
6884a54O9J47n2p9O3k46K83L9k76P9K06j84O5n7J04l7J21k24L4K24n2j97J70k62
6908b16K25j4j25J18L7k69L6K13k7K44j96J6j80J88L4l4J90p4k81L89r3j51pk3
$$ plain form
6751 452 -8 -196 307 -267 72 269 -388 141 3 -30 283 -320 -398 196 -241 232 361 -329 351 236 -170
6772 -170 367 12 -151 213 -225 105 -82 -258 150 -9 266 121 -367 66 177 -266 75 2 -107 277
6792 277 -177 92 83 -157 -15 -58 -64 139 -16 200 220 -396 505 102 -95 156 -67 -133 389 -293 66 -73
6814 -73 -369 -127 168 -204 -5 -2 142 287 -58 -41 61 -14 -74 20 42 314 -398 -21 -94 -299 223 60 49
6837 49 73 -255 28 127 10 34 310 169 97 -165 194 226 -69 -125 -89 -38 285 -93 141 87 -150 -304 209
6860 209 136 98 -199 -35 38 -56 44 -233 -210 139 -158 164 72 -38 -173 -76 -6 64 93 -15 -105 -175 -263 -154
6884 -154 -85 62 10 -69 -6 -252 31 70 -206 -127 79 -105 -40 -97 7 -30 91 -133 -99 125 73 -124 46 -216
6908 -216 9 -5 -130 -12 25 -244 -208 5 -22 222 26 42 -138 50 84 50 240 166 -115 274 181 30 23 0
6932@Q0q2J2q2J65J59j59o8J69k13J73k21K13k0k51P9K16k56J17k10J87j20J3
6955i9R4R1L3j40jm8m5J53j52M4K01n10L40Q1O1j24O7l97M69O8k16l4q5J86K1
6980E8L4l70K92j01K53k34R5j00L68m00K46j08j1LK2q9j87J70Q0J74j84L61k44
7003A28q2J72j04j29J43j57M1O4K6p2J2m1J45k66K37k47m0K89l0l34K16k75K40
7026f4L1r8J52o7j00L26l53L61k28j40M72j95j62L67k94M4PkK50l25q9J26r8j70
7050b49N42k75J44j86K1L52m56j13L60m49L97q5j06K6O8r4J83k71J91J65k4Q4
7072B25k20ML41n87N9M27n08M58l23j60M19m28J53L57l59L47J98n21K75J82m47
7093a08M45n52L45L4l45K13r4j67N65m49k3L47k51J14K24o11N56j79J13K21o99
$$ plain form
6932 0 80 -2 10 -72 93 252 93 25 194 -19 154 -67 146 126 -125 -46 170 -86 31 -179 8 -112 -99
6955 -99 -5 86 119 -21 -22 -70 -115 38 -114 -70 131 -379 -39 42 103 -21 46 -351 118 186 -30 -64 -149 37 58
6980 58 92 -278 14 -87 166 -68 27 -73 295 -105 141 33 22 25 47 -42 -229 -59 21 195 11 372 128
7003 128 46 218 114 -15 128 -29 12 76 102 30 42 1 146 -120 117 -130 -170 119 89 -245 -29 -304 -64
7026 -64 -33 -131 21 -46 -146 180 -173 188 -40 -180 292 97 -65 302 8 52 59 57 307 -18 -107 19 -79 -249
7050 -249 293 18 162 -24 -3 349 -107 -220 140 -309 88 3 -103 -77 -9 -103 80 -191 0 165 141 225
7072 225 5 9 350 -237 -178 249 -259 199 -124 -284 135 -293 -140 217 -142 205 403 -118 157 339 -108
7093 -108 337 -215 130 164 -181 32 -62 -229 336 -113 -136 211 -40 74 298 -313 243 64 177 398 -301
7114c01L02j25r5O05m28k59M62l63J79L34m02J67p6m36P30o08n0P86m77J2L57
7135C14n04L16J30l91N92o62K33K71o10L25j91Q1L22m74R7J83o10P19J43n12K20
7156hj57J77K58o65J70L93n06P09j89n42N80l53J23L42o93K56L22l98O39m45r2
7177g9k4j08K63j85j86O00l74K33J85p37K38P22q53K72r2j80P71n94j74N29m00
7198a73p5L73l09K68m03J39K80k99K83k7q0L93l10j35L15m41N61j04j070O68J91
7219D5j83L41m17L39j76k03M85j88l90O03j40n05L10p1J73J08l86M56K3k90J13
7240D7J62l55K42j99K52j94q1J91j91q8K89j04L9L8j90L03l8j59Q4j12j02L17
7262A51l06JO4j89Q4K24K9J6k82L14J56k18j37K03k70J31r6N0P3j50K16O1o2Q6
$$ plain form
7114 -301 1 -124 -219 386 -42 -301 161 -202 -23 311 -91 76 0 -436 294 -314 -364 422 -55 -43 314
7135 314 -190 126 256 -135 457 -205 28 299 -311 14 -177 -96 226 -248 -151 32 -578 141 284 -228 -8
7156 -8 -165 12 270 -395 -225 168 -338 371 182 -360 220 -133 -10 332 -361 -105 217 -181 458 13 -79
7177 -79 -103 -211 52 -133 -319 281 -93 140 325 -412 -174 548 -305 -33 -125 -305 466 -128 -302 227 -173
7198 -173 -248 125 -184 84 -319 -180 100 -199 84 57 -23 370 60 -75 240 -201 360 256 -814 -146 45
7219 45 -138 203 -214 125 -51 -254 231 43 -347 256 116 -389 -79 -150 23 131 -255 201 224 -66 47
7240 47 209 -146 96 -103 149 -45 -126 65 -126 -214 75 -29 10 48 -142 161 123 -36 48 -64 -166 151
7262 151 -155 -154 -90 -279 -195 29 58 74 -208 106 262 44 -93 110 -160 -29 -125 -75 -2 -152 64 125 63 149
7286A49k65J42k8J6k7j73J35K33k64Q1J27%k33J70j7J35q7q8M7n0j81Q2j42K66
7310B8m4Q5No0Q6L9j13K8L6r7P2Oj05j39M39l01J2PP6j06Q7o6j35J02K22o6j15
7337a7J31k50K18j8o9P5r1r9k29L02M8O4J83l11O9J27j63j0J72l13j2K08J2j13
7361h6r9K21pk3J90j42o4%K56k18P8j50M5J11Rk3j21j08K89p0j77J42j14K30j30
7386C9J0L4k6k12J30k7J00k66P6J66K72l63J8J38j95M31k16k08K26J09l68R9J93
7409A60k45L18l40K9o2K28k18J39K10j48M1J1j75q4L04k61K12K1k33K2J25n9J82
7432A77r2K6n6N7j94O4P1P5k68K15l3j29k2K07j03j78K16o2J94P6k32k01K92K76
7456C76m90K49j37l70O14k86k20M21o3k36M45k40o9j20L13k30k12L86l06P5m1
$$ plain form
7286 149 -116 26 -2 14 -13 -186 -51 182 -82 -1 126 126 -107 63 46 181 94 6 53 3 -178 -96 -238 28
7310 28 -16 69 74 14 100 139 26 54 90 -7 65 71 -34 -173 266 -35 -23 -16 60 -46 41 -25 -160 -58 164 98 -17
7337 -17 114 -136 82 64 -5 70 -21 -120 -349 -47 1 65 248 -63 6 133 -30 -40 132 -181 -193 15 27 -86
7361 -86 -185 36 29 6 196 54 -10 -10 246 28 106 -44 1 112 121 98 -23 -131 158 88 -89 53 -61 169 39
7386 39 49 83 57 -155 -25 -52 48 -218 -142 24 296 -67 -49 89 -106 325 109 -99 127 236 -132 -33 160
7409 160 -85 233 -107 -78 -140 88 -130 9 219 71 112 123 -52 -136 168 -93 119 140 -93 -71 54 -5 177
7432 177 85 111 55 112 -82 -18 53 128 -140 75 42 -87 -109 98 -5 -183 33 -29 165 241 9 -192 100 376
7456 376 -114 135 -2 -372 242 -44 -264 157 94 -142 303 63 -6 -126 187 -43 -255 131 -175 -100 -141
7477a41R6NK68m85K33j09P7K11k69r1J92O4j70K49k02j6K12j77on4J21J61m21
7500b52NL09k52L11k44r9L81rj62Q9k19m5K20k2K00j49J2O5k22P4J58k51k6Q1
7524d7k88M65l27J15K78j80L56k59n8l7LR6P6l16Q8K21l26L35l26nM77m27k0L44
7548B38k68J08Jj34J02k80J67J51m43M46j71j42K49r4j5K97k11l13K94l98P12
7569B96j89k37M31m01K14j27l03O72j70m48L33j45K29J11m56K29M3l48M71k61
7589e6k87K71lK56M5m16L5J41K3Q0q8m8rk41M07j10j60K94o8m88O62n36M03l2
7613G5m91O33j71l26L29j76J56M7p1K26j86j43Q7l8N9J07l17K84M4m77M12Lq7
7636b1n5J7J00O4l97L65k33J93N9k70M6K74j35J92q4l32M55j21l03K75j47J08
$$ plain form
7477 -141 -45 -40 228 -257 -24 -133 -56 155 -114 -205 -13 51 -119 130 -72 -88 124 -53 -59 -113 8 169 -252
7500 -252 -247 62 -190 121 -123 -222 159 150 -12 77 -142 -187 33 11 211 62 74 139 -83 -9 149 -102 -128 -47
7524 -47 -335 130 -197 -82 196 16 372 113 55 18 21 117 193 -123 -35 186 -140 195 -131 -136 341 -86 -106 238
7548 238 -30 78 79 -55 47 -233 -66 85 -358 88 -83 -225 24 -70 -85 212 1 -312 -18 -416 296
7569 296 107 -130 301 -100 114 -13 -316 356 186 -262 71 -74 155 266 -190 39 82 -266 205 -56
7589 -56 -343 -72 -75 181 226 -190 -155 -14 9 89 1 -47 -56 -297 110 0 -160 134 66 -422 240 -296 107 75
7613 75 -416 217 46 -280 49 -127 29 76 5 231 45 -98 -11 -49 10 117 -200 84 128 -349 63 66 -21
7636 -21 -76 -59 41 105 -292 73 -160 33 92 -178 -132 142 7 199 115 -217 238 117 -186 89 -58 50
7658E0p8j72K92l75K35R0j66l1J14L8J99j02m2mj03k10L26J0J0J26k47R4p7J21
7682I8O5k42K61k22j74L13k35O9K15k44J35r0k4K97l85o6K45k12K75j04M0J48
7704A63l12J42J62k42n8J52q0L4J29k25J66j28J51N4l3m2L3l03J39q4K32k30J11
7727f9O6j60j36L74l9K59k28P9k86J93P2k40L5K06j21k56L80j12l5J41k56J68
7749C5N0k10p5M53k04l34KK50jj50J63J19j07j92J52j23J32l78O16j70k70J61
7771h1L24k01j39l07N16K8l06K43j11N9M7K08o6l84l5L33k05j34J25k7k29L87
7793D5L2R1k65n4L81l04J34j28j1R1j93J53Jj23K1J05p9L3Q4n4q3J86j9K7J28
7818A99k49R8q1j64K61O7j27k42lJ45J76J49k45p6N0K0o9K04j06l4K2N7J41k9
$$ plain form
7658 50 -28 -200 92 -283 -48 42 -124 -155 -41 -3 196 94 52 48 -55 -265 61 71 81 207 -40 54 -23 98
7682 98 163 -79 182 -40 -214 99 -136 -67 148 -96 39 -51 -75 222 -163 -229 16 -196 79 -25 15 163
7704 163 -149 -7 155 -87 -145 7 -73 -39 90 -135 31 -97 54 108 75 33 66 -237 -98 -182 50 -180 -69
7727 -69 -3 -163 -299 75 36 295 67 146 -140 53 125 -115 -80 126 5 -251 129 17 -18 123 -133 35
7749 35 85 -125 -200 253 49 -285 -283 -33 -34 -184 -21 98 -9 -201 -49 -172 -40 -418 198 28 -242 -81
7771 -81 243 42 -97 -404 112 140 -166 77 -34 25 72 280 214 -170 -205 128 -77 -211 -86 -113 -342 45
7793 45 77 168 -97 -151 230 -74 60 -68 -79 12 -181 -28 -27 -150 -129 -24 -103 -70 14 -40 -123 63 44 71 199
7818 199 -50 48 -33 -197 64 131 4 -238 -241 -96 80 229 -16 -92 -42 -22 -91 113 7 -27 -5 52 193 164
7842A64l45l9K41N9j5j24O9J60j26mP8j94J09J3o0J99l67J22K64k82n9L50k36
7865b3J83l4m06M68k68J10pJ1N7k25J62k2m7NK85k49k79K86j24J92J53r8J4j52
7889hQ5j57Q0j33O6J9J34o64M29L31j14K45l68K33o9N7l73K04n6K43j18k8j01
7912f3J13j4L8o2p6K15j80j14J67J04J85n52L98k78k49N64o2P7k14k18K09O1k02
7935a53J24M5j84L74m36L00J24m89L54q2J0r6K01j78J79Lo3O6l16M3L01l40L20
7958A07l52K59J50m66K78o0J13pj76j68L29J27k64J23m9K6j25R4K74Qk84J15k01
7981a49O35l17R1O9m50k54M26l91M15l38J97Q1N30j03k53k38l06J049j299R59
8001C54m60O5O79r20K21K31k06J5k09J72M19l12J84j65k15M11l31R8p0r8J47M2
$$ plain form
7842 164 -181 -220 21 80 65 -59 10 170 44 40 118 -76 33 46 -14 185 -182 -60 204 -78 -137 213 -23
7865 -23 160 126 -280 188 -80 30 23 34 91 -134 28 6 -41 -36 249 0 -279 7 -117 75 228 130 144 -8
7889 -8 77 -80 0 -133 -67 -48 86 -578 -149 182 68 313 -55 178 109 166 -207 -3 -59 184 66 38 -63
7912 -63 50 36 74 12 -64 151 -29 -143 24 128 313 -239 159 -119 -368 196 134 211 -3 -221 -12 49 -153
7935 -153 -29 16 -168 206 -230 70 194 -295 59 -23 -13 -109 92 -86 93 96 33 99 -217 -174 127 -213 107
7958 107 -245 14 164 -302 -24 -84 29 22 -154 -322 7 134 -130 -7 -56 -30 -155 -61 213 221 -63 52 -149
7981 -149 486 169 260 329 -121 -375 51 -340 75 -263 -66 15 545 442 189 -49 -355 694 -605 354
8001 354 -106 -41 638 -282 -61 170 -36 -21 -230 -58 361 49 233 68 -147 264 -67 31 -39 -137 10 52
8023E2k78K41J03j70J31j33OL38l08K9J7k31M20l19j05K33k66M02m22K76k0J33
8045A29l02L49j86k43N58k48j50R0p2m4K2J44j3p8LQ5q7O2j7k07K84k60J76M2
8069C7k40J55J32l23M97m26K11mn7O4j2o3Q9L5j14K08j68P1J4k91K66j75j78N39
8093B67l31J2J92k10L6Q8J8l27K85j32J74l28L28n0j36L54m83M33l90K69R2k13
8115e2l4R2NK25j67j42j45K1L24J57k73j39L33j98m4L19n18L79j02r1O3j2O0N5
8139A16l71J92l9q7J73J00P5R4m17L41j2r3O7k66Q3J97n10K61J50q5J25r3J63
8162A64j27M2J10k58O2N3N0k39OJ38qj20J11J05j21J23J87n78L53L01o17K76o3
8185e0J5J24j17R0J44k26
$$ plain form
8023 52 -226 15 118 -52 79 -54 -48 290 -18 11 28 -203 217 -102 -207 26 -240 162 -260 16 -4 129
8045 129 -173 176 -10 -253 305 57 -93 -3 -75 -119 -97 47 34 -44 -41 44 -43 19 2 -205 79 -181 -5 37
8069 37 -203 -48 84 -239 258 -168 43 39 -18 46 34 -29 60 95 -19 189 21 92 106 -185 81 -94 -272 267
8093 267 -64 -52 140 -70 -34 54 72 -255 30 -102 72 -256 72 22 -114 240 -243 190 -200 69 161 -52
8115 -52 -86 6 11 236 69 -73 -218 -197 127 284 11 -128 205 7 -37 282 -236 143 41 -50 13 1 61 116
8139 116 -255 -63 -102 -189 -16 84 159 253 -164 177 165 72 139 -127 -44 153 -357 -96 54 -31 94 1 164
8162 164 37 79 189 -69 -7 46 96 -143 -137 1 -7 -127 -16 89 -32 91 278 -300 53 354 -263 13 -50
8185 -50 -35 89 -28 62 206 -20
8191b0
$$ Imaginary data points
##PAGE= N=2
##DATA TABLE= (X++(I..I)), XYDATA
0@%%%%%%qJ6j6J9k7L2m0N6p2R1j15J44j76K09k49K97l54M20m92N73o64P68q88
29d76J022j169J333j514J713j931K174k447K743l066L421l805M223m685N193n743
45c014O344p006P724q506R370j0318J1363j2527J3819j5261J6888j8736K0850
58A0990k3304K6192k9640L3844l9102M5884n5004O7968q7914J22689j99743O46034
70E18894q7712r57335P43890n95230O97788K43426j172982N83061j1268k77587
80c15055R29428q35506j10948M66567m68016R19689k46113j047771R01324j17397
90G6202O9074L43472j175616N18884O02100o97493N09172m07811l08837Q49748
100C78895m45590J78577J59465q46472P44113J94071m39294L15377p24295L17797
$$ plain form
0 0 0 0 0 0 0 0 -8 8 -8 11 -16 16 -24 32 -40 51 -64 80 -96 113 -136 161 -193 227 -265 308 -356 412 -476
29 -476 546 -623 710 -804 909 -1022 1152 -1295 1448 -1618 1803 -2002 2221 -2464 2729 -3014
45 -3014 3330 -3676 4048 -4458 4912 -5406 5957 -6570 7249 -8012 8876 -9860 10990
58 10990 -12314 13878 -15762 18082 -21020 24864 -30140 37828 -50086 72603 -127140 518894
70 518894 431182 -526153 217737 -377493 320295 563721 -609261 -26200 -37468 -315055
80 -315055 614373 -221133 -332081 134486 -333530 586159 340046 -707725 193599 76202
90 76202 145276 488748 -686868 -167984 434116 -263377 245795 -162016 -470853 378895
100 378895 -66695 111882 271347 -575125 168988 363059 -76235 239142 -485153 -167356
110a67356P92321q87060J33654J07306l35186P92538m01110l27967N66601n15080
120b41339L09169L44191o34369K72789j77534k6129O45776p03030j15485M48442
130A22481k86152M34130k37302m55604P11474k31866j37547L80818m92381J88244
140c705J54438l25669M05759l01486k63042M92787j88756O2603j7217l39191N60178
151B36699m8078l68460L36675k11675P4290K11086m34545K50560M8031l49145
161b54562L43141p1166j30613J50495k12050K77155Q6844l72870K32593K4542
171G3509l9108J27397l42182J63226K07027l57428J45673M0949j43801J93207
181F8469j52567M3357J96733k58120Q3184J40812r5895M0595j60421P4782J91884
$$ plain form
110 -167356 624965 -262095 -128441 -21135 -356321 436217 35107 -292860 273741 -241339
120 -241339 67830 412021 -222348 50441 -127093 -153222 492554 -210476 -325961 122481
130 122481 -163671 270459 33157 -422447 289027 57161 -80386 300432 -191949 -3705
140 -3705 150733 -174936 230823 -70663 -333705 159082 -29674 32929 15712 -323479 236699
151 236699 188621 -179839 156836 -54839 19451 230537 -204008 46552 94583 -254562
161 -254562 88579 17413 -113200 37295 -174755 102400 189244 -183626 48967 73509
171 73509 34401 161798 -180384 -17158 189869 -167559 -21886 19063 -124738 68469
181 68469 -84098 -40741 155992 -102128 -18944 121868 25973 66568 -93853 -19071 172813
192A72813k68718J13J07070o7385J17068j32736l5834K44979j47424m3356J49932
203I6522p4856J0526m3686j4933J35730j40364q3676J11675J1357K0478j13956
214h5183j5178K19663q1722r8350J08715j3547K2463k9022p7038J12898l7216
225B6483j26228P2799N1845l0096p6945Q315J48782k7955r4233M8776M6408M0902
237H8853o2392q5072J13075O538j33552K7868N5863k3654m6154j2638Q7116L0896
249D6747p5380p427Q2652N0831q6186o1344J04411J5101j08758j0613M0870J5198
261F102l4569n6692O2894P4333o9981m0888R3549N2500p6915m3440P0448K6857
273F4198o5642m9607K3390N8114l7969q6423O1731Q7990o4020m8687P4784N1317
$$ plain form
192 172813 -95905 -95792 11278 -56107 60961 -71775 -107609 137370 -10054 -53410 96522
203 96522 21666 32192 -11494 -26427 109303 -31061 -114737 -3062 8295 28773 -85183
214 -85183 -100361 119302 37580 -60770 47945 34398 56861 27839 -49199 63699 26483
225 26483 -99745 -26946 24899 -5197 -82142 -73827 74955 47000 -47233 1543 47951 88853
237 88853 26461 -58611 54464 61002 -72550 -44682 11181 -12473 -58627 -71265 15851 46747
249 46747 -28633 -36060 46592 97423 11237 -50107 54304 69405 -39353 -49966 -9096 6102
261 6102 -28467 -85159 -22265 52068 -17913 -58801 34748 87248 10333 -33107 37341 64198
273 64198 -1444 -51051 -27661 30453 -7516 -93939 -32208 55782 -8238 -56925 17859 69176
285F9176m1339m5233K5122N2628k7720q6038J3580Q2924m1613q8420N1941P5234
297D0242l6218m3540L4587N9837k84o4116m685P7994j1934j02782Q185P8902l4090
310B098p3398K3567O0614L399m5223o270P8401L1739q3171j5227R1272r804r2696
323c4699j099N3057n988n8426k3222N9687L8254n6528k6719Q3357M5236p8594
335e684k0590Q5254k57o7471j8090K1452L6792m6277p5034P0207N5326p0774j7402
348e2548O1530M2297l6572m1374O2563K8307n5087k9573N680N6908k9832j10713
360i8414P7226O8476q5681N88K8196L2372K9201q2232K9304Q3269o9323l1383
372a8401J4113L0261L220j13573M9076R1871r4004M408J7496J3953Q8823j18588
$$ plain form
285 69176 27837 -17396 7726 60354 32634 -53404 -39824 43100 1487 -86933 -34992 40242
297 40242 4024 -39516 -4929 54908 54624 -9492 -14177 63817 51883 -50899 -42714 36188 2098
310 2098 -71300 -47733 12881 16280 -28943 -35213 43188 74927 -8244 -23471 67801 57997 -34699
323 -34699 -35798 17259 11271 -47155 -70377 -10690 27564 -28964 -55683 27674 72910 -5684
335 -5684 -26274 58980 58723 -8748 -26838 -5386 31406 -14871 -89905 -19698 35628 -35146 -52548
348 -52548 8982 51279 14707 -26667 35896 64203 9116 -20457 -14777 42131 12299 -98414
360 -98414 -21188 47288 -38393 -37805 -9609 22763 51964 -30268 -964 82305 12982 -18401
372 -18401 -4288 25973 29193 -84380 -35304 56567 -37437 -33029 -15533 -1580 87243 -31345
384c1345j4748J53773r1370l7047L8402l5894N9601p9387l8625J29841q0945k4843
396e2587N2762k1223J03106r3670o7581K01471q8153p1424P7434q8054R6650k4383
408B4348j57864J70202k6178r3841J07868o3329O5297J1259j25915J89174l6731
419F4290j33863J26046q2039O4179L3001k44909J88930O3988j89331J35606p4537
430d8639Q766J56463j96184J01887P9469j92042J57195k8587n6316J00818k32394
441a49564J39014J60973k76257J06152l437m9386K48059k39689l1326K36861k03166
452f1766J12959M2043k00848J76347j12913q311K19417k90441K8878J46982j07476
463e5129K03273j97271j37054L66923j59504k9499J03037k57907K26526L1568
$$ plain form
384 -31345 -46093 107680 16310 -20737 17665 -18229 41372 -38015 -76640 53201 -27744 -52587
396 -52587 175 -21048 82058 -11612 -79193 122278 34125 -37299 40135 -47919 48731 24348
408 24348 -133516 36686 10508 -83333 24535 -38794 26503 37762 -88153 101021 64290
419 64290 -69573 56473 -25566 38613 71614 -173295 15635 79623 -109708 25898 -48639
430 -48639 -39873 116590 -79594 22293 101762 -90280 66915 38328 -17988 82830 -149564
441 -149564 -10550 150423 -125834 -19682 -23119 -72505 175554 -64135 -95461 141400 -61766
452 -61766 51193 93236 -107612 68735 -44178 -52489 166928 -123513 -94635 52347 -55129
463 -55129 148144 -49127 -186181 180742 21238 -8261 94776 -163131 63395 94963
473I4963k12994K24245j95605n7167K88462j72031N9445m8073j78560L96257q5752
484A13190k20429J62328j77421J98098J17333l85923J95384M69j38587L13131
494A77573k16299q3741J76088j77349K71497P425l53111K18668m043M4964J27264
505A88936m08076J38523K12548k13808J88435j63542j45295L38791j58225M7904
515B6191J09544l48630K26465J48792j59677R7732k68437O3362L36783k66688
525c4563o890j0018j12834L46246j43484j57016K09957k16876J49726J88403k98017
536h5366R4474n5095m2785L24521k58997j46161J75745p0099K03412r7074k49986
547b07411K72209m8409p259J44030k79593R9748J07264j50326K14183j64972j86173
$$ plain form
473 94963 -118031 106214 -89391 -146558 141904 -30127 29318 -18755 -197315 198942 113190
484 113190 -107239 55089 -122332 75766 193099 -192824 2560 3029 -135558 177573
494 177573 -38726 -122467 53621 -123728 147769 155194 -197917 20751 16708 61672 188936
505 188936 -219140 -80617 131931 -81877 106558 -56984 -202279 136512 -21713 26191
515 26191 135735 -212895 13570 162362 2685 100417 -168020 -104658 232125 -34563
525 -34563 -41453 -51471 -164305 181941 38457 -118559 91398 -125478 24248 212651 -85366
536 -85366 9108 -45987 -88772 235749 -23248 -169409 6336 -63763 139649 42575 -207411
547 -207411 64798 16389 9130 153160 -126433 -26685 80579 -69747 144436 -20536 -206709
558b06709K76650n0905J4216j0284k24034K55190P6044j66929Q3918j28359P4132
569g070J49281k06567R0064j8043j54733K31707n1940r3987Q0895j48407J66023
580C7223J17540k37326O2510K9049R277J08202j90564J6816J07719j19393R6920
591C7973l4813r1932J25335r3043N2919J15129j97927N9774R7596n9624O4085
602G5472j19598j5549J59177j05114k6603J8007m0382R9502o7230k7837J07126
613E6971r9123L1327P5512p5940N0909n1055l1837J38641r1182p4507O8374q946
625a0856M1217n1463n4564J08596j8545k3935K7181l6231N8762k3783m9965R3122
637E9536o0914n5870P3620j9446R244k7603n1663J05505J1015o9700J1335J3138
$$ plain form
558 -206709 69941 19036 33252 22968 -201066 54124 130168 -36761 47157 -81202 -7070
569 -7070 142211 -64356 25708 7665 -147068 84639 32699 -61288 19607 -128800 37223
580 37223 154763 -82563 -20053 8996 18273 126475 -64089 -47273 60446 -58947 37973
591 37973 3160 -88772 36563 -56480 -3561 111568 -86359 -26585 71011 11387 75472
602 75472 -44126 -59675 99502 -5612 -32215 -14208 -54590 44912 -22318 -50155 56971
613 56971 -42152 -10825 64687 -11253 39656 -11399 -43236 95405 4223 -70284 -1910 -10856
625 -10856 30361 -21102 -75666 32930 14385 -9550 17631 -18600 40162 16379 -33586 59536
637 59536 -1378 -57248 16372 -3074 6170 -21433 -73096 32409 43424 -26276 -14941 -1803
649a803N5273k3995o6161O0503j3094l0916L3839l5754J7104m571n0010Q7454
661B7869J0654p9245K4548L3057L4977k0684p0662M6670L0780l2059j2877k8561
673c5533L6573N249n7706N8172J3546n6543L1996J9125J8666p99o7525L8042N4486
686E7749m7149l4401n201L8214O550o0864K5648K7725k5580J7025l974J9169K1685
699C6596o2477K4891N9166n1382l1098J0297K1618J1804n3897l859M6157l509
711D307j3402j0488K8496K8445n1116O844N0259l3240k3337M376Q498K0893m2949
724b2414k4806N5960Q901l6060m482L4422K2401l4485r209L5322k934k2024j5794
737a5202R687K9301l7864l3135N0511J4841l6990j961K7672K1110j5616k3275
$$ plain form
649 -1803 53470 29475 -36686 23817 10723 -20193 13646 -22108 -5004 -9575 -59585 27869
661 27869 38523 -40722 -16174 16883 51860 31176 -39486 7184 37964 5905 -6972 -35533
673 -35533 1040 6289 -51417 6755 20301 -36242 -4246 14879 33545 32746 -34779 3263 57749
686 57749 10600 -23801 -29002 9212 15762 -45102 -19454 8271 -17309 -284 -4258 14911 36596
699 36596 -25881 -990 58176 6794 -24304 -14007 7611 19415 -34482 -38341 7816 4307
711 4307 -9095 -19583 8913 37358 -13758 -6914 43345 10105 -13232 -8856 -358 20535 -22414
724 -22414 -47220 8740 17641 -18419 -22901 11521 33922 -563 -9772 25550 22616 592 -15202
737 -15202 -5515 23786 -14078 -47213 3298 18139 -18851 -20812 6860 27970 12354 -10921
749a0921K1660K4824k4029l3666J7871K8470l4273l0106L2343J7522k0291j1107
761b1703J4879L0139l439l3174J5528L8972k3727l8708J9545K2949k5322k6370
773c0431J0498K2721k200k6946M816M3634j032l8271J5406L8789j7124l1507P732
786c915J9597o161l0041q433L1730O519l7288L57M5242K127l4632R823L1953m519
800B2359k1598r688J6912J5477l7706k0980M2358M590l7023K663K9616J2099k2179
813c100r808L1383J0433k3022j8091J4242K7586l6989l0772M5379J462l0547P463
826a4381O608K5029m292l8454L8542K6435l7567j0759J0185K2315j7468m5354
838c9161L5138J4649l0292P247p888K8857J7882n9863L9070M2579n4879P293O869
$$ plain form
749 -10921 10739 35563 11534 -22132 -4261 24209 -10064 -40170 -7827 9695 -10596 -21703
761 -21703 -6824 23315 19876 -13298 2230 41202 17475 -21233 -1688 21261 -4061 -30431
773 -30431 -19933 2788 588 -26358 -21542 22092 21060 -17211 -1805 36984 19860 -11647 -3915
786 -3915 15682 9521 -20520 -28953 2777 9296 -27992 -27635 17607 19734 -14898 -5075 26878 22359
800 22359 761 -8927 7985 23462 -14244 -35224 7134 11724 -25299 -22636 6980 19079 -3100
813 -3100 -12908 18475 28908 5886 -12205 2037 29623 -7366 -38138 7241 8703 -21844 -14381
826 -14381 -7773 17256 12964 -25490 13052 39487 1920 -8839 1346 23661 6193 -39161
838 -39161 -4023 10626 -19666 -12419 -20307 8550 26432 -33431 5639 48218 -6661 632 7501
851G501N25J7287n9225J1010M7527m1898l069o24J5162L9879o2969J5767O1388
864D8261n5847J5798Q372k8333N0071n6607k0146Q1838n9045k0590L2981j2365
876a5612M8252m4869l0148Q7496l3451j0276J7798m4563O3771k8931n7458R1723
888D3732n5118l7042P0791m1592L4856p445p3222J08397K84o6286L5397l4330
900b1578N0964J3105r8780P0050r472m8398Q1207o0061O127M3460q8443R9790
912C7971K6469j19920O2705j246J0082M7117j27682L5882O9543o7235M7434m7541
924b6421k3150R3363p3630M2221M5947j28166P7554L9845m7330N3866j15103Q161
936e2843J38710r3558j7952J667l3314J15194m8665m7839P0139p4904N7408N6524
$$ plain form
851 7501 8026 25313 -33912 -22902 24625 -17273 -20342 -20966 -5804 34075 -28894 -13127 48261
864 48261 -7586 8212 16584 -11749 38322 -18285 -38431 43407 -15638 -36228 -3247 -15612
876 -15612 32640 -12229 -42377 45119 11668 1392 19190 -25373 38398 9467 -47991 43732
888 43732 -11386 -48428 22363 -19229 15627 8182 -65040 43357 43641 -22645 12752 -21578
900 -21578 29386 42491 -56289 13761 4289 -44109 37098 -22963 -16836 26624 -61819 37971
912 37971 64440 -55480 7225 5979 16061 63178 -64504 -28622 40921 -26314 21120 -26421
924 -26421 -49571 43792 -29838 12383 58330 -69836 7718 47563 233 54099 -61004 -52843
936 -52843 85867 -7691 -25643 -23976 -57290 57904 9239 -38600 31539 -43365 14043 70567
948G0567r2043M4507n4027j2268J47853j09301o5875O4327k8835R4350l3479j16550
960i0774J03370N63k09M6277j01589L7176K5506l9155R5901r0342p4132J08642
972B1234k1157L6072k3615j25733J31021N0996p5711K6669o4978L6832P8800q0691
984a0261K3998k4672n2837J02345k0516k4376k18q0601J16528N4881j18804J9386
996a5147p418L1731P8307j11826j5116N3155l6376N3984k2613n1903L7117l0215
1008c6320N9807L5247j06776K5900L2489J3498M5435j10149r633R8211m2411J17
1020E415j7082m0826O8466j5566q736L2143n9429K6656L8468j2167J9513p2693
1032c5838P349R2271n5780k5371p13j6925P2362l3142m9301N4465j7334Q770K2840
$$ plain form
948 70567 -21476 23031 -30996 -43264 104589 -4712 -70587 -6260 -35095 59255 25776 -90774
960 -90774 12596 13159 12950 59227 -42362 -5186 20320 -18835 77066 -13276 -87408 21234
972 21234 77 36149 12534 -113199 17822 68818 -6893 19776 -45202 -8370 70430 -10261
984 -10261 13737 -10935 -63772 38573 18057 -6319 -6537 -87138 29390 84271 -34533 -15147
996 -15147 -22565 9166 87473 -24353 -39469 13686 -22690 31294 8681 -43222 -6105 -36320
1008 -36320 23487 58734 -48042 -22142 10347 23845 69280 -40869 -50502 47709 5298 5415
1020 5415 -11667 -52493 15973 407 -8329 23814 -35615 -8959 29509 17342 36855 -35838
1032 -35838 -28489 63782 8002 -17369 -18082 -35007 37355 4213 -45088 9377 -7957 813 23653
1045B3653k8666K3460k5700k379N9200n0762k0399J5242j0310N4015m6001n1599
1057f0246P8723p039j5905J3271l2062M4935J225l9525L9319k2951j1417K0523
1069H851k3675L2543k9553l8169P8301j6673l0513K0979k5416N5790L584p5574
1081c9525M6723J0742k0749J6341l9861K2712J1123m0634M9091j2066l0585L5468
1093H780j9248L8587N736q2057N6361L1281m3514J2192l8781J7842M6697n9707
1105b5831J2665J6645k5600L7193j5383O463K0944o0231M4622L4820n6322J1537
1117A522k2362J0679N7431p4633j1206N2070k4638K2238j1009j9243M4853l1117
1129e415O640L6279m6912P442q77m263M5361o2827k1424O7826k3457l0j499k6952
$$ plain form
1045 23653 -5013 18447 -7253 -9632 49568 -1194 -21593 -6351 -16661 37354 -8647 -60246
1057 -60246 18477 11438 -4467 8804 -23258 21677 22902 -16623 22696 -255 -11672 8851
1069 8851 -14824 17719 -11834 -50003 28298 11625 -18888 2091 -23325 32465 36049 -39525
1081 -39525 7198 17940 -2809 13532 -26329 -3617 7506 -33128 15963 3897 -26688 8780
1093 8780 -10468 28119 33855 -48202 8159 39440 -4074 8118 -30663 -12821 33876 -25831
1105 -25831 -13166 3479 -22121 15072 -311 6152 27096 -33135 11487 46307 -10015 1522
1117 1522 -20840 -10161 47270 -27363 -38569 13501 -11137 11101 92 -19151 25702 -5415
1129 -5415 1225 37504 -9408 -1966 -2843 -7106 38255 -24572 -45996 21830 -1627 -1657 -3156 -30108
1143c0108N7102j0193l3841L9223j9802o385J3297j6733K5933l0031k6703N5339
1155A7098j2002j6514N147j8843N0026m41n2400L8456N777j8903J4245k1651J2585
1168B580L983l3939K8368P669k0605L790n878L1904M534m6027K8097J8945k1110
1181B311N572j7952Q294J9514l8041N614K5075j8469l232L773J5025R279k7517
1194a0754Q708K3562j0605p306j2312J0696J7605l4658n913K8841j0922r199L496
1207h761O723J4633j2702r018K3305M829j7361q943J3295R440k4155r475J8876
1220F86Q6r705m950O649J8788q738j6320K0795J3403j8610q335J2341O188j3158
1234h80j2316O740J1426p638j5524R382K1149j0432j4858J6881J3528j2194r416
$$ plain form
1143 -30108 26994 16801 -17040 22183 2381 -4004 9293 -7440 18493 -11538 -38241 17098
1155 17098 5096 -11418 -6271 -25114 24912 24471 -27929 10527 16304 -2599 11646 -10005 2580
1168 2580 6563 -27376 992 8661 -11944 -8154 -14032 17872 22406 -23621 4476 23421 2311
1181 2311 7883 -10069 -1775 17739 -20302 -14688 10387 -8082 -11314 -7541 7484 16763 -10754
1194 -10754 -2046 21516 10911 3605 -8707 1989 19594 -15064 -20977 7864 -3058 -12257 -8761
1207 -8761 -2038 12595 -107 -9125 14180 19009 1648 -7295 6000 15440 -8715 -18190 686
1220 686 772 -8933 -13883 -7234 11554 2816 -13504 7291 20694 2084 -6251 6090 12278 -880
1234 -880 -13196 -6456 4970 -2668 -18192 -8810 12339 1907 -12951 3930 17458 5264 -4152
1247d152N755R427m873j8098Q33J8650o226j9977R741J9910q002j1227Q940J2657
1261A3358j749j2374l234J5235P27k4227k71K0223p194j6380N938J3273K317j0002
1275d360j144J6370N033j5131o210J6438M067k4437k815J8100o565j0687o30O105
1289e866J4852j1877j1666K5370N695j7082j332R165P744j6162j1707J5873q47
1302B160j0534m439J712K1295j1253k0677L1021O799j8535M962j253J0782J92
1315A2232k6977J2723J1309j7000j978p4J4339j772k3629K5778J1584k0562P779
1328C752o039J1873J3171m0602R599K5498k4954J576n62j58J6253k1981Q511K1754
1342A7691k1875N238J644N087J6480m2363M153L8226k9001l593N7r234L5109j9233
$$ plain form
1247 -4152 1603 11030 6157 -11941 -11108 7542 1316 -18661 -8920 10990 2988 -8239 701 13358
1261 13358 11609 -765 -3999 11236 11963 -12264 -12535 7688 494 -15886 -9948 3325 5642 -4360
1275 -4360 -5504 10866 15899 768 -5442 10996 15063 -9374 -12189 5911 -654 -11341 -11971 -5866
1289 -5866 8986 -2891 -14557 10813 16508 -574 -1906 7259 15003 -1159 -12866 3007 2160
1302 2160 -8374 -12813 -11101 10194 -1059 -21736 9285 16084 -2451 2511 1258 12040 12232
1315 12232 -14745 -2022 9287 -7713 -9691 -9765 4574 2802 -20827 4951 16535 -4027 3752
1328 3752 -2287 9586 22757 -17845 -8246 17252 -7702 -6126 -6688 -6846 9407 -12574 -4063 17691
1342 17691 -4184 1054 2698 7785 24265 -18098 -13945 24281 -4720 -8313 -8256 -17490 17619 -1614
1356a614j7069L3473j5926Q9J4546j1278J2449k4035m794M0219k6244j6129N729
1369a0584o980M0167j9080l8308M3575j757o136J8195k7730J2028N935j8804L0631
1382B1152j8658k7826J9092J213K3682j9546m2703M9383J3945j7495Q400l0995
1394b0356K3117K8322l8113J4212m517k6885L1311j052l899q574l1231M4624K2260
1407B9219l2451k979j4385L2718L0732n4809J316J4846j5108L0625j6399k2585
1419a9260J5540j6168K8482J9279m2931j857J0612K8066J6166o0112N88L4973
1431A3378o697J2716l3094j8489M3302j4208M320J3567l9906J5909K2275L479
1443A6552O629m8376O353M6310j3794q381l1328j938N6238k6847j7096J7810k5154
$$ plain form
1356 -1614 -18683 14790 -1136 -1047 13499 2221 14670 -9365 -14159 26060 -184 -16313 -10584
1369 -10584 -17564 22603 3523 -34785 8790 7033 897 19092 -8638 3390 9325 -9479 21152
1382 21152 2494 -25332 -6240 -5027 18655 -891 -43594 5789 19734 2239 10639 -20356
1394 -20356 2761 31083 -7030 7182 2665 -24220 7091 6039 2140 -6434 -37665 6959 29219
1407 29219 -3232 -6211 -20596 12122 42854 -11955 -10639 4207 -10901 19724 3325 -19260
1419 -19260 -3720 -19888 8594 27873 -15058 -16915 -6303 21763 37929 -22183 -21595 13378
1431 13378 6681 19397 -13697 -32186 11116 -3092 1228 14795 -25111 -9202 13073 16552
1443 16552 23181 -25195 -18842 27468 13674 5293 -26035 -27973 28265 1418 -15678 2132 -23022
1456b3022L0139J4228k6207J7626k5458K005M6628k9268j6942p559K336M9020
1468C3526l5756l0993L3835j0044K4687n7m2556M0857m789j7137M0508l6102j1212
1481a5233K1987j6137L1439k4543l7656M9301m156n25M92l8523N3372N316m4311
1494a9177L8457k3667n498L6367m4255K0450O871m5940N0127k945k7574K2632
1506E848k6982L6408J5561o0843L7068L849j6590L2775n3077J4022M0503n6740
1518b8198L1292P139m0510M6131j8907j325L3497n6975K7201L1420l9419K0023
1530A1369l0743L747N6464o1976K305K9633l6191M7126j5963l3968N5915l7542
1542i824L762M5452n5283J3372N809j7382M9930n0050k2724N4046k6224K0646
$$ plain form
1456 -23022 7117 21345 -4862 12764 -12694 -10689 35939 6671 -10271 -17830 -15494 33526
1468 33526 -2230 -33223 612 -9432 15255 15198 -27358 13499 8710 -8427 32081 -4021 -15233
1481 -15233 6754 -9383 22056 -2487 -40143 9158 5002 4477 4969 -33554 19818 25134 -19177
1494 -19177 19280 -4387 -9885 26482 -17773 2677 9548 -36392 13735 10790 -16784 5848
1506 5848 -21134 15274 30835 -30008 7060 10909 -5681 27094 -25983 -11961 28542 -28198
1518 -28198 3094 10233 -30277 15854 -3053 -4378 29119 -27856 -655 30765 -8654 11369
1530 11369 -19374 -15627 40837 -21139 -18834 10799 -25392 21734 5771 -28197 27718 -9824
1542 -9824 -6062 39390 -15893 -2521 3288 -14094 35836 -14214 -36938 17108 -9116 11530
1554A1530p678m3653O6963j4599k7664M5971m6227Q475L3219m1748L2751j9180
1566a840l8864O2456j5178j6786J0767l2934N3230O431n2692L7427j4182j035
1578c200L6345n1513J5984J5784m5125M7912l788l9564K9537j7154K3036K1054
1590B9308n7008K3996J9277j5263K1793l8950M626L6106m2005K0229Q637l8567
1602b7821L3403o700m552L0164m5264R544L8674k6001M583j3807m847L7510l0666
1615e780q377K0603k2064K0127j813j7195L1446k3463n825L8624k3931n256O224
1628C320j2172K7389j5368k5457K4805l581o53P59j3612K3676n164j5094K6658
1641A5506j0179p526R915j2912J6968l232k9474K0975P221j4112J806n742J3228
$$ plain form
1554 11530 3852 -39801 27162 12563 -15101 30870 -15357 -6882 26337 -15411 17340 -1840
1566 -1840 -40704 21752 6574 -10212 555 -32379 20851 27282 -25410 12017 -2165 -3200
1578 -3200 33145 -18368 -2384 13400 -31725 16187 12399 -27165 2372 -14782 8254 29308
1590 29308 -27700 -3704 15573 310 22103 -16847 -12221 23885 -18120 2109 10746 -27821
1602 -27821 5582 -1118 -5670 24494 -20770 -11226 27448 1447 6030 -7777 -12624 24886 -5780
1615 -5780 -14157 6446 -15618 4509 2696 -14499 16947 -6516 -12341 26283 2352 -2904 3320
1628 3320 -8852 18537 3169 -22288 2517 -1064 -1717 -958 -14570 9106 3942 -11152 15506
1641 15506 5327 -2199 7716 -5196 11772 8540 -20934 41 7262 -6850 -5044 -10786 2442
1654B442N672j7471J1612N731n368K175q180J1097J937k3603J1285J0151j3733
1667f253N03k494O469J0356j5741O99J6205l596o445j516P414K471j4256Q75Q773
1682C464m505l642l935O413J0236j2681l548J6797p30r346Q43M888K914p839o563
1697g234O824M444q409o165R393P664r881l250J1979K816o222k456L067N794n410
1712B954j0969N873Q399j0503p149R334N645n687l026N619O982j567p983K639
1726E61J0439o249j2351N769P515q532o537M676N636o30o046J303J1351L54j0954
1741c695L027J0869m691j0772L839N055l553o106j926P330L979j0770L06J4137
1755G029j508q876K857Q233q83q694j650O163P22p337n477Q265O710j2659l34
$$ plain form
1654 2442 8114 -9357 2255 7986 2618 4793 -3387 7710 9647 -13956 -2671 7480 -6253
1667 -6253 -5750 -8244 -1775 8581 -7160 -6461 9744 6148 -297 -1813 5601 8072 -6184 -5309 3464
1682 3464 -1041 -4683 -8618 -2205 8031 -4650 -8198 8599 7869 -1477 -634 4254 7168 -671 -7234
1697 -7234 -410 4034 -4375 -10540 -1147 6517 -3364 -6614 5365 8181 1959 -497 2570 8364 2954
1712 2954 -8015 -2142 6257 -4246 -11395 -2061 3584 -2103 -5129 490 7472 5905 -2078 561
1726 561 11000 4751 -7600 -1831 5684 -2848 -9385 -4709 927 297 -5749 -4446 6905 7259 -3695
1741 -3695 -668 10201 5510 -5262 -1423 3632 79 -6027 -7953 -623 3356 -7414 -7108 7029
1755 7029 5521 -3355 -498 7735 6852 -1842 -3492 2671 3393 -3944 -9421 -1156 5554 -7105 -7439
1770g439J3170j875m682J135K619N944p389p894R932K539j0414m563P319P080
1784E482r915l648J0783J317j178k559j009J1032o262j1430J2200M50j1260n17
1798f514L632O341m978r405R722P797j726o528j941J3986l371j2535R528j471
1812B537p395L417l940O382q04j4279J1381J1930o998o482o69J4239K039j4774
1826c416L172R84j25L129j1402N396L737j5166J3349R187j2744n86N62J2546O543
1841A5166k0367j214J0530K759r00j7029M854J1343j2964R391K245j3708J0675
1854G81n24N392R800k5789K049K0450m022m648j7095L648K2114j3399k495J286
1868b452q346J9417m781n533J4449k3773N666K5381j8057l793q396j390L0154
$$ plain form
1770 -7439 5731 3856 -826 309 2928 8872 1483 -6411 3521 6060 -4354 -8917 -1598 5482
1784 5482 -4433 -8081 2702 4019 2841 282 -727 10305 4043 -7387 4813 5263 -5997 -6514
1798 -6514 -2882 3459 -1519 -10924 -1202 6595 4869 -1659 -3600 10386 7015 -5520 4008 2537
1812 2537 -4858 -1441 -5381 1001 197 -14082 -2701 9229 2231 -4251 -4920 9319 11358 -3416
1826 -3416 -244 740 615 3744 -7658 -2262 1475 -13691 -342 8845 -3899 -4485 -3923 8623 15166
1841 15166 -5201 -6415 4115 6874 5974 -11055 -6201 5142 -7822 1569 3814 -9894 781
1854 781 257 5649 15449 -10340 -8291 12159 8137 3489 -13606 -9958 12156 -1243 -3738 -2452
1868 -2452 -10798 8619 3838 -1695 12754 -11019 -5353 20028 1971 -1822 -10218 -11608 18546
1881A8546j7849j7152J2650k039J8246p137j8074K2341j1726P03K2269k7580K072
1894d730N706j2437L0103j8887k7662L1208j854M155n84k6462K9815M808j7739
1907d560J8247k1886M199J8306k6400K2032q219l1112M0596n841j3165J4593k8221
1920b1431K8403J8402l9855J8477k415n220K4770l3914Q877J5653l3311L1417
1932I853l876k4833L0079k3641J1876K8968m9826J9155J9559k5168K4988k6213
1944i079o761L9305l5455O370J3732k8105L3171j3502j3869L7844l8343R036L2436
1957B6780m0736K0602n026k1475M7860l3926j8210L8059k5673J8620N61l3666
1969b6230M3843j3978j4047L3973l7943J3350J7542l5315L8142k0001l1679N2519
$$ plain form
1881 18546 697 -16455 -3805 -5844 12402 5265 -12809 9532 -2194 -1491 20778 -6802 -4730
1894 -4730 976 -11461 18642 -245 -27907 3301 1447 5602 5018 -21444 8371 13179 -4560
1907 -4560 13687 -8199 -4000 14306 -12094 9938 1719 -29393 11203 5362 -7803 6790 -21431
1920 -21431 6972 25374 -14481 3996 1581 -3639 21131 -12783 -3906 11747 -21564 9853
1932 9853 5977 -18856 11223 -12418 -542 28426 -21400 -2245 17314 -7854 17134 -9079
1944 -9079 -15840 23465 -11990 -5620 8112 -19993 13178 -324 -14193 23651 -14692 -5656 26780
1957 26780 -13956 6646 1620 -19855 28005 -5921 -24131 13928 -11745 6875 7436 -26230
1969 -26230 17613 3635 -10412 23561 -14382 -1032 16510 -18805 19337 -664 -32343 20176
1981B0176k1870n378J6339l8133M1820R516m1900L1151j5657R1L0419m2277J6364
1994F61P783l4478M4838j4144k6573L1472k7698K4300K3380n6954K6374J4332
2006A3293j7925K8829l6128l273L5768l2287J7520P54l3238L6136j1576j848K6684
2019B2709m8354J8547L3474l1877J7378j9045j3067M9334k9843j1795J9014k5741
2031a9266K7095J570k4610K6429k2575L668L4751l2867M553K215j5890M0965k1987
2044D051k9319L2372j3110Q168R516l3506K4358M083j5299K6142j9785o078J7463
2057I056j4818K0082q934l0765L1710j715q684R991k6098J9163J8333k7470J4741
2070D592j001j0713J9865j2691J898N276k2740J8369N906j6091P297j2479J0964
$$ plain form
1981 20176 -1694 -7072 9267 -28866 12954 22470 -19430 11721 -3936 -3845 26574 -15703 661
1994 661 8444 -26034 18804 4660 -21913 9559 -18139 6161 29541 -27413 -1039 13293
2006 13293 -4632 24197 -11931 -15204 20564 -11723 5797 6551 -26687 9449 -2127 -3975 22709
2019 22709 -25645 -7098 26376 -5501 11877 -7168 -20235 29099 -744 -12539 6475 -19266
2031 -19266 7829 9399 -15211 11218 -11357 -7689 27062 -5805 -1252 963 -14927 26038 4051
2044 4051 -25268 7104 -6006 2162 11678 -21828 2530 6613 -8686 17456 -2329 -8407 9056
2057 9056 -5762 14320 5386 -25379 6331 4616 -4068 5923 -20175 -1012 17321 -10149 4592
2070 4592 3591 -7122 12743 52 1950 7226 -15514 2855 8761 -7330 -33 -12512 -1548
2083a548J8256k7223O410J2054j0814J3366q956p305J5688j4722J667J1351j4246
2096f022K240j150K210J2587j6908o26J5279o472M282n189o352J6817r649q205
2110g158J2383p739j950L388l467Q282n365n940J1733M26k953k617j835J1735
2124H923o133j0200R654j864l080J608m774P006J354r226P460N524n203j710Q50
2139A89N863k672p966L441K788j985k726l256P392K135r200M554P117l730j824
2154A20R27K847J521o651k107N557k23o791j124O856N65o065K100N530Q3k210
2170I35j543L682L524o408m209O448M41p399o83M887N03l256r12L759M384k776
2186A377m045N376M127o645l084N137O53n125j919J776K980j618m396L369O825
$$ plain form
2083 -1548 16708 -10515 -4105 7949 -2865 10501 1545 -5760 9928 -4794 -3127 8224 -6022
2096 -6022 -3782 -4932 -2722 9865 -7043 -7669 7610 1138 5420 231 -6121 10696 1047 -7158
2110 -7158 5225 -2514 -4464 -1076 -4543 3739 -1626 -7566 4167 4593 1640 -977 -2812 8923
2124 8923 2790 -7410 2244 380 -2700 -1092 -5866 1140 2494 -6732 728 6252 1049 -661 189
2139 189 6052 3380 -4586 -1145 1643 -342 -3068 -6324 1068 3203 -5997 -1443 5674 1944 120
2154 120 1047 3894 5415 -1236 -3343 2214 1991 -4800 -5924 932 1497 -4568 -2468 3062 3145 935
2170 935 -608 3074 6598 190 -4019 2429 2870 -4529 -5212 -325 178 -3078 -3990 -231 4153 1377
2186 1377 -2668 2708 6835 190 -2894 2243 2896 -2229 -4148 -2372 608 -1010 -5406 -2037 4788
2201D788l695m510N536L924m897k873K184J921j886m715M50N882j994o061M317
2216a629O000l377l101L635L027j583l400p72L774n4o711m83P258k532n932M241
2232a639M219j262j871k98M830J770o327j431N181No507j503N819j587m465K699
2248b367K488J987j529l811P210L926r227l59N201o90l706l554K919K068m023
2263c467j68K161K744j002m405P669L974j0532K369M913k021J93p710J086Q911
2278D715o417l598L629J196K253l909K859N343q552K254N355l847K345r032j12
2293e518J4603j0219o905P861k042O057k450o560R867l498j544O412o278J982
2307A768m147l083J5531j1844r286J2674l678O384q52j5236J6951K550j0850R290
$$ plain form
2201 4788 1093 -3417 2119 6043 1146 -1727 457 2378 492 -4223 -3773 2109 115 -5946 -1629
2216 -1629 4371 994 -2107 1528 4555 2972 -428 -1200 2574 2520 -4191 -4674 2584 52 -5880 -1639
2232 -1639 2580 1318 -553 -851 3979 5749 -578 -2009 3172 3177 -3330 -4833 986 -601 -5066 -2367
2248 -2367 121 2108 579 -3232 3978 7904 -1323 -1682 3519 2829 -877 -4431 -1512 556 -3467
2263 -3467 -3635 -1474 1270 268 -4137 3532 7506 -3026 -657 4256 2235 2428 -5282 -4196 4715
2278 4715 -1702 -5300 -1671 -475 1778 -2131 728 6071 -2481 -227 5128 1281 3626 -5406 -5518
2293 -5518 9085 -1134 -8039 -178 -2220 3837 1387 -5173 4694 1196 -348 6064 -214 1768
2307 1768 -2379 -5462 10069 -1775 -11061 1613 -2065 4319 3467 -11769 5182 7732 -3118 6172
2321F172q091M83O373j0082J0138n314j2802J6613l088m75L343j7336J9317Q351
2335A3602k1161J1679m397k891J5554j8512K590Q495j7141J5370l18j0559J1039
2348C350j2924J1912J3629k6913J1285M944q717J8774k1928m221K4136k1388O515
2361a546P548j9946J8596n276m995K0398k3400M103J7233j6687J3407j1635j1440
2374a3640L1278k1153o245J8397k2035J7650L178k3116K7119j1274r284K5191
2386A6066k0941M838O675j9751K6683j1916j8809K7063j6201O089R803k9781K8479
2399H297K806k5020K6454j5266l235K2531k7841J3392N780k6197K7219p302j1731
2412a0113J8338k3254J8638J4081l5080K2063K42j1768K6634k9355L06K5552k9137
$$ plain form
2321 6172 -1919 -1436 4937 -5145 4993 -321 -13123 3490 402 -73 3270 -14066 5251 13602
2335 13602 -7559 4120 -277 -3168 12386 -6126 -3536 4959 -12182 3188 2870 -7689 3350
2348 3350 -9574 2338 15967 -10946 339 5283 -3434 15340 -6588 -10809 13327 -8061 -1546
2361 -1546 6002 -13944 4652 -624 -5619 14779 -8621 -4518 12715 -3972 9435 -2200 -13640
2374 -13640 17638 -3515 -9760 8637 -13398 4252 7430 -15686 11433 159 -9125 16066
2386 16066 -4875 -37 6638 -13113 13570 1654 -17155 9908 -6293 -204 9599 -20182 8297
2399 8297 11103 -13917 12537 -2729 -5964 16567 -11274 2118 7898 -18299 8920 1618 -10113
2412 -10113 8225 -15029 3609 17690 -17390 4673 4915 -6853 19781 -9574 -9268 16284 -12853
2425a2853J5893L777k5442K5733r819k008K1172l2261J2600J8490k0378J7459
2437A2363j8348q013L6078k6436k507J4359k5668K5848K37k2555K4887j8130P42
2450g143K7791k5339M665J289j2477L2619j9119j8974K2682j4795J4817M688l2022
2463b1318K4901M45j1957K5630k2989m217J9705j5334J7001o908k5726K6215j731
2476C717m016O321k5918K0270J3931k2545J5239j0213o464K5865j7457R34O702
2489F366k3242K1611N799j8600P881j1549J0246J8437k4836M036N430n365J9146
2502A5360j5980p463J6179j5518R790P797k2321R743j07m96J5519j9459k776J6864
2516G132n045O091q919q314J8166p892k639O641j4784Q444M392q503J1342j0577
$$ plain form
2425 -12853 3040 6817 -18625 7108 -2711 -4719 16453 -15808 -3208 15282 -5096 12363
2437 12363 -5985 -13998 22080 -4356 -6863 7496 -18172 7676 7913 -14642 10245 -7885 -7143
2450 -7143 20648 -4691 -26 1263 -11214 21405 2286 -16688 5994 -8801 6016 10704 -21318
2463 -21318 3583 4028 -7929 17701 -5288 -9505 10200 -5134 11867 4959 -20767 5448 3717
2476 3717 -299 6022 -19896 374 14305 -8240 6999 -3214 -9678 16187 -1270 -336 6366
2489 6366 -16876 4735 10534 -8066 -185 -11734 -1488 16949 -7887 -3851 1579 -3786 15360
2502 15360 -620 -8083 8096 -7422 2368 10165 -12156 -2413 -2520 -3016 12503 -6956 -9732 7132
2516 7132 2087 8178 -741 -9055 9111 1219 -1420 5221 -9563 -1119 3273 -5230 6112 -4465
2530d465n418J9008n480l047j67o260J4347k523j1489O069l904L724K321r589
2544f873Q298k195n842J2823l893m843M338m806Q526P30j2840N121L553j896L95
2559E96o442M998K791n729N339k79k328L744m180M944J977j0600M061M707m210
2574f11q17k828K235N068n119j07L506O37k8k769K920K441o729J481K784k547
2590d83l72k865J390N152m649k132N371J342j688j688K372K482l562j357R70N44
2606H27o54m061J453M731l794k762M709J357r23j339R98L248j186l632M68K980
2622B420j373m653J558L660l027j819K144J605N71j539r64M853k15m862J095L645
2638C099j945m216J077K606r56k116K67K279K156k844j301N086%m296Q81K369
$$ plain form
2530 -4465 -9883 9125 3645 598 431 -5829 8518 5995 -5494 575 -3329 395 2716 -6873
2544 -6873 1425 -770 -6612 6211 2318 -2525 1813 -2993 5533 6263 -6577 -1456 2097 201 596
2559 596 -5846 -848 1943 -3786 1553 1274 -1054 2690 -1490 3454 5431 -5169 -1108 3599 -611
2574 -611 -1428 -4256 -2021 3047 -2072 -2179 1327 1964 1936 -833 2087 4528 -2201 -720 2064 -483
2590 -483 -855 -3720 -2330 2822 -1827 -3959 1412 2754 1066 -622 1750 4232 670 -687 283 827
2606 827 173 -3888 -2435 2296 -1498 -4260 449 1806 883 -456 542 3790 2604 -1028 -560 2420
2622 2420 1047 -3606 -2048 1612 -1415 -3234 -1090 515 1086 -453 -1417 3436 3221 -1641 -546 3099
2638 3099 1154 -3062 -1985 621 -335 -2451 -2184 95 2251 -593 -1894 3192 3192 -1104 -223 2146
2654B146r97k697q77J949J315k678j607L979K007l621k06M408j64k619n21J308
2670A125Q87j904l227J968K884l610k084L989J920k646n6K323J409j172k146P40
2686D00K459k093m387K667K563l942j060K474J338j26j234L30L997p74l697J793
2702G08K543k300l805J821K098k654j267Q24J477K034l436l04N961j522l631K879
2718A426O09q19j801j255L334j571k936Q58J731K420l229k402P248j383l394L474
2734B310k158J086O99n324M767L64o266L404J572L90j289l726O934J220n263K562
2750A282j630J803K519q399M085L113q419N520R34l226L734m943L574O515q249
2765a787J373K152o51M115r153J516P178r085L878J261o607Q699m972p49J0200
$$ plain form
2654 2146 1149 -1548 -2425 -476 839 -1839 -3446 533 2540 -1081 -1287 3121 2957 338 -183 1125
2670 1125 2012 108 -3119 -1151 1733 -1877 -3961 28 1948 -698 -754 1569 2978 1806 -340 400
2686 400 2859 766 -3621 -954 1609 -2333 -3393 -919 419 293 -941 -611 3386 2612 -1085 708
2702 708 3251 951 -2854 -1033 1065 -1589 -2856 -2032 -555 1479 -1957 -2261 3700 2178 -1453 1426
2718 1426 2035 1216 -585 -1840 1494 -77 -3013 -2155 -424 1996 -1233 -3635 3613 2230 -1164 2310
2734 2310 152 1238 1937 -3387 1380 1744 -4522 -1118 454 844 -445 -4171 2763 3983 -1280 1282
2750 1282 -348 1455 3974 -4425 -340 2773 -5646 -126 808 -2418 1316 -3627 -53 6462 -1787
2765 -1787 -414 1738 1087 5202 -3951 -2435 4743 -4342 -464 797 -5810 2889 -2083 -2832 7368
2780G368j0598M36Q313n654M357n533m187J2075p947k147M372p117R106j884p452
2795f492J2928q058k752J2803j0134L462R18r922J4073m057j0685J0178n761M275
2809G76K924j2574J2621j118p658J2492r332P31Q274j4417J1829R00j6021J4274
2823C701k943m588R370j4052Q440Q344j4789J0009k400m096J2141j4595M294Q557
2837G393j6706J2139N9j1529J4108j0280J052J5147j8685N635Q485j0285J0887
2850G420r538m323J6700j4578K341N451j3244J4555m230q765J7653j4900R06J5803
2864A1251j5477P144r69j0218J9308j0055r749J2524r556Q620J413j5641J5736
2877D331m122m642J5356j5894L122Q321j2435J5161o012j6146J7966m146j621
$$ plain form
2780 7368 -3230 -2794 5519 -135 4222 -1311 -5498 6577 -1370 -3517 855 -6262 2844 960 -6492
2795 -6492 6436 -1622 -4374 8429 -1705 1757 2675 -7247 6826 2769 -7916 2262 -3499 776
2809 776 3700 -8874 3747 2629 -5029 7463 -1869 -1138 7136 -7281 4548 5448 -10573 3701
2823 3701 758 -3830 5540 -8512 -72 8272 -6517 3492 1092 -3004 9137 -5458 -1164 7393
2837 7393 -9313 2826 2885 -8644 5464 -4816 -3764 11383 -7302 -1667 6818 -3467 7420
2850 7420 -2118 -6441 10259 -4319 -1978 3473 -9771 4784 554 -8211 9442 -5458 -4552 11251
2864 11251 -4226 2918 1949 -8269 11039 984 -8765 3759 -5797 2823 4236 -11405 4331
2877 4331 209 -4433 10923 -4971 -1849 6472 -5963 9198 3186 -12960 5006 860 -761
2890g61N128j7097J3364P049j2552R638q205n87J4538j2832M762J212j5490J8169
2904F336q57j1028P625j1647Q864J3369j8980L445L198k691J3310j1931m237R286
2918D062r161R834O29j4501R252l702K947J1502j9000J291J2394n102P194q962
2932a323p571J5241m478j336J567j0929Q820K146m050O836j2041J183J4167o532
2946A700Q22m204n612J6357l583j0157M341m649N977L837r377L703k145J47J0010
2961G167o666j988J020k721J1818l868j1705O445N0K796J556j0945M120M819l201
2976a303M354l743j967M025j130M801k609q066O413J105m10l11q595N917O067
2991D548o297J083m11n49N023k810M11M70m440M125O24j622o52n102N618M199
$$ plain form
2890 -761 4367 -12730 634 7683 -4869 4769 -3436 -4023 10515 -2317 2445 3657 -11833 6336
2904 6336 5479 -5549 2076 -9571 -707 12662 -6318 -2873 325 -2366 10944 -987 -5224 4062
2918 4062 -5099 4735 5364 -9137 115 -3587 -640 10862 -8138 -6847 5547 445 7639 -1323
2932 -1323 -8894 6347 1869 533 2100 -8829 -9 2137 -1913 4923 -7118 -5935 8232 1700
2946 1700 2522 -1682 -7294 9063 5480 -4677 -336 -4985 992 4829 -4548 -845 -2990 -2843 7167
2961 7167 501 -1487 -467 -3188 8630 4762 -6943 -498 -448 2348 3904 -7041 -2921 1898 -1303
2976 -1303 3051 -692 -2659 1366 236 5037 2428 -5638 775 1880 1470 1159 -7436 -1519 4548
2991 4548 -1749 -666 -1077 -1626 3397 587 998 1468 -2972 1153 1777 155 -497 -5599 19 4218
3007D218p111J145J265L22M304m787m07L653l023Q85L42j584L40k523K544K791
3023B374n311J220J529Q37K650m810m3N982l957o83J011j606J729k448n57L333
3039A250l025qJ219P00K377l790L27N440l615j241J517j955K542k284l034M534
3055I54j136k479J813O40J452j684n16L886j615j340R69j132K416k468l565N046
3071A241n33l648K069J70J296Q8k242K499J184j845n10L96J606j943k870L547
3087E05R2k929J322j43J492Q68l194K213K881k639j118J510M82j016k068J015
3103g27J071j286m71O6J900O20k915J736L056k098j323J237M73l72j557j063J897
3120B44K6k395N52K456l88j856J186K328j024p69K6N49Q42k197j666K593Q6l209
$$ plain form
3007 4218 -2893 -1748 -483 -161 4143 -644 -1051 2602 -421 464 806 -778 -438 -2961 -417 2374
3023 2374 -2937 -1717 -188 649 3299 -1511 -1554 4428 471 -212 799 -807 922 -1526 -2083 1250
3039 1250 -1775 -1783 -564 136 2513 -1277 -950 4490 875 -366 1151 -804 1738 -546 -3580 954
3055 954 -182 -2661 -848 -208 1244 -440 -956 2930 1315 -25 944 -188 2228 -240 -3805 1241
3071 1241 708 -2940 -871 -701 595 683 -1559 940 2124 279 -231 165 1771 -172 -3042 505
3087 505 597 -2332 -1010 -1153 339 1207 -1987 226 3107 468 -650 860 1342 326 -1742 -727
3103 -727 344 -942 -1413 -1347 553 1173 -1742 -6 3050 952 -371 866 1339 967 -590 -1653 244
3120 244 270 -2125 -1573 883 495 -1361 -175 2153 1129 360 386 935 1777 -420 -2086 507 593 -2616
3138b616J230J545k16o66l6J723P98j061j271J712J312k702j574K624l97k263
3154a858N31O58N30J46j575J760J967j916r17K086O19j926j088J134L23j520j63
3171a209q4J652J70k783K494K422k807j57J771o03L85j977k9J762j459j328O75
3188a105J279O98k650J411K983l021N09J229q57J820k922j537M526k201k773K318
3204b93q27J343j044q50L491j441o26J666j049K076k380k454N325k648l717L522
3220I4j697J527Q52m493M670Q71l177K864q13N62L85l854M737j289n012M406j941
3237a308M93K618o853N010L556o356M435m51k074M580m968J312K670n859L449
3252B54J10k092L668o020L209O027q169L589J314l848O770n379k219P626o744
$$ plain form
3138 -2616 -1386 159 -57 -723 -759 964 1762 701 -570 1142 2454 -248 -1822 802 405 -1858
3154 -1858 -1327 -669 -139 7 -1568 192 2159 243 -674 1412 2031 105 -983 151 474 -1046 -1209
3171 -1209 -1293 359 529 -2254 240 2662 -145 -302 1469 866 1251 -726 -755 1007 -452 -1780 -1105
3188 -1105 174 872 -1778 -367 2616 -405 104 1333 476 2296 -626 -2163 2363 162 -2611 -293
3204 -293 -1120 223 -821 -1671 1820 379 -247 1419 370 2446 66 -2388 2937 289 -3428 94
3220 94 -1603 -76 776 -3717 953 1824 -1353 1511 698 1260 1645 -2209 2528 1239 -3773 633 -1308
3237 -1308 -815 1803 -5050 -40 3516 -2840 1595 1144 -930 3650 -1318 -6 2664 -3195 254
3252 254 364 -1728 1940 -4080 -871 5156 -3013 576 1890 -1958 4812 -567 -2786 4840 -1904
3267a904N18L230m830M399k781j211O905o572J092M253m883N667l629m385R865
3282E734o423k910O367o579M227R60o355P886k730k854O667m811K018P11n392
3297c484Q306l978o154P957m817J989K704r861Q504K147p137O922l730n01N772
3312D639o295L479J37o682P125j604k639L333p808O736N071r998M800k38j464
3327a408Q213p894j161N737o212M967J69o471M095k814K924M758j0009K787M325
3342B006j900N798q137k690J0141m731K74R45p368O015R86k156L498p004J258
3357c065P090k530J056n566j046J0857m793l656J087m406P484J035p544L964k639
3372b672J212O743m879j604m66L86Q036m644o062K585k06N562j806q839N382J380
$$ plain form
3267 -1904 -1386 1844 -2986 1413 -1368 -2579 4326 -2246 -1154 3099 -1784 3883 254 -4131 5734
3282 5734 -689 -3599 2768 -3811 416 1376 -4979 2907 177 -2677 3990 -821 1197 1908 -3484
3297 -3484 4822 844 -5310 2647 -2170 -181 2523 -7338 1166 3313 -3824 3098 -632 -1133 4639
3312 4639 -1656 1823 1960 -4722 2403 799 -1840 1493 -6315 421 5492 -4506 294 56 -1408
3327 -1408 6805 -1089 -2250 3487 -2725 2242 2411 -4060 35 -2779 145 4903 -5106 -2319 2006
3342 2006 106 5904 -2233 -4923 5218 487 761 1706 -5662 353 1339 -817 2681 -4323 -3065
3357 -3065 4025 1495 2551 -3015 -4061 6796 2003 -1653 -566 -4972 2512 3547 -3997 -33 -2672
3372 -2672 -1460 5283 404 -1200 -1666 -1280 6756 2112 -3950 -1365 -1571 3991 2185 -6654 -1272 108
3388A08k12M403o495m70M258r57M192m077n729N379J274J738l544p301P074K884
3404B525k383J108n414K865O158m293J377j732l882O522J06k333j778m547O849
3419A148K623n420J47k166M515M949p820J585J472l071N917k456m184K961l150
3434b950L960K346o982J589Q20K537L122p652J341M866l626L764l530l274O211
3449B542m150M19L994o960K584K983j880L492n096M6O422m074O60j064k708O368
3465C578m092k483N283n224J611L464m742M379j579k717O741l188k228K665k784
3480a316M149k350m403N800k830n67L160m818M218R68n268O230j070l423M168
3495B648k991J145J287n461M082K86l431K647k192K415J690n221M297J309m053
$$ plain form
3388 108 -104 4299 -2196 -2666 1592 635 4827 750 -4979 400 1674 3412 -132 -7433 -359 2525
3404 2525 142 1250 -4164 -1299 4859 566 1943 211 -3671 2851 2957 624 -1154 -5701 1148
3419 1148 3771 -1649 -1502 -3668 847 5796 -2024 -439 1033 -2038 3879 1423 -2761 200 -2950
3434 -2950 1010 3356 -3626 -2037 -1217 1320 4442 -3210 -1869 2997 -629 3135 -395 -3669 2542
3449 2542 -1608 -1189 2805 -4155 -1571 1412 -468 3024 -2072 -2026 4396 322 982 -82 -2790 3578
3465 3578 -514 -2997 2286 -2938 -1327 2137 -2605 1774 195 -2522 4219 1031 -1197 1468 -1316
3480 -1316 2833 483 -3920 1880 -950 -1517 1643 -3175 1043 2011 -3257 2973 1903 -1520 2648
3495 2648 -343 802 2089 -3372 710 996 -2435 212 -1980 435 2125 -3096 1201 2510 -1543
3510a543L828k641l81L603n453J850K350m293K082L38k79K385l852J836K795l092
3526d67J465j049p69L536m310j23L609l827Q54J405j971K646j328r36L871k124
3542D82r82J247n43K119l015j236L495k408m16J299j637K502o80k085L710l07
3558A545k141J685l07O14p96k289K108j94j402J65j95J933p09j942L128K52j561
3575a06J237m20J52K77j996N47J221j845p12J236M47m68j038J394J078p62K02
3592D44j91P95M92k478M36J871k002r97J173K9K64o83K05J322O7r12L8J365K1
3611A259k012L60J154j025r30O72m7O59p48o12K409K88j974P66J345n91p29m91
3629b47N08q7r17m84O32J053j205o90K673j50j748J226L61m6oj443Q07N34j665
$$ plain form
3510 -1543 2285 -356 -737 2866 -2587 -737 1613 -2680 -598 -260 -539 1846 -2006 -170 2625 -467
3526 -467 998 -51 -820 2716 -1594 -1717 1892 -1935 -1081 324 -1647 999 -329 -1265 2606 482
3542 482 -500 747 204 2323 -692 -1928 1567 -841 -1257 42 -1595 907 227 -1858 1852 1545
3558 1545 -596 1089 782 1396 600 -1689 419 225 -1177 -1012 -1207 726 17 -1925 1203 1455 -106
3575 -106 1131 711 863 1140 -856 -309 912 -933 -1645 -409 38 -430 -1468 -74 1004 242 444
3592 444 253 1048 1540 -938 -502 1369 -633 -1630 -457 -428 -164 -847 -642 680 747 -165 -127 1238 1259
3611 1259 -753 -393 761 -264 -1194 -522 -569 90 -658 -1270 1139 1427 -547 219 1564 973 244 -247
3629 -247 261 174 -743 -1227 -595 458 -747 -1437 1236 1086 -662 564 925 879 873 -570 237 771 -894
3648h94p67J127O49q28r90J984O33j316Q14MN43N83k559R83J548k618m5J054m26
3667e21J10j321J014J913j363r6N74P48Q85k729Q78J709k866M47Q25j253J289
3684B43j320o72L251j396j235J921q8J147j772o32K201j843m85O40j504K589j521
3701d76j899M227j857j572L357j462N99k8k263K927p24k274J151o50J435o32k309
3718b450L854q93j882K984j883Q12J437l409K624P52m176K243l83j87P45k483
3734b295K424R16k229J666q10Q56K226m181K132J572m127K308J40k508K425k770
3750b255J171K986l274L40J476K46J676l369M31L048k905J326j104k124L376k104
3766a059m57L198l753R20K812j302J208k358l46M036k203m82j203q12L846k307
$$ plain form
3648 -894 -1661 -534 115 -713 -1703 281 914 -402 412 416 959 1542 -1017 -34 1514 -1104 -1149 -95 -521
3667 -521 -411 -1732 -718 1195 -168 -264 310 1058 1943 -786 92 1801 -1065 -618 207 -1046 243
3684 243 -1077 -1749 1502 106 -1129 792 704 1851 79 -553 1648 -195 -680 -40 -1544 1045 -476
3701 -476 -2375 1852 -5 -1577 1780 318 917 889 -1374 1553 829 -1445 -294 -944 491 -141 -2450
3718 -2450 1404 511 -1371 1613 -270 542 1979 -1430 1194 1946 -2230 13 -370 -557 188 -2295
3734 -2295 129 1045 -1184 482 -328 528 2754 -1427 705 2277 -1850 458 598 -1910 515 -2255
3750 -2255 -1084 1902 -1372 -1032 444 690 2366 -1003 -572 2476 -429 897 -207 -2331 1045 -1059
3766 -1059 -1516 1682 -2071 -1151 1661 359 1567 -791 -1137 2899 696 214 -989 -1801 2045 -262
3782b62j590K515k991K151K465l029J171j120l25M888k863k852P48Q07L263k930
3798D6l298K951n23J903J069m973K821N73j111M687m628k713L941l18K044l057
3814e86m654N395R41m82j94m380M649K142l142K993l959j342O163l030r8j103
3830f87m684O904J700n174O61k156M671L456o363K093j303l88O187n186j465K488
3846G54m664O442Q64p871L420j16J931M248q037J034M314k330L963m771k421N759
3862B519m127L063Q75q113N916J395k424N044p891O03Q291n033J075j345m126
3877d278Q031l112k563L324n582M570K468n730N207m334p13Q828o517r54K929
3892A574m944O967j686o949O552k918P08L550o485M065N64l570P318m818k357
$$ plain form
3782 -262 -1852 663 -2328 -177 2288 -741 430 -690 -1015 3873 1010 -1842 -1094 -287 2976 46
3798 46 -3252 -301 -824 1079 2148 -2825 -4 569 -542 4145 -483 -3196 745 427 2471 -586
3814 -586 -5240 155 1096 614 420 -3960 689 2831 -311 2682 -1277 -2619 3544 514 416 -687
3830 -687 -5371 1533 3233 -1941 -1280 -3436 1235 4691 -1672 421 -882 -1270 4917 -269 -1734 754
3846 754 -3910 2532 3396 -4475 -1055 -1171 760 5008 -3029 -1995 2319 -11 3952 -819 -3240 2519
3862 2519 -1608 1455 2330 -5783 133 1528 -896 4148 -3743 -3140 5151 118 1193 -152 -4278
3877 -4278 3753 641 -1922 1402 -4180 390 2858 -2872 2335 -1999 -2712 6116 -401 -1355 1574
3892 1574 -3370 3597 1911 -5038 1514 -1404 -696 2854 -3631 434 998 -2572 4746 -72 -2429
3907b429N542m935L653J016q654P195r8m297N430n680K356M409o233M245K08m171
3923b443N869l924J88L604p734N150J813o576N502k496q64O113o941J854M541
3938C656n567L670j113k241N020n307P21L700n855L736k2l332O359m875p55O475
3954D270n671J402K148m391M968k667l057N221l526M09K130m029M108j038k607
3969b330N587l748p25M009m385L186l13n279N609j017k826L130k500J705J476
3984A579m007L609l48k073L580k767J106J071m500L936K00m025L153j676R7L033
4000A968l816J394K323k062J429o57o37J618k499J120J082k826J456k66q23K460
4016A264k714L2L453k056Q4R67j233J471j044j044J751j235m84L13k06J033j281
$$ plain form
3907 -2429 3113 -1822 1831 2847 -5807 1388 1290 -3007 2423 -3257 -901 3508 -2725 1520 1728 -2443
3923 -2443 3426 -498 -310 3294 -4440 710 2523 -4053 1449 -1047 -1911 4202 -2739 -885 3656
3938 3656 -1911 1759 646 -1595 3425 -1882 -1161 2539 -3316 420 398 -2934 3425 -1450 -2205 4270
3954 4270 -1401 1 2149 -2242 2726 59 -2998 2223 -1303 -894 1236 -2793 1315 277 -2330
3969 -2330 3257 -491 -1216 2793 -1592 1594 1281 -3998 1611 594 -2232 898 -1602 103 1579
3984 1579 -2428 1181 833 -1240 2340 -427 679 1750 -2750 1186 1386 -2639 514 -1162 -1065 1968
4000 1968 -1848 -454 1869 -193 1236 579 -58 1560 -939 181 1263 -1563 -107 -373 -1196 1264
4016 1264 -1450 -1418 2035 -21 63 1030 -203 1268 224 -820 931 -304 -788 -475 -681 352 -929
4033i29k64K573j326k83R01p34J278k78k057J679K56j816O49j1L10m08o47J527
4051D20q5n16L34q8J095o48j498J664N2j634K64K25p6M40k40k60J108q1n93N45
4071D28O26o18p01P03J14q67o8n95N10O99j351M91J551o73q40J296L33l86k30
4090D22m64N32j58q84n55J017L6j177K45J661n84k69P48n8L39l89p10Q46J48j533
4110g87J89O60k94o19N5P43J69q3j98J50J099m59j220J579L3j693N16r7jn4m71
4131g83K68R10n37m55O15J318q53q95J154k91r83L80m78N95K84j708R36J214q95
$$ plain form
4033 -929 -1193 1380 54 -229 672 -62 1216 938 -1119 560 816 -1000 -351 -362 -52 -460 -1107 420
4051 420 335 -181 153 65 1160 512 -986 678 730 -904 -640 -415 -491 -51 -291 -551 557 476 -117 428
4071 428 1054 436 -265 438 552 -315 -383 -978 -468 231 -1120 -629 922 249 -591 705 1038 652 422
4090 422 -42 490 332 -552 -1107 -90 -54 -1231 -986 675 91 -178 570 512 851 462 -248 598 746 -787
4110 -787 -598 62 -232 -851 -796 -53 116 33 -165 -15 1084 625 -595 984 1017 -676 -160 -257 -258 -312 -783
4131 -783 -515 395 -142 -597 18 1336 483 -412 742 451 -532 -152 -630 -35 249 -1459 -523 691 -204
$$ [...]
8191F
##END NTUPLES=NMR FID
##END=
