##TITLE=1H_LR-721-KuB
 CDCl3, 8 sc, 
 29.9.2020
##JCAMPDX= 6.0         $$ Bruker NMR JCAMP-DX V2.0
##DATA TYPE= NMR FID
##DATA CLASS= NTUPLES
##ORIGIN= UXNMR, Bruker Analytische Messtechnik GmbH
##OWNER= root
$$ XWIN-NMR		Version 3.5
$$ Tue Sep 29 11:37:44 2020 Russian Standard Time (UT+4h)  she@DPX200
##.OBSERVE FREQUENCY= 200.1315066352
##.OBSERVE NUCLEUS= ^1H
##.DELAY= (6, 6)
##.ACQUISITION MODE= SIMULTANEOUS
##.ACQUISITION SCHEME= undefined
##.AVERAGES= 8
##.DIGITISER RES= 18
##SPECTROMETER/DATA SYSTEM= spect
##.PULSE SEQUENCE= zg30
##.SOLVENT NAME= CDCl3
##.SHIFT REFERENCE= (INTERNAL, CDCl3, 0, 15.7039)
##AUDIT TRAIL= $$ (NUMBER, WHEN, WHO, WHERE, WHAT)
$$ ##TITLE= Audit trail, XWIN-NMR		Version 3.5
$$ ##JCAMPDX= 5.01
$$ ##ORIGIN= Bruker BioSpin GmbH
$$ ##OWNER= she
$$ F:/spectra/data/she/nmr/H-F/1/audita.txt
$$ ##AUDIT TRAIL=  $$ (NUMBER, WHEN, WHO, WHERE, WHAT)
(   1,<2020-09-29 11:36:41.25 +0400>,<she>,<DPX200>,
      <created by zg, POWCHK disabled, PULCHK disabled
       configuration hash MD5:
       00 E9 B6 7A A2 85 ED C7 34 08 36 98 17 FE 4E 26
       data hash MD5: 16K
       75 B3 1E 01 F0 89 EC 76 47 2D CB C6 47 68 57 AC>)
$$ ##END=
$$ 
$$ hash MD5
$$ 83 99 0B DF FF 27 BB 20 84 E3 B9 43 BC E6 07 82
##$RELAX= 
##$RELAX= 
##$RELAX= 
##$RELAX= 
##$RELAX= 
##$RELAX= 
$$ Bruker specific parameters
$$ --------------------------
##$DU= <F:/spectra>
##$EXPNO= 1
##$NAME= <H-F>
##$PROCNO= 1
##$TYPE= <nmr>
##$USER= <she>
##$AMP= (0..31)
100 100 100 100 100 100 100 100 100 100 100 100 100 100 100 100 100 100 
100 100 100 100 100 100 100 100 100 100 100 100 100 100 
##$AQSEQ= 0
##$AQ_mod= 1
##$AUNM= <au_zg>
##$AUTOPOS= <>
##$BF1= 200.13
##$BF2= 200.13
##$BF3= 200.13
##$BF4= 200.13
##$BF5= 200.13
##$BF6= 200.13
##$BF7= 200.13
##$BF8= 200.13
##$BYTORDA= 1
##$CFDGTYP= 0
##$CFRGTYP= 5
##$CHEMSTR= <none>
##$CNST= (0..31)
1 1 145 1 1 1 1 1 1 1 1 1 1 1 1 1 1 1 1 1 1 1 1 1 1 1 1 1 1 1 1 1 
##$CPDPRG= <>
##$CPDPRG1= <>
##$CPDPRG2= <>
##$CPDPRG3= <>
##$CPDPRG4= <mlev>
##$CPDPRG5= <mlev>
##$CPDPRG6= <mlev>
##$CPDPRG7= <mlev>
##$CPDPRG8= <mlev>
##$CPDPRGB= <>
##$CPDPRGT= <>
##$D= (0..31)
0 1.2 0 0 0 0 0 0 0 0.06 0 0.03 0 0 0 0 0.0002 0 0 0 0 0 0 0 0 0 0 0 0 
0 0 0 
##$DATE= 1601365000
##$DBL= (0..7)
120 120 120 120 120 120 120 120 
##$DBP= (0..7)
150 150 150 150 150 150 150 150 
##$DBP07= 0
##$DBPNAM0= <>
##$DBPNAM1= <>
##$DBPNAM2= <>
##$DBPNAM3= <>
##$DBPNAM4= <>
##$DBPNAM5= <>
##$DBPNAM6= <>
##$DBPNAM7= <>
##$DBPOAL= (0..7)
0.5 0.5 0.5 0.5 0.5 0.5 0.5 0.5 
##$DBPOFFS= (0..7)
0 0 0 0 0 0 0 0 
##$DE= 6
##$DECBNUC= <off>
##$DECIM= 32
##$DECNUC= <off>
##$DECSTAT= 4
##$DIGMOD= 1
##$DIGTYP= 9
##$DL= (0..7)
0 120 120 120 120 120 120 120 
##$DP= (0..7)
150 150 150 150 150 150 150 150 
##$DP07= 0
##$DPNAME0= <>
##$DPNAME1= <>
##$DPNAME2= <>
##$DPNAME3= <>
##$DPNAME4= <>
##$DPNAME5= <>
##$DPNAME6= <>
##$DPNAME7= <>
##$DPOAL= (0..7)
0.5 0.5 0.5 0.5 0.5 0.5 0.5 0.5 
##$DPOFFS= (0..7)
0 0 0 0 0 0 0 0 
##$DQDMODE= 0
##$DR= 18
##$DS= 0
##$DSLIST= <SSSSSSSSSSSSSSS>
$$ [...]
##$SUBNAM2= <"">
##$SUBNAM3= <"">
##$SUBNAM4= <"">
##$SUBNAM5= <"">
##$SUBNAM6= <"">
##$SUBNAM7= <"">
##$SUBNAM8= <"">
##$SUBNAM9= <"">
##$SW= 16.880792210976
##$SWIBOX= (0..15)
0 0 2 0 0 0 0 0 0 0 0 0 0 0 0 0 
##$SW_h= 3378.37837837838
##$TD= 16384
##$TD0= 1
##$TE= 0
##$TE2= 300
##$TE3= 300
##$TEG= 300
##$TL= (0..7)
0 120 120 120 120 120 120 120 
##$TP= (0..7)
150 150 150 150 150 150 150 150 
##$TP07= 0
##$TPNAME0= <>
##$TPNAME1= <>
##$TPNAME2= <>
##$TPNAME3= <>
##$TPNAME4= <>
##$TPNAME5= <>
##$TPNAME6= <>
##$TPNAME7= <>
##$TPOAL= (0..7)
0.5 0.5 0.5 0.5 0.5 0.5 0.5 0.5 
##$TPOFFS= (0..7)
0 0 0 0 0 0 0 0 
##$TUNHIN= 0
##$TUNHOUT= 0
##$TUNXOUT= 0
##$USERA1= <user>
##$USERA2= <user>
##$USERA3= <user>
##$USERA4= <user>
##$USERA5= <user>
##$V9= 5
##$VALIST= <valist>
##$VCLIST= <CCCCCCCCCCCCCCC>
##$VD= 0
##$VDLIST= <DDDDDDDDDDDDDDD>
##$VPLIST= <PPPPPPPPPPPPPPP>
##$VTLIST= <TTTTTTTTTTTTTTT>
##$WBST= 1024
##$WBSW= 4
##$XGAIN= (0..3)
0 0 0 0 
##$XL= 0
##$YL= 0
##$YMAX_a= 653800
##$YMIN_a= -545378
##$ZGOPTNS= <>
##$ZL1= 120
##$ZL2= 120
##$ZL3= 120
##$ZL4= 120
##$ABSF1= 10
##$ABSF2= 0
##$ABSG= 5
##$ABSL= 3
##$ALPHA= 0
##$AQORDER= 0
##$ASSFAC= 0
##$ASSFACI= 0
##$ASSFACX= 0
##$ASSWID= 0
##$AUNMP= <proc_1d>
##$AZFE= 0.1
##$AZFW= 0.1
##$BCFW= 1
##$BC_mod= 2
##$BYTORDP= 1
##$COROFFS= 0
##$CY= 11.3945322036743
##$DATMOD= 1
##$DC= 2
##$DFILT= <>
##$DTYPP= 0
##$F1P= 16.9975609425685
##$F2P= -3.02152046262296
##$FCOR= 0.5
##$FTSIZE= 0
##$FT_mod= 4
##$GAMMA= 1
##$GB= 0.15
##$INTBC= 1
##$INTSCL= 1
##$ISEN= 128
##$LB= 0.24
##$LEV0= 0
##$LPBIN= 0
##$MAXI= 10000
##$MC2= 0
##$MEAN= 0
##$ME_mod= 0
##$MI= 1.114404
##$NCOEF= 0
##$NC_proc= 0
##$NLEV= 6
##$NOISF1= 3.799351
##$NOISF2= 2.8
##$NSP= 1
##$NTH_PI= 0
##$NZP= 0
##$OFFSET= 15.70392
##$PC= 1
##$PHC0= -9960.07
##$PHC1= 0.6008911
##$PH_mod= 1
##$PKNL= yes
##$PPARMOD= 0
##$PSCAL= 0
##$PSIGN= 0
##$REVERSE= no
##$SF= 200.130013532006
##$SI= 16384
##$SIGF1= 3
##$SIGF2= 2
##$SINO= 400
##$SIOLD= 16384
##$SREGLST= <1H.CDCl3>
##$SSB= 0
##$STSI= 0
##$STSR= 0
##$SW_p= 3612.71676300578
##$SYMM= 0
##$S_DEV= 0
##$TDeff= 0
##$TDoff= 0
##$TI= <>
##$TILT= no
##$TM1= 0
##$TM2= 0
##$TOPLEV= 0
##$USERP1= <user>
##$USERP2= <user>
##$USERP3= <user>
##$USERP4= <user>
##$USERP5= <user>
##$WDW= 1
##$XDIM= 8192
##$YMAX_p= 0
##$YMIN_p= 0
$$ End of Bruker specific parameters
$$ ---------------------------------
##NTUPLES= NMR FID
##VAR_NAME=  TIME,          FID/REAL,        FID/IMAG
##SYMBOL=    X,             R,               I
##VAR_TYPE=  INDEPENDENT,   DEPENDENT,       DEPENDENT
##VAR_FORM=  AFFN,          ASDF,            ASDF
##VAR_DIM=   8192,          8192,            8192
##UNITS=     SECONDS,       ARBITRARY UNITS, ARBITRARY UNITS
##FACTOR=    0.000296,      1,               1
##FIRST=     0,             0,               0
##LAST=      2.424536,      0,               0
##MIN=       0,             -545378,         0
##MAX=       2.424536,      653800,          0
$$ Real data points
##PAGE= N=1
##DATA TABLE= (X++(R..R)), XYDATA
$$ [...]
1926B080m349L955j616k728M464k592P89J425m433L679K91j922L219m063J078
1941g23L278m231L004k50l745M732j879j159L429m283J567J738k704K350j547
1956d23n55L280l325R98J162l268M153j289k643L970k697M14K526l959J732R12
1972I88k534L308k288p60J980j582J570j37k909L267j023l46K512m014J676K107
1988A815k647J878j220j917L707j827k46Q19k088J743M48j175J357j753R66J530
2004A390k355J428k74j450K636j224j600K174j501P96R71k404J317K10n41J227
2020H00j334N23M80q61J588j026j179K192j401L22R81k180J248Q63j563J127p34
2037a54l19J242r87N05j90p16J259p23J57N37j339R36P48j601J235n37q62J586
$$ y = [2080, -2269, 1686, 70, -2658, 1806, -786, 3, 1428, -3005, 674, 965, -957, 2262, -1801, -723, 2555, -1676, 1328, 1078, -2667, 2065, 186, -973, 2456, -1827, -260, 1478, -1226, 1124, -423, -978, 2302, -1023, -25, 1137, -2131, 2022, 733, -1910, 2060, -637, -223, 2303, -1656, 76, 988, -1546, 1762, -526, -1286, 694, -888, 682, 545, -2364, 903, -120, -466, 2046, -1968, -292, 1815, -832, 1046, -174, -2091, 1616, -211, -457, 362, -1726, 17, 465, -710, 647, -1106, -140, 1390, -965, 463, 189, -1261, 1375, 151, -1449, 725, -776, 20, 991, -1413, -96, 114, -427, 800, -534, -11, 469, -392, 1196, 170, -1009, 1183, -218, 104, 1085, -1095, 153, 1016, -547, 580, -154, -473, 769, -218, 287, 97, -619, 640, -83, 74, 611, -728, 208, 956, -645, 590, 53, -809, 777]
2055G77p73q12Q64k56qM56n83J69l11L36M02p04O13k53k20J313j270m58J605j233
2075c46L17L66q40M59P4p14R08p37J26K01r8P74q14K22R99r62M46J31j084J030
2095D58J51j120P63l18j54N01l65Q2J60N7j05o1K9J38k13M07j45l24N02j3l21
2116A09K66k13m35K83j33m29Q81k58k62m20Q45k84l99R71o38p4L67j22k71J39
2136g7k02m8L27k03j47K30k6k27K24N4k38j5K96n4J68K74n15M10M8n24K34K48
2158B37j67q3p6J9q3L66k27k81K04M6J41K1l8J22J56lk29J64l4j6L7k43j64K24
2182I3M7k15%J11o2M0L81k67k27K93j39k80M06k6j90K84j66k59K61O8l46m4J8
2205b19Jl4M0k05K68k9j84L60M3k92K60L30m66q5K34k5j65J1n1k76N61r9n23M80
$$ y = [777, 4, -808, 56, -200, -208, 248, -335, -166, -477, -141, 261, -443, 170, -83, -303, 1010, -260, -718, 887, -346, -29, 337, -503, -44, 30, -684, 224, -513, -387, -186, -284, 490, -324, -102, 897, -65, 381, 512, -572, 458, 609, -511, 252, -66, -220, 281, -84, -2, 158, 215, 110, 49, 78, 216, 3, 410, 265, -59, 443, 430, 109, 375, 162, -273, 10, -123, -552, 329, 71, -191, -611, 234, -50, -449, 522, -116, -190, 177, 55, -216, -77, -279, -327, 0, -203, -350, -120, -146, -373, -149, -95, -333, -348, -52, -106, 62, 336, -179, 231, 279, -245, -11, 237, 70, -13, -89, -70, -153, 213, -14, -295, -91, -45, 96, 117, 79, 201, 357, 354, 125, 289, 255, 239, 276, 33, -131, 93, 140, -75, -75, 36, -26, 14, 395, 128, -99, 194, 55, -225, 181, 155, -35, 249, 83, -176, 85, 153, -193, -237, -219, -218, -252, -212, -417, -149, -178, -362, -2, 41, -251, 9, 339, -127, -212, 22, -3, -168, -157, -208, -484, 77, -22, -545, -65]
2229f5J15k42L48Q1m23N18k27k00M14J15n58K63L81o27K18P5k00j89L77l31J28
2250b9M00m69j73O30k76N3M75n65p8M82o1m78K98r1l59L9M61o08J40N48n79mM52
2273B08n03L66M18o54J64M49o23J5L17k61K59j07j83m35N66N3j36k04K9l52O87
2294G3k42j48N10k06j58N32o5k60J34j62r3J39L39n02l21L24J47k77M66n73J81
2315a62M65l41J22O05q28K67M32m57K8L0k26J58ko5l06K74K37n83L71K52o56P02
2337C17K20q96O35J79o64M50k84J0J57K8q0j71L7qk80P75l24q37R90l90j88O92
2359C68m26l67R00p15M2M69n60K68l1j59J36l08L69k96L0M33m28J96M45r35K89
2380b80R50j065L73M41p40O68K00p66M65j88J99k00k44O80r67L73N15r19Q05K47
$$ y = [-65, 50, -192, 156, 237, -186, 332, 105, -95, 319, 434, -124, 139, 520, -107, 111, 186, -14, -203, 174, -157, -29, 371, -98, -271, 359, 83, 136, 611, 46, -32, 450, 389, -89, 209, 118, -241, -202, 259, -349, -209, 339, -240, -244, 208, -295, 71, 489, -165, -1, 448, -175, -160, 157, -104, 155, 48, -135, -570, -4, 49, -87, -291, -262, -614, 73, -169, -317, 193, -13, -171, 361, 296, 36, 170, 8, -85, 54, 393, -109, -430, -106, 41, -236, 230, -343, -162, 303, -38, 84, 689, -139, 128, 560, 103, 131, 161, -65, 93, 91, 26, -280, -6, 231, -352, 19, 271, -385, 317, 537, -359, 276, 455, -209, 241, -43, -33, 124, 152, 72, -99, -62, -70, -350, 425, 101, -736, 254, -136, -324, 368, -58, -425, 475, -240, -198, 271, -289, -21, -52, -211, -75, -383, -14, -310, -280, 153, -275, -79, 366, -569, -280, 670, -395, -22, 419, -321, 347, 547, -219, 246, 58, 257, 57, -187, 493, -474, -101, 414, -505, 300, 547]
2400E47q97R03m61j97J039r07j76N29k85P9K18o22M01m16K33M12j035Q33j93p95
2420g90J388p45m11J287j297O00Q22j322L99J07l30M69n45L29J9n97O61l26k88
2439e70J148j065J86N52r59R12N40j561J256l37o69J135o17j48L79p86P15m5n49
2458d83Q31o86N28O94j273P55k11n74J450p71r16J441r93J53Q48j090L95k02k45
2477c49O59l99l25P23p17J132m74p13J371j156M08O64j484M87Q98j130M53m2q26
2496h20J362o87K38j34p63J138q9n75O94j115N40Q89j129L53N0o58J382m90r11
2515g25P83o65N56O01j026L35R5K8N09j183K92K54j19O52k47r85J363m83J5N71
2535F21j379M85O08l36O6l4m11P61p4k05j27m52Q03k01j87P48p54L53L06p43L68
$$ y = [547, -350, 553, 92, -105, 934, 27, -149, 380, 95, 174, 392, -230, 171, -245, -12, 400, -635, 198, 5, -790, 598, -147, -558, 729, -568, 32, 854, -468, -69, 38, -292, 177, -368, -39, -20, -617, 44, -282, -570, 578, -487, -301, 251, -708, 204, 744, -817, 439, 102, -567, 568, -49, -197, 182, -604, 111, 66, -483, 348, -338, 190, 884, -389, 366, 155, -419, 1031, 260, -656, 785, -208, -55, 793, -297, 98, -104, -349, 310, -89, -414, 309, -408, 724, 250, -463, 908, -248, 160, 824, -660, -173, 725, -405, 48, 6, -820, 542, -145, 93, -41, -804, 334, 245, -330, 364, -751, -211, 678, -451, -98, -48, -706, 676, 186, -725, 58, -607, -51, 550, -476, -141, -46, -18, 491, -692, -400, -146, -265, 387, 140, -845, 518, 35, 50, 621, -758, -273, 335, -1, 65, 31, -380, 381, 307, 102, -25, -477, 326, 125, -62, 686, -68, 285, 591, -152, 216]
2556B16On90P26k66m77M87j54M7J27k69J48J03j96N45n01j68M05n64Q77p28k49
2577d75M72N6k67L14m07j8L12j04K59l50n2M56J43l63K02k88J54L5l15L37l66
2598b65J42K63m05J43K63m41M93p8j70J88q8P0n8j13k8M6J1J60k10J81mm05O04
2621B99j92k19K92k84J06J85o5n2j18K45j50M5J1k64K54r7J87j90J40m39J70J50
2643A4j47nK11m06L04j71M8L48J11k59k26J26L4J24J35m34M4K94k40k34K61q4
2665a52r5K69q9j6p1K41m09N82k0l49K75q1j2L7J5m1J13p8l99J85J27m0j1O7J38
2690A86K13K3n60L98R3j91k30L19k93J22o9J33j87R2k02O4N03j28l53Q2%k34M15
2713A96j33j99L52n42J54N09p0o9k96l1K23O3k72j07r0L30k84m72Q09k91k57N12
$$ y = [216, 222, -368, 358, 92, -385, 102, -52, -5, 122, -147, 1, 104, -92, 453, -48, -216, 189, -375, 502, -226, -475, -3, 53, -214, 100, -307, -325, -13, -117, 142, -208, -260, 196, 339, -24, 178, -110, 44, 79, -236, 101, -265, -123, 140, -265, -122, 141, -300, 193, 115, -55, 133, 45, 115, 57, -56, -84, -38, -27, 133, -77, 104, 100, -305, 299, 107, -112, 180, -104, 2, 187, 122, 70, -48, 197, 47, 92, 103, -161, 93, -4, 183, -7, 133, -306, -136, 14, -133, -138, 73, -333, -29, -200, -152, 196, 307, 48, -178, -52, -18, 106, 241, -193, -149, 145, -95, -329, -68, -152, -247, 22, -67, -83, -154, 87, -322, 260, 240, -109, 166, 85, 73, 110, 125, 84, 197, 119, -280, -95, 32, -8, -19, 48, 186, 399, 422, -138, 260, 353, 162, -68, 251, -42, 80, 11, 144, -43, 49, -153, -89, 414, 286, -67, 15, 15, -219, 196, 63, -136, 216, -326, -172, 337, 267, 198, -98, -129, 94, 157, -115, -222, -312, 18, -266, -738, 71, -220, -477, 35]
2735C5k9m5l8j04L00j28j86J77m9m4o5o1M02k10k92N33o97M38L61k28R6o5l52
2758b51N02k90L0M14m87K7J50j31J23q7j03L72k52J11J33k53K74m3l11P28o34
2779B2m63R11m13L7j65j54N41p07O65q7l98j32N00k63R2J63k82N27q13J84M92
2800B57n04J87K18p28R55m18k73P21p33L8L84n42Q15n99j23N31n79M70K00q20
2820e43P02j12k26P89q33k9P19o32M2L63m69K10J3N6L30p12M27K30r01J404n97
2841B31p72R75n20j19P67n06j88M24p45Q40n22j24N62o38N31j68m37J080r31K5
2861b35Q07q01J40O35q82M60L2l43P80r02l9M66n00M85Ro01O29n57K13M70q82
2882f16P45p8o26J054m43l73P41o39K40L70q65O07M5l11L19l83K12K50o68O83
$$ y = [35, 6, -39, -77, -181, 119, -9, -195, -18, -67, -111, -176, -237, 165, -45, -337, 196, -501, -63, 298, 70, 166, 101, -251, 251, -39, -9, 405, -82, -55, 95, -36, 87, 0, -103, 269, 17, 128, 261, 8, 282, 239, -72, 656, 22, -441, 470, 57, 94, -71, -225, 316, -391, 274, 187, -211, -343, 157, -106, -14, 149, -133, 394, -419, -235, 257, -247, -60, 158, -570, 385, -33, -306, 415, -318, -280, 104, -438, 377, -222, -345, 186, -393, 77, 277, -543, 159, 47, -179, 610, -223, -252, 467, -165, -123, 240, -229, -19, -6, 50, 380, -332, 95, 325, -576, 828, 231, -541, 434, -86, -205, 562, 56, -132, 292, -453, 387, -135, -259, 303, -335, 196, 28, -409, 671, -260, -235, 572, -229, -89, 546, -336, 124, 156, -187, 593, -309, -348, 118, -382, 103, 112, -489, 140, -417, -204, 266, -616, 129, 51, -575, 479, 36, -337, 404, -235, 5, 375, -490, 117, 162, -149, 170, -213, -1, 249, -419, 264]
2902B64j78o02R61p33K52M96n15M0M17o65M98j51l73O04m52L47Qn19L48J58m32
2923b27P04q99J09Q75p98M10Jp20O74l23P9L72o07M93J64k06j65j41K26M64m66
2944A9ro2j13L46lm83M80m92R2Q73q25K70j8k27J38j62k4L4r9N21m11N0J92m25
2968c38L83J78n44M52K43o15N58m17k31M94k66J85R0l61K61j75p4M58k42m3M17
2989D13n22O68q29K8Q66o66p5O15m43M05l62l81J48n29J007j24j7j4m07MO37n64
3011a42m29Q08R1m7o23Q8n8L11n34P16k30k85K46K96Q3l21k06k44O20k47l22J62
3033b67O47j05l16l0j05P8L89J27l86j60l6n63M83J3M01o7O99m71j040O52l73
3054d30O07J73J83q33O34n66J87M11m77k52M05l72J48K98l81M24O2q75P77R70
$$ y = [264, 86, -516, 445, -288, -36, 460, -55, -15, 402, -263, 235, 84, -289, 315, -137, 210, 218, -301, 47, 205, -227, 477, -422, -313, 562, -236, 174, 175, -545, 129, -194, -115, 257, -350, 143, 307, 101, -64, -205, 21, 485, 19, 10, -52, -165, 181, 178, -305, 175, -317, -225, 648, -177, 93, 75, -152, -14, -176, -200, -166, -265, 256, -155, -105, 87, -338, 45, 223, -321, 131, 374, -241, 317, -100, -331, 163, -103, 82, 172, -189, 72, -103, -177, 281, 39, -4, 413, -109, 559, -270, -242, 624, -42, -117, 498, 55, 460, 98, -283, -135, -664, 343, 219, 202, 188, -219, -215, 422, -142, -571, 237, 328, 281, -342, -254, -312, -1, -535, 181, -49, -334, -88, 208, 291, -30, -236, -480, 140, -107, -429, -267, 380, 275, -41, -71, -176, -98, 291, 418, 32, -128, -164, -727, -244, -231, 170, 103, 802, 331, -709, -57, -430, 177, 350, 533, -300, 334, -232, -45, 366, -111, -363, 42, -330, -182, 116, -265, 159, 221, -654, 123, 1093]
3074A093m10p1j95l58j19M68Q6l76n12J238p71K75p52P12n86N53J16j138P83J92
3094B28n17O34k03l02K35K01o85O90K45q54N20j95q9j70O70m75Q8j5l88O7J90
3115a25r7k36P74l38M5R7Q2l4k73J12j23Q0k3j25K83m99O66k14p5J90o9J89j26
3138A61J8J17j71j44J49m9l6j05J05p4J47j83Q8j06J07j05J38K60n5j66K9l58
3160b33K10L8j12j08M89j88l66M65M6n68o0L25Q8qk83J80k70M46P3j94J3J5q5
3183h7K20j55k2J2r6j42K77k23L1L8J9O8Q8k51J86J18q3R8j05L40j96kM0p5N0
3208A48j42J28Q7k57n4%n2J40k4k49L59N2j5n4J12j8l6p5O2J82k69m0O5j29m8
3233a27Q7j49J76Q3j03n7N2L21k54L9j0k1k35J76J02j25QP5k85J74j99K06J7r2
$$ y = [1093, 683, 612, 417, 59, -60, 408, 494, 118, -394, 844, 73, 348, -404, 308, -278, 275, 391, -747, 36, 228, -289, 345, 142, -160, 75, 276, -409, 281, 526, -328, 192, -3, -92, -262, 408, -67, 21, 6, -382, -315, -125, -222, -458, 316, -22, 23, 120, 202, 168, -105, 7, -116, -36, -59, -184, 99, -400, 266, 52, -23, 167, 98, 287, 161, 179, 296, 125, -19, 130, 81, 45, -60, 45, -29, 118, -65, 23, -83, 24, -81, 57, 317, 262, 96, 125, -233, -23, 15, -97, -205, 284, 96, -270, 195, 241, -327, -387, -62, 26, 18, -265, -85, -355, 91, 164, -30, -17, -2, -87, 133, -22, -44, -32, -128, -270, 7, -216, -185, -147, -128, -60, 28, -223, -37, 81, -2, 96, -9, 331, 135, 133, 173, 98, 148, 6, 134, 221, -36, -90, -90, -142, -2, -26, -275, 84, 136, 121, 67, 179, 161, 125, 50, 112, 294, 25, -15, 50, -79, -127, -40, -189, -13, 70, -33, -90, -38, 283, 29, 68, 58, 37, -198, -22, 80, -45, -37, 38, -247, -73, -272, -66, -49, -141]
3257a41lj30K65j22J62J9j12J18Q2k80L39k58M3p8jJ12J1P6k92J71J45p1p7M9
3281B7o1N9J41L46k60qo0j41Pl7j52J97j18K42p0k01J40J07J45n07Q1K49l6q1
3305IN9R3k22p8M7M6J04j30NK02l20m3K19o1n1j5n8K58R5j78O4Q0n3K08k8n07
3331b55K19j18J57Jj75k94K42P1J55j43K83r3j54N13k29q6k67K00r8L15k81p7
3353a14oK00j61Q0j35P6k0J72k01P3K89m16M89J4k71R6Q7j05J3j56k09M05m0J51
3377C11o02J5M08Jq3N39p03j28J7K87Q9J49J17n52O21j38n0m32M33n56M31n41
3399c67k6K59o9J12k12J57k9L31l13K59K19l31J54Q6q9j34P6J97m37J44m7o5j8
3422a43J85j21r5L28M51m96j67K04O89n93qO4J70o78R2M32j52k28K5J75Pj46j09
$$ y = [-141, -144, -274, -9, -131, 31, 50, -62, 56, 138, -142, 197, -61, -18, -96, -97, 15, 26, 102, -190, -19, 126, 55, -22, 27, -34, 25, 166, 512, 252, 244, 184, 43, 50, 13, -139, 58, -60, 182, 112, -89, 51, 158, 303, -204, -123, 126, 90, 9, 68, 161, -61, -139, -92, -46, 58, -72, -67, 135, -185, -228, -9, -70, -121, -136, -194, 64, 159, -19, 45, 125, 72, 280, 252, -255, -36, -154, 3, 4, -171, -465, -223, -152, 3, -140, 143, 50, -104, 409, 180, 94, -173, 27, -71, 244, -37, -114, -120, 80, -81, -1, -136, -60, -80, 92, -109, -36, 253, -163, 326, 340, 69, 165, 252, 147, 160, 4, -205, 200, 160, 311, -291, -276, 132, 133, 50, 589, -114, -242, -225, 62, 151, 300, 417, -135, 486, 348, 298, -134, 299, -257, 174, -367, -393, -134, -203, -91, -303, -146, -175, 156, -157, 102, 321, -10, 144, 230, 141, 7, 83, 280, -157, -13, -60, -125, -143, 42, -79, -174, 154, 605, 109, -58, 146, 835, 242, 234, 298, 468, -210, -118, 314, 162, -66, -41, 134, 141, -5, -114]
3445a14l93M32M8Q8P2p3J20M9q8K14l58K13p5k22J20J70n02M10k04n8R1k01K15
3468d6J22k16K91l70J98L34k37o6n1J84J01k23k32J78j45MQ2k88K5L69k80L21
3490E5l3j2j28K82J74j11l05J88j35p6L60k06q2J18J02k59P2j41j72N27k02J50
3512A66k58K16NRk03r7J31Q36l74j004J090r70J284r43j80L55j04j1K00m06K59
3533AM7lr2j0j19M46k44j70K80n93L68j28L6k2LJ2P9k91L27J7l01M25J59m8J19
3558B98j99j10J4j39m0L6k9L45m01J25K27q7j32J38j28L11j08k97L06L45m76J9
3580A8J30j95O0J2J87l16Kj7n5J55j39J77q0K03j62R0k43K80j12m68Q73l90j21
3603a11N61N63j035j05j81O05o40M80k80L08m77K54J41j18j5L9M8j56K13j26J95
$$ y = [-114, -507, -75, -27, 61, 133, 60, 180, 229, 141, 355, -3, 210, 135, -87, 33, 203, -299, 111, -93, -151, -60, -261, -46, 76, -140, 151, -219, -21, 313, 76, 10, -41, 143, 244, 21, -211, -33, -178, -174, -92, -380, -355, 14, -266, 55, 22, 10, -118, 164, 338, 227, -78, 110, -25, -101, 259, 53, -29, 89, 191, -68, 4, -137, -309, 218, 16, 166, -92, 124, 129, 138, -65, -162, -31, 805, 431, -573, 517, -453, 831, -112, -292, 63, -41, -52, 148, -258, 1, 48, 45, -47, -57, -176, 270, 26, -144, 136, -457, -89, -217, -181, -203, -200, -188, -109, -400, -73, -56, -357, 68, 227, 179, 298, 99, -11, 3, -136, -176, -140, -169, 176, -225, -100, 127, 40, -92, 46, -82, 229, 121, -176, 130, 475, -1, 18, 148, -47, 13, 25, 212, -104, -102, -119, -174, -19, -158, 19, -61, 142, -20, 70, -173, 107, -5, -473, 400, 10, -111, 450, 1013, -22, -127, -308, 297, -343, 137, -143, 165, -312, -58, 83, -35, -50, -11, 37, -119, 94, -32, 163]
3624A63j53j6k2J19j90j58K44k9j22j20N4K23j64P5K09o6j09O4K54rq1k49M9J84
3648A50k65J1r5J99j45o0R1K7N4j8K96j45L3K58l28lj82J11j62L60j81k49J45
3671i8p8j15K84j10l5m3K92l61R8L05m2J57q2n3r2QLK6Q2k2l39M74l80k4J63j68
3697a50J30j8p1K53k38J88m3K4k9k60J91L26n12L54q3k06m8J43l50L69k30J28
3719a32O8L0K11j58L05j21j35L0J93l21J94j98o2L81r8n32N77l36q0L17j0k42
3741a19K60M5Lk50Q2JJ15O3o6l91M76l53j69J67l33L71J04j39J44Q2l75K54J46
3764A18k95K22k31N29m09J84K4l82L34k85m00O69j78k47J69J83k51L65J4j87J34
3785H0J05l85M18M3o5j95k2J75o23O68j88j73M4K6m20Q22l60RJ15j11K4L33j04
$$ y = [163, 10, -6, -28, 91, -99, -257, -13, -42, -164, -284, -230, -7, -171, -96, 113, 47, -62, 2, 256, 247, 166, -83, -34, 150, -115, -104, -199, 0, -145, -205, -114, -87, -33, -51, 245, 100, 133, 391, 63, 60, -122, -11, -173, 187, 6, -243, -98, -176, -291, -7, -117, -152, -195, 97, -264, -166, 139, 97, 254, 172, 119, 27, 35, 38, 64, 146, 124, -215, 259, -121, -145, 18, -150, -20, -38, -109, 144, -94, 94, 51, 75, 46, -214, -23, 303, -209, 145, 62, -144, -192, -49, -399, -30, -260, -132, -64, -34, 177, 19, 324, 203, 68, 98, 291, -30, 164, -34, -96, 285, 187, -345, 232, -104, -184, 133, 123, -119, 141, 186, 189, -61, 21, 22, 137, 200, 134, -257, 219, -134, -303, -136, -469, -98, 6, -133, 11, 93, -282, -28, 118, -177, 45, -186, 343, -66, 118, 142, -240, 94, -191, -591, 78, -100, -347, -178, 5, -246, 119, 133, -54, 80, 185, -200, 218, 261, 196, 1, -21, 154, -469, 199, 11, -162, -118, -92, -512, 310, -50, -41, 74, -37, -13, 320, 216]
3808B16k00J8M3K00j74J68n34M28J09k30k87K13n72L60M77l47O9k0J3O6K53j74
3830I5j74K59j62P0r8J82o55M49j44k99L66P2m8K23N7o44M43P8J96j84j71k03
3852b92J8M32k31l41N32k05J84M0n02k7O64q1j91J63q9n06J096l70n03J65J55
3873A11j49K58k39Jj00M01m45K94k13l87N39j71J16n9J89k01N32l49m0l15N50
3894C23j16j61K9l61q3O03l18k35L72j72Q2k2K82m59K40M4j79K85n0J1k2O4k06
3917d9k6J84m84K73L9m48K79J90j46M6K61k71j34M83j6j43l75K84J90J39K24m85
3939A5J27j51m17N36J37o19N59l49O2J21O2n50M62K10p9J6k0j09J1j1j10J29J65
3962A97k8k50J35m0J53p7k82M6K58j01j1P5j55Q2j10J6K5L0J07k58J02L95k06
$$ y = [216, 16, 34, 77, 277, 103, 271, -263, 165, 274, 44, -243, -30, -602, -242, 235, -112, -43, -63, -50, 16, 269, 95, -79, 180, 18, 88, -10, 172, -483, -34, -178, -477, -111, -39, -87, 136, 193, -451, -8, 70, 266, 82, -89, -292, -274, 158, -73, -414, 118, -87, 97, 137, -365, -392, 272, 191, 0, 163, 74, -432, 664, 294, -209, -44, 111, -38, 220, -19, -18, -118, 283, -162, 132, -81, -468, 71, -100, 16, -43, 146, -55, 477, 128, 88, -227, 323, 207, 46, 75, -286, -369, 234, -84, -319, 53, -119, -37, -59, 223, -236, 4, 48, -131, 154, 104, 115, 93, 157, -49, -75, 109, -375, -102, -63, -511, -232, -42, -188, -142, 119, -152, -286, 197, 181, 38, -337, -53, 137, 276, 500, 15, 142, -9, -426, 110, 247, -372, 187, -162, -100, 21, 83, -467, -5, 205, 126, 142, 122, 13, 24, 13, -97, 32, 197, 169, -81, 54, 14, 167, 90, -192, -146, 112, 11, 0, 75, -80, 2, -108, -92, -67, -37, 70, -188, -86, 309, 103]
3985A03k12L5k87K09J47j10L3M5p4K50jl25M79k97n1J01r1J01k69L47k1n09M58
4008F1J3k75K04m1q7O6L10n16M95R5k99k3K23L9k21m1j06Q6J32K2q1K06l38k06
4032b82M05o6M3K67j86o4j19K24l19J57K1M1n1j31k3K39k61J97r1J58k8l10J94
4055A5q7m4K95l26K31K23k23j40J34O3j16r8p1J27Mk35K10j98N5j05J02M8l9M38
4079B63k8m10J03J77k68J91O3j21j9J99P1k35r4L3K00q3j55J20Q1j45k3K26j24
4102B2J56p6j73L0RP2j7j11J53j59q2J17lK29J1m23P8K62L8M2l7k35K15Qj77n7
4128a08N8j28K33J16j70P2k42j16L43jj21p6J38O7j34r1M32l87J48j25J76K40
4150C24l55M6R3j26k37L33j28J69l34J32p0M3J97j44L41lk43r6r9J56j3Mn7J37
$$ y = [103, -109, -74, -361, -152, -5, -115, -82, -37, -111, 139, 138, -187, 292, -5, -56, 45, -46, 55, -214, 133, 112, -397, 61, 74, -201, 3, -38, -125, -59, 251, -265, 230, 325, 26, 3, 226, 265, 44, 3, -103, -17, 115, 137, 56, 262, -76, -282, 123, 57, 100, 367, 181, 117, -2, 222, -97, 60, 81, 122, 71, -60, -83, 156, -105, 92, 1, 159, 131, -179, 15, -72, -116, 179, -147, 84, 307, 84, -56, 78, 141, 25, -73, -144, -17, -13, -248, -38, -236, -181, -286, -184, -136, -175, 263, 235, -175, -72, 105, -163, 28, 91, -30, -49, 150, 221, -14, -108, -75, 125, 42, -113, 7, 88, -57, -80, 146, 22, 178, 102, -71, -41, -32, 40, 23, -88, 65, -94, -176, -59, -62, 167, 178, -245, -167, 95, 133, 175, 138, -97, 118, 126, -51, -108, -50, -178, 55, 171, 1, 73, -169, -285, 58, 57, -64, -140, -2, 65, -69, -160, 272, -115, 33, -92, 84, 324, -31, 15, 108, -18, -255, 78, -50, 119, -215, -83, -153, -110, 87, -57, 284, 281, 38, -58, -157, -1, -14, -10, -67, 70]
4174G0J50k40J71k64q6K85Q0m6j38K37r9k47j6Q9j0J91j07j08R4P2J15j30Kj83
4198a18J15k30J00K02L3J64l21j24K82o8Q2j50J28j82J3j10K57l50l4L01o8J37
4220E9l53J06J89k3K5q3J63J43l20J36K4l72P02m51k24M78l09k28O5K31NQ5m1
4243GL45k43k30J35K01J22j67k56K24m3m4K27n56K33J07l64O31l78r8J57n3L0
4265a3R3km6q1K11K16m27K17M1m80M77j90n04M57n9K9M9m29M15J56m35N01l5l77
4289b16M04j4m18K65n60P77m45j63M75l54N4M96o11j57M93n02Q00l11m43N19j16
4310b7J66rm12N40k31k43O36n76MK42n02O98k95k63N64K8m85L14m16K90M00m02
4332B1K30m37L7M74l42o9K46n64O22j18l27M63n38j09R07n52j26M33l92L50m6
$$ y = [70, 220, -20, 151, -113, -199, 86, 166, 120, -18, 219, 120, -127, -143, -54, -64, 127, 20, -88, 6, 78, 193, 63, 65, -118, -3, -233, -133, 69, 102, 266, -55, -179, 103, 35, 117, -33, 95, -87, -74, -184, 73, -277, -311, -10, -78, 59, -294, -188, 1, -22, 3, -80, 83, 226, -94, 42, 66, -306, 396, -55, -279, 199, -110, -338, -273, -42, -37, 48, 7, 352, 109, -121, 14, 215, 337, 170, -86, 138, 95, 51, 278, -278, -45, 62, -302, 329, -49, -147, 10, -43, -13, 80, 78, 32, -49, 162, 378, -49, 168, 209, -271, 206, 16, -488, -31, -90, -61, -12, -441, -26, 130, -305, 196, 161, -216, 188, 174, -244, 21, -539, 238, -207, -370, 105, -249, -195, 301, -310, -467, 26, -476, 324, 13, -430, 89, -27, 139, 130, -282, 258, 27, -216, 420, -156, -152, 90, -412, 286, -9, -272, 292, 320, -165, 149, -267, 23, 423, 21, 251, -186, -149, 325, -17, -86, 160, -404, 218, 100, -227, 236, -302, -411, 496, -56, -182, 251, -141, 209, 163]
4353A63m49N00l86J95J17n61N09m13J17L94m44j84P49m60M28k24n93R38k66n8
4373G2Q2n15K28M75n64K98k77p5N17n04M22j42m64P45k90m03N94n18K37L11l22
4394i3M29k37n50N91k29L26k81l43N27J31m91L49k19k97P38o41M70J30m24N14
4414D00j76m19P00k96l08J91k40L7O6N6J87k95p8K13m51O12l01l14O31J57p17
4435c45P38m77J88J37k02j27QJ06k61K21J4L8l65K50j07j39M32n50K87N18n38
4456a74K60j6j85J72k0p0j07O8Q7j5l1o5p2k14M42l54K58J61j83K53j02k24L7
4479i4J88o8K5R5j75n6o9Q3n0K17N2l01K24k6j2P2k79J27K75k20J34Qj82N6n0
4504b6q6J88k9j98L7J07J1L1p9j12j39J91K66k69J10K56m91J48L09q8m7j58Q6
$$ y = [163, -286, 214, -172, 23, 140, -421, 88, -325, -208, 186, -258, -442, 307, -153, 275, 51, -542, 396, 130, 72, 154, -361, -133, 342, -222, 76, -201, -276, 241, -263, 159, 17, -447, 298, 8, -395, 199, -319, -82, 229, -93, 336, 99, -451, 140, -89, 237, -44, -387, 140, 271, -220, 129, -90, -387, 351, -290, 180, 310, -114, 400, 224, -195, 505, 209, -99, 92, -148, -111, -45, 11, 198, -97, -175, 38, -413, 199, -102, -416, 215, 372, -345, 393, -84, 104, 241, 39, -88, -80, 26, -235, -14, 0, 38, -327, -77, -184, -323, 109, -441, -154, 364, -174, 86, 70, -115, 57, 37, -33, -140, -72, 15, 0, -31, -96, -168, -382, 60, -294, -36, 125, -58, 195, 93, -131, -94, 94, 26, 51, 146, -29, -85, -154, -71, -121, 96, 148, -153, 71, 45, 33, 105, -174, -47, 228, 8, 142, 150, -32, 24, -26, -112, 76, 47, -151, -114, -7, 4, 35, -44, -156, -295, -104, 162, -107, 3, 259, -232, -84, 225, 137, 90, -68, 18]
4527A8m8j91K06j65J15R2j93L52j28j74J30P7n2R3o7k31J14Q1P2k83M09m0L4k9
4551A92j15l05M53m1r72J392J1j35n62j93K11M10k52J82m2l53O1M8j29J04k22
4572b57K60j66L01l11O1K02L6j30m2K12j43J11k40r2K52J10k50q7n0J52M9J3o5
4595g4j84N2M40k72J93k07q4J06J10k1K04m97J52O7j92Q2K01k7L2O9k89J33P4
4618F8p9j48J85L02l10LJ97j08J17n9o0J41j33j18J80l25J96j5k14L55j16J41
4640B00l40K52j18k0L9K44j22l57K55J01K4j27j26Q5l5j00K16q5j65M81k08k89
4662a95R9l3M80k78l07O38n43J9M6j21K00l8j59J43K90l30J81j69K01P6j60L1
4684G1j91J17J42k57L12q1l55J86P7Q7j63n4k06M77k36J95J22m35K20k64N66K2
$$ y = [18, -30, -221, -15, -180, -65, 27, -166, 186, 58, -116, 14, 91, 39, 132, 65, -166, -52, 29, 101, -182, 227, 187, 221, 192, 77, -228, 225, 184, -788, 604, 615, 480, -82, -275, -64, 346, 94, 276, 234, -119, -58, -10, -139, -35, -257, 3, -163, 138, -173, -112, 90, 126, -4, -46, 166, 23, 134, -106, -198, 54, 164, -86, -173, -223, -71, -22, -9, -74, -258, -206, 234, -38, 155, -52, -136, -30, 80, 59, 263, -234, -82, -15, -207, -125, 76, 49, 81, 150, -139, -6, 68, -11, -159, 26, 328, 18, 21, 218, 110, 227, 168, 108, 249, 116, -2, 178, -147, 49, 34, -180, 175, 59, 200, -140, 112, -6, -26, 13, 257, 135, -222, 33, 134, 158, 31, -95, -10, -45, -145, 71, -14, -179, 302, 94, -195, -96, -129, 351, 73, -234, 404, -139, -120, -74, -195, 5, -33, -192, -49, 241, -89, 92, -77, 124, 200, 40, 71, -120, -3, 139, -118, 194, 113, -242, -56, 21, 108, -55, -109, -315, 162, -74, 121, 243, -192, 28, -236, 330, 352]
4706C52o91L41p7k4K88l23J74J31j37K27j17m01L20j28m16N70j68J5K00k61L01
4727A76K03l89J48k56QL3k40M22j72p4J58l10J8K02Q0j64M5L3O91r83K90K82l91
4750a90m9L32j86K6J2l88M75o49P60K96j116P98M52p80N42j28q87J366q87O97
4770D96o42j41P17m35M48m37K14n1k54o7K01O7k05K82j59j31N8j25K46qK17j9
4792B72j87Nq2J22Oq6n1N6j64lJ79k02M03k97J16L74n06K1O09m63j37N2j96J45
4816a4l4j23L88m10J93j79k9K95k15l2J65j7rQ4J1K2m6L6R9K4j82P4j58K08K10
4841C61l56O2k18K7L15l24J19K31l03K00o9N1K05k13P0J07k72R9P1k85J96j84
4863a10N4K57k45K82r5j87M3j15J67Ml0r9J31k34K48k02k64L56j19J70r3Rj39
$$ y = [352, -339, 2, -75, -99, 189, -134, 40, 171, 34, 261, 144, -257, 63, -65, -481, 89, -79, -64, 136, -125, 176, 379, -10, 138, -118, -110, -77, -317, 105, -67, -141, 17, -293, -275, -73, 7, -157, -112, -79, 612, -371, -81, 201, -190, -239, 93, -93, -67, -55, -443, 32, -617, 143, 439, -677, 121, 573, -207, 335, 207, -680, 686, -201, 496, -146, -287, 430, -5, 443, 6, 220, 169, -85, -152, 49, 116, -89, 193, 34, -97, -39, -164, 82, 74, 291, 272, 85, 90, 8, 130, 136, 50, -1, 55, -109, -112, 67, -135, 268, -29, 87, 461, -45, -24, 585, 122, -15, 37, -159, -14, -48, -171, 217, -193, 0, -179, -208, 87, -128, -160, 5, -12, -21, 63, 74, 96, 50, 86, 185, 209, 27, 101, -57, 151, 361, 5, 67, -151, -124, 191, -133, -14, 217, -86, 114, 45, 96, 301, 88, 158, 265, -7, 92, 163, -122, 74, -110, -56, 201, -44, 238, 143, -44, -1, -116, 51, 55, 25, -74, 57, -177, 71, -131, -395, -39, -158, 12, -81, -72, -211]
4886b11J89k05J57j8J56L6k05J64Q2l12L43j15N3q2q2j2K0NJ15m4p0rqm8L7L1
4912c3j09K46j88P3OK5Q9r6L8r2J05N6k70L94L8k33q8J69p4Q6R2l69O2K6J26j23
4938d4J98r7j86K58j68K5J16k08J25q7l6J06N7m1k32M38l14m3L49j47k33K28p6
4961a2J00p8j78L9l58N07O4j72J8o5J03J85l99K82j84J59J47J99l17n0L6k9l20
4984c23K63K67j25l9l3rJ55l10J02K08k89J39Q8o9N9j26L34k57L08m33K67p2l14
5007b09J82j89K69j50q6K57j35K17j3l3k18P2J45j1Q5p6j76K25L5j82p6j0J1J12
5031D6j15r1R7k00J17k0K34j81L56j27r2qm5K29l00J67k91J29J98j13N9j24K77
5054B02k54L8o0J4K08j04n1K0J74k1q6k41K67K2k94K59Mj27n5q2P6m1K33k14P6
$$ y = [-211, -22, -227, -70, -88, 68, 104, -101, 63, 145, -167, 176, 61, 114, 32, -50, -62, -42, -37, 78, 34, -36, -45, -53, -101, -64, -33, -142, 104, -84, -11, -5, 20, 109, 13, 51, -41, 64, 120, -150, 244, 282, 49, -39, 130, 56, 142, 234, -135, -73, -47, 79, -44, 154, 57, -129, 129, -39, -14, 102, -106, 19, -68, -104, 2, 59, 18, -214, 224, -90, -133, 216, 69, -164, 64, -12, 88, 10, -168, -129, -487, 20, 84, -88, -70, -135, -32, 153, -246, 36, -148, 11, 158, 357, 40, -10, 26, -3, -323, -60, 207, 82, 43, 10, 1, 156, -154, -52, 156, -133, 6, 94, 25, 84, -42, 292, 35, 343, -90, 177, 105, -209, -27, -216, 53, -97, -183, 74, -61, 156, 143, 110, -108, -36, 109, 98, 183, 107, -69, 156, 191, 9, -67, -77, -66, 46, -69, -160, -63, -263, -146, -166, 68, -113, 243, 116, 24, 16, -29, 200, -100, 67, -224, -95, 103, -10, 49, -75, 202, -52, -14, -74, -60, 148, 44, -7, 13, 187, 166, 80, -161, 106, 128, -166, 93, 97, -30, -85, -167, -91, -132, 101, -113, -37]
5079c7N0j7L0k04L24j76k3K85l27J7Q9oJ30l18p6L16k34Q7J45p8K1j14J02J23
5103A09Q9m4k97J20J97k53N4o2q1J87j13J07j14J22k02O3J2J61J29l58K31k7L7
5126F7j24L07q8j69j8J00K20n02L21k78j00L63J51j88l19K18k1j32r1K93K52q8
5148A74J09k29m4j02P7K5j05L39j20j8j43n7K72n6r9o1k0J66N1J63m40M1J83j12
5172fJ59P7k16k04L45r9m5k95J71P2mL61m05j22J49J1K93k41l5k1J18m4R9M2m45
5197b85J15J63o6j27N4K31q6lp0J05l59M69j76O7r4p4K37q0j48LJ35R0ll35K34
5222cl07M71k54J15j44J30j76J76l4J99j65j83L68j32K0l7K1j40L7J81l55L94
5244A82j66m6p4j58L14j01J11J69k09K7J60m56J97J03j50J03j35j8L00j58J56
$$ y = [-37, 13, -4, 26, -178, 146, -30, -53, 232, -95, -78, 11, 5, 135, -183, -259, 57, -177, -90, 55, -23, -2, -116, -14, 109, 198, 154, -143, -23, 174, -79, -25, -87, -168, 19, -94, 13, -101, 21, -181, -118, -106, 55, 184, -174, 57, 30, 67, -57, 250, 162, -7, -25, 75, 295, -207, 114, -164, -264, 99, 250, 62, -257, -39, -60, -192, -283, 10, 262, 174, 283, 54, 10, -92, -15, 10, -95, 244, 124, 106, -37, -94, 178, 122, 23, -38, -58, 108, 159, 322, -118, -77, 106, -6, 153, 230, 14, -190, 155, 56, 11, -284, -113, -41, -45, 316, -89, -211, -62, -51, 242, 1, -34, -55, 63, 19, 118, 160, -285, -170, -7, -73, -200, -146, 85, -1, -4, -74, 31, -328, 141, -35, 32, -62, -136, 101, 21, -127, -124, 11, 101, 98, -237, -3, -310, 161, -93, 22, -122, 8, -168, 8, -26, 173, 8, -175, 193, 61, 81, 44, 65, -75, -38, 143, -212, 182, 16, -30, -104, -262, 52, -49, 62, 231, 22, 49, 209, -247, -50, 53, -97, 6, -129, -147, 153, -5, 151]
5265A51o0o0Kr6r0N20n67K29p7j67L56m5r8l6J81o9J19j41j61K71Q0ql28o9L18
5290A55J58k19l0K3q9m9j29L18l05P4K75k26k4J56j79J09P2K5J20k03Q5P9j27
5313F9o3o2j03L15j39q2Q7l75N39m2k85N7M6p4J34J12q9J21k57J12j17j90J99
5336h7R4k9Ok1J9N5j18j8J07N6m8J86k83J59l3j09L2K87k55j10J22j78K19j10
5360e7q5J56L25m83K54j54n1K85k07lr3K19P9k30J56l5j13k49L94k65J3J85k29
5383a88R3Rn1J17J9R4k02p5K47j99K37p9J34j08J4m5K87n14N9K45j85K62l86N1
5407a64nJ47j35L7K10k42J55l1j1J13o7q3j38L29l5j38r7J37p4J11mK19K5k43
5431A6J20k66K11q3Q5J58k12j94L67j76J09q0J16N6j79m8J0j31KJ27P1r0j56J12
$$ y = [151, 91, 31, 33, -63, -153, 367, -200, 29, -48, -215, 141, 96, -2, -38, 143, 74, 193, 52, -109, 162, 242, 234, -94, -163, 155, 313, 94, 64, 87, -2, -51, -180, 138, -167, -93, 182, -44, -68, 88, -91, 18, 90, 115, 235, 32, 117, 196, 69, 6, -56, -159, 156, 17, -65, 22, -353, 186, 144, -141, -84, -38, -112, 22, 134, 45, 166, -91, 21, -96, -286, -87, 7, -22, -16, -37, -18, 37, -81, -99, 8, 64, 16, 202, -81, 78, 45, -64, -32, 255, 0, -110, 12, -166, 53, -57, -142, 14, 339, -144, 110, -44, -95, 190, -17, -20, -113, 106, 185, -45, 111, 76, -37, -286, 108, -157, -144, 41, -188, -95, -86, -137, -20, -1, 93, -109, -184, 63, -136, 101, 22, 156, 48, 62, 17, 304, -210, -151, 94, -91, 171, -215, -164, -169, -22, -157, -120, 90, -152, 3, -28, -39, 74, 7, -76, -214, 115, 80, -58, -155, -18, -92, 19, 15, 234, 259, 16, 136, -130, 81, -2, 83, 241, 29, -165, 202, 26, 135, 55, 171, 227, 48, 0, 10, -121, -119, 8, 79, -11, -167, -55]
5455e5n2k0K24j97L2j73L43J95l32J8J13l59L83k29Q0lK29j08j61O0j75K82m8
5478D7J17k85j71K37n7J47l25L50j27P1m8Q0k05R4L20k33p6k7J51k7J36k56J78
5501I1k3j65J07j00J10m4n0Q9L5J95k57P8o8k4N3lR8j26j04K27k12P9J40j2r9
5526A5j86L72l69K08l8j14p5K22r9J72j69J28k04J87J08k18L17l45R8K0q7k0J21
5549D4r8J16j03m4J54j87qL9QJ56l26L47k46J33j49J30j15K71J0nj54J7N5Q9o6
5574F8Q1k17J24j28k5N1m9K7j3j5J22q4j69J33Q6J76j19J12j30p0J86k05J26J1
5598G9j54P7J1j16J38j96K94l9p9R7j95L80m18O4j45J20p7P7J3j20K24J39l09
5621a35J69L32m29j93K35j81M55j08M6r7r0P6k60Q2N7K2n9k07L31Q9r0j30K28
$$ y = [-55, -107, -127, 97, -100, -68, -241, 102, 297, -35, -17, 96, -263, 120, -109, -29, -32, 197, 89, -72, -12, -187, 95, 47, 164, -121, -292, -55, -112, 35, -290, 60, -67, 4, -44, 36, -169, -75, 245, 12, -64, -91, 60, 33, 169, -87, 91, 68, -97, 10, -90, 20, -24, -74, 15, 50, 245, -12, 66, -2, -26, 27, 24, 122, -4, -108, 119, -93, -14, 126, 114, 15, -171, 201, -168, 40, 2, -112, -187, 35, -64, 108, -61, 67, -137, 50, 158, -60, 257, -88, 10, 30, -57, -77, 44, -54, 62, -41, -85, 69, -118, -126, -87, -79, 77, -249, 98, -148, -15, -164, -34, -149, 122, 132, 127, -27, -10, 45, 134, 68, 149, -68, 56, -72, -97, -46, -95, -68, -81, -96, 26, -58, -227, -94, -8, 168, 49, 161, 31, -39, 147, -58, 68, 79, -75, 2, 13, -103, 35, -161, 133, 94, 15, 112, -83, 297, -121, -57, -202, -82, -159, -82, -69, -189, 35, 174, -135, 34, 366, -63, -256, -21, -202, 253, 145, 191, 94, 4, 80, -180, -98, -41, -19, -78, -285, 46, 135, 45, -85, 143]
5644A43m9j0o9L1q9Q8L6J13l53L11k96K13J34j99J18n4L0l50K24r1L4Q6R6L9j76
5669d0L14l48K41n4l37J24K78ok41J28j09J59J47k30J13j22p8q3k8K96j99P5J17
5692A17o9n1J2k44K17J41k30O8k02J09N25n31J21q2P5J60j24P3R9l79J5K73j85
5715i2J92k19K22k50J31m1K71l87N0J71k84J66j09J3J38J4Q7k72J56J40k65L50
5737A82k41K1k8j08N6J22M0k42L74l19J32K70j79J8j68m9K26k31J28L40m67K01
5759G8j10kL26k98k18M75j65o6n3j4k04J75K5J22m3j27J20m4O0q0j79K33m7k20
5783b56L17l56K18L8PR6K4j10l4Q9j08O5m0k3R2q1Q8p4j20L8K63k31J06j37K06
5808G7k28l51N23n9L50l73R9J42l09M96l11O9k53K67l54L8J13k05J59K87j24k
$$ y = [143, 94, 84, 15, 46, -43, 45, 81, 194, -159, 152, -144, 69, 203, 4, 122, 68, 98, -252, -28, -119, -85, 1, 97, 136, -40, 274, -74, 167, 113, -224, -100, 178, 172, -69, 59, -50, 109, 256, 26, 139, 17, -61, -144, -172, 124, -75, 0, 117, 48, -3, 9, -235, -18, 123, -107, -39, -241, -132, 393, -138, -17, -99, -24, 136, 12, 85, 184, -195, -180, 93, -92, 100, -119, 103, -147, -16, -57, 214, -173, -123, 48, -236, -70, -179, -166, -28, -14, 73, -199, -43, 97, -168, 182, -59, -38, -66, -174, -118, 4, 44, -198, 176, -143, -11, 259, 80, 98, -70, -119, 107, -124, 4, 344, -123, 78, -32, -34, 292, -6, -224, 251, 86, 20, -33, -47, -251, -76, -51, 71, 28, -99, 21, -23, 37, -43, -222, 11, -36, -256, 61, -295, -77, -39, -32, 64, 88, -22, -56, 33, -75, -10, -50, -73, 19, -62, 26, -48, -168, -130, 133, -98, 8, -129, 77, -151, -502, 21, -38, 312, -61, 38, 180, -129, 367, 56, 125, -128, 139, -215, -177, -64, -269, -110, 177, 53, 51]
5830E1M6k07K33j81J62J4j5l0J09j39q2n3j17K64k52K86j60k89K97K5r4K17m0
5853D5P2j94J90j41Q8m1J34p2j03J57r9j94K04j59J89q7L8j52R7j51L64j31J31
5876A85l95K24j15K01m8j88K65j38KNK00k05qm1j79L10p0q6RJJ30J52l64K49j28
5901c2j35M10k01K14j54r2q7j66L36j10M3j42J09j01J36K1j64qK29jj67K65K05
5924D08m10P9k07K80k52j11P4K66j17j82L26l60L65m80K08n5J70mO5L0L4q1m3
5947Cn1J68K3r1Q3p7j43P4j41L10m8rk8R7R3l49K67k71L18k30K5j01P6J80l98
5972b20K49k22N6J12J13k2j20P4j74Q2l0J18o6L05n41L09L0Q6k0o9p2n9J05J18
5996A42k22J34m9j47M75k05l50J53J21rM9m4Lp1K64n32L87k00J5p7J19M2L2m2
$$ y = [51, 97, -110, 123, -58, 104, 118, 103, 73, 182, 43, -39, -92, -209, 55, -197, 89, -71, -360, -63, -38, -132, 85, 45, 117, -77, 113, -28, 60, 19, 153, 81, -22, 135, 36, -158, 46, -113, 76, -11, 27, -125, -28, -179, 185, 54, 185, -210, 14, -101, 100, 52, -136, 129, -9, -7, -2, 198, -7, -15, -56, -235, 75, 5, -81, -72, -71, 59, 211, -153, 96, -32, -167, 243, 42, 256, 102, 10, -77, -243, 93, -17, 26, -116, -7, -108, 28, 49, -115, -123, 106, 105, -62, 203, 408, -2, 77, -130, 150, -102, -213, -139, 127, 10, -172, 154, -206, 159, -321, -113, -168, 2, -2, 63, 93, 127, 46, 3, -48, 120, 143, 52, 135, 58, -85, -11, -152, 158, 110, 101, 73, 170, 263, -86, 181, -90, 228, -2, 23, -78, -2, 178, -220, 29, -193, -137, -25, 88, 66, -54, 20, -154, -72, -102, 16, -50, 255, -286, 23, 53, 139, 119, 50, -22, -81, 24, 142, -80, 54, 5, -142, 333, 128, -222, -69, 52, 43, 92, 48, 51, -20, 244, -288, 99, -101, -86, -163, -44, -2, 30, -12]
6020a2q6J06p6J03k5J65j31R2k7k27l5K08j75N1P2P6n0Rk21L4K83j23j10J39o5
6045b5J21j19j12L28m7K26l76r0L09l36jJ00j52L77k40L3j7o6K04N3K9j3j13n3
6069B0Q9k05Q2lj24J44P1p9Kr6q5K51k16J22J39q0M8K29m06K40m4K5k65J59j08
6094i0J71j80k35N88j35j14J5j11K89k48J8K06j96l77M45j07J92j50j62J16J67
6115A02j30j44K85M4Nl7j76J14j23R8j65J85j84j00L24r1j66J73r7J11q0K7m9
6138g4J06k29L68j86q9O9k3J06J10n03M65k25q7M08l9l03K68n8j0k11m7K58M4
6161A18o5j24L09k01Q9l59L01l03K32J0J11l2k47J30p6J16P3l32L06L6J01k59
6183f6j17J11m8JJ41j0L2j60Q4J73j88J24J37k79N8Q6j59N31n40J97k68k74M58
$$ y = [-12, -98, 8, -68, 35, 10, 175, 44, 136, 109, -118, -153, 55, -120, -69, 3, 79, 29, 38, -183, -149, 134, 11, -99, 40, -25, 96, -23, -135, 193, 146, 372, -4, -94, 215, -121, -122, -22, -174, 203, -37, -4, -21, -87, 117, 170, 199, 186, 73, 20, 109, -96, -14, -17, -141, 3, 74, -5, -3, -99, -184, 67, -149, -27, 112, 32, 80, 309, -97, 143, 99, 124, -141, 18, -90, 81, -99, -334, 254, 119, 5, 20, -91, 198, -50, -32, 174, -22, -399, 46, -61, 131, -19, -181, -65, 102, -28, -172, 113, 157, 162, 125, -51, 63, -60, 38, -127, 58, -126, -226, 98, 7, -159, 14, -83, 28, -52, -25, -74, 32, -197, 171, -15, -104, -35, -58, 48, 158, -345, 120, -105, -192, 216, 177, -126, 142, 84, 74, -137, -184, 74, 118, 53, -71, 238, 37, 126, -233, 68, -235, -3, 7, 118, 86, -161, -31, -107, 9, 82, -250, 56, 92, 193, -66, -183, -72, -120, -119, 22, 12, 44, -116, -32, 141, -47, 77, 214, -65, -7, 79, -80, 451, -89, 108, -160, -434, 24]
6206B4n5j66M79m17o9L92k06J11k64r6M48l98K51J95l42O4j12k6P4pj8K56l44
6229b26K58O9j71J77J25l63L59r7j55L64q11M63L8k04J38J04m4Jq6P5J68k31K51
6252B02k97M1O4q2J40j27J14O5j07j03J94K5k44J45j86N9L55l83J64q7P0J11j97
6275f4K47o7n3J12l35J44J58j72J22J12m31R4Q8R3K3j44Pj01J25J11o3J26p4l2
6299B6J80k72r3P6J8k06L32j51K50j05l19K74o4P9p0j62J90N3L2J4p7k77M20J52
6323C00k77P5j54m4K57j44j41J75k33K44k00J54K1j2k69R3K14k7k31K46Kj62J91
6346G8R4l30K45R4k08J4q4QL05m44K52m3K36j55K6p2J4P3k01N6L7Q0j14N2Kn8
6372d3j09R7J32j49Ql4K39k43M0J74j13k4M5P0m3k09jJ45Q2m3J07L9j39j15q8
$$ y = [24, -31, -197, 282, -135, -204, 188, -18, 93, -171, -267, 181, -217, 34, 229, -113, -49, -161, -187, -113, -120, -138, 118, -226, 32, 101, -70, 107, 232, -131, 228, 131, -24, 340, -471, -8, 30, -174, -36, 68, 24, 25, -61, 14, 182, -49, 202, -95, -54, 10, -72, 68, -59, 55, 120, 13, -90, 104, 129, -115, 30, -156, -97, 258, -125, 39, -48, 22, 133, -64, 183, 116, 63, 175, -160, -16, 142, -30, 92, 204, -227, -133, -45, 48, 71, -73, -66, -167, -42, 69, 6, 132, 58, 26, 206, -66, -159, -83, -65, -271, 61, -90, 160, 55, -264, 10, -54, 25, -45, -207, -17, 36, 68, 82, 5, -272, 148, 300, 23, 98, -56, -100, 157, 13, -128, 47, -186, 58, -142, 12, 33, 21, -248, -155, 59, 32, -199, 47, 49, -113, 78, 172, -158, 87, 181, -27, -13, -97, -89, 216, -228, 24, -19, 217, 62, 88, 16, 30, 103, -98, -42, -5, 75, -39, 13, 15, -43, -152, -55, 77, -72, -64, -98, 141, -102, -62, 112, -1, -25, 20, 90, 47, -162, -163, -18, 64, 21, 128, 167, 28, -87, -175]
6397a75M87m33K04k13j40L00j4J86n8l25J54j43R9K28k07m4K64k64j88O42k94
6418F6k77K24o8K7l5J01o4j28L34j74n5J06j14KK19j88l9r6n7L6L50l45K51K3
6442I9j10R4j10%J22O4k54P8P7K8J45k22p4j40k60M25j92K70j84O3%qJ00j82J98
6467B7o6K7Q1J9j81J93Q4j94l3j49K15Nj56P4J30R0J22j27l1J32l10N5J02k84
6491a75L69k57n1K61k93J18K94l45P2K09k63J97k43j90K70k04L11r1q9J48J14
6512A62k30L1J56n6q9M7Q4j10k51L12k13k2J21K9P0o9j79L06j53J37j04r1K33
6535A21m6n3Mj55j64M62j50K11k51q2q3K96l00K60o6q4J1k7l0K0j55M47k4n9N8
6560A61k60M3k8k7K04J55j85Jj45Q9K44m26q9M18j49J96k69K16o2k23J64K46j98
$$ y = [-175, 312, -121, 83, -130, -270, 30, 16, 202, 144, -181, -27, -170, -71, 157, -50, -94, 170, -94, -282, 360, 66, -211, 13, -55, -28, -63, 38, -26, -154, 180, 6, -49, 57, -57, -55, 164, -24, -63, -159, -216, -180, 170, -175, 76, 99, -11, 83, -27, -27, 95, 159, -95, -17, 60, 88, 233, 11, -63, -203, -463, -38, -230, 40, -144, -81, -81, -89, 11, -171, 27, -39, -12, 69, 88, -93, 100, 184, -10, -43, -192, 23, 28, -128, -54, 76, 166, 288, 161, 130, 262, -48, 7, 109, -175, 194, -63, -114, 147, -146, -28, 266, -79, -7, 202, -61, 136, -107, -297, -27, -231, 80, -11, -100, 48, 162, -68, -37, 119, 63, -26, 21, 105, -5, -256, 56, -157, -179, -58, -29, 41, -28, -207, 99, -54, 83, -21, -112, 121, 75, 22, 26, -129, -293, 169, 19, 230, -21, -103, -186, 110, -190, 70, 4, -80, -69, -96, -126, -106, -261, 186, 162, 103, 161, -99, -56, -84, -111, 93, 248, 63, 64, -81, 8, 252, -174, -263, 155, 6, 202, -67, 149, 87, -136, 28, 274, 76]
6583G6J30l55J50L21l95K77l11K18K2k44J7R5N8p8K30k29J5J44k89K47j83J93
6605A09j10j91K28J20j33J62m30L18K73q13L84J46Q0q5J6j15K5L06n43N29m44
6626a68K61l0Jj0o4j16M41m79K40K3k42N3K89k68L44m70n8M52l62n81M63P97m54
6649F2k45M41k49L8n62M62LO68k73l84J79k36k81N71n3r65R80n93L48J62k27q3
6671b37M46l11K39l54K52j98J29J89j20j03J91k40L12k43o4Nk4M76l44P3J61r
6693B26P8k27l6j7j11m5K00j74N7l6KJ61J37l08n3N3N1r6K88j12K1j29j00L94
6717B24k22K9p5J4O2k8J3Q2j51R4r7K65Ll78K42rK3j01j16m0M87l98Q96o3j208
6742d52J86j16K81J87Q9l01k59N53n1k44k6K65P5j10l05L04k41J17q2RK49j25
$$ y = [76, 206, -149, 1, 322, -73, 204, -107, 111, 133, -111, -94, 1, 59, -19, 211, -18, -3, 141, -148, 99, -84, 109, -1, -192, 36, 156, 23, 185, -245, 73, 346, -467, -83, 63, 143, 58, 74, -41, -16, 290, -253, 276, -168, 93, 63, 64, 54, -10, -126, 315, -164, 76, 99, -143, -90, 199, -69, 275, -195, -253, 199, -163, -744, -281, 516, 62, -183, 258, 9, 47, -515, -53, -50, 618, 345, -39, 140, -96, -377, 194, 141, -824, 156, -437, -89, 73, -154, -237, 209, -102, 137, -217, 35, -163, -34, 155, 35, -68, 123, -117, 195, -48, -112, -107, -131, 345, 1, 74, 235, 226, 304, 77, 41, 24, -87, -132, 68, -106, -49, -85, -83, 78, 215, -93, -146, -93, -42, -138, 150, 38, 59, -70, -170, 224, 2, 31, -44, -30, 32, 4, 17, 99, -52, 42, -55, 210, 213, -165, 77, 68, 91, -10, -126, -166, 321, -77, 819, 756, -452, -266, -382, -101, 86, 175, -126, -385, 168, 117, -127, -153, 112, 187, 77, -228, 76, -165, -48, -130, -121, 128, 3]
6764Cj29K45k43m6O4j42O05n14K15nj99q5L66k36n3K94j03r1Q5j19K91k96K44
6787A51o3j41J25j82J68K1K90k94J13k03J31N6l39K76k89J25j18PK21m0j67k5
6809a77J8J68R1j8k30K92j80J79j59q0K5J58m5m6n0N6k14J62K49l74J79o2K51
6832A93n9k67J24Q5k77L93k63R5m7q1Q9l3NM8J73j25M3l03J34L63k30o4P1Rj60
6857h4Q9k4R4kl30K42n8j27J39K2r2L52n10M29rj57P6N3k29O4J06Q9j41j9j05
6882a32J45P0l58r0O71l34M9P2K7j84MK6J58J12o7k99Jj41K03J74L5j81l0q8M17
6907B60k32o5J03r7L02l50q7K08K23j30j15q5J9K64j39o2Q1o6r5K36l33J91kL5
6931F4j6m2qL5j35KJ34j13J84j30P3K2J14r5k74j5M80l45J61j99J77l02R4J13
$$ y = [3, -126, 119, -124, -170, -106, -248, 357, -157, 58, 53, -146, -231, 135, -101, -154, 140, 37, -54, 31, -88, 203, -93, 151, 88, -53, 72, -110, 58, 79, 369, 75, 188, -15, 116, 172, -167, 109, -180, -55, -173, -166, 55, 15, -152, -177, -159, 9, 100, 82, -148, 144, -36, 143, -16, -96, -71, 87, 42, -4, -54, 2, -212, -50, 199, -175, 4, -58, 193, 134, -133, -9, 76, -201, 192, -71, 24, -23, -104, -15, -48, -43, 5, 178, 53, 96, -207, -73, 290, 60, -4, 67, 76, -84, 5, -19, 75, 73, -257, -15, -73, -200, -61, -39, -131, 221, -289, 140, 131, -26, 50, 103, -126, -62, 44, 133, -8, -27, -132, 13, 83, -275, -365, 306, -28, 21, 93, 120, -64, -60, -34, 124, 236, 169, -130, -129, -270, -67, 107, 142, -39, -69, -157, 260, 28, -37, 66, -31, 271, -79, -166, 42, 265, 135, 20, -65, -46, 218, 79, 17, 98, 32, -63, 173, -160, 31, 29, 64, 48, 6, -2, 33, -102, -100, 34, -79, 105, -25, 48, 70, 184, 89, -185, -200, 280, -65, 96, -103, 74, -228, -134, -21]
6955b1J82mo5k21J69L8j87K16l2j13j50L59k18K80o5J8k89M40l22j49M0J99r8
6978Gk8L4o9k5J96p6P2l48L17R7j27P6m4o7K4q4nJ27k19J32R0j42Jj57M43k61
7004c6R0o6j61J63Kj96J85K64m66M94n05K57L06k47l45J79L2o9J99r7O9j26J01
7027B7j64J37k4q6L02J01l92K01m0j94Q4R2j4Q0j51K28j6J0l58L64j44J66k77
7050f8L2Q0j64J76J12k03K27j80N5rj68O7m5j25J88m4j11M31j68p9N8J3j89K72
7074A58Kr6Q7l82J01P2j37K2K07j52rL8N3L4l0J56k80J82j28O0J1m4l3J42m00
7099c66L87N8j82P2L3j23J06qk01M52k17K11m60K15N8r2l10M52l01M42l11j31
7121b16M00K09o17K17J78L0j09j31j12j7M4K40j61K07j4q2J98k76q9L53k96r8
$$ y = [-21, 161, 157, 92, -129, 40, 78, -109, 107, 75, -38, -188, 171, -47, 233, 168, 186, -103, 337, 15, -134, -94, 105, 7, -21, 13, -56, -81, 115, 39, 111, -237, 80, 177, 50, 126, 82, 15, 39, -45, -50, 77, -142, -10, 80, -62, -61, -218, 225, -36, 54, -12, -173, -10, -8, -204, -19, 245, -221, 273, -232, 25, 331, 84, -261, -82, -50, -119, 80, -17, 52, -74, 27, -137, 0, -24, -110, 192, 293, -99, 102, 62, -132, -48, 44, 30, 110, -41, 187, 171, 181, -177, 187, 43, 209, -68, -36, 44, -120, 56, 168, -35, 192, 12, 67, 58, -110, -43, -88, -213, -25, -69, -180, 251, 83, 4, 62, 75, -114, 158, 160, 64, 151, -231, -130, -58, -195, -173, 34, -118, -127, -89, -36, -2, -32, 124, -156, 26, -102, -42, -31, -75, -108, 34, -366, 21, 79, -103, -31, 2, -121, -15, -23, -224, 228, 11, 222, -238, -23, 35, -57, -367, 85, -216, 226, -85, -216, 184, 393, -224, -7, 171, 201, 92, -39, -151, -168, -124, 116, -45, 162, 148, 66, 264, -12, -101, 252, -44, -142]
7143a42K9J44N9l3j59J46j27r6L72k92J27L9l09O4L70k92L63l45M5J06k10N0N6
7166c5J34o6O7j84n1K60o5j43N8L51j58k01P8J06k81J41j1j54K23o0O4n6l4K21
7190B04l55J17J79o5J30k35j21K87p9j29K79k55J67l25J63J5J28p0J25l6k81J51
7212fM3o1j07N0m3p7L79o1k82K95k63K58J01m61N8K88p8O6m3q1J90j46K5J72m86
7237b70L62k06J77M6l66N9M81k86p3l1P3J76j04o4k2J47O0k45k2J46j83J67K68
7260B90m67J28J9K9J45j4k38K25j95K59l0k24P9O2M7k97%K07J69j45k84J05J8
7283a12Q6j87R0J68q3j74L82l82L02j58J92j48K13k56N2l5J01q6O3j10J8L02k53
7306a5j6M1L1M8j44M5O9l0N8j13J25j11n1J67l06M31l72J70J43k14j65L69k52
$$ y = [-142, -113, 31, 90, 57, -102, 44, -83, -179, 193, -99, 28, 67, -242, -178, 192, -100, 263, -82, -37, 69, -141, -91, -35, 99, 33, 100, -84, -135, 125, 60, -83, -25, 326, 168, -33, 45, 151, -130, 11, 0, -154, 69, 9, 73, 17, -17, 204, -151, -34, 145, 80, 210, -25, -146, 141, 62, -67, 212, -43, 124, -201, -38, -23, 105, 35, 160, 124, -157, -6, 37, -24, -131, -81, -124, -201, 178, 117, -165, 130, -133, 125, 226, -235, -177, 111, 33, 99, 56, -25, 165, 19, 44, 216, -270, 92, -114, 63, 109, -257, -198, 283, -3, -76, -107, -34, 142, 38, -26, -48, 99, 159, -86, -108, 38, -145, 22, 290, -177, -49, -30, -1, 144, 130, -108, 117, -78, 181, 151, -73, 6, 68, 115, -182, -182, 25, 194, 49, -235, -130, -112, -26, -213, -123, 45, -38, -212, 170, -212, 90, -68, 124, -24, 189, -67, -15, -50, 51, -35, 28, -82, -64, 238, -15, -31, 10, 41, 89, -55, -10, 59, 29, 87, -26, 99, -12, -63, 104, -202, 229, -143, 27, 170, -44, -209, 160, -92]
7329i2K28M9l12M33m52M32m62J58L7p1J99l48R4j69K37n1JJ11M5j13k8j01J21
7352e4J93k43J47J9N6J05k63k0P4o8K45l97K10r7l0K49l8k5k42q6K95K6j8k22
7376a84L03k31K7J7J5k0j11R9M4J66q7j67J62M8q0j39R3O3K45l43J51Kj70N7L46
7401C06j06o1j05k9K56m41J31K16o3k10J8K77n15M18j94J90j00M8R4Jj17k7l5
7424d8j85m0J73K80k41J42P2k63k5J6J28K30j36j12J92k46J4j08K43j77K08n7
7446F0j13J83j63j17j4N4n7L73p4j40J21K4m58L16P7J0k62K96M6j0k0j22J38j55
7470gj3j05M6K17k44L68k85K75l28K25j52j23N4K32k36L8K0l4m9L2l0N8Q8J0l1
7495B6j48R4Q9J18r6j01j12J05J61j22m3p4J76j78M7K53j92P1m9N0p9J64k72L02
$$ y = [-92, 136, 185, -127, 306, -146, 286, -176, -18, 19, -52, 147, -201, -107, -276, -39, -90, -89, 22, 67, -46, -74, -175, -54, 139, -104, 43, 62, 118, 223, -40, -60, 14, -54, 191, -206, 4, -93, -123, 126, 88, 63, -179, -265, 30, 56, 38, -184, 119, -112, -85, -68, -53, -73, -184, -85, -41, 125, 38, -129, 33, 81, 1, -138, -45, 18, 263, -80, 71, 73, -97, -40, 306, 200, 139, 34, 5, 261, -180, -49, 167, 104, -106, -88, 189, -326, 92, -102, 88, -12, 36, 130, 131, 14, -13, -48, -233, -273, -100, 180, -61, 81, 153, -110, -135, -119, 9, 239, 103, -9, 183, -63, -49, -157, 86, -91, 117, 60, -53, 130, -33, -150, -164, -110, -167, 206, 132, -8, 113, 137, -321, -5, 72, 82, -180, 116, 162, 152, 132, 10, 148, -7, -20, -125, -79, 138, -106, 262, -23, 252, -76, 149, -3, -126, -72, 160, -76, -38, -18, -52, -101, -69, -99, -41, 47, 57, 26, -122, -28, 61, 179, 83, -18, -130, -25, 136, 14, -29, -103, 73, -105, -58, 195, 3, 74, 25, 75, -4, 160, -112, 190]
7519A90J22l17kJ60J3n8J39l32J01J54J18m30k4K01o6K0n7o1O9nJ73K4l54J29
7543i3K67l03J70j64J24O5j75J4J94j42N1k59K27j42q9J42K18j29r2K14k66R2
7565g6Q3K2j18J00j04L38k77oJ12j63j40L41L3J02m51L17k2KJ35k04j00J81l60
7588b55O9J74N9r0Q0k9Q1k29J43K09j85rj7j24L44j07k43L20k99K53Ol16L1K21
7612H7k87J86q6l3K1k4K20n1j22j8Jm2J51j28R6J26r2R8k73m1J59j51L04j19k25
7637b43R6J95k00K61j24m1P2j28K22o2J3k1j02N6p5J28P1j6j37J01N1l53M37l09
7661a08J3M4k0K58L7l31k3K18P1m4j02k7J95q7k19L8j36M04l72J22J84q6K36k80
7685a5lr4k1N6L21l40L6J66n8j0Qj53J63j44j26K08j46M3O0L65j34k85oK16o3
$$ y = [190, 312, -5, -7, 153, 166, 108, 247, -85, 16, 170, 288, -142, -166, 35, -31, -11, -68, -129, -60, -65, 108, 132, -222, -93, 174, -129, 41, -123, 1, 66, -109, -95, 99, -43, 8, -251, -24, -166, -255, -113, 105, -24, -116, 98, -168, -76, 7, 29, -89, 11, -93, 245, -32, -38, 74, -89, -229, 112, 145, 247, -204, 113, 91, 93, 228, 24, -76, 105, -255, -186, -12, 47, -43, 37, 8, 89, -140, 3, 212, 27, 18, 1, -123, 221, 114, -129, 191, -108, 145, 151, -165, -134, 87, -200, -14, -100, -133, -112, -136, 84, 33, -89, -107, -106, -148, 3, -125, -29, 97, 5, 103, -170, -211, -52, -203, 101, -18, -243, -147, 48, -152, 109, -15, -56, 16, -112, 110, 48, 61, 40, -62, -6, -81, 47, 118, 102, -35, 66, 117, -236, 201, -108, -95, -51, -71, 187, 224, -107, -130, 88, 159, 115, 13, -14, 181, 94, -125, -87, -223, 181, -191, -69, 115, 29, 265, -15, -18, -112, -133, -77, 244, -96, -60, 106, 48, 38, 46, -107, 56, -88, -214, -6, -152, -109, -49, 316, 182, -103, -109, 107, 44]
7710D4l0J42m82M19o4j26j55K46j94K25J81k23j7P1oj48K8j55K37m6J00QP4l16
7734a87L5K07j15J66J3k8j40o5k0M3M13l61l8M6J79j27k92L06j5J35p1p7J04j33
7758b2L5r5p5K4K59k95K09L36k28j30m3J17O9j43Ko8K7q3l0J00J40j81K50j35
7782D0k08N8J14J06r8l2l1P3j91J33J5pj4p1R1p5J5Q6J52k27j08K62J59j10l02
7807a70K36L6M8l24L96j91O1J2q8p9j36L93m65J89J28L8j87K06J01q3k67K50l7
7830F7J3j6k93K66j2m2j63K20L9lO4j68N9n2j9J02j2n6M3O0J11l12K23j51Pj74
7856a99O1J02N8J84m00J61J85k00j42K27l9M1l2J40j76L5m7J23j07K7n7M4n8L5
7880c4mR1K6L7r1j73O2J24j5J5Q7k47J28j9N5K75l68o0K47j77j7K62j81OJ50j73
$$ y = [44, 14, 156, -326, 93, 29, -97, -252, -6, -200, 25, 206, -17, -34, 37, 31, -117, -89, -244, -7, -53, 47, 55, 129, -187, -152, 55, -60, 106, 119, 91, -49, -114, -134, -91, 322, -39, -77, -31, 148, 21, -271, 35, 20, 155, 84, 7, 111, -22, 13, -82, -157, -133, 126, -169, 40, 376, 148, 18, -25, 92, 161, 18, 20, -48, -21, -104, -134, -34, 106, -75, 175, 40, -168, -110, 4, 110, 12, -20, -51, 22, -169, -36, -21, -28, -42, -113, -22, -97, -82, 4, 156, -71, -179, 83, 242, 132, -170, 66, 102, 150, -174, 222, 31, 92, 104, 16, -63, -199, 194, -271, -82, 46, 84, -103, 103, 204, 121, -146, 104, 67, 80, 64, -229, 37, 25, -17, -180, 40, 79, 76, 140, -28, 31, -21, -40, 62, 50, -6, 37, 97, 208, -104, 119, -32, -25, -199, -138, -36, 22, 206, -194, -33, 152, -48, -190, 37, -2, 39, 7, 147, -29, 6, -41, 82, -25, 2, -55, -11, -69, -34, -38, 53, 79, 116, 25, -148, -86, 38, 23, 38, 125, -122, 6, -13, 42, 317, -51, -111, 136, -41, -58, 204, 23, 29, 179, 6]
7906FJ87m59O0M76k19M1k2k43J22O9J0l77L66n0k9m1m4P4k3J3kK40l89J03q6L15
7932I8k32O6K73M5j43J06m64J18l5L78m61L08p1K20j58P7k08K00j25J16J7k40
7954a15K31J31l28P0j7J48j79J87j73J27N1j19M2j48R2j07Q1M8K50k63j54L05
7976A60n7k76J28J25k53K55j43K22r9j54j75L09q0Q0j00N5P3j29J53P5k53J30
7998D6L13j79k09m0J09K7k42mM05j31j36K10k17j94J76pJ44j40K27k81J91k07
8020a39J96j42L0R4l6m5q5J99j79K05r0P8M5p0k56k1L44j59L8K34j55k02J06J38
8044A28j85pj10j87K28K49p8rJ4P4j12n0RJ91j84M0j4K73k96Q9j2J24j46j29K55
8069A55l46R5r0J16J3j22j70K42j4K81j68j6J39q5j62L21q5k82q5L28K39p0l89
$$ y = [6, 193, -266, -206, 270, 51, 92, 70, -173, -51, 18, 28, -349, 17, -33, -62, -103, -147, -73, -96, -83, -85, 155, -234, -131, -217, 98, -134, -68, 205, 250, 107, 213, -251, -133, -168, 210, -251, 57, -14, 206, 48, 125, -83, 117, -8, 108, 125, -115, 116, 247, -81, -11, -28, 120, -59, 128, -45, 82, 133, 14, 56, -92, 0, -107, -26, 22, 272, 9, -145, 160, 103, -173, -45, 80, -173, 82, -61, 161, 62, -92, -267, 42, -38, 42, -58, -3, 70, -59, 94, 169, -84, 46, 359, 180, -29, -69, 40, 67, -175, -179, 226, 95, -41, 169, -48, -242, -66, -73, 71, -69, 158, -123, 68, -139, 57, -85, -55, 39, 3, -42, -127, 72, -107, 98, 8, 86, 131, 61, -195, -216, 128, -31, 7, 241, 86, -116, -10, 128, -57, -64, -174, -361, -133, 116, 38, 29, 43, 117, 5, -45, -36, 155, -29, 11, -3, 270, -26, 63, 51, 175, 29, -100, 155, -191, -96, -186, -70, -57, -179, -349, -107, -121, 160, -8, -24, 115, 30, -132, 189, 104, -178, -263, 65, 304, 234, -155]
8092a55j0J32R7o0J81k3qk39N2K69m09J94R7l8O4j99l1K73j50J11k39o0J95J73
8116B17k27R3q2N3K9j59P0j92n2K87l09L58P4k51L81k27q7r1k7J28j56J54J38
8139A22q2l40K23k9J74p7jK00j38j13J8k1K59m67N9K10P0r0q6J23J36r9o7K63
8163B47o48L03j30J23o7Q5Jj11J08j5J79l16J64P4q5L63k42K2qk08j7Q7K52n4
8187A07j2K45l05j21
$$ y = [-155, -165, -33, 64, 4, 185, 162, 154, -85, -33, 236, -173, 21, 118, 80, 144, -55, -86, 187, 37, 148, -91, -151, 44, 217, -10, 83, 1, 54, 83, -76, -6, -198, -250, 37, -272, 86, 160, -91, 290, 63, -24, -115, -142, -14, -170, -16, 122, 40, -300, -77, -106, 68, -9, -10, 190, 52, -61, -43, -64, 195, -272, -213, -3, 67, -23, -109, 14, 150, 51, -16, 247, -401, -98, -228, -105, -172, -87, -86, -197, -89, -104, 75, -241, -77, -3, -88, 275, 33, 55, 47, -161, -178, -91, 161, 107, 95, 340, 35, -86]
8191h6
$$ Imaginary data points
##PAGE= N=2
##DATA TABLE= (X++(I..I)), XYDATA
0@%%%%%%qJ6j6J6k4L2m0N6o4Q0j04J23j47J76k16K59l07L68m32M99n79O70p69
29d11Q86j017J159j318J491j682J895k130K387k668K977l313L680m082M520m999
45b625N526o101O726p409Q160q986R898j0910J2035j3294J4713j6322J8162k0298
59a0725K2813k5816K9478l4061L9975m7928N9239p6654J07055j74582N68863q4803
71C72854q93763O61118m61248N04262L40506q62075K19533J7017K2365O21361
81E41930p84188P182L53094l75405O48179k58018o06683O93106l02641J51464
91F8020L40813r03652M50808L78930n24132M32346l87060j94152O90374l60174
101g879m315J0071l48893O20463j59918k52898L24627n38700L67097M22398o71204
$$ y = [0, 0, 0, 0, 0, 0, 0, -8, 8, -8, 8, -16, 16, -24, 32, -32, 48, -56, 67, -80, 96, -120, 139, -168, 200, -232, 267, -312, 358, -411, 475, -542, 617, -701, 790, -892, 1003, -1127, 1260, -1408, 1569, -1744, 1936, -2146, 2374, -2625, 2901, -3200, 3526, -3883, 4277, -4709, 5189, -5721, 6314, -6980, 7733, -8589, 9573, -10725, 12088, -13728, 15750, -18311, 21664, -26264, 32975, -43679, 63376, -111206, 457657, 372854, -520909, 140209, -321039, 183223, 523729, -338346, -118813, -101796, -79431, 541930, -242258, -235076, 118018, -257387, 390792, 132774, -473909, 219197, -83444, 68020, 408833, -494819, -44011, 334919, -189213, 243133, -143927, -338079, 352295, -7879, -12194, -2123, -351016, 269447, 109529, -143369, 181258, -357442, 9655, 432053, -239151]
112b39151K92266r1327k55308P21342l88402k86363L53518l17143L46259R7721
122B33412m82299K67192j10771P9322L02223n06023J69395J31987k71946M70115
132B82607k71561k83679M77651k77097Q8461K05238m91017K84124J31086k58028
142a12215K41987k24277l1085K72472k07507J23985q0841j64550L71136j95250
152f145n1253K22234l62855K17918J97446l60690J98894n0899j44484L05015j81735
163a6554o1667J23929j58287J83313j8020j51064J59648j26683P9912J11472k51253
174a25254J70891M951j60638K55571j69951j08385K58367j62043N641R0650j67077
185a07277J24661K8645p8137N8253r8604Q2621O0635j23385J00349p2608m4764
$$ y = [-239151, 53115, -38212, -293520, 427822, 39420, -246943, 106575, -210568, 135691, 233412, -248887, 18305, -92466, -13144, 289079, -216944, -47549, 84438, -187508, 282607, 11046, -272633, 205018, -72079, 16382, 221620, -269397, 14727, 145813, -112215, 129772, -94505, -125590, 146882, -60625, 63360, -17481, -182031, 189105, -6145, -57398, 164836, -198019, 19899, 217345, -143345, 55549, 4650, -139834, 165181, -16554, -78221, 45708, -112579, 70734, 52714, -98350, 61298, -65385, 14527, 125999, -125254, 45637, 50588, -110050, 145521, -24430, -132815, 125552, -36491, -30850, 59800, -107277, 17384, 46029, -32108, 26145, -72459, 10162, 70797, -52588, 47761, -24847, -69611]
196f9611J83454j39764q365J04836j65722J07141P3351j55373Q0162o623m8715
207d5229Q6433m7246j095O382k8220O8726n7422O624P2272j08195M6698M5145
219D4873q8184R2832k9631q7496J09996l5858l5074O8012o5185k063M6151k3050
231d677P849p991Q986m254j9444O4186l3489m5983P5827m4151k1135P1102o1609
244a4783r554M7173m9900J6077L1476l7060K494J1021l29Q629N786n892k5245
257b0107K5796K4134m1835J5335R531m5422M0447J6482n4114K1866J1794k5626
269b1719K8070M085l1455J5394J9686j7070M40J6873j7148m114K4367j8897q920
282a0408K7757k0657j2631K8728j5676r194K7780j9130j6938L0976j428j7857
$$ y = [-69611, 113843, -25921, -34286, 70550, -95172, 11969, 85320, -70053, 10109, 3486, -45229, 41204, -6042, -7137, -755, -28975, 39751, -17671, -11047, 61225, -46970, -272, 44873, -43311, 49521, 19890, -67606, 42390, 6532, -28542, 39470, -25715, -27778, 18373, -4677, 3172, -4819, 4167, -87, -19531, 44655, 11166, -34817, 41010, -3141, -24276, 46826, -14783, -24337, 22836, -27064, -10987, 20489, -16571, -14077, -3056, -3385, 5244, 11030, 5138, -20107, 5689, 29823, -12012, 3323, 12854, -32568, 7879, 24361, -29753, -7887, 3907, -21719, 6351, 10436, -21019, -5625, 14061, -3009, -2569, 14304, -2844, -6958, 17409, -1488, -10408, 17349, -3308, -15939, 12789, -2887, -12081, 15699, -3431, -20369, 10607, 9179, -8678]
294h678J5268n855j3434K8176O15k8983J4268J0131j5829J4664J558k7063J5701
307E39J4612k4483N569J2543k2179O757J9288k0322j805K0635j2557m710J7034
320A0921r509l784J6307j3950j0088K2066q221j5850J5651q885r509K2848r600
333a603j6537J8512j71o058J3636n711j1451J4190Q365j4139j396Q097j2099M858
347a507J3158k6039K760K2266k1815N521J5293k3961J1739J4950j6885O693M133
360F306q146N012L579k509r445O349Q679j9329R443J0132k2001J5979M46j9661
374a5166K9439q367k1116K5620j0497m063J9215j8346o75P510l068P048q367L900
388C067l715j3230K9972r425k3699K6641j8135j734L0218l0800L181J6932k5599
$$ y = [-8678, 6590, 735, -12699, 15477, 16092, -12891, 1377, 11508, -4321, 10343, 11901, -15162, 539, 15151, -9332, -3763, 8780, -13399, -6642, 12646, -7676, -9481, 11154, -1403, -6113, 10921, 1412, -2372, 13935, -15, -10103, 11963, 3742, -12108, 3543, -5342, -14851, 7997, -1603, -18140, 372, 201, -5857, 7779, 2068, -9383, 4807, 13172, -967, -2363, 5734, -6365, -1507, 11651, -14388, -11628, 10638, -11177, -5656, 9637, -14324, -2585, 12365, -4520, 2173, 6306, -1840, 3172, 6751, 4242, -5203, 1146, 9825, -9504, -61, 10071, -11930, 4049, 4495, -15166, 14273, 5906, -15210, 10410, -87, -4150, 15065, -3281, -3956, 3554, 486, 7534, -833, 3067, -648, -13878, 16094, 6669, -17030, 9611, -8524, -10258, 19960, -10840, -7659, 9273, -16326]
401a6326J9895P781j6492J0508j4372M713J8465j2714K556j4884k619K9059k0984
414e414K655R443l5747L0070J5388l0783K3720j3848j4911M0227j4299j0998Q550
427D053j2696J6945m258j0190J2645j7343J3274M758k8559L1163k496k2777L0712
440A5231k1658n491L5083k4438K750N548k4288K8243M048j7517M847j8759J5886
453e15J8243j9248M233j6988L675L4892k7126N21J1811l3075L0389J4985l2692
466a0895J5030q910o808K8255j3278o565j513n685K4163j2107j0203J3835j8636
479a3317J6255Q667k8346K0179l450j2732K9489k1301q786K3585j6297J1793M559
492A0298k6391J3299P754J819q79k5104J4986J1186r421J4359k4095o715L5019
$$ y = [-16326, 3569, 11350, -5142, 5366, -9006, -4293, 14172, 1458, 4014, -10870, -13489, 15570, -5414, -2759, 6684, -29063, 1007, 16395, -14388, 9332, -4516, -19427, 20800, 6501, -4497, 4053, -8643, 8302, 4044, -6146, 6499, -10844, 2430, 7188, -21371, 9792, 7296, -15481, 15231, -6427, -11918, 23165, -1273, 1477, 7025, -17263, 10980, 15028, -2489, 2358, -16401, -515, 17728, -1520, 2713, -14275, -10600, 24292, -2834, -2313, 9498, -23577, 6812, 21797, -10895, 4135, -4775, -11583, 16672, 3394, -3171, -4684, -10369, 13794, 1687, -8516, 5319, -13317, 2938, 11605, -16741, 3438, -12, -12744, 16745, -4556, -13342, 10243, -6054, 5739, 10298, -16093, -2794, 4960, 6779, 5900, -19204, -4218, 6968, -2453, 11906, -12189, -18904, 16115]
505A6115j5327J072Q010k9069J9892J6330j6675N799j4291j330K2778p480m680
518A144j0873j471K7622j3423j0659J0497j2762J9366N514k9140J6415L211r018
531c577J9340j8480q753J7631o429P337l107j7510J0564N047Q402m065k5566J7339
545a827R173r466J5986k1279j0897L0573r358m164P601j8161Q300Q844m640N237
559E922j4465O02J3381p085M857n811q178J7004q740r98J0821j7440J0373Q609
573H852j9322J4294J866j3010J3423m512o352O472k869N519m502o995R158n754
587c732O851N663k0034R497Q724r416J2919q801j2172J7232k754j667M492j4412
601g610L959Q519k083O09j0115K589R046o088N993m952p944J5627n052n309R785
$$ y = [16115, 788, 1860, 9870, -19199, 693, 17023, 348, 6147, -8144, -9474, 13304, 5824, 1144, -9729, -11200, 16422, 2999, -7660, 2837, -9925, 9441, 14955, -14185, 2230, 5441, -3577, 15763, -2717, -11470, 6161, -268, 7069, 3962, -13548, -2984, 2063, 10465, 6400, -19166, -1827, 7346, -2120, 13866, -7413, -18310, 12263, 2905, -1259, 6342, -11819, -3519, 5325, 685, 5922, -8543, -7941, 5440, -1645, 3212, -2599, -10777, 6227, -2513, -3511, 7310, -10130, 243, 8852, -10470, 3824, 5690, -7320, 6103, 1591, -4761, 1711, -1158, 4361, -141, -7136, 2022, -3732, 3119, 8782, -11252, -1755, 6969, -2447, 10472, 1671, -10501, 6731, 3977, 2310, 6802, -7610, -3651, 4868, 2785, 3394, -6721, -4132, 4914, -1174, 4819, -133, -8077, 7550, 2498, -2811, 6974]
616F974j1563K616J0390j2425K534L595o367O534j712m799K427N41N838o528m954
631f899J0384m375J33N942j2726M967R056j0187L968R14o576P752j427l791M266
646A401l629L40K132n51P24m403L729L406o731N498J43o851R883j999q250Q899
662C741q78m696M725l180n79K027j497N57r08R85k02k145M700n19l559M015k802
679b15L70P001p531k268P001m578r8L448n381n15L055m99o71J44O99k229J831
696d36M000l971r26L241l230J916J782n252K657J923n549K616K045l503J450P80
712d57k669J477L740k288k998L295R05k628L613o88m610L325J930k994K285j562
728c24k613L691O23k428J265n98j605K731J254l185J038K417k766M47L671k987
$$ y = [6974, -4589, -1973, 8417, -4008, -1474, 2121, -4246, 2288, 576, -4223, -1796, -1255, 4583, -1945, -6899, 3485, -890, -757, 5185, -7541, -2574, 6482, -3705, 263, 1177, -5399, 2353, 926, -2865, 1401, -2228, -1888, 244, -307, 417, -3986, -257, 3149, -3582, 1916, 2059, -4792, 5091, 3092, -5158, 3741, 2863, -1833, 2892, -288, -867, 1160, -337, 220, -688, 297, 95, -2050, 2650, 2131, -1428, 2587, -215, 155, 7156, -375, -2643, 4358, -220, -318, 3130, -2251, -2766, 289, -210, -881, -737, -38, -2267, -436, 3564, -407, -1333, 1908, -1322, 594, 2376, -2876, -219, 1704, -3845, -1229, 816, -2687, -1237, -457, -3126, -1649, 2091, -197, -3195, 100, 1005, -1623, 1990, 1302, -3308, 17, 1947, -1047, 1238, -324, -2937, 754, 1377, -1051, 214, -384, -1989, 742, 1996, -1189, -151, 2266, -500, -53, 3618, 631]
744F31j139L403k440r35L775k568k605K617p63k57J438j345k043K990N32j894
760f03J841o41j927L102J086l386R86N46k824K082J941m442m30L037j742k79J956
777C03j973l17K531j090k30K647j861j705K198K19j468J894k267k215L263N46
793D75k749J486n6j958K810J564k801L95J571j251J287J868k733p63K119r60K3
810C27J453k578l25K489j719o4J982k026q15K531n14l40J460j003j988K736J496
827C102l385M50J920k740J604J259l369N70J386j914J117N96j831L84Q97l61J3
844c02O21p6o67J473o49j759L020q55l053K233n26j340K662k166k100L322m89
861f51r27J366m83M4L45J354p61j108K264j486r08K759l053r08M698l254j654
$$ y = [631, -508, 2895, 455, -480, 3295, 727, -1878, 739, -24, -281, 1157, -188, -2231, 759, 1291, -603, 1238, 597, -1330, 1772, 2858, -528, 458, 1004, -1820, 262, 2203, -2239, -2669, 368, -1374, -1653, 303, -1670, -1987, 544, -546, -776, 1871, 10, -1695, 503, 722, -746, 1148, -1119, -3334, -71, 475, -2274, -788, -844, -2802, 8, 1572, -1229, -834, 737, -514, 773, 2641, -92, -855, 1264, 304, 327, 1780, -798, -1123, 1366, -353, -417, 1565, -461, -1276, 1255, 741, 401, 1861, 858, -1130, 1606, 3102, -283, 167, 2087, -653, 951, 2210, -1159, -589, 797, -1117, 0, 596, -1235, -851, 46, -315, -302, 319, 243, -424, 1049, 400, -1359, 1661, 806, -2247, -14, -540, -1880, 782, -1384, -3484, -162, -651, -1578, -212, -695, -651, -306, 1048, 287, -821, 1443, -43, -951, 1808, -1245, -2153, 2545, -709, -2363]
878b363K294j172K030L07k738J378J066Q51J84j969J211q80J13L141l056j233
894h36J214k068L947N88o235K910J252j340L486k731j969K794r04J513n94j266
910b39J667l361K695K455n653K734J319m260M401k301k098N218l595j220K086
925a52j776L884j174l727L063j227J550K923n487J154O3r96O660n229l838L963
941c46k565M605K231r261K495L204p84M242m954r27L044j542M645k530m752N205
957B010l042O92M965q147J290M767m077L354k469j865O701l791m93K159m099N731
973C686j92n699L604k155J483L547o965J755J312l410P924l894n667N695j980
988i56K506K394p715K643K099p01L233n964L2M877m275L163n19n597O568j765
$$ y = [-2363, -69, -1241, 789, 1096, -1642, -264, 802, 1653, 1837, -132, 1079, 199, 312, 3453, 397, -836, 378, -1690, 2257, 2845, -3390, -480, 772, -568, 2918, 187, -1782, 1012, 108, 1621, 1027, -239, 1428, -1933, 762, 3217, -2436, 298, 1617, -2643, 1758, -543, -2641, 2577, -1018, -2238, -152, -1928, 1956, 782, -2945, 118, -1109, 441, 3364, -2123, -969, -906, -1902, 4758, -471, -4309, -346, -2911, 1694, 3925, -5336, -2841, 363, -421, 3821, -1133, -2060, 984, -558, 4087, 1557, -3195, 2010, -1032, -340, 4625, -3522, -2232, 2535, -1542, 1812, -657, -2522, 4179, 388, -105, 2054, -2045, 3686, 3494, -2205, 1399, -756, 727, 4274, -2691, -936, 376, -3034, 4890, 996, -4671, 1024, -956, 1550, 3944, -3771, -1128, 971, 270, 3503, -2461, -2429, 2448, -1827, 1336, 817, -4780, 1788, 23]
1004B3k528M566n308J662M217n060K512q40j885O512m331j677K935k735M556l45
1020B274o444M770j476J93M306o644J099K620l269N527j605n207N041r88J445
1035A642J628n489K731J101j551L359m818k6M863n016J227J746m188M334l85k513
1051a355K749k486K152K889m980J179K89o58M559m436k849L258j174L404j799
1066G42n051M181l35jL471n250m47L485j041K737k023l306L222l72J415m96m678
1083c747L440J451k561J709k043J52L300l487P51J663j874K262n44j527J633j220
1099f42J833L83k851J239k68J66K751l413j534K613j58J092j084k677K858P76
1115A084m62Q99k127P38J547o45Q06j768m32J730j519J041L51l507K014Q98j320
$$ y = [23, -2505, 2061, -3247, -1585, 2632, -2428, 84, -756, -2641, 3871, -460, -2137, 798, -1937, 2619, 2274, -4170, 600, -876, -683, 3623, -3021, -1922, 698, -2571, 2956, 1351, -3856, 1185, 197, 1642, 3270, -2219, 512, 1613, 62, 3421, -1397, -1423, 3440, -1576, -349, 1397, -2791, 1543, 1158, -1355, 1394, -1092, 1060, 3949, -1031, 148, 437, -221, 4338, -98, -2947, 311, -863, 2541, 742, -4309, -128, -463, -464, 3007, -2243, -2690, 795, -246, 2491, 468, -2838, 384, 12, 1427, 931, -3747, -307, 1144, -1417, 292, -1751, -1599, 1701, -1786, -1035, 628, -1246, 1016, 472, -1055, 578, -642, 1191, 1574, -1277, -38, -306, -140, 2611, -802, -2336, 277, 119, 1211, 127, -2550, 308, 1084, 622, 1521, -606, 132, 1679, 1034, 1840, 72, -360, 1370, -149, 892, 1243, -2264, -250, 648, -672]
1132f72R70p96P5J313o60M71n16j11J263r87o27R94r27J37k13r55J338j241n20
1151a664K040j596j32J363j037P53M61k97M4j03R24k70j728J342j32o32P31o59
1169e92m92Q10n39O08K83r00R37J05n38R76l42p29Q57K21j47p43P30Q41j288M0
1189I8M65j008O96N74j498L28M20q2K05J9K37J21PJ78K24n16n0k2L37m72n23M57
1211A95n98n22J131p71p12R73J51n36L69P33k31n4J11K2k1L49j094m02N06M29
1231B8p83m01n45R42O72o46k64P33l38R4J020n4k85J7Q4n29R03l26j372N95O12
1252A57n04Q6K7j98j09O24K01K74K56j147O84R21k97m15o9l95R4J102n89j272
1272e69N86L45n87L05P38j288k23P45L85R9l00l29L27J88K76L30o66o39L13N72
$$ y = [-672, 298, -498, -423, 890, 230, 701, 185, 74, 1337, 350, -277, 717, -210, -73, -286, -1241, 97, -1144, -1664, 376, -1220, -1352, 11, -1026, -273, 188, -109, -65, -168, 756, 486, -1242, 100, -32, -664, 67, -592, -1084, -274, -813, -205, 78, -822, 115, 220, -318, 658, 316, -413, 444, 665, 518, -225, 505, 1346, 58, 98, 563, -445, 251, 825, -673, -345, 75, -7, 198, 217, 454, 575, 582, 760, 984, 468, 418, 396, 733, 261, -262, 195, -403, -925, 206, -565, -1277, -304, -153, -689, -320, 413, 182, 128, 239, 261, 240, 589, -505, -907, -401, 28, -755, -1156, -1701, -759, -87, -733, -997, -264, -602, -508, 512, 458, 173, 190, 274, -255, 648, 322, -1050, -455, 157, -347, -261, -234, -432, -541, 83, 284, 558, 814, -333, 351, 1272, 975, 560, 491, 96, 190, 1292, 703, -569, 17, 362, -225, 80, 818, -470, -693, 52, 437, 536, 236, -93, 234, 422, 698, 1028, 362, -277, 36, 608]
1292F08n79J26l06j560L53J902q39j161J012m25K4J307R1j145L84J005m41k16
1310A40L48m28j358J064M33r85J2m25M39J22o1Q40N9r15J126M1k55J251k13j497
1330b62J99P39K92j220J50L66j738J371J396j844L18L23q12K109J36j824N37L45
1348E81Q62l88j101M96n96p8Q45j072L41K47j666J804M27k013J486m23l3J393
1366A112k263Q03K002j555L16p00l85J778j020m58k23j603K522o46n15J760l837
1383b912L59N146k457j334P01j142K897P32j920p94n62K528Q4k697K110j534r56
1400a751L044k199o7J428k139K396N63k661K694n5p62J395k891J279K285j650
1416I09o91k184Q20L425k460J96l88l155N419R59m030K201k555M38M898k294k009
$$ y = [608, 29, 155, -151, -1711, -1358, 544, -295, -1456, -444, -869, -845, 462, 553, -592, -208, 797, 356, 140, 488, 60, -1298, -234, 199, -786, -774, -1199, -760, -638, -699, 141, 200, -715, 411, 452, 197, 1448, 1235, -262, -63, 676, 968, -252, -102, 264, -1474, -103, 1293, -551, -233, 90, -722, 1387, 1523, -301, 236, 581, 1443, 1055, -46, 450, -146, -224, 621, -451, -110, 137, -1529, 275, 702, -1311, 175, -248, -281, 1112, -1151, -348, 1654, 99, 415, -285, -670, 1108, 88, -370, -593, -2196, 326, -320, -835, 925, -2912, -2553, 2593, 136, -1198, -497, -1639, 1258, 1990, 70, -724, -1286, 1242, 1326, -1371, 739, -795, -1751, 1293, -906, -973, 455, -1684, 712, 1275, -1386, 1308, 1253, 491, 1886, -1005, 274, 2559, 909, 218, -1966, -1146, 2279, -181, 15, -373, -3528, 1891, 2850, -1180, 1021, -1534, -1096, 3802, 1508, -501]
1433e01o74j48L495j285j628J17k194L660P71l841K978j634j446M571l008n4K418
1450A597l087K417O7l014L199o34j332Q77k568L341J28k385J914l732K333M538
1466C659n825J080J943l907N218K24m160K254j434J364K545l296N28j566P14L892
1482C233m341k03K169l461M322l16m776N920k034j285L871m166J292K841l484
1497d18J650j479r80L788l157P05n64l142O577j704l957M252m355K525N420p304
1513b143R94K862l343M211j700l172K543k228L311k60m471M129k172Q9N172p362
1529c540J805M699n029M066j846m536P667k450k611L009l940K950K043l827K087
1544E47l039J446M571n805K739m45m446Q854k438n387N431l858J688N003p180
$$ y = [-501, -1175, -1323, 2172, 887, -741, -624, -2818, 842, 1613, -2228, 750, -884, -2330, 2241, -767, -821, 1597, -1490, 927, 994, -2020, 1179, 545, -787, 90, -2478, 863, 991, -1394, 520, -3212, -879, 3659, -2166, -1086, 857, -3050, 2168, 2392, -1768, 486, -948, 416, 2961, -335, 193, -1373, -659, 3233, -1108, -1311, 858, -2603, 1719, 1403, -3373, 2547, 513, -772, 3099, -1067, 225, 3066, -418, 1232, -247, -1227, 2561, -596, 109, -455, -3597, 2980, 1276, -2681, 1571, -2784, -259, 5161, -2143, -1149, 1713, -1630, 2581, 881, -2291, 252, -1976, 1335, 1075, -3396, 733, -1439, -1350, 3822, -3540, -1735, 2964, -2065, 2001, 155, -4381, 3286, 836, -1775, 1234, -2706, 244, 2287, -1540, 547, -2492, -1046, 3525, -2280, 459, 14, -4432, 4422, 1984, -3403, 2028, -1830, -142, 4861, -2319]
1559b319J685J685k323M384l489q05K493l417M318j300m309N971l655Q0N659p657
1575b999K462M379o018L427o44k654N144k804j356J749l028L512n50k791L578
1590A407m055K111M428o931L402Q55m635P046k046n005N159k613P4L204m509J214
1606h94L74p00L185m087R48J965k847M402j782l756N906k790r76L964n394J638
1622h44L548m556K072M38k311K538j012N15n44j049L322k216j192L380l624J425
1638a10L288n193K034J734l089L237j386k084K887q37p19O38r72O56l11O19Q05
1655A197l115K359O39k774L552j343k558L697r07j637K048j565m04J517p52n96
1671f42Q0K90m36j12J152o95j51J829k173J93K419k460m84K198j806L56J532j908
$$ y = [-2319, -634, 1051, -1272, 3112, -377, -1182, 1311, -2106, 2212, 912, -3397, 2574, -1081, -1001, 4658, -2999, -537, 3842, -2176, 1251, 607, -2047, 3097, 293, -1063, 686, -2342, 1170, 620, -2171, 1407, -2648, -537, 3891, -3040, 362, 1217, -3418, 3628, 1582, -3423, 1736, -877, -803, 2401, -2108, -894, -520, -1220, 1965, -2122, -1174, 791, -2056, 2346, 564, -3192, 2714, -76, -1052, 2912, -2482, -844, 2704, -1852, 220, 658, -1653, 885, -127, 388, -156, -1205, 2117, -99, -1291, 2089, -1535, -110, 3178, -2015, 19, 1753, -1336, 1901, 515, -1569, 1318, 481, -238, 400, -572, 84, -227, 392, 1197, -1918, 441, 1080, -1694, 1858, 515, -2043, 1654, 747, -890, 1158, -407, -811, 706, -46, -642, -562, -272, -708, -820, 332, -363, -514, 1315, -858, -665, 1754, -706, -1190, 1008, -798, -442, 1090, -818]
1689h18m7J393j125o3J005k97q05R16L91p56Q28k39j215J699j02k149J847O13
1707A076j954J058M39j222J258R1j373N38J504j328n83J654j138n60J424r66n12
1724e94J606j261m22J984j311n80J348j023n53J357n37n38R10n43j177J748N87
1741A001k091O34O76j007J118O23j933P90J010j533P82O54j793P28M07n09K52
1758a91K68p73j84J372j88r95J824j001j756K651l13j400J402j161n81K065q63
1775A76k59r2k86P60R1M13l38j117J386m74L0J481k610K66K046k342J108J604
1793A843l096J453O29j578J509q1j036L01j32J410q36j042J387j890J209J699
1809A749l124J835K34k886L916j120j461J877k305Q48K149k475N67k67r19K276
$$ y = [-818, -865, 528, -597, -660, 345, 48, -757, 159, 550, -206, 622, 383, -832, 867, 765, -1384, 463, 1076, -878, 180, 619, -603, 655, 746, -627, -89, 1415, 87, -496, 1158, 20, -540, 884, -82, -594, 1012, -249, -671, 1313, 2, -578, 770, -253, -806, 551, 14, -524, 386, -157, -1334, 414, 1001, -1090, -456, 220, -787, 331, 954, -979, -189, 821, -712, 70, 724, -1069, -341, 66, -443, -191, 77, -696, -880, 492, 304, -691, 1133, 132, -1624, 1027, 714, -686, 716, -445, -1026, 1039, 176, -83, -175, -461, 299, 390, 803, 465, -652, 734, 260, 290, 1771, -839, -573, 1473, -869, 239, 1843, -1253, 200, 829, -749, 760, 679, -357, -56, -188, 1222, 386, -656, 731, -1159, 50, 1749, -1375, 460, 694, -2192, 1724, 604, -857, 1020, -1285, -437, 1712, -763, -196, -463, -1382, 894]
1825H94j843J359J79k940L279p61j518L492l422k78L692l515J089J338k916L069
1841A198j337j208K474j878J016M08k399L778j894j366L482l773J461K397m288
1856a929L308q09l149M647k198p34K744l980K273J738l152K667k100Q4L052m453
1872a991K683J000m417M816k132k297N275m184M73L159m675L024L46k729L426
1887A777l185p5L453l810K645q48k723N222k756j002L509m731K589K428n200M414
1903A707j675k727N033l076k18J882l467L692n27l019M320l193J102K809n247
1918b604L945M04l835M506l150j123M798m415J199J834m499M104j38k003K627
1933A650l448J719K666m035K709j185j920N042l663k27K858m957L603Q57l944
$$ y = [894, -949, 410, 589, -2351, 928, 167, -1351, 2141, -1281, -1559, 2133, -1382, -293, 1045, -1871, 1198, -139, -1347, 1127, -751, 265, 673, -1726, 2052, 158, -1208, 2274, -1499, -38, 2359, -1929, 1379, 570, -2579, 2068, -130, -864, 1880, -2100, 173, 1911, -1241, 1426, -674, -590, 2462, -1991, 692, 1692, -2725, 2091, -41, -2338, 2937, -1247, -774, 2385, -2290, 734, 1080, -1649, 1777, -1408, -1483, 1970, -1840, 805, -43, -2766, 2456, -300, -1302, 2207, -2524, 65, 2493, -2707, 1707, 32, -2695, 2338, -738, -956, 926, -2541, 1151, 624, -2395, 1925, -1268, -166, 2643, -2604, 1341, 1745, -2090, 2416, -734, -1857, 2941, -1474, -275, 1559, -2940, 1164, 1026, -977, 1650, -1798, -79, 2587, -1448, 1261, 76, -1844, 3198, -465, -692, 2166, -2791, 812, 1669, -2275]
1948b275L625j603r83L687l232L61J240k613L500j425j621K950k919J960J245
1963A897m433L517m87k048L709l290J1K758k881J546K45k701L036j040k16J546
1979A169l513K723J007k381K553k444l78L567l064K52J314k980K966M44k961K459
1995G33j444N17J709k299J040j27o33K373k379K06J440k200J978J53k915K553
2011G05n54p17J679j921K77J515r25P77o24q39J801j408R58k56j627J977l72j024
2029e78J601j710j39J941j712L95O04j224J051j99n39R30j143P05L83r41Q82p52
2047d45j11J724k104N49Q33j554J389lj390J308n59J08O26q86M35J53r6N50n73
2066d6j3N53q33R66n57o87J013l55m79Q53q64J72N71k51J51J79l07M40j29R7j52
$$ y = [-2275, 1350, -253, -1236, 2451, -781, -420, 820, -1793, 1707, 282, -1339, 1611, -1308, 652, 1897, -2536, 981, 494, -1554, 2155, -1135, -1124, 1634, -1247, 299, 544, -2157, 879, -161, -377, 1169, -2344, 379, 1386, -995, 1558, -886, -1264, 2303, -761, -509, 805, -2175, 791, 1235, -1726, 733, -711, -194, 1515, -784, 256, 129, -504, 1869, -510, -304, 1136, -1064, 914, 1067, -1848, 705, 151, -566, 1113, -808, -531, 984, 59, 836, 212, -627, 1174, -234, 724, 468, -1159, 818, 446, -578, 1023, -687, -826, 1115, -597, -202, 402, -822, 229, 30, -509, 421, -722, -17, 366, -575, 307, -445, -556, 1168, -936, -387, 446, -1108, 281, 278, -1112, 196, -363, -255, 371, -515, -80, 73, -23, 527, -46, -59, 494, -339, 627, 70, -617, 396, 41, -438, 415, -449, -277, 294, 43, 194, 373, 66, 506, 377, 474, 322]
2087C22l75O72l15n53N40p00L25N22r02O8N86n32N66o5k54O2L47Lk81J2L46n64
2109a70K78J85o03K03L32p80M81j37k92J48K16j76O48l46j93j23k13O29j41L92
2129C38n92J7N61j23n09K31k79R8K95l1o38P38k60k7m3M94m59M68k41J96K0K34
2151D88m64R2K56l98j40M12j25m63K92l02L97pK28l68N65j03j99K68j24%n1K13
2173D67m35r8p6J40M5J63p90L12l1K01m2J2MJ7L02k57p7L92l77O8q9K80l43P1
2197a41j42k9J64j70M3q2L97l77J33L85k69r9L41l3k13J61j82p7O45m16m29M40
2219E0J25m15J91M0j78L43J57n14K51M53l10J53R9n18L09nj32jK13m11K21p1k69
2242b19K74N6J5m53N96j92m33M81L4k11K67K35l73l00J52o8K81k60j53J18pl19
$$ y = [322, -53, 619, 304, -249, 291, -409, -84, 438, -464, -396, 190, -342, 224, 159, -95, -33, 314, 317, 36, 48, 394, -170, 108, 293, -310, -107, 225, -555, -74, -211, -503, -355, -139, -315, 333, -13, -206, -329, -542, 87, -54, 338, -254, -237, 324, 201, -308, -77, -356, -258, 37, 6, -632, 106, -154, -181, -224, 270, -189, 279, 38, 234, 254, 488, 24, 116, 372, -26, -166, 246, 121, -342, -50, -352, 45, 38, 266, -102, 463, 360, 161, 429, 305, 305, 254, 467, 32, -66, -142, -2, 43, 206, -584, -272, -303, -102, -144, -132, -128, -111, 191, -66, -143, 249, -128, -60, -149, 131, -212, -141, -283, -312, -148, -318, -275, -357, 40, -337, -204, 181, -88, -187, 154, 121, -92, 69, -113, -190, 455, 39, -390, 50, 175, -240, -49, -9, -187, 156, 313, -201, 50, 503, 193, 346, 445, -73, 236, 231, 99, 98, 311, -100, 121, 50, -219, 55, 111, 126, -327, 269, 77, -356, 125, 159, -52, 215, 450, 77, -223, -71, -139, 142, -118, -271, -153, -160, -479]
2264d79N70o7l65J44K47j36l73P07l71q4O10m14k29L02j86l90O00l97J08Q6k99
2285d16J62J15K05l05K14J22l93O01j10l69L36J1o31P23J51p84L47J58l00J5J82
2306C4q2l16O86P3n39N10j74j72N78l77l20O53n45j65N52l64l25K70q4l4P0K16
2328A45k91kN09n89J67K61n25M92L64p30J05M69q19L45J98l68k8N40o35L8K15
2349a39j47Q0N05k29r90J183K59p42N35l6q12R15j70l79J62l07n2L05j33K53l39
2370b78L48o1k73O42j45m45Q45o45k92J287r16j45P56r70J02O93o22Q5J37j32
2390b9l2j0N2k9j65R11q12M4N17r58N74M49j039J117n09p21R62o50r4P38j002
2411f86K85K60j26P74p63K29M05r28R14P2j216J287o21o74J555r30m80R58r41
$$ y = [-479, 91, 24, -341, -197, 50, -86, -459, 248, -123, -207, 403, -11, -240, 62, -124, -514, 86, -311, -203, -117, -416, -254, -139, 66, -239, -25, 97, -296, 305, 195, -174, 162, 173, -458, 265, 416, -368, -21, 137, -163, -148, 34, -48, -364, 322, 395, -144, 366, 192, 20, 598, 221, -99, 554, 9, -156, 396, 32, -293, -23, -107, -141, -71, 145, -146, -148, 361, -228, -61, 200, -325, 167, 531, -199, -94, 375, -444, -99, 99, -269, -297, 243, -392, -354, -139, -286, -206, 299, 70, -920, 263, 522, -220, 315, 279, -533, 382, 212, -167, -5, -312, -364, -59, -192, 61, -278, 70, 9, -264, 378, 233, -212, 633, -12, -304, 983, 67, -78, 678, -292, -190, 503, -119, -34, 103, -29, -61, -71, -19, -48, -213, 698, -114, -70, 447, -511, 63, 512, -527, 590, 81, -640, 322, -328, -422, 316, -686, -401, -141, -267, 507, -256, -27, 378, -550, 364, 436, -780, 507, -114, -788, 767, -163, -643, 315, -626]
2430f26N15K32p75P32n12L71J76o20R34m39o60J398r97j11J385j361L28N70j093
2449e53R27j7q77R46m43J83M85r59M78k02J91Q82j375O7P13j001J141M2j589J051
2469I0m5l51R58r70j08O89o40P09l81n09P82n39L73M30j021P25O0p88J245j104
2489c95k76J381j184J09L54r23J216q2n85M94m93O31L52j017O23m77J34R67j196
2508c67j96N86l29N99K88j473R46q3j31R02j087m4R14l91M19n43k60P64m96J15
2528A33R8q82P35L11o03M42n49o7J139o61k58L23o36P65K97n23J74l86M72M71
2548G95r99M13k96k93Q44q28l15Q28o04M98L81q86N65k33k70P66n25Q1L20n83
2568c41L81j04l18L87j80J00k16l19P18O2n00O77m24k15O34m48j0j1P8L03M8r
$$ y = [-626, -111, 121, -654, 78, -434, -63, 113, -507, 427, -12, -672, 726, -271, -382, 1003, -358, -30, 540, -553, 374, 357, -520, 426, -17, 166, 651, -308, 170, -32, 159, 1041, -334, -267, 446, -555, 586, 628, -961, 90, 45, -306, 652, -318, -426, 263, -377, 332, -49, -558, 224, -315, 58, 488, -533, 192, 252, -536, 709, -395, -671, 710, -474, -365, -11, -934, 282, 200, -385, 109, -384, 247, 599, -418, 205, -272, -138, 829, -367, -563, 23, -306, 293, 581, -892, 54, -29, -160, 742, -345, -389, 525, 134, 553, 10, -250, 514, 18, 133, 231, -651, 84, 395, -208, 234, -315, -382, 757, 96, -162, 161, -475, 290, 587, 64, 238, -148, 324, 795, -204, 209, -87, -380, 464, -364, -679, 149, -455, 43, 424, -462, 103, -130, -400, 366, -159, -78, 242, -341, 40, -64, -382, 5, -175, -75, -291, -610, 108, 170, -330, 347, -77, -292, 342, -106, -116, -127, -49, 254, 302, 293]
2590B93j95l91N55J16m85J05p7k29O82o42K96L39k88K85j15k97r0O02k64L33n44
2611a1j69J28J03J80k20l10K07r2L93k64K92k80K47m67M54k84j7L54k94j7K53
2632A86J4j15n6j36J61l32J35L3k25J25k17L35K39m95j0L04J68l27L40l95J94
2653g4K07k81O8p5k20L39J40nk89j18J81k08N65l2k71L02n7j1O4l14m65P70j13
2676A03Lj77l2J4K32j34k96M10L3j93J07K54k31m6K42l36L2K91n72J5K54q4j2
2699a23J97k4k94J64J05j26j50L22k14K2M66m12J23M49r60N49k87j21K83K0l5
2720d6J16q8j5k3LJj36L86k42k74L65J76l73L61K55o41N45m84m1L53l35K04O2
2743A29m14L37k52K85M3j52L83k90J04K29m59K91K39l98K9K58m54K06o4k59N63
$$ y = [293, 98, -293, 262, 378, -107, -2, -79, -308, 374, -268, 28, 367, 79, 364, 249, -48, -138, 464, 200, 533, -11, -180, -52, 51, 231, 11, -299, -92, -184, 209, -55, 237, -43, 204, -263, 191, -93, -110, 244, -50, -67, 186, 200, 85, 29, -107, 54, -278, -143, -110, -335, -210, -427, -92, 147, -348, -358, -54, 114, -213, 127, -268, -74, 133, -148, -80, -155, -375, -36, 104, 99, -190, -308, -127, -335, 230, 198, -73, 229, 172, 161, 225, -89, -554, 216, 103, 106, -71, -103, -89, 143, 9, -287, 123, 156, -37, 70, 324, 93, 47, 289, -47, -15, 276, -296, -281, -27, -111, -123, 74, 50, -244, -80, 25, -101, -251, 71, -143, -121, 345, -67, 56, 505, -455, 94, -193, -314, -31, -11, -46, 70, -18, -33, -56, -53, -52, -188, 198, -44, -318, 47, 223, -150, 211, 466, -175, 370, -114, -155, 198, -137, 67, 129, -285, 52, -200, 85, 128, -24, 359, 69, 173, 402, -57, 234, 473, 75, 104, 362, -92, 114, 50, -209, 354]
2764C54l01k47Q3k11N93k54j33N55o76J83J06k74M05k81o77J036j32k39K82l54
2784a82k74M06j12M23m40J17N41n31j0L82p87R10m26l60Q70n81l84Q10p21K77
2804g2M29q16N54n8k20K93k88N19k03n64Q24l40k19P40p14N6O38q71P43l32o23
2825e24P87j53k11N09o62L65J76n32P60l32o30R53n99J64M33r47P19J02n85M80
2845B73m12j59P35p43K30J10k63M84l21O1M47r69L59J66m41R68o85n14J229r58
2865d03K55K66q16R74k09m54N88m20J63L14q34N07j3l00P20m52j65N69p40N55
2885A05K04j033R90K3m26O50n92M1K66n35L73J33k97L93o01K74M61q43Q94l11
2905A69o28Q21k56l49Q54o64Q8K43m95k9L10k16M16l48K81m3l78M94l78j29N11
$$ y = [354, 53, -194, -111, -322, 271, 17, -116, 439, -237, -54, 52, -222, 183, -98, -775, 261, 129, -110, 172, -182, -456, -50, -162, 261, -179, -62, 479, -52, -62, 320, -467, 443, 17, -343, 527, -54, -438, 372, -349, -72, 357, -459, 95, 37, -183, 110, -178, 341, 138, -426, 398, 58, -161, 579, -135, -79, 559, -312, 431, 99, -524, 263, 110, -101, 408, -254, 111, 287, -245, 515, 183, -447, 506, -93, 71, 504, -443, 276, 378, -207, 273, -139, -298, 437, -306, -76, 34, -229, 255, -66, -5, 442, -527, -168, -2, -443, 525, -160, -674, 555, -403, -148, 118, -698, 276, 67, -387, 201, -219, -56, 258, -576, -69, -82, -382, 338, -114, -279, 290, -450, 105, 309, -724, 266, 289, -137, 513, -79, -38, 228, -307, 66, 199, -98, 295, -306, -32, 429, -414, 480, 169, -459, 362, 106, -243, 611, -53, 35, 278, -217, -246, 64, -152, 264, -84, 197, 154, -224, 270, -108, -237, 274]
2926B74m21P0L84o55L17n8k14L78n17J32N67n53J94p9q5K63o7K24j15m90P22K5
2948B96q34Q29l05j63O12m90j87K21p5J09p3j07K05oL8K62k67o9K17j98N59m89
2970H5k76M72n93M76j21j94K60M8j59K80l64J43K19l36k3J50n5N64q20N57p9n52
2992c18L17M31m15P6K12l09k07m0L85r00J082k9m82q5N63l21r1j70j66J219p83
3013c1m32P08l07nL28n16J98k52K87k39O24p0P2j97p44Q31J6l66L53n0%o13M24
3036A9q87O68L86r4R7J66m08O57p43J90k75L32p6M47k20J19k52O5K4M2n84N47
3058B20m02K35L81k73n2m64N13j16j13o71L51M52p76Q27l63J32k6j94K79N92j026
3079d94M97l00K92o13L85j84O46n06K10l74M49l7j41k5L40j71L99n48N29m22k91
$$ y = [274, -147, -77, 307, -348, -31, -89, -303, 75, -442, -310, 257, -296, -102, -181, -266, -3, -70, 154, 39, -451, 271, 296, -538, 291, -14, -177, 435, -55, -242, -21, -96, 13, -60, -167, 38, 32, 70, 332, 65, -4, 213, 15, 574, 85, -191, 281, -312, 164, 43, -151, 109, 157, -2, 278, -86, 57, 276, -60, -83, 67, 12, 576, -244, 313, 234, -318, -1, 430, 15, 91, 303, -6, -213, -253, 132, -768, 314, 285, -197, -282, 281, -40, -131, -301, -467, 752, -31, -463, 245, -62, -67, 261, -255, -57, -309, -22, -261, 363, 293, 365, 168, -576, 255, 271, -95, 258, 208, 208, -405, 19, -868, -200, 186, 92, 189, 355, -53, 604, -139, 51, -224, 108, 32, 479, 259, 378, 126, 191, 215, 257, -327, 220, -182, 53, 434, 161, 109, -355, 158, 42, -71, -742, -391, 61, -715, 112, -251, -119, -145, -339, -60, 532, -494, 3, -297, -5, -618, -233, -417, 229, -277, -67, -441, 8, -29, -170, -195, 145, -26, 373, -175, 354, -68, -359]
3100c59K38k99O21L67q19L14L09o9p06K04J47J20N8l57O97j12l60J80l48N51k46
3121A31J64n4k50K50k92n4p6M40J16k00m3j05j37M01j97m1j48m0J39r2k10J15
3143a83K60m9pk49L9K33j92k32J16k89O12l85K23L33j54j38L28l25l56j47L27
3164b35m80L47J39o9r5N1L04m24N22j32J53N1j59LK53o4k83L93l43k3o8J63j0
3187fk53J17R5K93k00K81j81j45K60j87J82q8j7o1N3j31j24L8L0K18k06K76l46
3210a02J36J21k67J46J2O2r3j7K9l3p5J75j79R1j2k38M08m17J19m0j05K12J92
3233A25j6j80J89j76K1Q2K3k44L44k03j19j68J39k1J01L47m48K56L0p9k98J66
3255a29N0rK69q9P8j58K24j37j53j7j11L67j47j59M05l7k88J35l7j24K08Q3k47
$$ y = [-359, -121, -420, 201, 568, -251, 63, 372, 303, -403, -199, -52, 68, 126, -231, 466, 354, -6, 174, -174, 377, 131, 295, 241, -9, 241, -51, -105, -181, 259, 375, 175, 132, 27, -110, 291, 94, 53, -95, -135, 4, -88, -298, -183, 77, 28, 21, -228, -189, 44, -148, -380, -264, -553, 59, -326, -103, 230, 76, -62, 266, -59, -415, -562, -235, -715, -368, -229, -298, -393, -342, -38, -462, 60, -72, 81, 132, -27, -24, 229, 165, -118, 275, -68, -91, -159, 4, -6, -259, -142, -47, 246, 46, 327, 146, 1, 261, 74, 256, 168, 151, 90, 143, 12, -112, -74, -44, 174, -32, 244, -102, 34, 155, -112, 34, 46, 108, 15, -2, 27, -6, -81, 94, -85, 6, -6, -244, 164, -253, -134, -174, -279, -67, 125, 109, -71, 118, -58, -37, 45, 68, -176, 168, -35, -154, -322, -183, -204, -103, 244, -204, 52, 82, 3, -295, -129, -79, -88, 181, 92, 170, 12, 236, 99, -54, -71, -182, 185, 38, -121, 284, 247, -41, 94, 57, -67, 141, 224, -23]
3278b3K13k74L06k83M56m39J06m4Q5j13J79k62p3L96m13P7k0J20J5J07k11j28
3300b23J79K50j84N5j23O7j05j0j32m0J45n1m1L14k88J62j48L75j33K21k10k8
3322E2J61j16l0Q6j60op2j35L2o1N06m60M48l28j03K76K94j33k68R1J00J5N2l09
3346f8L4J68k00J9ok38J86J03j7p1N8L5J46j27N4r7K74p9J00k47O2j1K6k57Pj21
3372b67L66k29j58K28j44k4K02J82J12n71J84N87o69M42k32l77L53K14O7q04O71
3393A33m06N40k18NJ07m91M85k19o4M03j61r3L23j61l0m6pJ83j12j51J9j61K26
3416A04L4j95K9Q1M1P3J27m57K88PN52o47N73K25j642R95n87K65o31J158J8m52
3438d1k97N84j63J16L3r6k06j12N10k26K0j48j15K34o9L6k44J78J6j30n8J95m69
$$ y = [-23, 190, -84, 222, -61, 395, -44, 62, 18, 103, -10, 169, -93, -166, 230, -183, -106, -126, -6, 9, 116, -95, -223, -44, 206, 22, 77, -46, 21, -84, -94, -226, -266, -121, -172, -213, 101, -187, -25, -173, 202, 69, 290, 80, 52, 213, 97, 67, 153, -7, -13, -85, -220, -188, -249, 257, -203, 245, -83, -186, 90, 384, 251, -17, 74, 174, 189, 241, -68, -34, 134, -66, -47, -53, -291, -105, -2, -19, -90, -32, 3, 149, 22, 76, -21, 253, 174, 274, 27, 89, 78, 104, -153, -146, -267, 99, -130, -288, -60, -204, -228, -26, 156, 268, -303, -119, 468, -201, 241, 9, -368, -15, 199, 266, -538, 133, -273, 267, 49, 54, 161, -330, 155, -64, -128, 275, 114, 21, 344, 183, 153, 107, 100, 283, 171, 20, 39, -122, 104, 138, -57, -28, 53, 94, 167, 294, -163, 125, 132, 684, 37, 610, 835, -807, 188, -399, -134, -765, 393, 411, -41, -338, 246, 83, 199, 232, 136, -70, -182, 328, 102, 122, -26, -141, 93, 24, 60, -184, -6, 10, -120, -178, 17, -452]
3461d52P1O21k42OK0oJ91l1l95K91J21n9L9n57L90J16j52O1j15m4K99j04k6j04
3485f1k16N13J9n6J7n3L6L17n38P3J0k35L17j35j68R9k92L78o1J63p4j75R4J38
3509A10m75P97l84M78m68N19r85O80l23N0j189J463K27j006K28N96k58J54l30
3528a16j56L98o0l25j2K61l04K42O1K8p4J38l21q1J05l4J25M8K45m84K52K06M9
3551A91j14j18K54j85O6r7M2J06J4J44m29j50K91k1l8r0M28k99Rm3J8j51K35O4
3575A27K31m81K38j12Kj40r7J33K26k25O1J27j21l1O9K3O0l5J2L2q2N0o3j13p6
3600a85R8r9k57Q15p04P42l52L05k33k03J4k37K22N1Q9n2J60j58O9j70J88l8j11
3623d6M7J08j32N4l45J90J50L4l47L98j25m3K05J31j90O9J65l25P7n7L8l60L15
$$ y = [-452, -381, 240, -2, 4, 24, 18, 209, 178, -217, 74, 195, 136, 175, -382, 8, 124, -28, 33, -82, -126, 173, 69, 43, -61, -277, 236, 255, 199, 216, 163, 199, 516, -22, 51, 61, -174, 143, 8, -160, -61, -353, 25, -36, 127, 53, -122, -28, 110, -365, 432, 48, 526, 58, 577, -408, 272, -51, -1, -1190, 273, 500, -506, -278, 318, 60, 214, -116, -272, 126, 66, -259, -271, -10, -314, -72, -11, 17, -57, 81, -240, -321, -216, -250, -125, -77, 168, -316, -64, 142, 191, 77, -41, 213, 28, 94, -3, 39, 145, 159, 303, -126, -276, 15, -6, -44, -134, 294, -5, 4, -39, -21, -172, 63, 127, 358, -123, 115, 3, 5, -135, -232, -99, 127, -98, -37, 90, -31, -62, 7, 30, 90, 55, 67, 99, 17, 67, 4, -109, -185, -87, -186, -443, 372, -332, 410, 58, 363, 130, -73, -59, -296, -74, -23, 66, 14, 174, 16, 85, -85, 103, 65, -46, 1, 109, -23, 31, -314, -124, 26, 60, -287, 111, -14, -57, 148, 279, 89, 158, 323, -2, 75, 18, 56, -304, 11]
3646A1j94J16Q8j06J6K28j70K2n1M8p8O9J8J36P8m38J24jk19J01J18K12k36j0
3670a18J89j28P5r4j37K4L82j72p7l8J51r8J27l9k21M0M1m6O1j99J91R2lj65N05
3695C43j18l65L19m9k7P4k5k00K8P3K02l08R4l8j93N94l19k50M09m33K10J83j51
3718E3R7j34n5K22m6r8L8k13K14p3K10k73j90J89L23m12R8R7j25L97k7l01J57
3741A48oj82O3J9p7j42R1J26l57L07q6m15N32k53k65O12m2j17L72l36L8m8K8J51
3765A61M2l57JJ7K32j78j1J07k21K15M54o07L4M98n24M33Ok43O9l08L75j60j56
3788a21k0O4j18Nj45L93j4k35L75L3r4J96p8l95L41q5k95N83j80r3k76L53p9j19
3812dP7n9k57L10j80k56M67m79P8O13m96P5L75j77j61J92l13j24O18k42j96j24
$$ y = [11, -183, -67, 21, -85, -69, 159, -11, 11, -40, 8, -70, -1, 17, 153, 231, -207, -83, -84, -303, -202, -84, 128, -108, -118, 71, -57, 18, -76, -213, -189, 193, 21, -56, -94, 57, -41, 86, 47, -174, -134, -93, -139, -78, -277, -86, 6, 3, -162, 343, 225, -140, 179, 130, 103, 177, 152, -48, -20, 53, 255, -53, 41, 3, -190, 404, 85, -165, 244, -189, 21, 204, 53, 150, 16, -39, 183, 137, 39, 77, -136, 78, 5, 215, -58, -248, -59, 264, -148, -50, 47, -78, 319, 292, -9, 148, 142, -40, 23, 42, -35, -177, -86, 40, -317, -10, -96, -511, 21, -232, -497, 115, 73, -44, 328, -8, 30, -18, 10, 161, 203, -154, -153, -136, 96, -82, -93, 14, -207, 8, 462, -145, -111, 387, -137, 296, 302, 59, 128, -180, 195, 35, -121, -141, -77, -195, -190, -335, 58, 44, -191, 184, 217, 123, 319, 241, -154, 187, 102, -193, 390, 210, 117, -159, 194, 115, -4, 73, 14, -243, 67, -113, -369, 98, -381, -303, 310, -186, -111, 264, 87, -74, 118, -195, -319, 299, 57, -139, -263]
3834b63K86k88J53K49k09J25J71p5j3kn28M02r4K06rk71K18m7J59j09k20K94J68
3857C03m52L94l47j68N37q8L6j3k14j80N21j38j36l48M95Q2j07o4k16K4L19k01
3879C9k8P9j23L17Qj71k41J92N2j16K24m65QM32k93j57J41L8m3K34j50k31J41
3902a13j9R7K00k76j69M05K59m62M9j49K5L2K47k10k71M79l39q3O75m06j21M41
3924B91j92j27K74m02J32L23Jn66L54J49k99L10k22l56L41J38r6Q3j55l3J44K75
3946C67l71J47O8j35l5P1J54l31kK63j07j60M07n92J25k2Oj07J76N1K55K7p07
3969d52O44r7j1J22k3k11O8K0j14L2ol8j57K25k03K46J33l68j4M70k47RK40m29
3993a61L02p6j76J20M3n1k7j61N3J8L67l2l55m0K34j65M8J51K1j15Q2j59L4K30
$$ y = [-263, 23, -265, -112, 137, -72, 53, 224, 149, 136, 134, -394, 8, -86, 120, 111, -160, 58, 11, 170, 61, -159, 135, 303, -149, 245, -102, -270, 267, 179, 215, 202, -12, -192, 329, 191, 55, -293, 202, 284, 177, 113, -103, -79, 240, 39, 11, 90, -33, 284, 292, 121, -120, 72, 124, 8, 232, -233, -225, 207, -86, -243, -102, -64, -107, 127, -23, -254, -113, -132, -35, 165, -111, -280, 125, 384, -78, -29, -178, -153, -121, 126, -84, -355, 124, -215, -298, 377, -29, -150, 291, 99, -28, 246, -156, -24, 299, 300, -266, 88, 237, -62, 248, 26, -330, 11, 149, 53, 136, -19, -52, 92, 367, -4, 143, 211, 76, 41, 112, 266, -65, -67, 196, 89, -71, 336, -256, -131, -153, -147, -254, -78, -27, 228, 255, -452, 192, 95, 84, 206, 183, -28, 40, 60, -54, -22, -28, -66, -223, 2, -201, 45, 178, -190, -204, 266, 19, 28, 268, -161, 141, 65, -111, 9, 52, 1, -26, -187, -134, -116, 251, 219, -136, -176, 58, -107, -59, 92, 113, -2, 80, -79, -45, 185]
4017A85r6m1kj44P2M3K7n8j5j72q7M84l25n5M50n1n72L07J04o75Q20m49J09J61
4041B0l5l54K63n2J49J8j53K8J92K24o28K24K65l72L05J99l98J21J80k99J57q8
4063c4k09j86O19r6k52K62k14J75j08J22m1n6j54Q9k5K25M4j32j74M7l68N89p3
4086E0J59j89j59P9K20j06l4J74j41K19k7Q6j61q5l34M84m46L7L01j12Ko0J39
4109I6o8k5j13J13q4J32ok42L70j65m8N8J56j94L29k03l03J87J46k08j5J00j0
4132CN2M4l33J55j37J24N1L10k00M6j37M2q9J71j67L0L71m81J79M3J4j92J45J29
4156A73j33N4K51k53k1R7l32J05M8q3n6K06p4m9K37L7j74r0m3J25O5j36L50j11
4180A93l22K45J03n6m28L79r9K3K05j87j39J43j22Q4o3k16J09Q8J99j65j8K4K1
$$ y = [185, 89, 48, 46, -98, -26, 17, 44, -14, -29, -201, -288, 196, -129, -184, 266, 215, -357, -50, 54, -621, 199, -250, -141, 20, -15, -369, -106, -158, -9, 9, -144, -116, 76, 300, -328, -104, 161, -211, 94, 293, -105, 16, 196, -103, 54, -34, -243, -429, 190, 94, -158, 104, -110, 65, -43, 79, 38, -18, -172, -83, -108, 117, 161, 29, -145, -98, -466, 123, 50, 209, 20, -139, -60, 160, 54, 20, 194, 53, 272, 245, 331, 170, 85, -249, 235, -211, -174, 127, 15, 17, -43, 96, 28, 3, -110, 3, -81, 51, 45, -197, 173, 8, -40, 18, 174, -20, 309, 106, -197, -10, 136, -72, -87, 13, 3, 55, 99, -234, -79, -216, -92, -41, 269, 69, 115, -22, 20, -69, 102, -65, -35, 336, -145, 34, 77, 91, -101, 44, 173, 40, 94, 345, 92, 71, 168, -164, -59, -11, -94, -150, 56, -18, -67, 170, 207, 33, -57, -100, 25, 90, -46, 304, 193, -129, 116, 219, 163, -265, 114, 15, 38, 243, 56, -83, 60, -62, 22, -41, -257, -148, -60, 139, -26, -44, -20, 1]
4203Aq7J66l26J94O3j09M6J99k87Q0m4p1K04J80j64R3q4j63K76J23k02j75J16
4226B9K69l59K90j38m25J94L80j48J62j12k03J62j35K9K6r9K78k28rK80k65J97
4248A75j87r4L33m47P5rr1r7L26k50K74J16m37M74o8J5J62n36L93K36o10M25o71
4271d93L75L04m95K74qm71N06M01m40J40k25L3K72j87K3J2j33L55m43J3Q3l20
4293d24N66j3n90M78J68k24M74o11j42M97k75L45L01q48M36j70p4M26q55M06L20
4314A91k33K58l31o9N21l21J33J15p19N00L69o12L42l03J23M03m82J65j35j20
4334b05L31m9k87L75o33M62L20p92N97j98k96Q92p22o2O32o94M66K10p28K37P1
4355g3k02K96o06O33K18o22O20k25n27J010o03K25K39o89N65l2m43K32k29K62
$$ y = [1, -86, 80, -246, -52, 11, -98, -52, 147, -140, -60, -104, -175, 29, 209, 45, 138, 54, -109, 167, 290, 88, -87, 29, 298, -61, 229, 91, -334, -140, 240, 92, 254, 142, -61, 101, -34, -5, 21, -78, 200, -28, -37, 243, -22, 175, -12, -106, 227, -220, -145, -154, -245, -342, -16, -266, 8, 124, -313, 161, 93, 108, 270, -266, 127, 363, -247, 178, -493, -118, 186, -309, -35, -43, -514, -8, 393, -47, 93, -132, -99, 173, -14, 9, 21, -112, 243, -200, -187, -104, -424, 142, 129, -461, 17, 185, -39, 435, -176, -318, 179, -96, 249, 550, -298, 138, -32, -106, 320, -535, -129, 191, -42, 216, -115, -184, 337, 16, 149, 264, -455, 45, 414, -198, 144, -159, -36, 367, -115, 50, -85, -205, 126, 77, -210, 165, -468, -6, 314, -478, 119, -79, -375, 517, -205, -267, 365, -329, 137, 347, -381, -144, -73, -275, 21, -585, 48, 266, -356, 264, 39, -488, 522, -81, 144, 383, -306, 259, 227, -216, 16, -213, 49]
4375D9K90l77p3K50m43O33m78O5L77m84K92M80r38N77p1k80O20o45j09N64n65
4396b66L42l3l43L01j35J90r0k63N99k45k71M46k08r8K97l37J87r4k94M23q4J32
4418A56k0o0m50K36L49l12K99n01L72k35J65L02m34M39M1n14M04k77l19M13j16
4439f2l63N48l66K8J99Q0NO3j87J84l11L90l3k52M22l88j4K23Lk96N33n01J33
4462C8kR7j76J76P9j36j61K78q2k87N99o37L99r5l44J51L39l92J47M3j86K89j51
4485a4j00M8n4m9J28J98j8j94K85j79k67N09k71l3j8m4l21N13k21k5j6K42J11
4508B10m83K48k40L04Jj03O2L95l20o2L24l62J00j68K8k34M17l15K57nr0J1j98
4531b23K19p5N53j52l38K30m0l70J27M40l13j24J41k61l0M1K37K00j24J66mlk21
$$ y = [49, 339, -38, -111, 139, -304, 329, -149, -84, 293, -191, 101, 581, -357, 220, 149, -131, 489, -156, -265, 299, -266, 76, 43, -300, 1, -134, 56, -34, -297, 302, 57, -214, 232, 24, -74, 223, -114, 73, -21, -315, 108, 24, 156, 136, 76, -374, -138, 211, -101, 198, -303, 69, -166, -1, 301, -133, 306, 347, -167, 237, -40, -359, 54, -62, -425, 123, -243, -215, -16, 64, 69, 132, -55, 129, -182, 208, 175, -77, 345, -43, -57, 166, 169, -127, 406, -95, 38, 36, 133, -43, 133, 212, 76, -85, 193, 111, -176, 423, -214, 185, 90, -254, -103, 236, -156, -9, 34, -152, 137, -14, -114, -66, -120, -169, -41, 157, 139, -55, 230, 51, -216, 293, 22, -11, -29, -73, -394, 119, -102, -127, -143, 99, 210, -273, -25, -265, 39, 40, -63, -1, 394, 74, 12, 336, -26, 74, -94, -66, -300, 117, -198, 59, 54, -36, -25, -223, -4, -79, 474, 322, -16, 214, 174, -196, -69, 371, 58, -66, 75, -186, -216, -175, 62, 262, 138, 304, 300, 297, 76]
4554G6l09L25M91k47M18r5r02k7k09M41J60l12L73k20j28J6J92k95M50j97j52
4575a51k33N75j31J7m4j7OL6K45k66j73J45l35M73k30P2P3j51J86K46l74J30r6
4598Cj22J38j89M13j47Lj00j2J7m1N5j48K30j50r5j67K73N6o0P3L0QJ2j77J09
4623A2j3j5l41K96k4r9L9k8K26j0j79J80j84O7j4j74K92k33K88K7m23J87J71k86
4647b38M45k36j28K02k38k0J28j97L17j28J99n7Q9k6m1k36N70L77j534J121m21
4668e2J56o1j78q5N40m30J03J48k30L14qk52l4L42r8k59K74m8k74K52J89m87K90
4691A12n1l06K83K1m48M19p1L07N0n03R2J38N4L40m12q2J87k81J70N7l28O13o66
4714c05K27K63l43L23J19n68P4L01l68M82m52K28r0RM8J40l86M44k71k6L84o14
$$ y = [76, -233, 92, 583, 336, 754, 659, -243, -270, -479, -38, 122, -190, 183, -37, -165, -149, 43, -252, 198, 1, -151, -384, 191, 60, 77, 33, 16, 22, 58, 303, 37, -136, 9, -326, 147, -83, -11, 62, -89, 97, 343, -31, 99, 3, -119, 19, -170, 243, 96, 99, -1, -13, 4, -37, 18, -130, 100, -50, -145, -312, -39, 17, -43, 30, 60, 68, 80, -97, 12, -1, -16, -357, -61, -85, -184, -145, -173, 53, 43, -136, 44, -140, -73, -87, -261, 31, -202, 86, 113, -310, -123, 48, -238, 207, -29, -157, 45, -193, -213, -85, -282, 35, -93, 106, 49, 138, 112, 71, -165, 405, 782, -752, 369, -52, 104, 43, -135, -220, 320, -110, -7, 141, -89, 225, 217, -35, -69, 273, 175, -84, 190, 142, -132, 120, 309, -178, 112, 61, -245, 38, 59, -389, 30, -41, 266, 316, -187, -95, 43, 97, 437, 25, -57, 130, -151, 19, 76, -252, 361, -305, -78, 185, -158, 165, 284, -284, -210, 91, -277, 205, -247, -19, -109, -100, -52, 88, -298, 146, -125, -151, 233, -381]
4736c81M54j87M08j84L0l32M87l38p5L19p3K02m59L07L01n37JK82K9R18j338M5
4758a21N05j344J055k01m2L05J05o5K71j071R96Rp09O55n72K7L89m15J02L21m21
4779b21J17J81P4q2L6o5m6pk01L36k11L51k64k11m6R6J68J11j79J1Kj37N01m28
4803a14m2L93k84L23j49j94M48k35k24J40l5J7j4j01J19k11K27M1k77K38o7j55
4825a56L82j2j12J68p2Pj52N2J36k01k70L42k14j63M13l65K42j59R7J49k21j57
4847b66M92k20N7J88l01J34k83J37K0j47k9M14j91j50o0q1M42j72j37J89k1M8
4869F3j54j17J80J21o0j99L5j9J36j44K75k85K47K7k56L89k90p1L9J48m8K46j07
4892A56l31O63m60K52k13l13K30j58m4L34k32J22J27k11J5J48Q5Lk44K91J22m96
$$ y = [-381, 73, -114, 294, 110, 140, -192, 295, -43, -118, 201, 128, 330, -129, 178, 479, -58, -57, 225, 254, 1172, -166, -121, 384, -960, 95, -106, -148, 157, 262, 197, 468, -603, 393, 402, -307, 348, -224, -197, 192, -223, -121, 200, -221, -104, 77, 151, 69, 105, 40, -6, -13, -214, 122, -89, 262, -2, -213, -259, -163, 5, 116, -63, -52, -50, -187, 314, -114, -156, 237, -47, 276, 127, -67, 381, 146, -78, 62, 27, 44, 30, -71, 48, -163, 64, 105, -172, 66, -1, -156, 226, 214, 102, 270, 198, 205, 53, 105, 241, 40, -230, 112, -102, -265, 148, -217, 25, -134, -37, 112, -109, -266, 226, 6, 63, 251, -50, 84, -199, -62, -42, -189, -218, 196, 5, -145, -205, -286, 156, -16, -153, 36, 15, 63, -91, -208, -28, 93, 33, -166, -131, -150, -14, -158, 117, -168, 79, 106, -150, 239, -51, -122, -83, 65, 17, 263, 156, -175, 488, 28, 280, 67, -246, -16, -174, -218, 116, -116, 6, 133, -78, -63, 85, 170, 173, -71, 220, 342, -154]
4914a54K56k52j6P4K05j45K6K7j78J24j57R4J75q1K34j15m8J70k82J20M6l29L34
4937A28n3m9m0n3k58M95l36J2J50R0J3j24J70l51K47N9p0k17J82K25j4k24k95
4960c13L43j18L40m44K6J39p4m5K55l5M2O0j72K65j79j67J52l6j18K3J68l82L40
4983G0j81K67l31R0R6j8l4J69q3m9J97j39N0k93J98J0qk30K31l66M32o5l0L5O8
5008H6j43K34l98J61K65k63J31J44k51J19k13N9J21N7q5j60N3P9J57k82l4k0J90
5031Gr3r5K82q4j28J81P1j02K3k2mN1n5o9m7j02K14J47l55K64r0j7L12j75j39
5056b5J94j43n3l1J75o3j6j92K79k1k13K63k00K69o33M48p7J80k56j41K59J0l5
5079b2J36j65m13N03P3j83R2k39o1L60k95O1K13k33J20L28k79r8P8R1rM0l20K33
$$ y = [-154, 102, -150, -166, -92, 113, -32, -6, 21, -157, -33, -190, -96, 79, -2, 232, 117, 69, 239, -43, 77, 123, -206, 128, 75, 26, -14, -67, -325, 170, -166, -154, -4, 86, 99, -25, 145, -206, 41, 100, 30, -187, -5, 220, 206, -18, -313, 30, -88, 252, -192, -166, -27, -101, -146, 109, 74, 116, 176, 4, 269, 90, -77, 75, 39, -79, -56, 112, -270, 70, -111, 156, -175, -85, 11, -7, -41, 128, 45, -4, 193, 54, 104, -189, 9, 19, 11, -219, 12, -354, 78, 13, -17, 18, 86, -57, 177, -221, -60, 205, -58, 73, 217, -34, 85, -128, -69, 52, 109, 24, -136, -83, -4, 153, -129, -163, -183, 7, -86, -181, 101, 17, -111, 70, 141, 39, 62, 40, 36, 87, 32, -37, -84, -186, 28, 175, -180, 84, -6, -23, 289, 114, -25, 169, 26, -27, -58, 117, 54, 38, -154, 125, 104, -109, 154, -46, 223, -410, 38, -39, 141, -115, -256, 3, 13, -22, 114, -51, -464, 39, 112, -71, 21, -218, -279, 81, -214, -153, 60, -173, -53, 275, -4, -102, -24, 67, 58, 98, -222, 11]
5103A1j13K08J50l07k0o3P2O4l1m1J52j11J7K78l15J43j46K11j74Q6j46J43j00
5126c2Q2J05l80Q7K83K2k32J02J29ok1j41J12j96l2J72j26PL26k00M9n7j18K23
5150A58j85j65K21j63Q2K04m2j54j6j7J68q6Qj02Q0l8m4K98l25L10k95m7K9j31
5174b52K40l4j75K34J8l24J73L92j65k1k84J04l3K79q9J25k98J41R0j69Q4k97
5196b61K61L3j82M55k54K33k02J5p6k43P8P4n1P2N9r7J37k34J60K21j04k24J19
5219a1k31K01j39K85n1K4j02J16j60p9K81l9k13J35l6J6k57q1M76j31j6k2j19
5242a53J50K5K4j21Q2j80L92j96j89QN5K7K6j61J87k20K48N6l32J71NL3j08J19
5266e2R9N9j90L09k28J39j04J36m5j30k84K58J5j83K88L4j58J87k41M51l70l6
$$ y = [11, -102, 106, 256, -51, -71, -134, -62, 2, -29, -70, 82, -29, -12, 266, -49, 94, -52, 159, -15, 71, -75, 68, -32, 50, 155, -225, -138, 145, 167, -65, 37, 166, 160, 139, -2, 110, -86, -118, 54, -72, -65, 261, 61, 110, 53, -65, 158, -27, -192, 29, -134, -52, 152, 110, -44, -60, -77, 91, 5, 13, -89, -9, -47, -91, 207, -118, 192, -103, -150, -121, -252, -12, -46, -221, 13, 31, -293, -120, 272, 107, 86, -198, -94, -127, 152, 63, 188, -110, 31, 121, -48, 36, -261, 0, 33, -149, 306, 52, 285, 83, 98, 22, -221, -143, -69, -120, -48, 11, -86, 51, -183, -23, 198, 94, -130, -11, -242, -41, -180, 105, 54, 78, -24, 92, -68, -147, 134, 95, -118, 17, -19, -3, -260, -341, 135, 4, -12, -34, -153, -3, 22, 46, -75, 7, -173, 219, 23, -166, -158, -103, -76, -50, -211, -24, -244, 4, 60, -272, -101, -96, -63, -171, -52, 47, 106, -84, 225, -3, 136, 32, 168, 123, -7, -291, -33, -18, -201, 87, 121, -37, 150, -91, 360, -10, -46]
5288d6L75l80K33j74j97j53L05j3J06M4k20J16q1o8K3q3O0K12l4L1L4m7j60j28
5312b45K54Lj36J73k09JK28j15K00j08j15P2o1k0J54J04k56J69J00j29k86J48
5334g4n9M3J60J17k45K05j63N7N6jk36J21J48j73j18L6J04M8l15L59p0J68j63
5357Ej8r9M14p4k05k31J41J46N3j54M1k02M53j9m32M24k16K2m9M0q6j54R5j4j04
5382b23L63j03m30M24kj67P5L4j66K02J67j69j53M3mJ69j11K32M8m23J14n2j00
5405b32K41n2J20j55Qj7K01K00k40n4J92l00O5j72J62J26K9k36J08J66p7j58K23
5428A48o3j56n5L35j45o8m5K56l13L16N1j79j56J17O3q4K20k67r1j15L01j66J47
5451E1P6m6N2l90K64M7r7K63m12N02j2k87j19L0O6J48j54m0k61L58Q9Q4j96J80
$$ y = [-46, 329, -51, 182, 8, -189, -342, -37, -50, 56, 100, -120, -4, -85, -153, -130, -213, -153, 59, 25, 56, 90, 43, -117, -245, 9, 12, -124, 49, -160, -159, 69, -46, 154, 46, -69, 3, -58, -78, 76, 180, -76, 93, 193, 64, -222, -74, -133, -90, 70, 187, -58, 147, -16, 41, 97, 96, -140, -19, 129, -44, -162, -126, -22, 26, -289, 70, 0, 168, 5, -13, -112, 302, 228, 23, -208, -67, 79, 132, -22, 19, -183, 270, 251, -181, 243, 27, 49, 0, 40, -46, -200, -105, -119, -223, 140, 37, -393, 31, 29, -138, -63, -29, -195, 7, 174, 5, -148, -105, -109, 60, -51, 181, 229, -194, -80, -132, -232, 9, -43, 77, -78, -70, -87, 114, 314, 74, 20, 212, -88, -23, -195, -33, 93, 122, -114, -6, 160, 83, -75, 148, 85, -71, -126, 209, 64, -4, -49, 207, -106, 210, 261, 82, -74, 43, 106, 22, 242, -25, -116, -231, 70, -96, 51, 127, 81, 133, -257, 7, 54, -43, 220, -192, 310, 298, 11, -108, -78, -12, 136, -18, -58, -319, 39, 128, 212, 16, 196]
5475A96j3m04M15j58P7k08J41J1rP2p5j29j89L53j71J47l1j61R3q8J28P4M4j21
5499fJ91M0j19k70J24N4j46j31K54J04j38N1R6nj06K6L0k9k13qJ15J3J97j55J15
5524H4j88J7k0P6R6J39k82K63r1j61K5m0k5K0L1L3l7J0J00j85K13N7p7J13j44
5549B7m9j0k25K60n4L71l90P4K76o4j30m91M94l5M5k74K76j34J6r3J53l05J92
$$ y = [196, 183, -221, 194, 36, 113, -95, 46, 57, 48, 120, 45, -84, -273, 80, -91, 56, 25, -136, -43, -131, -3, 71, 115, -6, 185, 225, 106, -164, -40, 14, -132, -263, -9, 95, -43, 8, 104, 99, -7, 19, 49, 20, -193, -201, -86, -73, 124, -31, 84, -104, -87, -107, -31, 65, 204, -78, 185, 94, -67, -42, -82, -107, -87, -56, -23, -60, -50, 50, -135, 78, 135, 58, 171, 27, -22, -32, -257, 3, -51, 320, -70, 4, 280, 216, 86, -405, 89, 54, 99, -175, 101, -33, -17, -110, 43, -262, -70]
$$ [...]
8191f8
##END NTUPLES=NMR FID
##END=
