##TITLE=1H_LR-721-C1
 CDCl3, 8 sc, 
 22.9.2020
##JCAMPDX= 6.0         $$ Bruker NMR JCAMP-DX V2.0
##DATA TYPE= NMR FID
##DATA CLASS= NTUPLES
##ORIGIN= UXNMR, Bruker Analytische Messtechnik GmbH
##OWNER= root
$$ XWIN-NMR		Version 3.5
$$ Tue Sep 22 12:40:01 2020 Russian Standard Time (UT+4h)  she@DPX200
##.OBSERVE FREQUENCY= 200.1315066352
##.OBSERVE NUCLEUS= ^1H
##.DELAY= (6, 6)
##.ACQUISITION MODE= SIMULTANEOUS
##.ACQUISITION SCHEME= undefined
##.AVERAGES= 8
##.DIGITISER RES= 18
##SPECTROMETER/DATA SYSTEM= spect
##.PULSE SEQUENCE= zg30
##.SOLVENT NAME= CDCl3
##.SHIFT REFERENCE= (INTERNAL, CDCl3, 0, 15.7039)
##AUDIT TRAIL= $$ (NUMBER, WHEN, WHO, WHERE, WHAT)
$$ ##TITLE= Audit trail, XWIN-NMR		Version 3.5
$$ ##JCAMPDX= 5.01
$$ ##ORIGIN= Bruker BioSpin GmbH
$$ ##OWNER= she
$$ F:/spectra/data/she/nmr/H-F/1/audita.txt
$$ ##AUDIT TRAIL=  $$ (NUMBER, WHEN, WHO, WHERE, WHAT)
(   1,<2020-09-22 12:38:45.01 +0400>,<she>,<DPX200>,
      <created by zg, POWCHK disabled, PULCHK disabled
       configuration hash MD5:
       00 E9 B6 7A A2 85 ED C7 34 08 36 98 17 FE 4E 26
       data hash MD5: 16K
       AA 68 6B 2B 52 30 D8 CE 38 69 9A CA 53 18 21 AD>)
$$ ##END=
$$ 
$$ hash MD5
$$ FD 40 AB B9 4C 03 A3 7E F6 BD 31 71 D7 DF 0A 9C
##$RELAX= 
##$RELAX= 
##$RELAX= 
##$RELAX= 
##$RELAX= 
##$RELAX= 
$$ Bruker specific parameters
$$ --------------------------
##$DU= <F:/spectra>
##$EXPNO= 1
##$NAME= <H-F>
##$PROCNO= 1
##$TYPE= <nmr>
##$USER= <she>
##$AMP= (0..31)
100 100 100 100 100 100 100 100 100 100 100 100 100 100 100 100 100 100 
100 100 100 100 100 100 100 100 100 100 100 100 100 100 
##$AQSEQ= 0
##$AQ_mod= 1
##$AUNM= <au_zg>
##$AUTOPOS= <>
##$BF1= 200.13
##$BF2= 200.13
##$BF3= 200.13
##$BF4= 200.13
##$BF5= 200.13
##$BF6= 200.13
##$BF7= 200.13
##$BF8= 200.13
##$BYTORDA= 1
##$CFDGTYP= 0
##$CFRGTYP= 5
##$CHEMSTR= <none>
##$CNST= (0..31)
1 1 145 1 1 1 1 1 1 1 1 1 1 1 1 1 1 1 1 1 1 1 1 1 1 1 1 1 1 1 1 1 
##$CPDPRG= <>
##$CPDPRG1= <>
##$CPDPRG2= <>
##$CPDPRG3= <>
##$CPDPRG4= <mlev>
##$CPDPRG5= <mlev>
##$CPDPRG6= <mlev>
##$CPDPRG7= <mlev>
##$CPDPRG8= <mlev>
##$CPDPRGB= <>
##$CPDPRGT= <>
##$D= (0..31)
0 1.2 0 0 0 0 0 0 0 0.06 0 0.03 0 0 0 0 0.0002 0 0 0 0 0 0 0 0 0 0 0 0 
0 0 0 
##$DATE= 1600763924
##$DBL= (0..7)
120 120 120 120 120 120 120 120 
##$DBP= (0..7)
150 150 150 150 150 150 150 150 
##$DBP07= 0
##$DBPNAM0= <>
##$DBPNAM1= <>
##$DBPNAM2= <>
##$DBPNAM3= <>
##$DBPNAM4= <>
##$DBPNAM5= <>
##$DBPNAM6= <>
##$DBPNAM7= <>
##$DBPOAL= (0..7)
0.5 0.5 0.5 0.5 0.5 0.5 0.5 0.5 
##$DBPOFFS= (0..7)
0 0 0 0 0 0 0 0 
##$DE= 6
##$DECBNUC= <off>
##$DECIM= 32
##$DECNUC= <off>
##$DECSTAT= 4
##$DIGMOD= 1
##$DIGTYP= 9
##$DL= (0..7)
0 120 120 120 120 120 120 120 
##$DP= (0..7)
150 150 150 150 150 150 150 150 
##$DP07= 0
##$DPNAME0= <>
##$DPNAME1= <>
##$DPNAME2= <>
##$DPNAME3= <>
##$DPNAME4= <>
##$DPNAME5= <>
##$DPNAME6= <>
##$DPNAME7= <>
##$DPOAL= (0..7)
0.5 0.5 0.5 0.5 0.5 0.5 0.5 0.5 
##$DPOFFS= (0..7)
0 0 0 0 0 0 0 0 
##$DQDMODE= 0
##$DR= 18
##$DS= 0
##$DSLIST= <SSSSSSSSSSSSSSS>
$$ [...]
##$SUBNAM2= <"">
##$SUBNAM3= <"">
##$SUBNAM4= <"">
##$SUBNAM5= <"">
##$SUBNAM6= <"">
##$SUBNAM7= <"">
##$SUBNAM8= <"">
##$SUBNAM9= <"">
##$SW= 16.880792210976
##$SWIBOX= (0..15)
0 0 2 0 0 0 0 0 0 0 0 0 0 0 0 0 
##$SW_h= 3378.37837837838
##$TD= 16384
##$TD0= 1
##$TE= 0
##$TE2= 300
##$TE3= 300
##$TEG= 300
##$TL= (0..7)
0 120 120 120 120 120 120 120 
##$TP= (0..7)
150 150 150 150 150 150 150 150 
##$TP07= 0
##$TPNAME0= <>
##$TPNAME1= <>
##$TPNAME2= <>
##$TPNAME3= <>
##$TPNAME4= <>
##$TPNAME5= <>
##$TPNAME6= <>
##$TPNAME7= <>
##$TPOAL= (0..7)
0.5 0.5 0.5 0.5 0.5 0.5 0.5 0.5 
##$TPOFFS= (0..7)
0 0 0 0 0 0 0 0 
##$TUNHIN= 0
##$TUNHOUT= 0
##$TUNXOUT= 0
##$USERA1= <user>
##$USERA2= <user>
##$USERA3= <user>
##$USERA4= <user>
##$USERA5= <user>
##$V9= 5
##$VALIST= <valist>
##$VCLIST= <CCCCCCCCCCCCCCC>
##$VD= 0
##$VDLIST= <DDDDDDDDDDDDDDD>
##$VPLIST= <PPPPPPPPPPPPPPP>
##$VTLIST= <TTTTTTTTTTTTTTT>
##$WBST= 1024
##$WBSW= 4
##$XGAIN= (0..3)
0 0 0 0 
##$XL= 0
##$YL= 0
##$YMAX_a= 834535
##$YMIN_a= -719858
##$ZGOPTNS= <>
##$ZL1= 120
##$ZL2= 120
##$ZL3= 120
##$ZL4= 120
##$ABSF1= 10
##$ABSF2= 0
##$ABSG= 5
##$ABSL= 3
##$ALPHA= 0
##$AQORDER= 0
##$ASSFAC= 0
##$ASSFACI= 0
##$ASSFACX= 0
##$ASSWID= 0
##$AUNMP= <proc_1d>
##$AZFE= 0.1
##$AZFW= 0.1
##$BCFW= 1
##$BC_mod= 2
##$BYTORDP= 1
##$COROFFS= 0
##$CY= 11.3945322036743
##$DATMOD= 1
##$DC= 2
##$DFILT= <>
##$DTYPP= 0
##$F1P= 16.9975609425685
##$F2P= -3.02152046262296
##$FCOR= 0.5
##$FTSIZE= 0
##$FT_mod= 4
##$GAMMA= 1
##$GB= 0.15
##$INTBC= 1
##$INTSCL= 1
##$ISEN= 128
##$LB= 0.24
##$LEV0= 0
##$LPBIN= 0
##$MAXI= 10000
##$MC2= 0
##$MEAN= 0
##$ME_mod= 0
##$MI= 1.114404
##$NCOEF= 0
##$NC_proc= 0
##$NLEV= 6
##$NOISF1= 3.799351
##$NOISF2= 2.8
##$NSP= 1
##$NTH_PI= 0
##$NZP= 0
##$OFFSET= 15.70392
##$PC= 1
##$PHC0= -9968.03
##$PHC1= 10.6009
##$PH_mod= 1
##$PKNL= yes
##$PPARMOD= 0
##$PSCAL= 0
##$PSIGN= 0
##$REVERSE= no
##$SF= 200.130013532006
##$SI= 16384
##$SIGF1= 3
##$SIGF2= 2
##$SINO= 400
##$SIOLD= 16384
##$SREGLST= <1H.CDCl3>
##$SSB= 0
##$STSI= 0
##$STSR= 0
##$SW_p= 3612.71676300578
##$SYMM= 0
##$S_DEV= 0
##$TDeff= 0
##$TDoff= 0
##$TI= <>
##$TILT= no
##$TM1= 0
##$TM2= 0
##$TOPLEV= 0
##$USERP1= <user>
##$USERP2= <user>
##$USERP3= <user>
##$USERP4= <user>
##$USERP5= <user>
##$WDW= 1
##$XDIM= 8192
##$YMAX_p= 0
##$YMIN_p= 0
$$ End of Bruker specific parameters
$$ ---------------------------------
##NTUPLES= NMR FID
##VAR_NAME=  TIME,          FID/REAL,        FID/IMAG
##SYMBOL=    X,             R,               I
##VAR_TYPE=  INDEPENDENT,   DEPENDENT,       DEPENDENT
##VAR_FORM=  AFFN,          ASDF,            ASDF
##VAR_DIM=   8192,          8192,            8192
##UNITS=     SECONDS,       ARBITRARY UNITS, ARBITRARY UNITS
##FACTOR=    0.000296,      1,               1
##FIRST=     0,             0,               0
##LAST=      2.424536,      0,               0
##MIN=       0,             -719858,         0
##MAX=       2.424536,      834535,          0
$$ Real data points
##PAGE= N=1
##DATA TABLE= (X++(R..R)), XYDATA
0 0 0 0 0 0 0 0 0 0 0 -8 8 -8 8 -16 18 -24 32 -40 50 -62 76 -88 106 -128 152 -180 210 -244 281 -323 372
31 372 -427 488 -556 630 -710 799 -899 1009 -1127 1261 -1404 1560 -1731 1917 -2119 2344
47 2344 -2590 2854 -3145 3463 -3813 4197 -4626 5101 -5628 6222 -6894 7660 -8544 9579
61 9579 -10800 12277 -14098 16398 -19404 23493 -29303 37869 -81326 834535 95761 -129110
73 -129110 39998 -718954 564940 405668 -321222 143911 -473157 29729 619331 -344340
83 -344340 84491 -228842 -388520 773992 -72402 -350633 186172 -411796 496512 367600
93 367600 -693125 208307 28537 -101488 510601 -441878 -198435 275198 -187348 367595
103 367595 -115134 -454259 342258 -44969 214535 163159 -690424 286496 346365 -238505
113 -238505 258414 -412483 -189667 580914 -223510 -24439 30237 -396236 369243 137138
123 137138 -143874 105585 -376494 182878 378867 -279608 57728 -202125 -111077 510571
133 510571 -254804 -183460 167412 -276217 287123 145728 -352554 171342 -67883 -5826
143 -5826 315467 -255342 -76961 83776 -53878 229460 -206981 -173936 245153 -134636
153 -134636 95866 63421 -296277 251399 54321 -168926 236200 -157389 -81271 222823
163 222823 -113521 42560 -46738 -169594 219346 -4324 -90500 16414 -119793 206089
173 206089 61422 -195479 136112 -59145 -15311 205679 -188058 -20796 91981 -155597
183 -155597 143824 31309 -188629 62060 16020 57727 45137 -137684 64572 46659 -17412
194 -17412 68693 -120066 20158 80757 -149564 83112 38544 -156462 81595 4293 -30479
205 -30479 94922 -93418 -6351 110263 -39997 -18139 -14266 21421 33607 -97523 14767
216 14767 33753 -57352 43302 -45166 -19242 109757 -78053 -10354 113449 -66483 -13134
227 -13134 45255 -24461 30822 -30770 -59458 36609 21506 -19971 -43646 19876 56517 -51375
239 -51375 17563 71708 -46999 8407 22145 -26324 60805 -25131 -90025 55047 30476 -53443
251 -53443 -8020 12574 10681 6051 869 9253 21488 18483 -32525 535 61046 -42959 -53561
264 -53561 50893 -9937 -41781 10932 -13628 13141 28450 -44544 515 70933 -7369 -47019
276 -47019 27635 26103 -31339 -10807 100 -17036 6395 -19898 -32156 43927 11835 -56555
288 -56555 26323 53109 -26841 -11319 24407 422 3928 -13673 -38071 24206 25565 -61340
300 -61340 -19616 51897 -7507 -23759 25639 9304 4066 16208 -13243 12414 34411 -40874
312 -40874 -33729 48662 389 -53308 5844 19349 -8561 5698 -1216 6339 41070 -6712 -35622
325 -35622 44708 36482 -50004 -14448 25889 -16774 -6791 -2227 -22013 19093 3376 -33149 35443
338 35443 40455 -36420 -14446 41205 16599 -20541 -12798 -5879 -1329 8396 -31230 -21250 44551
351 44551 -21753 -46604 54193 19708 -27470 14022 -6035 12416 27268 -37646 -12314 24165
363 24165 -17230 -30756 818 28723 -21637 -37355 38083 13041 -5095 18735 -31493 27720
375 27720 42285 -65845 14027 41994 -53192 -4332 3262 -4376 26835 -37997 -10871 43990
387 43990 6572 1231 -18388 26056 38878 -59594 18384 41593 -57416 15186 -11388 -28892
399 -28892 71523 -47417 -47440 78612 -8023 -7110 14378 -16744 46433 -14279 -25266 37090
411 37090 -31536 2636 -2926 -38357 57284 -41229 -45918 89961 -34787 -18545 45392 -44662
423 -44662 61048 12092 -92792 62420 15413 -41698 12664 -48692 25505 15815 -53803 50463
435 50463 -23640 -25073 61745 -41280 47587 23153 -120118 80623 53128 -75389 24213
446 24213 -62140 1068 94800 -74388 -10755 17316 -36738 78530 -8798 -22955 35940 -71091
458 -71091 60316 61932 -89622 20308 -33418 -9163 109976 -97793 -35977 80012 -57898
469 -57898 56977 24762 -78709 64755 -11577 -3085 66694 -82909 -2629 28062 -19230
480 -19230 67007 -95625 -52817 130753 -35720 -2149 7019 -90699 119373 40351 -88424
491 -88424 43575 -60479 5558 103511 -72670 -20737 -30012 -40177 132802 -17374 -81282
502 -81282 9527 -34900 115019 42953 -130792 33843 -11410 122 114037 -100664 -61179
513 -61179 41027 -39685 97956 1559 -135133 38789 39211 52592 18422 -127757 42053
524 42053 71928 -29017 32238 -85086 -18868 103732 -66661 5025 20053 -90423 81164
535 81164 39094 -45017 27045 -67882 41112 110511 -77647 -37190 -11228 14047 98342 -70989
547 -70989 -66428 33917 -18478 82125 8255 -98372 42793 -6606 26393 101590 -104635
558 -104635 -63823 61082 19321 50071 -65896 -90455 69228 26786 11036 -13330 -71097
569 -71097 56637 26988 -20712 52040 -59211 -29632 64206 -18917 17536 -30855 -78697 80673
581 80673 26964 -55850 -1358 -22874 47427 41729 -58686 3870 6731 10156 39361 -51647
593 -51647 -12793 11331 -30817 60818 -10682 -83070 33190 22155 25534 20737 -80156 10563
605 10563 71483 -1500 -6798 -41573 -9063 42448 -11014 6936 -17509 -50040 39314 24823
617 24823 3936 5437 -63434 26659 80407 -25932 -24474 -17890 37 57147 -20348 -44465
629 -44465 8500 -2405 17285 4074 -14968 7225 -15978 25114 36476 -38620 -3743 11720
641 11720 -3745 31165 -35729 -40414 41889 1901 -18021 -4189 -14428 23005 10500 -8317
653 -8317 9628 -13760 2478 17387 -42 3711 -38333 -17090 49432 -6786 -31094 -7242
665 -7242 -10943 37111 18391 -37835 5257 15623 -519 13585 -128 -7714 -18070 -7786 27992
678 27992 -1700 -24429 -11767 -2496 35447 7068 -35445 16985 19332 -7446 13938 -3370
690 -3370 -5387 7502 -15257 1360 13363 -15188 -16227 5692 20653 -4253 -20317 18970 17855
703 17855 -5388 249 -7161 12112 17443 -28140 -10507 18579 -10038 -9124 3171 -2753 1071
716 1071 -2841 2153 16312 4526 -14090 -5399 23414 9074 -29731 -6727 13573 -7697 -5748
729 -5748 -5243 -6608 11335 -3370 -10236 19185 8570 -16173 2224 16439 -220 -12339 -6085
742 -6085 2350 3731 -8464 -17396 6389 17010 -14652 -10138 22370 6995 -8695 3992 5542
755 5542 6026 1003 -15039 -1459 14867 -10991 -18960 10515 8737 -11187 -227 11426 6414
768 6414 2134 -4730 3858 20382 -2530 -23396 5596 15572 -12719 -12657 3282 561 244 -855
782 -855 -1922 12999 6773 -14646 5464 22611 -6098 -15956 4701 3604 -5351 -5681 -7922 2036
796 2036 5387 -14771 -2392 24188 -474 -17771 7911 13657 -414 -4282 -7250 -2188 4711
809 4711 -7487 -11982 7546 3275 -19953 1545 22269 -2743 -7813 3859 3301 12165 -645
822 -645 -15537 8925 4515 -19238 -1113 11151 -3220 -12347 -2835 12665 9014 -428 -5577 783
836 783 20133 -1702 -17137 17585 21 -23583 8629 4739 -4820 -137 -16240 8510 24578
849 24578 -9257 -10065 9372 15604 739 -14705 9000 5554 -14513 2419 -7332 -654 11517
862 11517 -24645 2776 25953 -19366 1296 16383 -5784 7880 -8751 -3932 21306 -13137
874 -13137 -17670 833 5165 8580 -23543 -4910 22551 -16106 5963 15417 -16237 15161 -6326
887 -6326 -14175 39441 -13873 -36637 14519 6009 7855 -11634 -27973 21293 9957 -3264 6527
900 6527 -15103 15842 6455 -16833 31737 -11819 -30861 24955 -6919 3612 6847 -42198 22642
913 22642 26885 -26607 10096 194 2510 19514 -18160 9356 4693 -19343 20829 -11808 -8876
926 -8876 14171 -33098 24972 26859 -51889 11743 22855 -2103 24020 -35301 -12314 42939
938 42939 -9307 -3282 -11965 -22762 25095 -6889 1041 13409 -44131 11848 29984 -6276 21079
951 21079 -38222 -19380 62240 -11984 -17535 1962 -35897 28712 17078 -29291 7372 -19482
963 -19482 3542 33489 -13688 4170 -15062 -7812 53969 -23423 -28469 24831 -20308 18928
975 18928 6267 -48357 28666 9975 -20626 24754 -16784 -1227 22117 -11655 22502 -10468
987 -10468 -28286 29181 36 3851 -6776 -46393 37112 24690 -31864 14673 -19653 -1336
999 -1336 48430 -21074 -4157 8972 -27840 27868 13865 -21289 -6566 -23052 24835 20974
1011 20974 -34885 7997 -4390 -731 37064 -28981 -1887 29163 -33847 13825 17232 -27960
1023 -27960 8875 -13804 -2960 26322 -28254 -5444 15266 -1728 15091 -23196 129 36926
1035 36926 -23220 -2158 5616 -19916 29815 -12667 -29685 29807 -16218 -8072 27150 -16929
1047 -16929 721 2389 -2165 28151 -13352 -13375 10123 -6123 20807 -14528 -28108 32546 -11191
1060 -11191 -13132 24402 -19940 7920 13549 -20573 27492 1527 -23844 18803 487 369 -5146
1073 -5146 -19609 24032 -1645 -19275 10586 -10250 18872 11145 -36018 23956 15133 -21848
1085 -21848 20175 -9901 -12000 17579 -17195 5471 7244 -25306 5589 6688 7769 3210 -27385
1098 -27385 17677 18178 -16469 13653 -13392 -10486 25734 -20507 -2113 15607 -31207 5294
1110 5294 17052 -8156 5134 -14861 2873 25159 -9086 -2695 -3863 -102 18188 -21479 -3800
1123 -3800 17637 -24436 5657 10845 -17352 16612 -4194 -10964 27957 -6795 -11335 12677 801
1136 801 5044 -10497 -8872 14864 -7747 -2421 867 -11503 16852 -1916 -10206 24688 -10879
1149 -10879 -11524 23511 -3473 -1907 -591 -17915 14019 9185 -17008 -5128 1219 8637 -1193
1162 -1193 -7447 12971 -3762 -5419 13890 -5356 3145 2275 -20715 12593 9806 -22603 728
1175 728 4631 -3372 4636 -6123 1566 10089 -2750 -3477 1810 8286 -1669 -14725 8554 3505
1189 3505 -15340 3995 436 -4983 7797 -8918 -1171 18643 -6002 -8625 10519 4811 -3216
1202 -3216 -4115 -547 1991 -1842 -4626 -4936 5873 4921 -12390 2671 15857 -6086 -2366 9653
1216 9653 -945 1912 398 -7217 6007 3635 -13784 -2448 10555 -2614 -8220 4381 6082
1229 6082 -24 1133 -759 2884 9070 -6906 -9265 10700 1234 -13613 676 3684 -4860 -200
1243 -200 -589 118 7489 -2093 -7277 10569 7958 -11464 -3705 7881 -2198 -5213 -1836 -4304 2080
1258 2080 1118 -9329 4100 11761 -7881 -4812 11632 2789 -4669 414 -1293 189 1236 -6591
1272 -6591 -3401 6839 -3947 -9768 8778 7978 -6932 761 4792 1539 6191 -4093 -5750 9471
1286 9471 -1880 -10657 4744 4013 -7209 -3676 4785 3986 -77 1214 -1160 4048 9653 -7916
1300 -7916 -3756 13892 -7509 -10800 7672 -1477 -2150 -1419 -7743 7467 6954 -6281 -102 4547
1314 4547 3312 -1786 -953 6463 -6875 -5537 5404 -5299 2788 -2958 -15534 14357 7459 -15189
1328 -15189 6959 3385 -3040 7704 -4145 133 2269 -7847 2049 594 -521 -4456 -12359 14788
1342 14788 6439 -17079 8174 2919 -1152 12870 -13554 -429 16544 -13925 -1481 5835 -7434
1355 -7434 3335 -5807 780 9176 -11123 3284 7275 442 8479 -15425 2131 23529 -15744
1368 -15744 -3664 4987 -13645 15381 -376 -16653 11514 -7498 -627 18979 -5332 -4018
1380 -4018 -7276 4588 26080 -13939 -15151 3784 -5399 20494 -4774 -28143 16278 -1316 -3848
1393 -3848 20414 -15655 -3767 8284 -6202 21420 -4903 -23962 8544 2918 9166 -5762
1405 -5762 -27033 16453 6415 -7997 11382 -19697 5014 23038 -18901 8844 2585 -21030
1417 -21030 22288 2272 -14702 710 -14327 17046 12842 -23373 602 -2621 12254 22017
1429 22017 -27612 -1156 13336 -11583 24261 -5125 -26146 12887 -8109 11069 18660 -35042
1441 -35042 -3278 15618 6468 17453 -25293 -10654 24093 -2556 11508 -9939 -23862 23846
1453 23846 -5314 -2971 16250 -32684 4603 24343 -13955 11033 -10114 -11883 31014 -8056
1465 -8056 -8362 3799 -13794 19504 -3891 -18579 15447 -16091 4320 20296 -24917 7805
1477 7805 3227 -10550 32903 -15439 -23334 21985 -5637 10498 -1327 -32791 18377 6759
1489 6759 -7078 9729 -23535 7439 16918 -13983 20977 -11895 -20857 31964 -7200 -2103 6989
1502 6989 -32596 19633 16252 -24106 9722 -10109 -134 23537 -18024 6787 5318 -16872 24925
1515 24925 -5188 -11865 13914 -22217 14253 15735 -34245 12628 5768 -8318 21754 -22249
1527 -22249 -2902 28402 -16191 5206 1419 -14558 20346 -10766 -4333 13488 -25950 10882
1539 10882 12035 -16644 16609 -16604 -7048 35454 -17539 -6419 9773 -16350 20693 -1391
1551 -1391 -20876 14918 -12918 247 16489 -18147 6666 -3432 -8000 29315 -14204 -12123
1563 -12123 16740 -12703 14139 1912 -27806 19754 -737 -13803 15792 -13823 1136 11110
1575 11110 -13987 15131 -331 -12896 16234 -5537 3277 4769 -21685 17080 5942 -19606
1587 -19606 11506 -7997 -838 18478 -18217 3498 11611 -12685 13137 882 -8562 7293
1599 7293 -10621 7241 8966 -18622 4071 -72 -1424 13638 -16085 -351 15926 -12416 7272
1612 7272 5282 -11838 9792 -5029 -4234 11907 -12159 -4375 5731 -3617 5774 -7487 -2656
1625 -2656 13281 -7092 338 5451 -6532 8420 -3833 -8654 12262 -7198 -6920 8027 -5500
1638 -5500 1120 591 -5996 9217 542 -5413 4101 374 4501 -2524 -6704 8518 -3148 -6489
1652 -6489 5285 -4010 950 1903 -7587 8064 4756 -7677 3778 3809 543 988 -3920 2653 1871
1667 1871 -4385 -693 -604 2225 -771 -5921 5911 4184 -5367 3316 2807 -175 2406 -3660 80
1682 80 4910 -4742 -4796 2466 1170 -2491 -2579 1889 2275 -1130 37 986 2992 695 -5564 1639 5510
1699 5510 -5194 -4649 2232 -292 -1355 -1532 -1200 3174 1432 -3278 890 5918 -347 -4764 1380
1714 1380 3523 -1939 -2759 -1544 264 1008 -3373 -1981 5233 586 -4511 2718 5065 148 -1589
1729 -1589 -691 1550 2234 -2560 -3871 2122 1725 -5046 -1237 5462 260 -2578 1676 1891 3195 608
1745 608 -3465 2307 3683 -4364 -2646 2929 -369 -3541 -1610 2652 1437 -1073 -1282 1022 4824
1760 4824 558 -4871 3136 3238 -4344 -747 151 -1322 226 -4120 -649 4331 -2100 -2520 2588 2932
1776 2932 -44 -2535 2278 1720 -3204 500 -1778 -1094 2511 -6085 -1300 6436 -4150 -1628 4402
1791 4402 39 1611 -824 -232 4159 -2623 -2584 605 232 1366 -5948 -1672 6513 -2911 -510 2653
1807 2653 -2559 5661 -335 -3572 8465 -2934 -5721 4577 -475 572 -2763 -5184 5326 257
1821 257 -841 1641 -3977 5691 1485 -4040 8780 -4197 -6843 8414 -2090 -599 -558 -9365 7296
1836 7296 3322 -7347 2921 -1165 2690 3048 -6506 6731 591 -6908 6047 -4160 -200 3136
1850 3136 -11568 7160 4109 -12683 5919 1266 -733 6533 -10560 2314 10325 -5721 1555
1863 1555 -4537 -2691 8354 -8051 2333 3154 -13617 9033 4252 -4934 7776 -11300 955
1876 955 16887 -9132 -845 620 -6131 11145 -5076 -5383 7544 -10125 3785 6771 -6179
1889 -6179 7934 -7791 -1900 18015 -10166 -2583 6439 -8935 11307 -3526 -13574 14014 -3853
1902 -3853 -4731 6711 -8803 8339 2498 -8830 11306 -6501 -2648 11641 -10128 4599 -420
1915 -420 -14568 16498 -1488 -12256 8622 -9088 5690 10631 -14463 6611 948 -6794 14226
1928 14226 -6744 -3753 3640 -11947 13189 2062 -16421 8461 -4562 2762 12354 -18694 4622
1941 4622 11541 -11242 10237 -3225 -8635 12347 -8730 957 6740 -13867 7253 2091 -5179
1954 -5179 9928 -12072 2758 15568 -13503 4270 1731 -8367 16305 -7515 -9858 11509
1966 11509 -10030 4620 7954 -13229 5636 -761 -467 14488 -12314 -3501 8541 -3853 11491
1979 11491 -7943 -14122 15774 -4019 -2089 7387 -15363 5813 7718 -7673 10729 -5914 -8615
1992 -8615 12494 -1924 2034 -2410 -12816 12173 1858 -7776 4301 -10416 5044 10389 -12046
2005 -12046 5903 684 -8582 13818 -2524 -6368 4610 -7902 6730 4409 -13148 2276 613
2018 613 1583 5856 -11285 2849 7865 -5731 7993 -3246 -6947 9717 -4457 1234 5682 -13856
2032 -13856 1952 8264 -2318 2210 -7930 -1094 12163 -1922 -952 -1626 -3219 9194 -1941
2045 -1941 -3443 3883 -9037 1867 7698 -6049 1253 -2842 -3055 12047 -1337 -6413 3064 -42
2059 -42 3847 -58 -5473 2859 -2032 -1030 2961 -4365 1078 -470 -3111 7996 -1690 -6259 6151
2074 6151 726 132 719 -6435 2467 3416 -4577 -1248 -677 428 852 -2044 2748 -392 -2693 4055
2090 4055 551 142 314 -5448 3529 4197 -6160 -1033 1608 -1398 1688 -1052 -875 2898 -291 154
2106 154 1981 1404 -687 -2570 3127 1983 -4658 -212 717 -698 1827 -2638 -1392 5102 -627 -2003
2122 -2003 2883 821 -1108 69 754 291 -1059 -1776 -698 1487 427 -3796 182 3861 -1574 -1035
2138 -1035 2545 -101 175 288 -1535 1597 782 -3973 -986 2887 -1407 -2814 897 1053 -691 388
2154 388 242 901 1990 -1510 -1782 3322 44 -4429 -202 1286 -1353 -770 -24 -248 1316 -7 -1225
2171 -1225 2984 2338 -2850 -141 3164 -679 -1647 -217 -987 821 228 -2322 1350 2620 -2119 -666
2187 -666 4282 1282 -1996 466 1021 243 637 -2328 -1183 2102 -1377 -3156 2526 1766 -2852 -64
2203 -64 2166 994 478 -952 -643 2452 346 -3764 603 1928 -3015 -2065 1513 -169 -376 -193 -696
2220 -696 2396 2139 -2836 -303 3561 -1180 -2419 1121 -256 -1607 -424 -1144 464 1566 -2284 -1413
2236 -1413 3557 1181 -2640 1046 2082 -1114 -386 433 -1055 781 -795 -2928 2459 1502 -3349 446
2252 446 2697 385 174 468 384 1171 -401 -1445 722 1248 -2692 -2448 3218 645 -2488 1007 44
2269 44 975 2965 -2111 -786 3445 -1463 -1385 2194 -690 -2519 -868 960 296 -969 -332 -351 1370
2286 1370 2455 -2472 762 3348 -3594 -149 1985 -2536 196 -894 -2515 2626 -786 -2316 1840
2301 1840 1212 -518 -1008 1515 3157 -2367 -1190 479 -1404 2926 -2204 -4904 4003 -709 -2482
2316 -2482 4189 -1462 -1538 2404 -299 2878 702 -3524 760 962 1431 -1049 -3772 2693 -572 -2180
2332 -2180 4714 -1970 -1215 3315 -2337 3890 2484 -6617 2653 2734 -2369 677 -3016 556 2466 -3510
2348 -3510 911 799 407 2115 -4039 2842 4406 -5788 2818 1583 -4830 3838 -2282 -2573 5597
2363 5597 -5207 -2552 4375 -1232 1762 -1644 -1697 4937 -2209 502 1633 -4543 2970 -997 -3063
2378 -3063 5726 -6171 -2662 7206 -3723 878 1805 -4904 6079 463 -4468 4189 -1527 -139
2392 -139 402 -3653 4849 -1948 -4376 5334 -3360 1287 3897 -6262 5664 2168 -7024 6429 -4
2407 -4 -4006 3365 -4927 1687 3984 -6010 1451 35 -666 4846 -4148 1654 2686 -5511 6644 947
2423 947 -6169 4509 -4165 253 6743 -9042 -393 5025 -3675 3732 -1866 -2504 5601 -3386 1150
2438 1150 2653 -4681 3160 -2268 -1560 5746 -7954 -873 6762 -5291 2468 -268 -4967 8397
2452 8397 -1324 -4665 4746 -3009 1301 1961 -4748 2489 -2372 -1395 5309 -4632 83 1516 -3359
2467 -3359 7712 -1448 -7027 6614 -944 -532 4053 -6680 899 2798 -3712 3820 -1624 -3681
2481 -3681 2980 -402 4043 -8 -6138 4861 1411 -1233 2770 -6714 1066 5224 -5954 1950
2495 1950 1130 -4814 4361 -50 -970 2920 -3531 1723 3336 -2445 584 -2611 1041 3736 -5617
2510 -5617 678 2140 -3442 3640 -1314 -2934 5170 -2462 -787 4639 -3409 -827 1266 -721 2000
2525 2000 -3326 -2322 2678 -965 999 -1874 -2211 4703 -1363 -1158 4023 -3168 -150 2538 -2406
2540 -2406 2056 -768 -4315 2882 1222 -1829 -186 -684 2259 373 -940 2018 -821 697 1360
2555 1360 -2061 2423 -224 -4182 2977 413 -2501 1406 -754 815 1993 -2139 587 2067 -253
2570 -253 -603 -877 1419 -515 -2380 1529 -338 -1319 1026 -1620 793 2442 -3247 554 2699 -1167
2586 -1167 -138 153 -340 509 -1250 -1248 163 -126 -676 -1288 1745 1362 -2395 1079 1683 -1137 907 -228
2604 -228 -629 1696 -1172 -2304 1368 -130 -1645 -182 989 424 -309 603 720 588 463 -1084 297
2621 297 1938 -1818 -1295 1667 -801 -850 399 -705 784 1025 -994 730 2080 -603 -827 1477
2637 1477 487 -1351 -462 110 -292 260 -492 -1091 1628 122 -1574 1634 1839 -1057 -244 871 347
2654 347 255 -507 -1026 674 387 -1941 -12 1301 -874 -1154 1337 698 -3 -85 -601 660 1310 -2035
2672 -2035 -936 1568 -983 -1683 596 526 -367 68 -81 664 1604 -587 -1366 1835 863 -2131 -292
2689 -292 657 -1144 -434 -182 -16 1037 -522 -1161 1934 1507 -1007 -83 1259 401 -860 154 -42
2706 -42 -254 -133 -1269 190 1838 -1751 -1310 2620 629 -397 319 -185 1242 603 -1534 -146 813
2723 813 -706 -1469 183 1376 -1252 -898 1600 -249 574 720 -1409 1806 543 -2682 1227 560
2739 560 -1680 -552 -1087 379 708 -1385 155 336 478 831 -978 1730 -70 -2828 2246 480
2755 480 -1822 650 -2489 707 3221 -3118 -712 1931 -815 1379 -184 14 1074 -2281 1048
2770 1048 1168 -1420 864 -2301 -410 3630 -3101 129 2309 -2318 2610 594 -1978 3351 -1431
2785 -1431 -1211 2632 -2227 86 230 -1577 2274 -2478 -721 3557 -2443 1140 593 -2451 5148 -1015
2801 -1015 -3408 3906 -2109 -313 2556 -3801 1470 -112 -2654 3879 -1007 -1090 1117 -2174 4309
2816 4309 355 -4648 3414 -1417 -638 3492 -5233 1034 2103 -4428 3959 -131 -3664 3675 -1415
2831 -1415 1085 2463 -4645 2584 1098 -2574 2289 -3548 801 3587 -5832 2737 1885 -3998 4781
2846 4781 -1658 -1494 5243 -4230 1195 3750 -4829 1732 -299 -1131 4194 -4970 -352 3554 -2823
2861 -2823 3384 -1519 -3520 6278 -2579 -474 4035 -5959 2127 2194 -3692 3693 -3029 -2897 5925 -2233
2877 -2233 170 472 -3104 5232 -1027 -2641 3904 -3796 1201 2690 -5172 3130 -931 -4089 6245
2892 6245 -2667 -2922 3522 -2686 3467 1110 -5360 3832 386 -503 1819 -5366 1918 2381 -4108 3424
2908 3424 -2193 -2656 5684 -2597 1075 2123 -5883 4417 3079 -3524 1514 -3477 602 4350 -3524
2923 -3524 202 -387 -1864 5245 -1723 -832 2234 -4444 4160 3457 -5115 1480 -1378 -296 5157 -4768
2939 -4768 -1736 2526 -1637 2552 -979 -2330 3146 -1287 1461 1892 -3887 1866 577 -1156 3396
2954 3396 -4694 -1906 4690 -2045 463 -230 -3092 4339 510 -1692 1586 -2171 1169 1756 -2100
2969 -2100 1110 -2952 -914 4237 -2290 -768 208 -2197 4773 377 -3793 2541 -643 453 2264
2984 2264 -2613 111 -51 -1312 2567 -1365 -1226 337 -1159 3453 -153 -3347 2854 373 -45 1899
3000 1899 -3161 819 2047 -2571 1261 53 -1662 1401 -237 801 574 -2006 2578 899 -801
3015 -801 776 -2375 974 2273 -3219 720 539 -1806 1930 -638 -889 1857 -1660 802 1970 -965
3031 -965 -236 -944 849 1215 -2494 183 472 -1216 1459 -1381 -1017 2527 -1600 -215 2171 -1206
3047 -1206 116 546 -641 870 -932 -899 575 -123 -18 -1334 -105 1957 -992 -512 1565 -851
3063 -851 767 520 -1059 1616 -441 -1931 1188 115 -913 -126 -50 987 86 -363 592 430 1018
3080 1018 -42 -701 1481 -383 -1454 1059 -251 -872 495 -742 404 976 -951 140 1223 124
3096 124 -377 62 633 -147 -648 421 -287 95 169 -1362 534 984 -1148 478 1326 -477 229 271 43
3115 43 490 -123 -1127 236 269 -689 -576 897 -53 -803 809 494 -192 516 -243 -307 1241 -679 -1122
3134 -1122 695 -339 -1192 -27 137 -299 -88 -95 -83 782 223 -619 925 1122 -805 -576 758 -400
3152 -400 -339 176 -633 481 142 -1062 516 1102 -542 -424 942 602 -347 -162 -20 -100 200 -844 -804
3171 -804 1233 -398 -1579 798 597 -648 351 -140 73 734 -557 -529 535 -152 -905 -168 742 -332
3189 -332 -1111 416 494 81 867 -874 174 1204 -1184 50 1007 -1058 -540 110 -234 238 -617 -536
3207 -536 904 688 83 -557 669 1568 -1148 127 1125 -1083 345 -96 -1133 1495 -361 -1490 1647
3224 1647 555 -431 571 79 687 -10 -816 730 -100 219 -707 -1195 1581 -488 -1111 1789 -974
3241 -974 -218 1663 -719 592 628 -1898 1008 863 -1130 -416 -992 697 284 -1096 1181 -593 -458
3258 -458 1443 -1189 891 911 -2540 1485 1164 -1508 423 -893 -563 1350 -1457 -148 1078 -682
3274 -682 490 -469 457 1127 -1717 939 693 -1790 1366 -579 -1243 1754 -1971 -424 2391 -1550
3290 -1550 -141 690 -469 1757 -478 -947 1147 -819 925 -72 -1219 1444 -1747 -347 2739 -1784
3306 -1784 -41 849 -986 2342 26 -2433 1560 -71 -185 399 -1642 827 -117 -566 1209 -1172
3322 -1172 37 1304 -939 1842 -315 -2193 2836 -67 -1649 1118 -1475 432 985 -2018 122
3337 122 3 -385 1266 -801 414 -172 -1401 2717 -174 -2070 565 -1549 1340 1295 -4165 67
3353 67 1289 -646 1487 -1100 -809 1565 17 1378 -200 -1723 597 77 1240 859 -3655 547
3369 547 1873 -831 1191 -1699 -1081 3490 -187 -246 637 -1613 1301 739 -403 134 -2258 656 1952
3386 1952 -1449 145 -1034 181 3621 -1574 -1456 1876 -1003 1490 324 -2737 892 -212 -108
3401 -108 1509 -1842 -609 387 444 2211 -1984 -1446 2154 -412 1280 -363 -3212 1935 456 -1405
3417 -1405 1305 -2106 -978 2129 -474 699 -827 -1412 2350 703 -176 -764 -1970 2160 730 -2098
3433 -2098 845 -1291 -397 2308 -1806 208 935 -1868 1981 679 -1563 434 -435 1100 775 -2596
3449 -2596 426 25 -149 1152 -2156 131 1825 -1821 1318 672 -2282 1634 100 -357 1079 -1890
3465 -1890 -248 1539 -783 -172 -940 -69 1954 -1186 63 742 -1155 1677 -125 -1247 1491 -1529
3481 -1529 -500 1864 -1782 -533 417 -882 1639 -406 -1235 963 69 619 -391 -997 1213 -706
3497 -706 -635 1380 -1518 292 929 -1117 1104 59 -1480 1434 478 -810 357 -141 678 187 -1036
3514 -1036 336 -162 -46 -50 -941 1159 127 -1220 1327 444 -715 738 -445 252 1146 -1598 -96
3531 -96 586 -562 -172 -446 392 255 -301 442 -45 9 647 -225 357 790 -1517 -191 950 -930 -428
3550 -428 -66 -481 1001 -117 -661 764 303 55 -290 252 596 -798 -184 207 -386 -70 -391 -326 1070
3569 1070 -183 -536 963 608 -449 180 282 -36 96 -723 -362 108 187 -908 138 547 -500 -204
3587 -204 1105 105 -208 377 -347 210 423 -741 -217 451 -319 -527 233 -8 -411 166 55 588 451
3606 451 -344 -113 812 -328 -719 164 279 -664 -283 -209 -202 233 -54 -215 923 439 -618 315 726 -139
3626 -139 -500 287 -361 -192 -445 -701 -115 439 -908 -49 666 46 -516 63 112 307 -152 -302 -60 384
3646 384 -492 -323 276 -234 -765 -294 461 -95 67 101 94 621 2 -767 381 490 -773 -186 540 -83
3666 -83 -112 -81 197 802 516 -501 327 1004 -199 -426 368 29 -745 -88 -266 93 231 -818 -58 721
3686 721 174 93 294 247 19 -267 70 275 -47 -440 -479 322 75 -610 109 661 -412 38 525 38 135
3707 135 -287 -252 503 91 -788 -119 315 -108 -554 -215 136 -74 117 -133 96 931 -315 -688 964 199
3727 199 -657 68 -283 11 299 -204 -198 344 -219 -174 649 562 -238 -344 690 53 -308 128 -487 -176 378
3748 378 -601 65 250 -495 53 843 -16 56 -63 268 461 5 -757 -223 343 -206 -877 232 443 -97
3768 -97 180 -53 -23 725 -132 -73 588 -622 -565 415 -67 -688 -799 -9 650 262 0 -804 406 973 -230
3789 -230 -335 -29 -626 369 742 -451 -329 -431 -90 1067 -121 -901 -316 724 973 -165 -396 287
3807 287 175 788 127 -1056 42 -286 -470 1096 -556 -1129 599 453 791 36 -996 533 801 381
3825 381 -603 -749 634 10 -219 254 -906 -335 979 90 248 42 -1164 1342 1027 -944 -680 -159
3843 -159 618 785 -1014 -561 -334 209 1185 -331 -399 86 -764 1610 867 -1725 -40 -131 378 1168 -1755
3862 -1755 -961 827 -26 542 -349 -736 420 141 786 434 -1221 468 520 -186 864 -1453 -928 1610
3880 1610 -629 -395 168 -974 1280 235 -716 883 -183 298 914 -336 279 -687 -151 1536 -730
3897 -730 -816 253 -675 1281 300 -1864 1206 278 -272 1201 -890 -448 468 -924 927 -195 -966
3914 -966 621 -137 533 276 -1634 1091 727 -688 766 -916 -80 1393 -1282 152 572 -1491 482
3931 482 122 -392 561 -609 357 663 -926 14 -179 -208 858 -1176 -465 1014 -1053 181 107 -939
3949 -939 1102 -98 -314 1141 -615 -290 479 -420 117 -555 -312 811 -483 -291 289 -730 1250
3966 1250 -112 -903 1381 -327 -62 1070 -667 291 193 -832 500 52 -1238 327 183 402 -116
3983 -116 -786 837 137 -373 732 -641 206 533 -889 426 247 -1009 440 168 -138 219 -248 270
4001 270 500 -235 208 299 298 -79 -788 364 222 -893 79 -245 -476 473 -580 -86 1069 -363 -112
4020 -112 387 -154 -339 -421 -35 278 -243 -273 -277 13 450 -533 -83 496 -329 24 778 54 15 127 -396 397
4042 397 103 -635 -388 379 -189 -240 141 424 269 -11 136 218 424 -384 -249 425 101 -850 62 49 -288
4063 -288 286 -97 -57 554 65 -236 516 343 -377 -5 112 -235 -398 35 -172 138 8 -481 242 679
4083 679 -443 -630 396 25 -14 -75 -366 175 69 -556 -104 305 -265 -300 288 480 -263 7 284 19
4103 19 519 -25 -326 384 -179 -701 189 237 -462 -246 106 243 -25 358 -68 273 665 -259 -159 376 -37
4124 -37 -586 208 97 -11 -109 -343 245 397 -139 -172 449 43 -151 166 266 -185 -194 -71 -245 160 -312 -454
4146 -454 219 438 -565 269 290 -304 260 -61 -108 -94 -345 -181 17 248 -361 -397 414 -9 -438 246 -254
4167 -254 96 225 -445 285 576 -670 -381 370 -362 -62 -177 -133 385 -28 261 29 200 125 -547 201
4187 201 770 -774 -14 157 -384 418 -311 -488 535 -155 15 205 382 212 -242 199 485 -488 222
4206 222 78 -460 553 -386 -512 704 -368 -506 553 108 217 72 -692 454 437 -212 -2 -290 25
4225 25 -383 -651 655 -621 -500 542 -508 873 204 -1093 736 670 -700 440 -716 -11 512
4242 512 -389 231 58 -819 349 -213 238 133 -1036 773 566 -874 601 -557 -194 1136 -924
4259 -924 -173 608 -933 565 -28 -264 500 -684 718 790 -1067 354 -308 -238 1320 -1438 -770 1058
4277 1058 -722 953 249 -1217 917 -22 -21 943 -1260 -142 1008 -405 465 -1148 -855 1331 -776
4294 -776 191 456 -1477 1219 458 -1016 1231 -733 -402 1542 -834 60 -309 -813 1428 -282 -882
4311 -882 117 -1076 950 664 -1582 849 -188 -272 1619 -1168 133 814 -1394 1174 6 -1802
4327 -1802 901 -86 175 877 -1462 722 1023 -687 832 -824 -523 1600 -1373 306 321 -1967 1475
4344 1475 593 -858 1189 -838 -89 1772 -1274 73 193 -784 1295 -920 -610 590 -1132 1073
4360 1073 218 -1122 1130 -455 -411 1860 -1396 -129 1340 -1130 988 -389 -1304 1173 -625 -184
4376 -184 406 -1200 631 468 -540 1228 -794 -590 1340 -1017 503 372 -1408 1265 -167 -1337
4392 -1337 1031 -641 304 636 -1192 459 408 -512 1086 -589 30 546 -720 804 157 -1331 995
4409 995 -181 -302 903 -1034 152 1072 -639 508 204 -355 554 -563 277 359 -889 508 -36
4426 -36 -289 879 -766 -48 1177 -885 -31 401 -505 597 -245 -458 833 -501 -225 -96 -709 215
4444 215 -50 -155 757 -332 197 402 -624 595 -294 -437 636 -36 -762 428 -592 113 167 -490
4462 -490 224 -112 15 530 -105 0 23 -281 607 -294 -505 135 -171 32 354 -546 126 320 -173 10
4482 10 336 -108 93 -62 -42 -30 -379 141 -311 192 62 -183 402 725 -227 126 152 -243 284 -238 115
4503 115 326 -128 -145 321 -126 -187 53 504 260 -263 14 73 84 263 -227 -113 408 -177 -302 132 -461
4524 -461 -147 83 -304 446 90 -136 34 269 201 -508 -264 253 -76 178 -57 74 87 -293 -301 187 116 -92
4546 -92 148 188 193 -126 -39 -4 -140 288 -254 -43 156 -293 -164 429 -129 -217 286 181 38 381 -162 68
4568 68 304 45 -43 145 146 29 -38 237 2 136 25 -26 166 180 -237 -47 295 -189 0 -97 -162 117 271
4591 271 -173 233 -132 -82 4 -18 43 -208 199 316 -252 -183 -173 18 111 -219 -230 260 -332 12 160 37 -2
4614 -2 256 142 -44 -303 75 78 122 104 -437 -73 335 -178 69 129 -188 373 26 -391 178 -136 -148 125 -50
4637 -50 46 -223 -187 253 -88 -2 25 -248 542 228 -381 437 -297 -235 343 -401 82 227 -320 211 75 -229
4659 -229 386 41 273 359 -477 539 211 -384 142 -288 -53 328 -811 21 69 -542 331 78 -382 208
4679 208 -625 347 422 -594 0 -274 -122 565 -533 -331 281 -699 391 375 -477 570 -546 39 818
4698 818 -522 193 75 -364 484 -458 -498 745 -328 126 248 -492 562 -176 -367 695 -817 51
4716 51 650 -513 194 -68 -658 982 -225 -371 190 -353 725 366 -764 401 -439 16 967 -813
4734 -813 50 -63 -608 706 50 -1124 428 -74 311 680 -776 187 435 -209 784 -477 -506 424 -644
4753 -644 351 355 -963 651 -267 -388 607 -903 118 1084 -689 145 43 -569 482 -503 -166 146 -831
4772 -831 532 6 -545 771 -517 -36 1021 -1001 77 432 -352 849 -230 -751 675 -304 178
4789 178 372 -667 392 102 -446 718 -561 -245 502 -516 533 55 -645 1029 6 -297 501
4806 501 -429 115 516 -311 306 241 -347 482 -206 -327 89 -636 377 174 -960 278 -92 92 336
4825 336 -867 342 485 -437 492 57 -288 468 -461 -209 94 -307 -79 20 -256 293 -215 327 668 -415
4845 -415 166 39 -243 551 -460 -259 217 -225 107 -51 -198 25 -62 325 301 -309 316 128 -193 264
4865 264 -432 -446 606 -197 122 37 -354 123 84 -320 294 118 -155 630 145 -88 -73 -147 -30 -243 -21
4886 -21 -39 -39 307 9 -311 406 -72 -47 70 44 -311 235 286 123 -98 -137 -43 -31 293 -277 -316 198 187 173
4910 173 95 -240 -93 362 -199 -313 103 -412 -39 187 -105 -399 -324 289 -129 253 -74 52 447 152 -275
4931 -275 78 234 -56 117 54 165 194 -3 122 443 -68 36 61 442 35 -219 -101 121 -130 148 -213
4952 -213 -66 229 -248 237 153 -259 -106 235 139 190 -24 8 75 -298 41 -250 63 44 -221 -56 213 -95
4974 -95 130 215 -3 119 -163 -145 149 166 -20 -409 226 -16 -173 -197 1 116 220 39 61 200 -140 -40
4996 -40 -148 -98 -115 11 -11 28 -26 5 84 -84 -136 144 275 210 -203 38 295 -33 192 218 -119 171 -23 -344
5020 -344 124 281 -224 -66 48 46 141 -120 -80 330 31 48 -298 206 99 -158 -32 73 142 70 -51 89
5042 89 176 -184 88 -46 -420 -176 -21 91 -191 14 64 67 54 95 -294 84 251 -106 135 -97 -147 -15 9
5065 9 -140 309 -161 -102 30 124 -125 173 183 -16 76 158 80 -183 26 -93 -192 145 19 -225 60 80 -352
5088 -352 144 174 79 -23 -287 216 158 -44 -63 -89 -171 -130 -273 -264 263 -214 -56 92 -102 -3 158 19 296
5111 296 -197 -112 201 73 122 -21 -144 91 141 -189 -57 135 126 9 54 14 -141 97 47 -169 -107 -170 -188 285
5135 285 116 -254 61 366 -36 25 -353 -73 196 49 -21 -77 -292 -169 -72 -30 -170 -112 120 18 -22 269
5157 269 -387 55 352 -145 -68 80 -118 326 130 -273 -57 -225 -61 320 -27 134 -128 -320 296 -93
5177 -93 -69 291 -84 220 360 -254 177 -52 -441 422 -16 -325 165 -187 245 33 71 29 -25 111 79 -409
5199 -409 153 -64 -155 291 -24 -289 318 116 163 76 -322 293 403 -62 -6 -67 73 25 -138 40 53 -108
5221 -108 191 -26 -143 245 -465 131 495 -172 -93 142 -260 214 -359 -179 140 -17 243 -131 16 219
5241 219 -181 311 251 -555 76 -29 -76 452 -52 -102 301 -138 227 -177 -190 246 297 113 133 92 -6 321 25
5264 25 18 -149 -357 105 -40 -186 119 -60 -37 223 -245 72 45 -144 428 -221 -266 122 -212 103 -31 -78
5286 -78 155 -83 -58 -65 26 189 150 -133 114 -168 -302 -1 122 -396 206 -214 -130 210 -129 -26 52 158 -9
5309 -9 -305 91 75 -45 264 -301 -205 572 86 -191 61 -140 156 22 -58 8 -192 -93 90 -193 48 51 -105
5332 -105 298 -19 -22 -38 -114 333 175 -269 169 69 -126 11 52 -102 288 -141 -93 -178 -200 99 -86 160 26
5355 26 -304 284 -9 -162 91 -153 1 72 -243 -195 55 -181 61 70 97 -121 87 153 242 -40 -14 -130 134
5378 134 171 -106 -123 143 -181 126 27 -149 141 -179 -64 355 183 -183 19 77 63 119 244 -43 -47 183 -37
5401 -37 -248 115 113 134 88 156 -220 -245 1 176 87 7 129 317 305 -276 19 317 73 116 63 50 97 169 246
5426 246 51 188 -82 76 -43 -26 -97 23 74 95 -70 52 201 281 30 22 70 -20 71 121 42 -329 99 -168
5450 -168 222 75 -193 -180 325 -90 -95 -74 223 -66 -60 104 43 66 57 -94 46 168 -15 29 114 -69 136 165
5474 165 -261 190 31 -198 59 178 -188 -140 -18 15 78 -36 26 -213 3 46 -62 215 -102 -194 -57 222
5496 222 -92 -86 102 113 35 1 53 112 0 -118 145 34 64 -211 -1 -29 -73 -26 -14 -107 251 84 88 70 -59
5521 -59 -46 20 123 -124 134 -123 84 104 -100 69 -70 -94 -50 137 -17 -61 201 -133 -155 263 201 -39 100
5544 100 20 169 49 -10 279 24 195 136 55 -109 61 -42 -102 -139 -180 -37 111 126 118 -34 223 -31 -204
5567 -204 207 62 132 -96 -68 -59 -200 -266 133 -111 -63 46 113 96 -106 -125 -212 36 -114 111 231 98 -156
5590 -156 -49 128 -155 -100 59 -162 11 -113 -61 31 -51 -57 111 -125 -101 171 -207 46 101 -166 -2 157 -247
5613 -247 -34 -163 141 92 -86 282 -153 217 -94 121 48 182 -8 -69 162 21 348 -7 115 -244 -204
5634 -204 198 -169 97 -117 23 112 104 -90 126 -69 -20 234 -51 -60 75 -139 54 175 -318 -213 97 -144
5656 -144 206 -56 -182 74 -372 15 -12 -247 246 -16 86 157 -27 71 227 -96 45 -59 -205 16 -207
5677 -207 -40 -173 -102 -18 38 237 100 -93 61 262 -241 -55 -13 7 252 54 120 308 -177 -77 312 -48
5699 -48 33 -28 160 140 -79 150 324 -141 -8 37 -123 15 -41 199 149 7 97 -90 -131 262 164 203 347 -328
5723 -328 -97 -26 26 11 -14 -23 -23 -181 55 -154 -68 -141 163 1 54 -311 14 -127 -81 236 215 142 117 -124 -187
5748 -187 58 -254 296 -227 -149 31 -111 111 180 -206 65 -92 -171 -71 140 217 -189 28 112 196 122 32 -302
5771 -302 30 149 -134 5 -7 -70 137 -29 -126 132 -40 9 62 -179 181 52 31 91 -368 419 1 -126
5793 -126 12 -182 -410 103 -237 -159 -197 -165 122 35 -61 177 -93 -234 102 -89 49 -120 89 17 -71 -57 224
5816 224 -343 227 12 28 151 -53 207 -15 -251 182 116 -70 247 -58 55 183 20 301 132 -106 3
5837 3 258 -18 260 -253 28 113 -181 -40 64 -150 33 -112 -135 231 63 193 -147 -1 249 -102 -67 175
5859 175 75 -3 127 97 124 96 -82 192 6 -104 29 -142 29 117 -164 -2 17 -192 137 -49 -76 -2 166
5882 166 161 113 -95 106 75 -181 181 35 -64 96 83 -63 93 -145 182 12 -68 167 -54 17 8 11 178 -333
5906 -333 204 -57 -8 46 -144 -195 50 -49 292 43 -112 62 -122 -71 -18 -164 190 -14 61 -171 -181 -272 42
5929 42 159 -15 -147 255 18 175 -22 222 -16 -91 153 66 66 13 -51 -198 -137 -99 166 63 -7 239 35
5952 35 -81 -64 -61 -2 83 -86 -91 27 -79 231 -30 -252 -32 211 -198 149 -1 -8 -53 10 193 -282 -64 39
5976 39 -129 112 117 -110 -150 -12 56 -112 114 -119 -103 -129 -23 307 179 -16 103 -3 42 -31 34 -133 -73 9
6000 9 45 79 221 -195 32 220 44 65 -289 36 -25 -100 -51 -178 49 276 42 15 86 -136 336 29 0 -50
6024 -50 142 73 -81 -57 22 -23 -30 -110 84 74 50 -96 85 -119 -172 4 27 54 -22 77 157 -159 -76 -232 -66 289
6050 289 -23 33 -55 17 -29 -81 17 -256 141 -203 118 -73 62 140 112 -121 157 -147 -116 -23 -171 69 -117
6073 -117 -57 112 14 121 -101 190 -23 -93 168 24 12 -165 12 67 133 -76 42 -36 -15 -129 97 69 91
6096 91 44 187 109 29 97 -6 169 -158 84 -20 -27 -16 -158 -46 161 146 -111 -12 -21 -51 -132 14 26 -108 43
6121 43 -97 -177 -95 93 -208 224 -73 -23 -30 57 51 2 72 -26 186 -82 50 92 89 -55 -34 293 -233 35 41 14
6147 14 -145 22 179 -25 180 -129 91 35 147 -151 181 -101 233 -222 -34 81 -44 6 -262 301 -236
6168 -236 199 -132 113 -30 38 -130 -118 -367 -115 -55 20 70 -164 248 -78 9 46 41 -16 331 50 -58 -63 86
6192 86 107 80 8 64 143 -93 7 -244 73 60 -54 -150 -84 11 198 -36 -115 99 -80 30 114 -109 93 -132
6216 -132 -51 -91 248 90 -215 79 -199 -89 -41 -62 -116 71 100 -243 -15 240 -38 179 176 -7 355 -83 -189
6239 -189 50 132 -107 -63 -139 -187 -19 -154 31 -130 -136 156 -140 89 137 -74 61 -244 -89 190 -151 -8
6261 -8 116 -396 3 -239 -94 103 51 37 141 -179 74 199 -117 9 60 24 149 30 -37 329 241 18 151
6284 151 24 26 42 131 267 -185 -109 60 191 47 1 -114 107 113 87 -159 190 208 18 90 49 -109 96 -21
6308 -21 -21 -61 -101 101 161 -84 -54 -14 112 151 166 -47 88 196 128 -239 120 -118 128 185 -290 11 81 -10 -192
6333 -192 -5 27 -26 55 100 56 36 54 -95 23 230 31 -77 -49 141 120 469 -14 -245 195 -27 -5 -196
6356 -196 102 80 -264 15 5 -126 227 55 -178 -130 44 4 -136 17 42 -151 -64 -68 -265 189 -25 126 -71
6379 -71 -14 -245 100 -47 76 -39 -191 -16 -78 135 -44 -157 85 -45 -26 133 231 -166 -44 -27 132 -121
6401 -121 -181 18 -240 -179 49 -37 190 116 -29 -119 5 28 8 78 -28 -167 -146 220 -48 74 50 -133 -85 76
6425 76 187 -149 49 -171 -227 162 -270 123 -217 -58 -44 -20 -103 -72 109 -11 33 154 13 -154 -131 309 50
6448 50 19 247 83 319 -149 -8 190 -24 -48 -115 238 107 -61 -83 -58 205 83 209 38 225 265 -177
6470 -177 -107 -193 -69 143 -295 -20 -158 -134 6 0 150 27 245 -111 200 -100 227 -11 112 -155 -65 84
6492 84 77 107 14 -42 -21 78 -28 -214 -43 -83 -205 235 180 -124 154 -8 100 -21 14 163 -139 -38 -164 173
6516 173 164 -152 -1 16 -30 24 29 -52 -18 -137 -13 142 130 -206 -47 93 235 -281 271 153 -208 -61 89
6539 89 119 138 -111 191 29 134 147 60 -37 244 -8 -2 -114 96 135 -120 55 -41 -364 -130 19 -162 -162 13
6563 13 152 220 148 -37 -23 37 -3 132 -77 66 -16 -77 -75 7 218 -175 117 -281 -25 163 -132 122 -120 233
6587 233 118 266 -29 109 -37 -164 129 -115 31 -169 76 -111 -21 -55 -81 -101 -41 -132 113 -1 66 366
6609 366 24 -195 -319 132 265 -137 26 15 77 -39 45 31 -43 -85 -146 168 -339 15 42 263 101 -113 -201
6632 -201 -67 -20 -41 -105 73 17 -25 80 191 -80 -233 38 154 -183 162 -202 95 18 -161 -111 -126 140 -72
6655 -72 -60 58 28 -207 37 -30 31 -84 -69 9 47 32 19 -26 224 128 -138 -103 70 69 59 -26 -8 14 146 -38
6681 -38 -109 284 51 -68 84 -73 -55 -64 -195 29 -18 -51 -66 155 174 428 -147 107 -32 11 125 -39 -221
6704 -221 -62 -71 -71 -94 -116 136 33 -159 -114 -40 -90 190 71 7 -5 -243 274 -67 -43 99 -33 -64 36 -95
6728 -95 -123 43 -264 -58 -87 -224 -210 -92 -130 -105 -185 -110 25 -21 294 60 -97 -63 -146 19 72 -191 199 40
6752 40 33 103 38 120 242 123 139 -296 225 117 -98 112 317 -15 225 88 19 88 -108 22 -39 226 104
6775 104 -141 -244 49 -105 -144 307 102 33 279 -233 -204 -127 -82 55 -95 88 -33 -145 -40 188 -186 77
6797 77 0 -94 -43 -8 303 130 -37 63 -87 -51 44 -119 -104 156 31 82 104 35 355 140 -335 41 -145 270
6821 270 -40 0 60 -58 -145 143 21 57 -41 1 -54 -378 -76 155 20 43 -14 -26 -210 -69 -253 181 -37
6844 -37 122 248 125 46 220 39 -3 16 -7 31 62 145 26 -88 -76 -180 22 164 40 -63 156 -47 -78
6867 -78 -114 78 -218 44 -152 -199 115 156 -9 126 339 -173 -177 194 197 0 32 35 86 156 131 -137 -37 166 94
6892 94 212 247 170 -62 -113 -92 99 -160 16 -101 -249 60 38 -93 -77 -166 12 -16 152 -217 -301 193 -123
6915 -123 135 -63 286 45 196 212 1 -106 148 211 -60 177 58 4 169 -229 26 57 -27 11 95 40 -106
6938 -106 -209 -275 153 -64 -19 -44 -82 80 62 259 -51 74 81 47 49 -199 -23 -37 -38 -20 138 -29 22 -115 63
6963 63 -109 -39 -92 -18 54 -15 197 -9 -32 -190 -29 80 6 -90 -195 25 46 63 -62 -3 -8 120 127 -128 31
6988 31 -55 -35 -144 117 91 165 131 14 -215 250 89 -172 59 19 -59 -36 -190 157 150 102 -93 98 -88 -109
7012 -109 -2 -4 -86 133 -9 49 -171 -49 -51 187 -26 -184 -44 67 182 -74 -16 27 -46 217 -118 -137 190
7035 190 79 272 -160 -191 101 102 -48 -10 241 5 -182 138 -61 -13 26 125 -121 51 34 -104 107 14 115
7058 115 61 -71 79 138 268 114 -9 134 -28 -19 169 2 130 101 -37 17 22 144 -46 159 0 73 -278
7081 -278 -43 24 -33 -36 -59 56 -96 -208 -8 -3 -218 -25 40 -43 140 -327 -226 -93 -186 -228 60 -118 173 120
7105 120 -181 318 -87 188 239 -134 232 -10 -260 -98 16 -193 72 34 -114 143 -107 6 100 207 156
7126 156 -12 -82 214 155 107 77 -12 238 -41 -307 -146 -137 117 163 -48 69 -178 -74 229 -192 4 140 -148
7149 -148 50 -32 -67 111 -166 -50 388 -212 90 99 12 468 -152 85 -20 -517 52 18 128 48 111 56 -45
7172 -45 -240 61 171 -30 329 185 -259 162 -10 -192 5 -309 232 -33 -249 237 -190 65 301 -28
7192 -28 -55 78 214 264 112 -55 -29 -198 -6 110 25 -60 54 -26 263 35 15 83 -50 323 429 -107 303
7215 303 -61 116 134 -134 -236 -17 -87 112 -134 -213 -87 50 194 18 -41 31 126 -285 223 -36 -84 156
7237 156 51 -85 130 46 -21 186 -57 109 -66 -13 178 -214 -79 58 -3 219 67 -191 -220 -126 231 139
7259 139 -89 181 60 -23 77 -196 -128 160 -30 66 42 -25 -72 48 -142 52 -303 -91 162 -4 -64 -40 -105
7282 -105 110 -77 36 77 -73 156 -92 134 58 196 185 276 -20 99 -130 -142 254 -176 88 41 7 6 2 40
7306 40 143 -154 -21 25 -51 100 37 -154 12 -95 77 49 -168 -44 -52 -236 -42 211 -131 -8 -83 78 -15
7329 -15 -195 34 -84 -82 15 -153 -282 -121 89 177 63 -109 -90 -128 -48 187 148 -152 89 -51 -24 -164 6
7352 6 -75 -33 226 -270 50 319 -80 132 264 -181 129 248 -158 -74 -93 -96 -165 -144 -369 -120 -95 -60 -131 -61 -72
7377 -72 262 -44 61 -14 120 48 -191 65 -122 4 45 216 27 -292 62 278 -119 147 -203 155 48
7398 48 113 73 28 7 -99 254 -21 -137 -54 133 -166 -202 -85 -45 209 84 -28 37 -198 -93 -306 -89 210
7421 210 123 -72 -78 -23 81 69 -16 34 -76 162 68 -58 298 165 -77 -46 -68 -153 176 -21 74 296 -90 53
7445 53 -22 143 50 -98 186 -10 103 33 -33 98 314 -108 66 194 -168 69 162 -71 45 -69 -181 -46
7467 -46 -51 -374 214 130 372 -146 -231 -195 -62 157 -106 -234 29 -224 -80 -84 100 5 146 -169 99 146 -38
7490 -38 154 102 160 168 290 104 90 196 294 -151 70 -16 36 120 7 134 -174 -137 67 -193 -151 -118 44 -148
7514 -148 56 -50 102 -70 -55 226 13 345 7 -173 -213 152 -99 -62 -32 -140 12 161 301 -111 31
7535 31 95 -51 129 49 44 -106 122 -29 51 120 11 108 206 -151 -25 -91 49 77 302 67 -104 65 59 -64
7559 -64 6 -83 6 12 77 -221 -18 -40 -80 194 131 21 -92 -15 -23 54 -17 7 -45 104 45 -187 -32 -194 -61 322
7585 322 -199 8 73 -211 -69 -126 -127 139 0 -3 -104 54 -57 -65 -248 -82 127 -145 148 79 187 79 -158
7608 -158 -135 -131 -179 46 -85 -196 157 -105 -40 -159 143 14 83 -137 -3 -226 67 139 -275 100 -154 32
7630 32 -121 -87 -179 213 -299 -115 105 3 112 -112 -221 222 -94 35 144 18 58 -19 -24 -138 -49 -161 23
7653 23 81 110 -126 67 -70 7 51 189 23 7 -95 -63 216 84 245 135 124 81 134 17 76 -56 64 64
7677 64 -250 -91 181 106 222 249 -193 122 -53 149 -143 45 -116 249 37 -195 -26 -46 32 12 21 -192 -2
7700 -2 176 25 -130 40 106 -57 -49 -20 52 -44 -35 -58 13 -220 -104 -45 -123 173 -60 -15 97 -123 -39 185 7
7725 7 -44 167 -26 -35 30 -34 -74 -221 186 -128 148 -70 -99 13 -78 -113 -119 -104 -129 -75 -71 11 -77 230 -213 193 -60
7752 -60 -250 -57 148 -151 -231 22 -218 84 36 89 43 35 110 301 225 -77 215 -37 78 5 -23 237 121 145
7776 145 -143 -189 -54 -10 -72 -98 -59 77 47 252 -12 297 -32 -69 262 -27 173 44 -237 42 68 7 -99
7799 -99 58 -233 -153 114 20 -108 46 -57 46 -247 -56 -222 123 -98 15 -45 -92 -6 0 67 -6 -167 222
7822 222 -35 -231 21 -159 0 -1 -113 -262 0 -100 -85 -80 -104 -43 -196 135 121 20 9 127 -23 -2 -209
7845 -209 -287 -69 46 -68 133 -267 -73 182 82 -134 118 100 -116 -135 -151 112 0 -139 -4 -161 -56
7866 -56 78 249 126 11 87 1 -51 -181 108 -180 -116 163 131 188 9 -115 -196 13 41 117 144 -34 146 119
7890 119 -102 174 -108 -53 49 -94 252 -142 -38 36 298 -11 26 -82 76 25 -11 -222 31 -167 -14 12
7912 12 -24 -89 277 -220 32 92 38 -20 -36 139 -15 -37 -136 173 -40 74 -26 -48 -123 61 198 -5 18 3
7936 3 -105 21 182 130 -48 -46 105 160 -333 -41 39 246 -39 -121 10 80 8 -115 -84 183 -198 -101 -13 -317
7960 -317 -244 -32 -85 -40 -134 -23 178 104 188 39 73 -170 -128 -204 -261 63 125 219 31 -88 -126 61 26 -169 283
7985 283 -346 -207 17 -120 -52 83 -216 -71 -235 71 -232 -15 -173 185 -186 40 -157 -81 63 6 -47
8006 -47 57 -54 -136 -21 19 52 -294 24 58 32 -59 108 137 329 -236 -46 17 68 163 190 -14 -82 105 -193
8030 -193 -75 -182 -54 155 -137 -28 -41 -157 93 -120 -8 152 -230 40 -104 50 235 -61 -263 81
8050 81 -19 91 97 -16 -38 300 -108 -146 85 24 -70 203 229 106 -95 191 -49 -59 77 -34 210 -96 -259
8073 -259 35 1 -141 276 -89 -32 -114 7 -184 107 -79 15 -221 126 70 -61 152 0 -55 89 27 -106
8095 -106 222 -14 191 423 -166 156 -55 -13 100 -152 296 34 -96 -186 -34 -48 120 -203 21 210 -278
8116 -278 85 247 -12 177 -101 -91 115 -238 218 287 213 -40 227 -103 246 -167 109 138 -92 278 316 -250
8138 -250 103 -74 -98 186 -26 70 -92 -44 104 137 -68 -31 -141 161 202 132 108 3 58 150 -249 110 -118
8161 -118 -228 132 160 95 16 134 343 -48 -177 14 -72 124 -64 -259 174 -20 -144 82 -128 -132 -22 99
8183 99 -196 -15 -45 231 -31 -63 165 -249
8191b49
$$ Imaginary data points
##PAGE= N=2
##DATA TABLE= (X++(I..I)), XYDATA
0 0 0 0 0 0 0 0 -8 8 -8 16 -16 16 -24 32 -40 56 -68 80 -96 120 -144 168 -201 240 -279 324 -375 432 -496
29 -496 572 -653 742 -844 952 -1073 1206 -1354 1517 -1693 1888 -2099 2328 -2581 2855 -3156
45 -3156 3486 -3847 4239 -4667 5140 -5661 6235 -6873 7587 -8389 9291 -10322 11508
58 11508 -12893 14532 -16506 18941 -22023 26061 -31599 39677 -52553 76190 -133266 535402
70 535402 433671 -658836 161095 -438661 310720 662454 -560560 -91800 -68610 -169339
80 -169339 699081 -277762 -294776 143052 -343600 590287 212701 -684934 259771 -78679
90 -78679 127545 515320 -719858 -65725 426859 -279010 334945 -203994 -441392 472004
100 472004 -62723 55663 107790 -519842 318574 222351 -134688 202448 -537904 46789
110 46789 613401 -380126 -5873 -78739 -328301 606275 -50200 -354056 214379 -265946
120 -265946 213016 330209 -344890 48124 -139619 -2891 465968 -312951 -167024 76812
130 76812 -171514 429175 -76145 -416313 297488 -89479 65721 290477 -398014 50975
140 50975 171238 -147293 257052 -161728 -232918 223499 -46096 94644 -57133 -260972
150 -260972 289718 10898 -93369 168330 -245073 113770 224068 -270808 131611 1510
160 1510 -208042 243542 -53514 -108220 68968 -152717 164086 97661 -188702 57662 -30078
171 -30078 95979 133543 -246304 55159 78840 -120559 169351 -112530 -147120 177555 -102876
182 -102876 30946 118724 -203822 44238 111645 -17639 46449 -119030 8385 109143
192 109143 -71976 24372 -63416 -53813 124978 -108093 -4022 118152 -147976 40528 98477
203 98477 -75404 72981 -34209 -62253 122419 -34797 -66107 16065 -1461 32674 -68086
214 -68086 -17088 83089 -48631 16292 21803 -42556 101464 -24563 -69881 115979 -40054
225 -40054 -70188 67139 -23635 -8380 -1738 -57079 42659 41299 -25436 -21770 19028 63823
237 63823 -29236 -21685 73984 -40616 -37111 41536 -32957 15434 888 -91258 44099 63171
249 63171 -59261 -10832 35801 12313 4781 -3058 4227 7815 1866 -28769 -19770 42661 -27220
262 -27220 -69607 47726 19255 -52113 18902 16127 1126 30582 -26927 -13615 62500 -6268
274 -6268 -64499 13952 31577 -37035 -23257 13568 -8382 3344 4289 -18796 37405 30953 -48248
287 -48248 12281 61429 -28606 -32633 26197 -848 -14982 -8076 -25878 16677 35386 -42223
299 -42223 -20346 65753 11873 -33656 25217 19593 -11049 7474 -10040 -8340 21833 -30958
311 -30958 -40642 44735 16714 -53691 6592 41531 -5060 320 10203 1304 23676 -4990 -42739
324 -42739 22202 33536 -56359 -32650 36332 -7195 -18626 10822 -9781 12616 20315 -24918
336 -24918 19413 40994 -38933 -28959 37322 10067 -37025 -21165 2016 -280 5261 -12962 -17815
349 -17815 41744 6279 -46508 46191 38740 -45120 2266 9431 -7489 18758 -31874 -26413 30979
362 30979 -7167 -26050 11184 31062 -3984 -31483 37440 33139 -24068 10797 -13330 -2336
374 -2336 43994 -54622 -20576 59235 -44512 -21409 35445 -6142 21486 -12573 -18900 53448
386 53448 7588 -17770 -8458 3561 33765 -48776 -19426 56951 -51830 -15191 31654 -34169
398 -34169 51355 -3274 -68314 79124 19053 -47194 22801 -16544 15827 2834 -51708 29380
410 29380 -11659 -26682 23890 -32954 33871 8652 -63104 81239 7579 -63995 58250 -23393
422 -23393 2501 39393 -97084 27316 56029 -70657 9439 -9583 956 49676 -49548
433 -49548 25772 25795 -49129 62518 -10556 -17717 48839 -101692 28280 98828 -102369 -5653
445 -5653 9036 -25963 101277 -43583 -56417 66429 -23427 43952 23460 -68111 37500
456 37500 -31215 3993 82404 -97118 -19773 38005 -33941 90747 -44857 -86713 114609
467 114609 -19545 -10054 60678 -88891 29617 38610 -53751 52909 -53873 -45262 71214
478 71214 -28484 25736 -30821 -77609 137394 5655 -76980 44087 -61494 60352 80379
489 80379 -131998 9803 11758 -37804 101273 -55860 -71710 38345 -24496 96988 18624
500 18624 -125791 34337 18759 50480 58093 -148518 -2699 68837 -37933 79512 -59431
511 -59431 -106132 93917 1093 32579 37877 -135507 34891 97287 -3535 7598 -103595
522 -103595 6586 115842 -55130 -13938 -26843 -44701 114957 -29329 -56855 64593 -60840
533 -60840 40811 81043 -81663 8168 -10997 -4346 106187 -76196 -80568 43541 9725
544 9725 65478 -43377 -97870 70674 19792 26512 29078 -109156 25851 54808 -23195 66749
556 66749 -77083 -97930 97534 28655 -6464 -38247 -87369 80405 62922 -34916 -6540
567 -6540 -51570 37244 61583 -52167 18588 -23608 -55583 74279 -4307 -30723 3300 -61722
579 -61722 63335 62079 -78635 -1350 17267 22262 45775 -62065 -18284 37428 -7310 22826
591 22826 -37001 -35482 42093 -16047 27128 19008 -81763 33970 60477 -8567 10948 -57554
603 -57554 -7314 86197 -15178 -39633 -21121 -10848 49807 -3508 -21553 2959 -34405 36457
615 36457 46192 -23507 -1943 -35125 7614 81920 -34727 -57035 5607 1980 40552 -11468
627 -11468 -59278 19365 19189 6056 10347 -20525 6146 1986 5654 31863 -38322 -24791 28019
640 28019 -9436 9163 -16107 -44489 44210 20974 -32843 3992 145 16868 18391 -19373
652 -19373 2340 -4362 -7145 18175 -8020 -9618 -19171 -15697 48754 5793 -43651 6894 10718
665 10718 25216 22796 -40570 -4917 29494 -5822 1329 -2965 -15577 -8371 -2746 24493 3962
678 3962 -28302 -74 12926 26577 11674 -36840 7143 30972 -15462 -882 31 -16080 5753
691 5753 -7334 -5674 15477 -10099 -13109 13012 19698 -1126 -19798 13355 21228 -15376 -8440
704 -8440 -2560 568 11713 -24128 -18412 24585 -2111 -13990 9293 2639 1570 2791 1405 10567
718 10567 165 -16367 -6428 16024 5522 -30175 -11245 21572 -2549 -9287 3709 -905 11203
731 11203 5585 -9757 14066 10996 -18808 -3127 15406 -3790 -16169 -4717 5913 4089 -4727
744 -4727 -9360 8649 21264 -7627 -11466 22333 10322 -15423 -408 6100 -1370 -3164 -12608
757 -12608 -4119 14620 -4555 -16948 12644 16159 -8872 -1599 14168 3809 -3657 -5008 -1131
770 -1131 10512 -5118 -25569 1740 18328 -11451 -14972 9105 6796 26 2229 191 7612
783 7612 5684 -14412 -1973 17667 -8991 -23099 3278 7420 -7578 -5261 -1431 3313 8910
796 8910 -6100 -2834 22197 2468 -21567 5107 15192 -6623 -10511 -5911 -1573 5127 -2514
809 -2514 -8464 8006 9818 -11674 1571 24882 -464 -14449 5661 4563 2816 -1273 -16709
822 -16709 3041 10097 -15902 -1931 16485 -664 -9251 2413 15606 8615 -5845 -5674 -196
835 -196 12403 -443 -22276 7609 8026 -24533 5568 15103 -8827 874 -4361 5157 24653 -9067
849 -9067 -16916 10212 10004 -4500 -17596 494 9446 -16486 -2431 3999 -5082 12793 -10922
862 -10922 -5571 31011 -12199 -12009 21674 -7872 -4174 -1238 -11307 15263 -7589 -23189 8918
875 8918 8550 6035 -11890 -9093 28674 -4525 -8664 21430 -15152 -80 8384 -21255 24499
888 24499 -516 -44531 18898 19969 -4519 -3326 -20806 20568 24039 -14063 4081 -7343 2941
901 2941 16016 -21763 12857 3944 -39254 22907 11769 -15184 14199 -26216 8696 42916
913 42916 -29273 -4611 16404 -8928 15179 -13583 -9067 14755 -21826 8734 4591 -21964
925 -21964 19357 -13254 3224 38524 -43940 -5571 44405 -14485 4499 -17930 -26294 44910
937 44910 -3699 -27793 1248 -17509 22406 10989 -17095 17002 -25520 -692 46557 -15720
949 -15720 -2621 -13825 -29199 56963 1804 -48093 12596 -16026 13708 34060 -36126 -100
961 -100 7465 -4434 36217 -11556 -15407 4964 -13283 39139 -7474 -50052 30911 -545 -6202
974 -6202 21832 -40693 14631 36359 -30531 15262 2690 -16754 28032 -10357 -997 3391 -33900
987 -33900 24321 13090 -19383 2724 -30266 23074 43665 -41442 -65 9216 -14019 43070
999 43070 -12762 -32563 20052 -19278 9739 23232 -33735 -7240 -2504 13262 29325 -34920
1011 -34920 -4778 20041 -9911 27673 -14934 -26278 35312 -22292 -10476 30164 -29883 -2272
1023 -2272 8543 -11420 27160 -13982 -16896 29134 -2417 3440 -8141 -13008 35477 -15451 -23503
1036 -23503 19500 -16025 13171 7365 -37152 27159 8590 -21650 30544 -6712 -13178 15878
1048 15878 -5977 16497 -5773 -26267 15999 -1129 3702 -640 -30866 27618 11184 -27000
1060 -27000 25818 -4693 -9820 24528 -18962 8110 13987 -32930 11538 10050 -14081 713
1072 713 -14952 15308 11840 -26416 11727 4827 1578 17339 -31845 6199 29822 -30402 4070
1085 4070 5076 -23308 18128 -5574 -8727 16095 -19691 1914 19567 -1703 2903 -19325 6106
1098 6106 27901 -22362 -1628 2076 -19022 23432 -6498 -18480 23428 -18047 -3999 30517
1110 30517 -10018 -2267 -1063 -3386 24873 -8149 -15503 4556 -3639 12863 -10815 -15371 24200
1123 24200 -12373 -5902 23899 -14487 6123 11055 -17095 20731 2257 -23119 13030 2305
1135 2305 -5331 -4753 -10870 14531 379 -10616 8286 -6156 9950 8956 -16744 16113 648
1148 648 -21699 20580 1032 -16556 3160 -12248 6499 14749 -18697 -5551 9656 6994 2076
1161 2076 -9164 8077 3191 -12030 10761 -1839 -8786 5086 -15616 4143 17413 -20725
1173 -20725 -3449 15718 -3328 3130 -253 -1491 10212 -2983 -6576 1950 3681 -1238 -13527
1186 -13527 3737 10561 -13709 1514 10111 -5570 6930 183 -4437 16604 -2352 -14481 9137
1199 9137 5705 -7950 -5207 -126 2728 -1217 -3053 -536 5420 7251 -7709 -575 16729 -4384
1213 -4384 -9402 9110 -884 -5194 337 -6943 1632 5244 -11340 -2993 13326 621 -8529 4970
1227 4970 8504 -2133 -1985 -541 -424 4247 -5860 -11877 7604 4110 -13967 -300 8931 -3121
1241 -3121 -879 3826 463 4804 -74 -7689 5846 7519 -12571 -7303 9335 -687 -7660 662
1255 662 395 2595 4631 -4747 2169 12388 -5227 -8109 10700 3512 -9223 -1657 587 -1332
1269 -1332 1170 -3115 -2659 7213 1102 -7170 7826 11174 -7562 -2790 7128 -240 557 -2913 -8141
1284 -8141 5990 1554 -11566 3811 7187 -6032 -2642 7302 4825 -2060 -448 352 451 5256 -6543
1299 -6543 -9384 10610 -3046 -14585 8534 3559 -5927 2101 -3096 5155 9500 -7430 -2736 5434
1313 5434 852 -3184 -4104 2955 -4210 -8510 6918 -861 -2412 3439 -10227 9563 14529 -16209
1327 -16209 1660 10709 -7000 4325 -1452 -5747 3965 -6108 -15 4385 -3207 -329 -5977 10410
1341 10410 13234 -17016 2682 12538 -7255 7533 -6897 -9675 17548 -9191 -10604 12262 -5868
1354 -5868 286 2510 -2480 10785 -6122 -2305 12441 -4182 1929 -7220 -6650 22245 -11690 -16605
1368 -16605 13152 -8532 5948 9572 -20063 8932 5952 -7584 17381 -4355 -12415 938
1380 938 856 17945 -11068 -25497 11551 2222 7565 3513 -29180 13054 15860 -12462 15470 -7488
1394 -7488 -14148 16397 -4639 6822 1588 -28561 9255 12417 -2514 -1009 -21771 12333 20622
1407 20622 -15379 7305 -5381 -5970 27483 -14837 -8695 14370 -20614 11544 12791 -23878 3268
1420 3268 -721 7428 18430 -23480 -3397 13988 3216 17574 -21840 -14784 25470 -9402 5621
1433 5621 4849 -32067 12959 9612 -4173 18945 -26664 -10917 31156 1227 3903 -15690 -19122
1446 -19122 29861 1269 -8277 -1265 -24245 19216 11125 -18421 15942 -16926 -8184 35660 -13527
1459 -13527 -5302 4781 -17274 24955 512 -24300 9957 -7650 7485 7588 -24815 13691
1471 13691 1724 -8692 25136 -18167 -6939 20057 -14293 17728 -1748 -34471 24044 6260
1483 6260 -9085 6633 -27565 12039 23957 -17052 7021 -8913 -3001 27263 -14479 3085
1495 3085 4172 -27530 26912 6545 -22387 12631 -19494 5905 30407 -27368 461 9335
1507 9335 -8850 23706 -10965 -10189 16528 -17629 11983 7585 -25050 13839 -7715 -3022 25023
1520 25023 -29321 -219 24579 -15936 13041 -6480 -16915 31580 -10464 -13330 12283 -16283
1532 -16283 11935 2244 -18019 16933 -13947 -2361 24967 -18798 4855 3082 -16938 31946
1544 31946 -7406 -25450 18947 -10801 5492 10783 -27428 11717 4305 -10399 20595 -12586
1556 -12586 -4580 12527 -11641 20376 -2093 -25690 20406 -3259 -2954 11500 -26914 10451
1568 10451 16202 -21274 13234 -354 -9268 18165 -10288 3288 10288 -18859 11380 3401 -10339
1581 -10339 8899 -16137 5774 17161 -23270 5442 7322 -9388 18303 -9935 -8997 19040
1593 19040 -11395 2115 8339 -15797 5391 -2610 -2904 12570 -16519 -2181 12073 -5777 10331
1606 10331 -7082 -9262 19697 -7910 -4838 10884 -14107 3157 3604 -10814 10781 -5597 -9419
1619 -9419 11833 -1676 1278 -160 -6121 12971 -2463 -7496 8476 -6100 1616 2484 -11977
1632 -11977 9161 792 -11555 10318 85 -3393 6015 -4500 5752 4600 -8621 3442 2099
1645 2099 -608 -495 -7781 5743 2155 -8978 5962 1174 -2832 5259 -4323 3887 7975 -8913
1659 -8913 664 6197 -2894 -966 -3398 -323 3003 -4830 -1426 2141 1093 1245 -4310 3785 6467
1674 6467 -6367 -81 4670 -2969 -195 -2801 -2315 4252 -3664 -5671 3724 2555 -1983 -1490 2375
1689 2375 3395 -1332 -627 1239 838 -133 -4849 -664 5343 -4231 -5836 3874 1935 -1737 98 212
1705 212 3042 2047 -2894 568 4693 -757 -5888 789 3878 -2272 -3480 384 1582 1899 -1075 -1075
1721 -1075 5151 2178 -4449 1777 5245 -1598 -3290 -670 934 930 -2439 -3414 2363 3183 -3517 -990
1737 -990 5790 1317 -3617 1492 2619 317 -421 -4119 -83 3292 -4196 -3696 3471 481 -3398 -69
1753 -69 3970 1879 -1693 -706 1400 3131 -52 -5579 416 3916 -5084 -2523 2161 -1028 312 -1177
1769 -1177 -265 5204 -778 -2999 3334 2545 -1321 -2800 642 1896 -3621 -1323 798 -1540 2874
1784 2874 -2160 -2144 7966 -1112 -4017 5808 709 -1201 351 -1509 2766 -1906 -4516 2106 623
1799 623 530 -2657 -2173 7820 -54 -3526 4557 -1496 1856 2457 -6237 4691 163 -8611 4574 1731
1815 1731 -2734 -336 -3841 5153 3960 -3457 2041 -1970 1988 4480 -6397 3410 -92 -10322
1829 -10322 7334 1423 -6367 2136 -5769 3997 7871 -8498 1466 3759 -738 4043 -5879 1465
1843 1465 4423 -9229 3173 888 -5226 5522 -6999 1499 10175 -11493 2385 8637 -5020
1856 -5020 4744 -5275 -3167 12550 -6429 -4489 1433 -4352 8277 -3307 -4302 8248 -9714
1869 -9714 4039 11827 -9425 3922 -2587 -5408 17033 -6944 -10134 6608 -5672 6455 1507
1882 1507 -10994 8992 -2946 -2031 11804 -7256 1751 766 -7865 15625 -5075 -12921 11031
1895 11031 -6184 2161 4563 -16073 10996 5456 -11631 8661 -3335 596 8455 -11495 5888
1908 5888 1771 -10073 11651 -6164 -5309 7401 -12993 9677 8430 -17729 8370 1374 -2893
1921 -2893 13579 -13110 -1909 9863 -10222 8447 -815 -12147 8195 -6486 4510 9577
1933 9577 -18428 5667 7526 -4767 12716 -12033 -5089 18740 -11166 269 5182 -12946 10398
1946 10398 -682 -7912 10992 -9809 1123 10860 -9100 7084 -3085 -5692 17846 -10667
1958 -10667 -6797 10268 -10307 8292 1307 -16582 12792 -1362 -4510 12448 -11564 74
1970 74 8338 -5677 10616 -7217 -11562 13245 -3023 1450 -594 -16816 13734 5484 -11262
1983 -11262 8846 -8556 -1641 14956 -9082 2793 1955 -12334 11805 2039 -7094 1651 -10585
1996 -10585 7943 8786 -12804 3703 -1195 -1292 13486 -9724 -1900 8752 -10130 8232 3199
2009 3199 -12816 5628 -1915 -17 8504 -12176 -426 8294 -1475 5048 -7141 -2026 12383
2022 12383 -5847 430 2070 -9963 8297 974 -6315 6636 -9124 -1886 13370 -3623 -1649
2035 -1649 -1796 -2340 12487 -1038 -7065 995 -2757 5940 1035 -8621 3934 -3770 -1900 10516
2049 10516 -5311 -3264 2886 -3498 8705 1393 -10597 3277 2180 -332 258 -6424 1174 1685
2063 1685 -2761 3543 -2364 -1031 3608 -2911 5037 1427 -8451 5179 3227 -3660 883 -4375 689
2078 689 5601 -4708 -2051 2485 570 1958 -1058 1517 1603 -2910 3474 1684 -2911 611 -3439
2093 -3439 635 5738 -5620 -2574 4547 -216 1054 873 -1170 2491 542 -1022 1326 153 -1409
2108 -1409 -2390 1340 2376 -4512 -1397 3235 -516 929 -427 -1588 4600 1025 -3619 2201 1329
2123 1329 -2430 -486 265 -233 -1445 -1224 105 1401 661 -2547 -126 4354 -687 -2826 2736 245
2139 245 -1469 150 -1529 -23 1148 -2954 -657 3242 -90 -2539 1433 2450 -509 -169 560 184
2155 184 851 -1033 -2328 2388 941 -4329 -293 3100 -708 -474 1138 566 1175 625 -842 1767
2171 1767 1751 -3205 -1435 2991 -634 -2804 133 352 514 763 -1413 813 3106 -1302 -1598 3812
2187 3812 1130 -3393 -344 1015 -655 -372 -1711 -1323 2467 1 -2695 2204 2507 -2503 -568 2627
2203 2627 317 -1044 -959 -1380 1251 193 -3765 -168 2810 -1950 -1824 2512 1128 -567 222 11
2219 11 1485 1931 -2838 -1691 2907 -689 -3383 969 808 -1719 360 522 453 1744 -967 -973 3165
2236 3165 1476 -3020 -315 2245 -1602 -1365 648 -1130 187 515 -1583 2178 2885 -2663 -165 3905
2252 3905 77 -1234 -199 -281 202 -486 -1621 360 1378 -1907 -2006 3294 1933 -2859 794 1803
2268 1803 286 1971 -1509 -2619 2628 -543 -3026 1798 -431 -2731 214 1705 1048 -1108 -51
2283 -51 657 415 1854 -1988 -1215 2749 -2563 -2181 2909 -1911 -1202 1178 -1756 2248 1401 -2455 2104
2300 2104 1754 -1408 -658 928 2243 -2328 -2665 1652 -459 849 76 -4682 3479 2841 -3517 3448
2316 3448 652 -3147 3126 568 27 747 -3939 53 2094 -191 -663 -3356 2058 2466 -2913 3723
2332 3723 111 -3755 3911 -870 -215 3172 -6476 -305 5152 -3776 -444 -425 -801 3590 -2427 -465
2348 -465 2952 -1142 1600 -2139 -243 4951 -5465 -1236 4374 -5351 1240 1337 -4139 5261 -1855
2363 -1855 -4467 6268 -64 -1007 400 -2618 4149 -452 -3187 2355 -3797 602 2530 -4413 4227
2378 4227 -1151 -5464 8437 -423 -3585 4521 -4011 2765 3345 -6769 2768 1300 -3193 2045 -2671
2393 -2671 2537 1949 -5529 4897 828 -2412 5383 -4678 1055 5444 -8042 2924 3944 -7133
2407 -7133 2813 -1020 -1686 6154 -5213 -829 4192 -2171 3785 -1925 -2342 4852 -4787 1806 3759
2422 3759 -8448 2495 1288 -3437 6779 -5437 -3868 8767 -2746 -59 1991 -4510 4714
2435 4714 -391 -3179 3685 -4415 122 1913 -4110 4896 -3367 -4342 8980 -2884 -1967 3972 -5060
2450 -5060 5207 2594 -8104 3882 357 -2433 3459 -4667 393 1930 -2914 5005 -1807 -3141
2464 -3141 4977 -2379 3796 2143 -9010 4895 3167 -4545 3716 -4168 -2109 6109 -3357 907
2478 907 1589 -4649 3926 1646 224 1274 -6403 3010 4416 -4536 1388 -3423 -1972 6905 -4415
2493 -4415 -1506 4509 -4444 2837 3056 -3630 2372 -2089 -957 4191 -3597 -1428 -460 -1157 3815 -4087
2509 -4087 -2080 4929 -2612 1250 2018 -4252 4051 268 -3690 4725 -2156 -3051 2989 -885 507
2524 507 -1371 -2698 3791 911 -880 413 -2208 3973 853 -3589 3719 -1377 -2462 3465 -2104
2539 -2104 -198 1414 -3992 2320 2836 -2575 237 217 1601 1457 -2132 1028 39 -1294 1483 -2019
2555 -2019 317 1193 -3897 2203 2714 -3621 1002 1160 -278 2051 -1624 -766 2442 -738 -1291 -750
2571 -750 465 288 -2349 833 1229 -1850 1009 -68 -75 2615 -2090 -1031 3407 -1205 -1646 952 -605
2588 -605 3 -668 -1161 916 429 -65 -610 1299 1917 -1825 -94 2276 -1274 -417 487 -1317 884
2605 884 -245 -2372 1758 1317 -1521 228 1492 510 -97 254 405 81 32 -876 -314 1451 -1388 -1911
2623 -1911 1971 530 -1177 1032 354 272 910 -689 346 1673 -942 -1621 956 787 -1810 -953 912
2640 912 -364 -216 71 -516 995 932 -1553 858 2129 -1790 -1040 784 -269 -544 -583 -813 590 560
2658 560 -1168 -94 1884 -201 -1449 1210 918 -708 -322 -600 -293 721 -1561 -1329 1559 -75
2674 -75 -1762 1080 1232 -208 -173 633 825 1069 -553 -1395 1110 830 -1966 -721 1515 -607 -815 973
2692 973 335 818 503 -913 1529 1550 -1719 -953 995 54 -1280 -404 344 -263 -189 -381 -26 1945 -589
2711 -589 -1626 2454 1021 -1570 -17 -312 119 335 -1718 -633 1045 -427 -1047 167 1548 -651
2727 -651 -1335 1764 510 -451 948 -1415 205 1234 -2811 141 1574 -2211 -456 495 476 1225 -885
2744 -885 -240 1175 24 475 -560 194 652 -2879 1408 2042 -2912 294 -215 -594 3378 -1878 -1784
2761 -1784 2998 -361 100 941 -1068 763 -1149 -235 1900 -2097 -101 -229 -913 3801 -1350 -2122
2777 -2122 3648 -1374 307 2091 -2967 1619 224 -2861 2635 -1322 -1761 1523 -1508 1395 -409
2792 -409 -1922 4092 -997 -1437 2176 -2533 2391 763 -5582 3243 415 -3064 3102 -2358 -861
2807 -861 2673 -2905 2587 1022 -3308 1870 -978 1407 1892 -5881 2074 1972 -3131 3565 -2894 -1825
2823 -1825 5002 -3599 1176 3022 -4946 3001 1146 -1730 2952 -3615 60 3352 -3831 1304 -282
2838 -282 -1660 4338 -4040 -602 5077 -4211 2184 1842 -4136 4575 -1756 -2732 5013 -4180 -1064 2445
2854 2445 -2641 3272 -2160 -3054 5748 -1706 -198 1421 -4535 4791 520 -4680 4412 -3790 -1740
2869 -1740 5074 -4600 1036 997 -4288 5677 106 -3340 2719 -2694 2864 1558 -5443 3017 -1002
2884 -1002 -2276 4496 -4568 -36 3252 -4841 4388 1194 -5341 4558 -472 -90 2749 -5580 1982
2899 1982 2692 -3419 1435 -2855 -99 4775 -4183 1200 1567 -4133 5319 86 -2754 3590 -4295
2914 -4295 1292 5353 -5235 -362 121 -1137 5124 -2862 -2285 2511 -1924 3487 305 -3595 2720
2929 2720 -1975 778 4665 -5848 -493 2032 -1699 3942 -2474 -4260 4626 -559 346 999 -3425
2944 -3425 2647 620 -1542 2351 -3821 -15 2566 -2465 1974 -1741 -3550 5547 -416 -2303 1763
2959 1763 -2397 2770 2291 -3987 1089 -556 -479 2427 -2527 -7 -200 -1718 4517 -655 -2837 1948
2975 1948 -1114 2803 2058 -4736 1602 1808 -1648 2014 -2095 -1372 1878 -1175 1533 316 -2091 1955
2991 1955 8 1662 972 -3869 1652 1968 -2190 1435 -1892 -1280 3099 -1943 -335 1524 -1939 1288
3007 1288 1156 -554 807 -1700 1089 1538 -1550 185 -1062 8 2678 -2764 -1101 2364 -1769
3022 -1769 993 849 -1838 1573 -273 -722 2033 -1350 -857 286 -194 1210 -1856 -879 1786 -1072
3038 -1072 603 251 -1504 2732 -195 -1813 2515 -997 -1040 1088 -920 169 -317 -1251 1159 454
3054 454 -457 -102 -335 2045 -101 -1271 1810 -557 -498 935 -1558 335 675 -1983 927 846 -1109
3071 -1109 379 273 642 374 -761 345 300 59 -52 -1240 633 53 -2085 640 477 -1215 696
3088 696 -109 -378 1421 -604 -225 1097 -221 -743 -131 380 -410 -1241 -16 70 -144 681 -513 365
3106 365 1316 -898 -210 1466 -708 -570 465 -156 -132 -166 -1067 270 606 -655 -234 984 460 -574
3124 -574 132 822 -263 294 -313 -524 584 -243 -1681 893 711 -1072 169 797 113 119 198 209 636
3143 636 172 -669 31 872 -674 -989 727 -68 -668 254 -53 461 698 -983 473 1355 -709 -1027
3161 -1027 662 286 -812 -606 -11 -272 102 -162 -594 1089 355 -1427 611 1465 -577 -275 232 -231
3179 -231 268 -414 -822 286 -208 -729 -43 846 -33 -1054 601 1040 -381 423 -478 -167 1311 -832
3197 -832 -773 1188 -1004 -862 987 286 208 -59 -672 1181 838 -492 -709 359 977 -967 -893 1264
3215 1264 -535 -460 705 -845 1371 515 -1613 1381 923 -901 413 -61 125 -171 -908 533 -124
3232 -124 -679 -111 -930 1034 634 -1758 1316 233 -1436 1497 -344 -781 1050 -1755 176 1627
3248 1627 -1528 -693 -110 81 809 -860 659 448 -1024 1414 -244 -557 1519 -2083 8 2146
3264 2146 -2164 -138 301 -1060 1548 -587 -912 1524 -509 99 383 -218 1235 -1257 -729 1292
3280 1292 -1982 594 851 -1850 1773 -170 -1118 2696 -744 -1308 1967 -669 828 -93 -1550 963
3296 963 -385 -110 517 -1385 802 -219 -1130 2747 -801 -1284 2062 -661 1143 557 -3036 1141
3312 1141 1004 -1631 476 -1161 116 880 -1167 1171 -269 -712 1762 -865 336 893 -2862 1798
3328 1798 1143 -2423 1068 -434 -437 1968 -1838 -227 1491 -568 1223 -340 -763 822 -1153 1584
3344 1584 691 -3048 435 414 426 1918 -2990 -535 3253 -487 498 -508 -1406 2073 429 -256 227
3361 227 -2186 543 712 -247 848 -2946 -247 3487 -820 -118 -112 -1589 3017 132 -2230 647 -1338
3378 -1338 291 1442 -1339 2 -1054 203 2486 -1480 -462 405 -427 2884 -866 -2950 2106
3393 2106 -296 26 988 -2867 229 1375 -749 1253 -1079 -1244 1427 252 1178 -1208 -2350 2464
3409 2464 441 -348 207 -3023 1122 2522 -2014 519 -542 -1444 2772 113 -508 109 -1770 1769
3425 1769 1374 -1685 -554 -1366 1351 2002 -2815 281 771 -924 2810 -851 -1503 1991 -963 672
3441 672 1496 -2576 132 358 151 1043 -2352 -474 1422 -663 875 -789 -1029 2570 -778 -513 1300
3458 1300 -2463 725 1091 -1430 658 -1056 -1012 2271 -475 -683 18 -431 1881 -646 -978 1001 -855
3475 -855 712 673 -1992 739 -147 -1536 2218 -799 -1485 1385 -134 761 108 -1752 1222 454 -621
3492 -621 -107 -1053 932 15 -1028 1148 -662 -637 1567 -320 388 987 -1551 964 1151 -1332 -24
3509 -24 -78 232 489 -1072 28 437 -315 609 -444 174 627 -1112 894 856 -1621 501 15 -313 860
3528 860 -980 -768 1370 -181 -609 80 458 672 -540 244 244 -286 128 -261 -518 507 -1241 -529 1420
3547 1420 -891 -888 537 73 667 284 -617 551 521 -184 -424 94 287 -818 -358 332 -621 132 0
3566 0 -133 680 323 -863 735 568 -678 -99 221 -200 -18 -211 -580 156 168 -334 118 993 -34 -371
3586 -371 656 539 -515 222 -118 10 89 -590 -265 581 -115 -581 311 438 -53 316 -7 75 143 -243
3606 -243 -386 714 -187 -738 -21 406 -406 -210 201 -264 370 41 -103 380 163 -741 -56 578 -33 -724
3626 -724 -102 85 -180 -68 -113 62 719 -173 -449 1042 223 -601 -136 192 -168 -89 -454 -70 354 -1
3646 -1 -237 524 219 -307 336 638 138 33 143 -120 421 -22 -930 -29 462 -381 -310 665 51 -379 191
3667 191 263 450 315 -529 -213 742 -290 -698 252 215 -669 -39 310 367 437 -656 -130 835 81 -628 451
3688 451 318 -451 -306 232 -58 -358 -367 -191 383 441 -950 14 911 -175 -189 482 -132 -116 -53 -451 99
3709 99 -83 -985 -70 748 -27 -315 38 518 180 112 97 179 400 -218 -683 559 309 -901 -93 272 -252
3730 -252 532 -103 -74 511 -176 -284 414 347 -377 -439 571 -139 -751 25 -148 116 831 -622 -169 936
3750 936 -291 29 789 -70 -382 -55 -15 204 -454 -579 -25 383 -61 -645 173 870 13 2 157 -310
3770 -310 409 241 -690 102 -419 -365 323 197 -466 -455 -2 456 263 -578 -471 89 1141 -336 -598 310
3790 310 -405 95 832 -439 -722 -29 154 1038 175 -1079 -113 951 1036 -447 -952 179 236 338 46
3809 46 -1164 -128 287 -220 942 24 -1087 887 841 -50 -463 -946 300 841 -249 -833 -612 528
3827 528 758 -568 208 -341 -389 1306 280 -559 128 -855 588 991 -1475 -1126 294 380 352 -961 -775
3846 -775 354 35 660 -118 -700 511 -394 755 912 -1987 -460 984 70 709 -1115 -1203 1437 525
3864 525 -21 260 -616 612 548 -14 566 -1311 -379 1278 -309 31 -559 -917 1926 42 -946 800
3882 800 -254 738 869 -1048 52 81 -396 656 -383 -352 136 -643 1342 -366 -1136 1048 72 383
3900 383 722 -1811 304 1314 -1061 451 -317 -969 966 -258 190 352 -1415 655 503 -51 455
3917 455 -1116 603 1118 -1203 83 -61 -685 1378 -517 -603 1147 -794 236 896 -713 568 -154
3934 -154 -238 957 -667 -36 526 -563 806 -766 -810 1308 -848 -398 868 -855 928 636 -943
3951 -943 855 19 -688 933 -74 -150 -90 -473 738 -343 -465 655 -100 446 604 -1072 875 180
3969 180 -856 694 -656 -643 692 -476 -2 608 -825 248 358 -242 37 -479 404 379 -801 379
3987 379 -280 -402 696 -792 -266 619 -887 -47 843 -401 326 -35 44 566 -564 -484 154 50 163
4006 163 -485 -118 566 -696 182 457 -395 421 -93 -196 669 -147 -705 482 208 -494 -35 -265 108
4025 108 110 -408 -20 58 643 -187 -283 614 -235 -269 778 -30 -328 74 -579 86 405 -620 -151 415 150
4046 150 -115 167 283 197 -118 133 -187 237 -230 -507 440 -1 -908 66 449 -278 146 173 -50 363 -90
4067 -90 -541 342 430 -338 -285 77 -128 -260 45 -146 -17 399 -138 -4 435 -151 -111 535 128 -375 116
4088 116 -285 14 89 -451 43 239 77 -310 434 321 -333 -29 179 -193 10 -84 -472 27 145 -618 -19
4109 -19 317 -124 154 1 90 26 276 -172 190 42 -356 -464 332 -119 -915 354 84 -294 239 111 140
4130 140 553 -282 -255 485 266 -194 -87 -37 -295 -301 -36 -320 -82 156 -430 247 650 -544 -104 239 -92
4151 -92 205 -115 -34 62 -198 -207 371 427 -183 -587 498 440 -267 143 546 32 148 -367 -37 389 -188 -381
4173 -381 418 80 -188 4 -29 269 19 175 77 -98 158 -206 -143 576 -350 -412 405 -638 259 298 -401
4194 -401 592 407 -237 412 320 127 -255 -11 378 -629 -276 74 -366 266 -111 -742 595 -7 -722 567
4214 567 260 -152 250 -650 178 314 -401 81 -256 -34 -1 -312 730 38 -758 804 -39 2 508 -1074
4234 -1074 37 620 -824 9 -169 -537 757 -246 5 252 -590 725 517 -104 482 -801 279
4251 279 1018 -1248 -48 72 -851 918 -488 -504 1100 -337 221 901 -639 442 -259 182 768 -1314
4269 -1314 -231 493 -611 885 -664 -1129 1845 -234 -280 845 -1420 524 976 -830 514 -786
4285 -786 -719 1147 -556 2 -397 -1094 1333 82 -764 828 -1065 463 1221 -1515 680 57 -1111
4302 -1111 1414 -416 -1204 594 -970 1132 599 -1502 704 -127 360 1353 -1420 474 828 -1188
4318 -1188 1067 -500 -1457 1478 -756 184 1079 -1660 833 1067 -597 704 -684 -234 1394 -990
4334 -990 251 -45 -1039 1519 -270 -870 1178 -1651 595 1648 -1287 164 -210 -772 1737 -663
4350 -663 -982 951 -804 652 -225 -1343 1085 -354 80 1183 -1675 522 607 -977 1678 -646
4366 -646 -1405 1335 -751 -210 560 -1294 1071 551 -1221 935 -384 209 1068 -1037 901 53 -1221
4383 -1221 1333 -636 -690 934 -1293 572 849 -1484 903 418 -254 1258 -645 43 749 -919 456
4400 456 3 -638 919 -902 156 755 -1416 586 513 -730 872 -371 -406 1350 -716 -236 771
4417 771 -723 644 -109 -657 613 -641 1 551 -997 373 -135 -240 1231 -497 -590 829 -615
4434 -615 58 41 -958 476 -17 -309 334 -476 73 80 -471 520 -325 -508 668 -346 -261 240 -646 511
4454 511 239 -717 475 123 -182 539 -129 282 247 -264 148 179 -360 -66 -160 299 23 -514 267 37 -402
4475 -402 233 -294 -271 536 -231 -7 376 -171 -34 35 -136 41 -331 3 292 295 93 -345 58 433 -90
4496 -90 -204 216 -182 126 -229 -344 243 -114 -265 309 -28 -290 -222 192 31 -344 51 169 112 35 -189
4517 -189 -211 281 -358 -444 226 173 -46 138 -99 106 33 -99 -123 256 -4 -225 -106 325 -236 -258 260 -104
4539 -104 -62 290 34 131 54 -2 160 235 13 -239 87 -20 -129 -142 -16 -73 76 8 -136 326 -2 -189 193
4562 193 406 -204 108 63 149 391 -200 -388 -107 158 42 -79 178 297 -189 -90 -119 -139 120 -337 -182 57
4584 57 167 -103 243 -316 -42 148 53 216 322 -212 129 78 -41 -293 -36 100 -427 -175 -183 -195 89 -78
4606 -78 -260 212 380 -126 514 56 -293 -111 -96 -155 -136 -189 -14 144 170 48 -149 518 -218 40 296 -216
4628 -216 73 155 -163 185 291 -428 2 22 -138 -55 -117 43 51 -212 99 -120 181 462 -675 34 207 -726
4650 -726 222 18 -305 472 -412 -140 337 -495 40 229 125 206 -621 140 265 -431 78 -134 -244 314
4670 314 -155 -316 459 -702 110 457 -506 245 157 -16 632 -555 -103 1 -456 407 -368 -386 430 -181
4690 -181 206 387 -413 377 141 -350 847 -592 -607 730 -349 -92 174 -253 800 200 -423 580
4708 580 -427 187 428 -613 496 -239 -615 745 -520 -322 625 -539 640 327 -802 296 -72
4725 -72 -20 488 -800 447 82 -465 658 -393 -743 511 -799 306 573 -1037 565 494 -182 740
4743 740 -427 -195 823 -382 293 -23 -470 582 -327 -162 670 -971 355 899 -462 470 -287 -162
4761 -162 1032 -344 -413 380 -594 530 -86 -741 610 -396 311 667 -742 318 275 -134 936 -303
4779 -303 -581 512 -555 230 254 -1008 525 303 -386 760 -404 -64 345 -471 410 -241 -645 704
4797 704 -177 -138 24 -754 493 308 -653 317 -289 -332 457 -373 -17 157 -607 410 -86 -331 422 -372
4817 -372 151 105 -811 346 136 -171 462 -461 -188 698 -582 -26 8 -245 230 -247 -123 140 -392 408
4837 408 534 -2 184 4 67 326 -312 -335 459 -327 207 23 -525 465 22 -204 137 -205 14 293 -6
4858 -6 22 -23 -167 371 -321 3 -2 -429 375 76 -437 199 -277 60 79 -125 130 -142 -184 269 191 -196 -386
4881 -386 -161 322 -16 -539 -194 41 301 185 -394 99 168 150 285 -137 -153 238 37 174 -246 128 93
4902 93 302 277 -41 -73 194 288 62 -100 -327 -168 154 79 -177 157 -221 274 69 -130 42 -81 120 305
4924 305 63 -134 -27 261 207 -234 -146 120 12 -140 201 -197 -325 -33 137 45 -150 -286 6 -84 157
4945 157 -61 -283 -41 -214 19 -311 162 298 -13 -4 274 147 -123 127 -102 120 -140 6 189 3 -213
4966 -213 -205 -219 -38 -133 36 640 -73 111 186 -11 -84 -207 -117 121 202 -95 -35 -25 172 127 -133 -3 -13 160
4990 160 68 -48 377 -29 -434 75 407 -215 -101 -24 67 350 43 -89 420 25 -55 151 180 208 -192 270
5012 270 -182 -54 -3 116 -174 189 -151 72 261 -192 -234 239 269 13 -178 -129 -122 -65 -171 -104 128 116 -233
5035 -233 -118 16 13 392 156 -69 186 -265 -159 -242 -97 -167 -113 225 -155 6 7 131 -25 74 38 -54 117
5058 117 -152 -79 34 -246 -115 -102 -98 41 300 57 -85 171 -8 124 229 -108 55 -67 88 66 -40 -309
5080 -309 -84 -141 16 -91 -57 204 40 -111 214 17 -168 145 -117 23 -145 -302 77 197 -196 -97 -59
5101 -59 78 143 240 199 9 178 163 -181 263 -63 -194 -50 -11 -37 122 -221 -175 26 61 147 289 164 70 -115
5125 -115 -111 -268 -68 -29 78 88 3 -152 -54 162 -148 59 329 -46 57 -139 -265 297 -69 -39 143 -221
5147 -221 -75 -184 246 151 -320 -93 424 137 111 195 -66 459 -103 -266 -41 -9 -131 128 133 -50 8 104 321
5170 321 66 -6 -6 -238 151 -125 -401 -85 -7 -59 168 -296 28 13 -363 238 -14 -124 200 71 57 -1 -164
5193 -164 52 258 89 12 -106 -2 393 -329 253 53 -372 140 81 -125 326 -361 87 478 -312 -49 22
5214 22 54 255 -94 -258 136 -239 129 82 -212 369 -205 -38 292 -188 -58 114 20 157 99 -312 230 215
5236 215 -115 45 111 201 199 11 430 -25 -432 302 71 73 281 -250 337 261 -77 256 17 -170 187 -569
5258 -569 108 -112 -352 189 93 -34 -16 -390 165 467 -350 273 0 -89 380 -381 -57 442 -238 22 -112
5279 -112 -216 -41 109 17 -127 -46 255 78 -333 83 -166 -135 434 -142 135 119 -277 194 131 -43 196 -217
5301 -217 -154 198 -57 298 64 -118 86 -244 -244 50 -207 166 -88 -73 362 95 -129 252 15 175 271 -230
5323 -230 -16 -18 -321 95 -207 -136 235 -50 132 139 -28 147 -116 164 179 -216 11 115 -244 -309 117 -375
5345 -375 250 57 98 38 95 -130 105 65 275 -63 74 190 86 421 -227 -161 197 -111 -229 111 3 188
5367 188 136 33 -165 166 325 165 -96 5 182 278 73 -15 14 419 -96 24 92 -196 140 29 -201 53
5389 53 51 -175 157 150 209 44 -175 80 57 -40 58 -320 36 -5 114 180 234 -156 -73 53 -46 4 -96 94 31
5414 31 -39 -87 -3 -50 -145 -94 115 196 5 246 -175 -230 11 -69 -67 406 -257 -173 153 180 95 89 33 11 243 -124
5440 -124 -10 139 -122 -112 -18 -90 -179 60 -124 96 52 -151 -303 -31 3 -244 60 323 -180 107 135 -239
5462 -239 -217 151 -72 -162 42 -111 38 158 115 -81 297 -99 -274 -58 -390 -9 -249 -14 -43 -26 -10 -190
5484 -190 22 22 -70 65 70 -107 38 201 56 -48 130 -412 24 36 126 -87 -14 191 18 18 -11 -108 178 -98
5508 -98 16 -92 -15 -46 187 -107 135 127 80 16 107 12 -4 38 0 96 7 44 227 96 227 126 92 29 -204 91
5534 91 61 -37 -45 -45 -166 -82 84 -51 42 -262 -202 -120 86 70 -13 -112 122 -69 -47 321 -106 103 -160 -52 146
5559 146 -12 -379 260 255 -25 156 -147 -26 -36 118 105 152 198 22 44 153 -226 196 -149 -66 40 6 -168
5582 -168 100 -103 101 132 -72 41 -216 -24 -84 -100 156 90 -97 -35 -73 -122 -117 226 -56 41 -59 113 248
5605 248 -242 53 -10 -2 229 -148 -16 -63 0 -271 33 -85 382 56 -214 161 -71 206 159 -196 -62 158
5627 158 -40 271 78 101 173 -58 148 159 -121 26 -113 17 28 -93 -103 9 -160 305 -6 -111 225 53
5649 53 70 64 72 -114 209 62 -9 -83 -90 -66 -228 -17 -281 -386 363 31 50 -118 -114 142 105 -147 151 20 -39
5674 -39 129 86 -62 125 125 239 -115 -39 268 -331 51 75 -63 -70 303 -107 135 -137 -383 120 -57 100 64
5697 64 -28 -79 377 60 223 -225 -75 357 -228 190 -288 -80 251 -187 -458 146 60 72 144 -116 484 -31
5719 -31 -61 175 -330 113 -94 -54 252 40 -70 -41 54 263 136 -148 129 39 -234 160 -291 -182 14 -82
5741 -82 -117 13 128 -139 63 -35 117 -21 84 62 -288 1 133 -109 0 -153 -278 112 -201 94 -160
5762 -160 -104 -34 70 65 92 -228 113 21 -83 248 -368 -193 101 -58 89 -258 -141 -184 85 206 -215 -79
5784 -79 272 290 -44 -137 110 -144 133 -148 -117 43 -446 92 153 125 207 55 167 235 2 -210 -74 229 142
5807 142 166 -65 -36 -147 20 92 -117 154 135 102 140 -132 -164 117 -78 40 8 -81 -47 -111 29 141 -342 261
5831 261 -69 -221 241 26 29 61 89 -147 -159 -167 126 280 -92 85 13 81 0 -427 73 17 -24 -65 29 -213 -61
5856 -61 -284 100 -171 -210 116 43 -234 175 -48 40 -161 -58 -6 39 82 33 -122 -119 131 -170 -76 -121 -61 317
5880 317 -31 -54 27 -171 245 -85 -301 -49 41 -267 154 -135 0 -207 -43 132 -148 -20 73 159 238 -132
5902 -132 -120 13 -162 29 -90 72 -54 68 -80 -218 -11 -207 209 102 -243 -32 131 -15 -93 -170 144
5923 144 -24 -138 14 -176 -128 210 -83 78 62 -15 224 85 -17 59 -43 139 28 36 -89 130 -9 87
5945 87 -406 202 27 112 -75 -88 102 -187 -80 -200 3 -112 54 -94 59 -199 -46 93 97 193 -137 194
5967 194 75 -88 200 58 -18 -63 -151 87 78 -39 171 -65 -180 -40 -214 136 -3 -21 -17 -44 -5 -199 -204 -168
5991 -168 29 117 -38 -82 -81 17 198 -240 56 94 -221 -37 39 143 160 -79 3 29 -144 -146 -48 -223 -113 -69 -2
6016 -2 -10 -242 -4 -57 333 -1 163 -180 104 -73 49 -31 94 30 186 -188 237 141 114 23 138 26 -45 -146
6040 -146 24 23 -93 58 31 71 -9 334 -5 35 17 -60 -180 43 182 -74 63 -130 141 49 285 56 -43
6063 -43 -52 -219 119 -286 170 -164 -10 -23 231 -47 49 18 -157 87 -82 -124 289 -175 185 264 -21 -224 -117
6086 -117 -46 -39 111 -118 8 -135 -118 -148 -116 170 -24 -28 -9 2 -72 -10 -34 136 -32 310 -176 -181 72 77 95 129
6112 129 163 -138 62 3 -184 41 86 -166 41 -93 -295 56 133 -15 1 59 352 99 284 -246 261 95
6134 95 -88 260 71 -52 45 -33 144 -126 47 72 -31 -96 145 189 -174 -44 -2 35 -127 -99 -138 -95 -5 147
6158 147 108 23 41 143 232 -8 172 38 87 102 231 124 175 149 71 100 195 -105 118 -2 -23 38 61 122 -84
6183 -84 -74 6 171 68 24 -428 -250 196 -101 -9 -103 43 -23 31 292 5 46 -29 -173 -205 -41 20 -56 85
6207 85 -26 70 -167 -155 136 -197 -26 -72 -45 65 74 4 -161 53 -114 -39 -22 292 15 -199 -154 20 15 -83 -164
6232 -164 -200 -26 27 430 20 -115 150 -50 -56 132 -320 -3 130 0 23 106 90 18 -53 36 -238 -25 -58 -294
6256 -294 95 85 67 193 307 -151 90 56 -79 84 105 -185 -14 21 39 -131 95 30 47 -118 186 -72 23
6279 23 -25 288 62 56 -116 106 -339 -104 -54 -62 87 75 110 168 5 -4 -66 150 -226 251 163 63 -45 -66 -154
6304 -154 -263 -65 368 179 86 184 193 9 -212 -103 -285 47 111 123 -20 103 -82 -271 72 -262 -77 25
6326 25 -42 -71 19 0 -40 88 -77 25 -161 -51 -59 108 -23 -29 -27 84 -263 104 -114 -129 -119 -21 127 -40 -100
6351 -100 -67 153 67 -8 -19 288 218 55 63 189 21 194 98 57 -198 31 120 -112 49 49 7 -140 -136 -71 -142 8
6377 8 -108 -83 81 67 4 -371 27 -164 -193 57 114 -122 30 29 21 137 -315 1 -40 -193 10 111 -121 -117 -43
6402 -43 48 -74 -50 124 -33 1 -5 -73 -40 94 -32 12 6 38 -154 25 33 128 -63 -101 192 -226 -82 -169 -83 61
6428 61 110 -108 91 -171 -1 181 77 -32 23 -122 56 -219 -342 325 208 44 -100 -93 -24 159 -97 97
6450 97 -80 61 -6 8 51 -25 -87 122 -33 -54 113 -5 414 -107 132 49 144 -215 350 -148 -15 -302 201
6473 201 -46 -54 43 -43 -47 128 11 -147 95 -298 -149 3 101 -25 -299 -99 -135 163 -57 170 28 43 -90
6496 -90 72 9 -364 168 -3 -97 -135 22 77 -161 159 -78 15 -69 84 -116 219 -163 49 -93 -225 -159 -23
6519 -23 24 -115 -125 -211 74 -25 -271 -71 205 113 46 -247 -21 -146 31 64 175 -236 -134 -81 3 -11 24 30 -9
6544 -9 6 22 -82 -14 44 66 -122 154 70 -144 -53 -34 -4 -292 2 -10 -230 -110 -288 90 -127 66 -121 -12
6568 -12 -2 42 -73 205 146 166 42 94 306 -29 4 -46 -65 -15 -55 25 -35 -6 -64 -165 11 -31 3 0 -3 57 -20 126
6596 126 197 200 -131 67 26 -193 -96 7 206 -15 11 73 225 -55 -205 161 108 -63 -299 44 -155 62 210
6619 210 54 74 4 -137 -115 -143 -5 -26 -129 267 -74 167 -55 -42 10 37 -282 84 -170 -46 -59 -208 95
6642 95 -10 156 78 -30 -100 -35 175 13 67 -23 67 58 149 -145 137 -164 49 208 131 -16 -116 33 173 145
6666 145 -143 -83 56 100 -265 -6 -67 40 119 -25 204 138 213 -50 28 220 49 -322 35 -44 -44 105 -86
6689 -86 -57 84 16 178 79 84 -16 -197 -138 -83 -108 -58 -160 -224 28 29 145 133 -55 -71 -81 -129 -63 -220 -14 7
6715 7 84 -52 -17 97 -10 -93 -29 193 2 -71 3 66 57 -38 -23 96 -84 -188 17 -15 210 63 -89 -203 31
6740 31 -129 -128 121 -192 -112 -260 185 -291 -288 7 -308 -319 -76 33 113 -232 -24 2 0 -141 59 194 -58 63
6764 63 33 24 198 -112 206 -72 -125 -14 -144 -355 14 -191 61 -36 -115 148 -157 -294 136 -123 -75 19 -150
6787 -150 289 56 224 57 -279 40 90 -20 7 149 -226 51 -16 48 -84 -20 -59 -31 114 127 -67 184 186
6810 186 19 72 -61 26 156 -90 -337 32 -222 -46 -145 -157 -149 58 149 -239 98 65 -37 -235 -116 114 2
6833 2 141 -185 -63 10 -52 142 82 -48 -58 -33 -109 149 -69 -21 121 -25 31 -66 8 54 -115 36 -34 156 1
6858 1 183 -116 127 210 -59 111 -125 409 5 254 166 217 -169 20 124 -197 -61 -183 211 129 -12 -118
6880 -118 -72 -45 82 -183 -88 102 42 -294 -39 -135 -81 2 172 -2 71 -159 -22 -197 177 -307 85 -10 67
6903 67 -41 78 -107 170 134 276 -38 -166 120 -259 -151 -85 149 7 -82 68 80 -52 73 -79 32 -5
6925 -5 8 106 121 -4 -63 -95 -121 -4 -21 -104 -3 -73 -142 27 -75 -136 67 30 -28 133 -75 127 88 -181 -22
6950 -22 -127 185 0 -14 -43 -127 12 80 161 14 -28 231 -2 -36 3 -174 -95 -185 -130 -131 -30 115 -147 36 287
6975 287 -177 -138 -116 42 47 139 137 -196 -24 93 92 102 -229 -209 39 42 -76 -127 31 -228 89 -64 87 29 -175
7000 -175 63 -110 -94 101 38 -64 -11 -94 108 -350 147 -36 -132 -204 -194 -79 85 -96 -23 66 -130 92 94 47
7024 47 -136 -117 -25 177 44 -22 83 -99 180 -64 -161 -188 71 -237 163 -105 84 202 -109 -243 172 30
7046 30 29 -63 -139 187 -163 -25 54 -113 29 86 71 86 -24 6 -16 129 -295 -244 -81 -64 -12 114 -15 -47 -11
7071 -11 130 -153 165 -309 -263 88 -315 -120 38 -181 347 105 -100 204 -62 -9 97 -103 165 99 -144
7092 -144 16 -336 -178 341 -75 -136 82 -87 -46 -27 70 49 -316 161 223 -100 86 50 14 86 -22 44 108 -277
7116 -277 92 64 -70 -101 -164 -94 -40 -198 -131 229 -340 67 22 72 5 -234 14 132 -29 185 58 -68 83
7139 83 -228 29 112 -208 45 54 -258 -50 -174 89 -35 -217 -135 66 -34 214 -292 -128 122 -218 -327 130
7161 130 -137 72 196 -32 -108 -119 -152 179 31 108 -120 -290 331 -450 -82 -166 -388 4 92 -45 213 48
7183 48 -76 359 -114 -68 -41 -118 228 -110 -217 235 -34 -103 89 -265 -80 -19 -139 271 -43 96 265 -264
7205 -264 143 19 -210 166 -122 -49 -164 -265 -161 165 -138 -140 -253 -243 231 -149 22 172 -181 215 139 -123
7227 -123 68 -97 -73 -13 -67 -4 237 -220 56 -212 -106 276 40 -22 -28 -25 7 -14 -105 108 -106 -9 96 46 195
7252 195 -14 -136 277 59 310 -6 -63 -37 110 -28 -7 -53 -102 235 -124 -78 133 -47 69 -8 58 -60 -22
7275 -22 184 -119 -22 167 -216 -183 -197 -9 74 2 176 -55 -35 14 120 121 -51 60 -23 -100 8 -219 52 -38
7299 -38 -81 85 -188 84 -24 -268 241 125 -227 128 -51 34 -92 54 -34 144 -181 23 154 8 201
7320 201 124 145 -123 76 99 -86 -40 59 197 -186 99 251 139 -113 211 -69 -265 -15 -128 -73 44 151
7342 151 -76 25 -193 -51 368 -41 -11 -104 -4 -154 -124 -77 -110 167 44 -6 -94 47 60 90 -8 158 -199
7365 -199 -48 127 -258 -43 -38 -21 -53 55 24 -72 -58 -146 214 300 29 -25 132 -38 251 -282 -18 87 -131
7388 -131 -120 106 -57 -21 -139 -61 -24 -3 -295 70 -103 -7 187 -97 1 200 124 -54 17 -190 35 -212 205
7411 205 128 -115 72 22 37 -4 -64 -34 -93 -108 -50 -165 17 151 -28 257 -18 165 162 -182 147 -127 97 -215
7435 -215 -19 -49 -327 86 150 -299 9 196 -26 -145 112 105 -184 136 -100 29 130 125 99 -111 -5 203
7457 203 -20 -54 10 236 -39 59 -194 -61 -74 10 -72 -41 88 -93 -40 48 158 -80 152 -26 -99 91 -10
7480 -10 -124 44 83 151 50 -149 300 -181 -1 124 -96 148 271 -198 -113 -7 231 281 -2 7 64 344 -235
7503 -235 -105 43 -50 -253 46 31 -128 96 139 -73 -18 -4 4 49 -58 -32 254 -118 94 1 -242 210 -41
7526 -41 45 60 -92 90 13 -46 122 72 201 338 -347 -76 -48 -46 10 -184 -43 244 19 170 110 -51 7 170
7550 170 94 216 -126 88 -77 -321 35 24 3 155 -125 48 53 -188 40 3 -165 -33 19 -250 105 248
7572 248 -176 51 -36 199 -53 251 22 194 -18 129 76 75 96 -163 154 -52 -242 130 -65 -28 -23 -137 -68
7595 -68 117 -27 262 95 -117 -212 -133 112 402 -37 -131 -192 124 216 -430 -92 27 -173 29 111 -67 308
7617 308 -2 -257 111 -87 56 -305 -107 96 -93 -74 -21 -22 146 78 -46 154 -67 64 31 94 21 -152 -50
7640 -50 198 -167 -78 -210 -80 -139 112 22 180 -156 37 96 -25 -25 72 -181 75 54 -236 -160 -82 -123 -83 -224
7664 -224 26 15 -194 153 23 -117 149 20 10 -19 -274 -185 -97 -43 130 14 -230 134 -78 64 88 -81
7686 -81 94 56 -18 172 -71 -78 109 -29 86 -75 33 129 84 -113 4 88 16 64 -39 109 -21 -101 -127 52
7710 52 -111 27 -194 25 95 -145 -34 49 -107 -22 38 132 59 -263 13 -84 -94 7 93 -80 -134 -97 116 -36
7734 -36 310 223 12 213 141 -94 0 -173 -86 162 -64 -240 14 -139 21 173 -101 47 -128 97 19 -39
7756 -39 196 269 -44 46 312 -60 -51 99 148 396 -71 -18 -4 -48 87 -149 -104 -92 58 166 -140 -113 -65 175
7780 175 206 -39 131 127 55 -79 89 39 -2 -15 -49 14 -186 207 -235 169 -199 119 -168 -84 -25 -14 -70 199
7804 199 49 170 107 -219 -278 -160 -133 60 -80 223 145 -277 -194 -47 33 -91 -53 -27 99 -77 360 -135 -96
7827 -96 -147 -76 119 236 9 89 -91 42 20 68 126 -66 126 39 -42 -167 173 -101 45 -18 -20 -6 -176 85
7851 85 -7 46 -138 -61 -280 38 13 68 -156 264 20 -150 -46 -252 -91 137 -205 -168 60 12 65 4 -37 42
7875 42 127 -39 -188 21 23 72 -86 -63 96 128 92 53 308 62 -351 -183 -25 -91 -53 120 -1 -126 67 -135
7899 -135 -65 -49 -57 172 59 -8 -39 10 47 187 30 114 -26 -83 -2 -49 -36 245 253 -41 77 -129 17 97 38 -22
7925 -22 -24 69 60 26 202 -75 73 146 65 -71 216 -70 41 44 -52 -4 -31 -111 131 123 224 13 -63 100 -34 267
7951 267 6 36 -178 -14 -28 128 -111 -71 87 -115 -93 -61 16 -122 -55 90 248 -295 -198 30 149 119 -304
7974 -304 -25 -26 46 -136 206 -136 -56 21 -185 77 -84 -35 297 -141 -46 261 -375 50 1 -45 310 45 -187
7997 -187 -109 86 103 105 -62 218 -177 -141 -37 -152 -135 162 12 177 -22 -35 194 -201 101 180 -58 -85 -176
8020 -176 -117 56 -70 -185 36 13 41 -52 102 237 -123 190 91 125 -22 197 -35 133 -24 -268 125 -198
8042 -198 -45 -77 -108 243 115 -172 406 52 -61 174 -135 17 -25 -159 -63 155 -104 -362 103 179 155 -224
8064 -224 19 98 -87 252 -74 -204 53 62 319 150 -98 95 -27 -126 200 -193 -116 188 -27 60 -241 -36
8086 -36 89 -143 -77 115 215 181 160 -126 59 65 -67 204 -70 -24 167 -186 149 57 48 175 80 73 61 -82 169
8111 169 -30 237 -48 -271 -70 -318 69 11 233 -344 -102 -294 -194 -82 -79 -208 -105 -118 362 -83 -194
8132 -194 -72 -165 -38 206 49 -56 -77 75 4 -114 -199 -4 21 213 413 29 251 224 12 32 92 90 -3 -21
8156 -21 -40 -236 -248 -50 -288 -36 -149 -8 107 235 -115 277 18 201 -40 -266 -90 -127 -4 184 -138
8177 -138 -41 4 -215 132 150 69 103 152 -145 177 -264 121 -36 -37
8191c7
##END NTUPLES=NMR FID
##END=
