##TITLE=1H_LR-721-0-C1
 CDCl3, 8 sc, 
 2.10.2020
##JCAMPDX= 6.0         $$ Bruker NMR JCAMP-DX V2.0
##DATA TYPE= NMR FID
##DATA CLASS= NTUPLES
##ORIGIN= UXNMR, Bruker Analytische Messtechnik GmbH
##OWNER= root
$$ XWIN-NMR		Version 3.5
$$ Fri Oct  2 10:04:57 2020 Russian Standard Time (UT+4h)  she@DPX200
##.OBSERVE FREQUENCY= 200.1315066352
##.OBSERVE NUCLEUS= ^1H
##.DELAY= (6, 6)
##.ACQUISITION MODE= SIMULTANEOUS
##.ACQUISITION SCHEME= undefined
##.AVERAGES= 8
##.DIGITISER RES= 18
##SPECTROMETER/DATA SYSTEM= spect
##.PULSE SEQUENCE= zg30
##.SOLVENT NAME= CDCl3
##.SHIFT REFERENCE= (INTERNAL, CDCl3, 0, 15.7039)
##AUDIT TRAIL= $$ (NUMBER, WHEN, WHO, WHERE, WHAT)
$$ ##TITLE= Audit trail, XWIN-NMR		Version 3.5
$$ ##JCAMPDX= 5.01
$$ ##ORIGIN= Bruker BioSpin GmbH
$$ ##OWNER= she
$$ F:/spectra/data/she/nmr/H-F/1/audita.txt
$$ ##AUDIT TRAIL=  $$ (NUMBER, WHEN, WHO, WHERE, WHAT)
(   1,<2020-10-02 10:03:48.51 +0400>,<she>,<DPX200>,
      <created by zg, POWCHK disabled, PULCHK disabled
       configuration hash MD5:
       00 E9 B6 7A A2 85 ED C7 34 08 36 98 17 FE 4E 26
       data hash MD5: 16K
       84 53 38 5A D8 60 7B 06 3A E1 76 46 BF 10 12 64>)
$$ ##END=
$$ 
$$ hash MD5
$$ 84 2C 87 FF C2 4D 19 C4 E2 80 9B 80 F1 5A 4F 43
##$RELAX= 
##$RELAX= 
##$RELAX= 
##$RELAX= 
##$RELAX= 
##$RELAX= 
$$ Bruker specific parameters
$$ --------------------------
##$DU= <F:/spectra>
##$EXPNO= 1
##$NAME= <H-F>
##$PROCNO= 1
##$TYPE= <nmr>
##$USER= <she>
##$AMP= (0..31)
100 100 100 100 100 100 100 100 100 100 100 100 100 100 100 100 100 100 
100 100 100 100 100 100 100 100 100 100 100 100 100 100 
##$AQSEQ= 0
##$AQ_mod= 1
##$AUNM= <au_zg>
##$AUTOPOS= <>
##$BF1= 200.13
##$BF2= 200.13
##$BF3= 200.13
##$BF4= 200.13
##$BF5= 200.13
##$BF6= 200.13
##$BF7= 200.13
##$BF8= 200.13
##$BYTORDA= 1
##$CFDGTYP= 0
##$CFRGTYP= 5
##$CHEMSTR= <none>
##$CNST= (0..31)
1 1 145 1 1 1 1 1 1 1 1 1 1 1 1 1 1 1 1 1 1 1 1 1 1 1 1 1 1 1 1 1 
##$CPDPRG= <>
##$CPDPRG1= <>
##$CPDPRG2= <>
##$CPDPRG3= <>
##$CPDPRG4= <mlev>
##$CPDPRG5= <mlev>
##$CPDPRG6= <mlev>
##$CPDPRG7= <mlev>
##$CPDPRG8= <mlev>
##$CPDPRGB= <>
##$CPDPRGT= <>
##$D= (0..31)
0 1.2 0 0 0 0 0 0 0 0.06 0 0.03 0 0 0 0 0.0002 0 0 0 0 0 0 0 0 0 0 0 0 
0 0 0 
##$DATE= 1601618628
##$DBL= (0..7)
120 120 120 120 120 120 120 120 
##$DBP= (0..7)
150 150 150 150 150 150 150 150 
##$DBP07= 0
##$DBPNAM0= <>
##$DBPNAM1= <>
##$DBPNAM2= <>
##$DBPNAM3= <>
##$DBPNAM4= <>
##$DBPNAM5= <>
##$DBPNAM6= <>
##$DBPNAM7= <>
##$DBPOAL= (0..7)
0.5 0.5 0.5 0.5 0.5 0.5 0.5 0.5 
##$DBPOFFS= (0..7)
0 0 0 0 0 0 0 0 
##$DE= 6
##$DECBNUC= <off>
##$DECIM= 32
##$DECNUC= <off>
##$DECSTAT= 4
##$DIGMOD= 1
##$DIGTYP= 9
##$DL= (0..7)
0 120 120 120 120 120 120 120 
##$DP= (0..7)
150 150 150 150 150 150 150 150 
##$DP07= 0
##$DPNAME0= <>
##$DPNAME1= <>
##$DPNAME2= <>
##$DPNAME3= <>
##$DPNAME4= <>
##$DPNAME5= <>
##$DPNAME6= <>
##$DPNAME7= <>
##$DPOAL= (0..7)
0.5 0.5 0.5 0.5 0.5 0.5 0.5 0.5 
##$DPOFFS= (0..7)
0 0 0 0 0 0 0 0 
##$DQDMODE= 0
##$DR= 18
##$DS= 0
##$DSLIST= <SSSSSSSSSSSSSSS>
$$ [...]
##$SUBNAM2= <"">
##$SUBNAM3= <"">
##$SUBNAM4= <"">
##$SUBNAM5= <"">
##$SUBNAM6= <"">
##$SUBNAM7= <"">
##$SUBNAM8= <"">
##$SUBNAM9= <"">
##$SW= 16.880792210976
##$SWIBOX= (0..15)
0 0 2 0 0 0 0 0 0 0 0 0 0 0 0 0 
##$SW_h= 3378.37837837838
##$TD= 16384
##$TD0= 1
##$TE= 0
##$TE2= 300
##$TE3= 300
##$TEG= 300
##$TL= (0..7)
0 120 120 120 120 120 120 120 
##$TP= (0..7)
150 150 150 150 150 150 150 150 
##$TP07= 0
##$TPNAME0= <>
##$TPNAME1= <>
##$TPNAME2= <>
##$TPNAME3= <>
##$TPNAME4= <>
##$TPNAME5= <>
##$TPNAME6= <>
##$TPNAME7= <>
##$TPOAL= (0..7)
0.5 0.5 0.5 0.5 0.5 0.5 0.5 0.5 
##$TPOFFS= (0..7)
0 0 0 0 0 0 0 0 
##$TUNHIN= 0
##$TUNHOUT= 0
##$TUNXOUT= 0
##$USERA1= <user>
##$USERA2= <user>
##$USERA3= <user>
##$USERA4= <user>
##$USERA5= <user>
##$V9= 5
##$VALIST= <valist>
##$VCLIST= <CCCCCCCCCCCCCCC>
##$VD= 0
##$VDLIST= <DDDDDDDDDDDDDDD>
##$VPLIST= <PPPPPPPPPPPPPPP>
##$VTLIST= <TTTTTTTTTTTTTTT>
##$WBST= 1024
##$WBSW= 4
##$XGAIN= (0..3)
0 0 0 0 
##$XL= 0
##$YL= 0
##$YMAX_a= 1009821
##$YMIN_a= -927788
##$ZGOPTNS= <>
##$ZL1= 120
##$ZL2= 120
##$ZL3= 120
##$ZL4= 120
##$ABSF1= 10
##$ABSF2= 0
##$ABSG= 5
##$ABSL= 3
##$ALPHA= 0
##$AQORDER= 0
##$ASSFAC= 0
##$ASSFACI= 0
##$ASSFACX= 0
##$ASSWID= 0
##$AUNMP= <proc_1d>
##$AZFE= 0.1
##$AZFW= 0.1
##$BCFW= 1
##$BC_mod= 2
##$BYTORDP= 1
##$COROFFS= 0
##$CY= 11.3945322036743
##$DATMOD= 1
##$DC= 2
##$DFILT= <>
##$DTYPP= 0
##$F1P= 16.9975609425685
##$F2P= -3.02152046262296
##$FCOR= 0.5
##$FTSIZE= 0
##$FT_mod= 4
##$GAMMA= 1
##$GB= 0.15
##$INTBC= 1
##$INTSCL= 1
##$ISEN= 128
##$LB= 0.24
##$LEV0= 0
##$LPBIN= 0
##$MAXI= 10000
##$MC2= 0
##$MEAN= 0
##$ME_mod= 0
##$MI= 1.114404
##$NCOEF= 0
##$NC_proc= 0
##$NLEV= 6
##$NOISF1= 3.799351
##$NOISF2= 2.8
##$NSP= 1
##$NTH_PI= 0
##$NZP= 0
##$OFFSET= 15.70392
##$PC= 1
##$PHC0= -10328.1
##$PHC1= 13.40089
##$PH_mod= 1
##$PKNL= yes
##$PPARMOD= 0
##$PSCAL= 0
##$PSIGN= 0
##$REVERSE= no
##$SF= 200.130013532006
##$SI= 16384
##$SIGF1= 3
##$SIGF2= 2
##$SINO= 400
##$SIOLD= 16384
##$SREGLST= <1H.CDCl3>
##$SSB= 0
##$STSI= 0
##$STSR= 0
##$SW_p= 3612.71676300578
##$SYMM= 0
##$S_DEV= 0
##$TDeff= 0
##$TDoff= 0
##$TI= <>
##$TILT= no
##$TM1= 0
##$TM2= 0
##$TOPLEV= 0
##$USERP1= <user>
##$USERP2= <user>
##$USERP3= <user>
##$USERP4= <user>
##$USERP5= <user>
##$WDW= 1
##$XDIM= 8192
##$YMAX_p= 0
##$YMIN_p= 0
$$ End of Bruker specific parameters
$$ ---------------------------------
##NTUPLES= NMR FID
##VAR_NAME=  TIME,          FID/REAL,        FID/IMAG
##SYMBOL=    X,             R,               I
##VAR_TYPE=  INDEPENDENT,   DEPENDENT,       DEPENDENT
##VAR_FORM=  AFFN,          ASDF,            ASDF
##VAR_DIM=   8192,          8192,            8192
##UNITS=     SECONDS,       ARBITRARY UNITS, ARBITRARY UNITS
##FACTOR=    0.000296,      1,               1
##FIRST=     0,             0,               0
##LAST=      2.424536,      0,               0
##MIN=       0,             -927788,         0
##MAX=       2.424536,      1009821,         0
$$ Real data points
##PAGE= N=1
##DATA TABLE= (X++(R..R)), XYDATA
0 0 0 0 0 0 0 0 0 0 4 -8 8 -16 16 -20 25 -32 46 -57 72 -86 103 -125 149 -179 214 -251 292 -340 394 -454
30 -454 522 -600 686 -783 886 -1001 1128 -1268 1421 -1593 1779 -1982 2203 -2444 2707 -2995
46 -2995 3312 -3657 4032 -4444 4895 -5389 5932 -6536 7205 -7950 8789 -9736 10812
59 10812 -12053 13500 -15211 17272 -19805 22997 -27157 32787 -40778 52691 -117151 1009821
71 1009821 19218 -178018 58980 -905094 832905 333595 -547643 286480 -576474 257662
81 257662 795827 -927788 260691 126588 -459701 786150 -367464 -315336 466130 -477528
91 -477528 460120 171722 -692713 497260 -214866 -37836 721566 -775976 679 342747
101 342747 -305007 631871 -336286 -554570 575025 -144639 246138 63930 -808242 581977
111 581977 180537 -312183 377933 -572784 105143 558526 -465161 155524 -86380 -246724
121 -246724 596928 -323562 -145715 280781 -453304 434029 108815 -524269 310583 -148578
131 -148578 41662 353277 -498924 85176 170707 -234983 401649 -258789 -226156 378631
141 378631 -277301 167706 117504 -396285 260668 -34893 -110842 292333 -318705 28384
151 28384 210410 -253674 256873 -106511 -198132 334942 -173081 15538 126137 -280690
161 -280690 219519 80165 -189656 153414 -200021 75489 265537 -284017 58001 13084
171 13084 -79962 266727 -154234 -105585 170877 -121838 117386 31913 -185397 186960 -83245
182 -83245 -44834 165917 -162975 51978 46340 -116908 137615 -58697 -81669 143732 -99590
193 -99590 32149 43803 -135179 131272 -23240 -57137 86277 -112777 23328 83964 -87477
204 -87477 39475 -39505 -62067 130520 -65897 -26061 29822 -73974 85989 -11136 -62848
215 -62848 61174 -35476 -6952 44442 -62620 47452 1475 -70540 74508 -30951 -16226
226 -16226 27993 -33155 35745 -10411 -38484 52293 -3618 -17389 36038 -43867 31439 23996
238 23996 -33086 33894 -17094 -287 14125 -9528 21170 23 -36230 31945 13167 -19306
250 -19306 21782 -19427 21554 3317 -13194 22235 -318 -414 -3207 -1155 11151 7649 -30329
263 -30329 16829 6696 -18811 4013 -10729 17319 -10838 -9114 1754 3636 1819 -7016 -6149
276 -6149 3238 12912 -27317 5643 2743 -5046 -10696 -8625 15587 -18301 -7717 -2650 8115 -7423
290 -7423 -5663 -3999 2931 11069 -17758 7749 325 6961 -13027 -1294 17397 -7948 -6031 -6282
304 -6282 14072 -4850 2731 -6171 5552 6923 -9084 11782 2822 14313 -12811 1087 15221
317 15221 10405 -4238 -7072 15073 -3493 4104 -6162 15934 -859 -15069 7022 7265 11056
330 11056 -10706 1830 -462 11395 -3052 914 9085 -6916 1641 -15531 16231 7728 -12602
343 -12602 -15343 125 7642 -4220 -208 -7283 4361 -21394 6916 14008 -5842 -3200 -18275
356 -18275 4347 6947 782 -11159 1099 -7852 -6162 -4710 2406 18371 -30624 -4796 8930
369 8930 -910 3374 -1816 1516 864 -7812 -5978 23800 2895 3487 -27999 -11230 44241 -1570
383 -1570 -10585 -6969 -5740 7384 13717 3823 6047 -17718 -1545 30570 -10999 15453 -3707
396 -3707 -10869 22420 -5535 -4960 10709 4754 1737 -7752 -18957 29723 -1315 -6110 16183 -30906
410 -30906 5554 13811 8392 13218 -25772 -24113 25403 15395 3776 -16395 -38485 32348 2232
423 2232 -12025 11224 -24817 -2936 5500 -2255 10359 -11550 -20761 24469 -5380 -3741 -3887
436 -3887 -23572 41285 -853 -38591 -6970 10691 29253 -1736 -47100 -4186 23613 8582
448 8582 19259 -37604 -15115 23145 10483 20026 -21665 -16611 17663 7477 2129 7984 -17209
461 -17209 6500 6697 -10019 17612 -6468 3459 -3411 453 21757 -10439 -14531 21181 23452
474 23452 -11210 -22219 -10365 45100 19078 -26926 -29560 -7235 51440 8740 -27839 -18238
486 -18238 -3263 19831 16619 -9525 -10868 -10107 -1956 29799 -12077 -1345 -8792 -18496 32143
499 32143 -8428 -19422 1445 -1571 10979 -4253 -31715 13275 2680 4115 23017 -59455
511 -59455 884 35244 1736 13539 -44613 -21333 44504 4280 -566 -10033 -46201 43666
523 43666 4179 -18160 38210 -48949 -1358 28790 -7924 34173 -28988 -38355 60416 409
535 409 -9143 3615 -48157 74156 8942 -64697 28712 -14976 36577 34196 -79919 8936
547 8936 34052 -6121 56704 -62667 -34797 71206 -26850 42168 -12492 -71744 64390 -1918
559 -1918 -13127 36981 -64654 19115 34415 -59857 63098 -23912 -44358 60711 -45582
570 -45582 27595 15757 -74864 62133 10260 -49628 37885 -56207 29457 65368 -98471 20693
582 20693 -1151 -15237 81587 -73083 -29476 51212 -43300 56983 3432 -86674 65971
593 65971 -21012 2265 56520 -94381 36523 30905 -52523 57828 -38508 -21820 73999 -67140
605 -67140 18292 36949 -69135 71943 -19020 -33160 65101 -63796 27738 51158 -66690
616 -66690 37148 -13635 -29486 91411 -58593 -17612 45475 -57950 65102 -2347 -56291
627 -56291 57762 -37047 5852 57814 -69509 25729 17607 -46030 70162 -46049 -22084
638 -22084 62145 -55990 23950 8197 -51832 59680 -20554 -33033 50893 -54868 21460
649 21460 33095 -59842 47343 -26748 -27143 65563 -41404 -6040 17975 -44782 48604 -5534
661 -5534 -47472 50103 -37007 3160 33912 -51442 34104 87 -34180 44302 -20316 -10294
673 -10294 32107 -37111 29219 6221 -45205 47687 -12771 -10946 24593 -36048 21220 19296
685 19296 -30441 25282 -8773 -12639 37907 -28584 13862 14269 -33616 34352 -1723 -17525 20882
698 20882 -14345 6504 14408 -29800 20701 4628 -18658 24472 -21178 6110 16735 -23641
710 -23641 13491 5922 -14129 10264 -7329 -309 15515 -27238 9013 8266 -17176 10355 -11458
723 -11458 591 9123 -14365 -264 8004 -9628 5651 -4353 -6282 13704 -16278 3800 5930
736 5930 -9353 963 -4791 1388 4756 -7716 -5406 9982 -7696 2353 838 -1101 8726 -10784
750 -10784 3253 5543 2299 -1517 -1394 681 5394 -410 -4925 9939 -4524 -47 -1567 5298
764 5298 7041 -5856 1551 1785 5578 -695 4357 -279 2731 -1738 -3207 9625 902 -187 -9141
779 -9141 3723 4049 -2118 -138 368 588 -6891 3740 1280 6464 -5393 -6378 2471 1281 3909
794 3909 -6415 1020 -2755 -3999 -3940 5825 1101 -8815 -3716 -4987 9206 -2211 -2628 -1078 -3536
809 -3536 41 -1070 3834 2178 -2787 -12916 6285 3318 200 101 -9142 4318 -4096 1261 7177
824 7177 651 -5808 -1329 -381 9187 8170 -12582 6427 -1845 776 6806 -1516 5940 -4470 -7313
839 -7313 7426 8372 -3448 3962 -9810 4240 10077 -9424 12538 138 -6357 1170 -1472 9818
853 9818 7170 -13644 -1258 2761 -4919 15936 -9773 -4148 3187 -13775 12733 5823 -8290
866 -8290 -1297 -6724 2153 12387 -14389 4617 3478 -16435 10948 -6981 1827 7961 -18128
879 -18128 -910 4946 -5607 8357 -5505 -7212 10175 -19510 10685 15382 -15330 2891 -11462
892 -11462 1084 19947 -8015 -5059 673 -12256 16231 270 -7542 14474 -22003 5271 17161
905 17161 -10304 7078 -4039 -3364 15255 -10328 1290 14267 -13869 13712 -7522 -12497 25869
918 25869 -8814 533 5564 -18264 10571 10558 -1860 9311 -25027 -96 29216 -11477 7461
931 7461 -12613 -13449 27934 -7096 -7006 6160 -14975 9566 2960 -15477 18154 -15377 -3726
944 -3726 19933 -21853 7435 65 -9043 21335 -14890 -15502 15943 -7678 12473 -1282 -32347
957 -32347 19385 -2346 3149 14876 -34975 1874 15540 -2621 16817 -21070 -20448 32362 -3471
970 -3471 2977 -4608 -25480 35407 -2673 -16307 12955 -16550 14026 15904 -28498 10155 3745
983 3745 -7212 29459 -22648 -4743 12290 -11796 33223 -9158 -28022 20651 -3482 8004
995 8004 18441 -34547 5473 10568 -7041 27936 -27186 -8511 19764 -12165 22086 -6553
1007 -6553 -32194 29548 5714 -12953 8643 -27229 21473 15634 -28642 10615 -17006 5406
1019 5406 29030 -29400 -5090 8731 -17514 29468 -1738 -28716 12700 -13214 22266 9603
1031 9603 -36829 12023 -257 -2065 22630 -27032 -8696 24528 -18049 12703 -1711 -18975
1043 -18975 22367 -11082 6891 7989 -27203 18960 13656 -18195 12342 -12376 -4836 30226
1055 30226 -17517 -69 -1483 -9981 27319 -7779 -7839 8644 -17164 16197 21515 -26364 3522
1068 3522 1575 1074 22777 -22476 -3118 10770 -3997 12035 -12646 -10220 23268 -8918 -7962
1081 -7962 13712 -15232 9312 2834 -9315 11863 -11167 -249 8035 -7874 7192 -3006
1093 -3006 -18030 16763 1430 -11252 6923 -13780 4691 7124 -5469 335 -10874 2312
1105 2312 15366 -10803 -7536 7564 -7024 11361 -2678 -14427 9268 1842 319 -4668 -4408
1118 -4408 8417 -439 -8281 9722 -1332 -4748 7707 -6520 6445 4334 -6245 1059 3421
1131 3421 3765 -619 -5453 3658 6147 -6769 5625 -267 -4929 7453 918 -885 -1980 1005
1145 1005 3681 3368 -2705 -350 -783 2932 6095 -9222 29 4224 -810 -1998 422 365 -2197 -795
1161 -795 -378 3966 -4362 -188 -1060 -29 3699 -4554 -2143 1289 906 -5698 723 329 -568 -2600
1177 -2600 -3503 3293 -2742 240 -540 -185 -891 -1161 -938 2823 3750 -7110 -175 1481 3860 -1141
1193 -1141 -3110 1896 -892 -45 633 3534 -2257 954 -1144 1947 4343 -1966 2021 -785 1936
1208 1936 -610 1425 3191 2035 -2710 -2616 5007 395 1977 -2919 1270 1218 -1579 2303 2071 2054 -3590
1225 -3590 -113 831 4773 -1474 -2880 1318 -1785 1062 -2232 2476 -944 -2853 -2782 628 2667 -1789
1241 -1789 -1050 -3453 2823 -2098 -398 1575 -750 -2578 -4436 2932 436 -62 -4592 -285 -250 -958
1257 -958 797 -1425 2468 -4537 -863 1263 3838 -28 -3536 -1 515 2594 -1838 2670 -1512
1272 -1512 -1025 -846 763 5427 -1662 -1367 -1989 3615 1680 1187 515 1351 85 -2837 6088 1712 733
1289 733 -2611 -798 2443 993 1824 -898 36 -2473 1518 -90 5178 130 -7452 1991 2154 2826
1305 2826 -1326 -912 -953 -1561 -1216 2377 1623 -4345 -316 -6290 3737 4057 -4678 -1827 -1022 -553 -1080
1322 -1080 1395 1282 284 -7177 1266 1953 -2833 5196 -5130 -3228 864 -707 1918 2636 -3632 -3866
1338 -3866 -1516 4022 8396 -9033 -940 3853 -2920 4971 1001 -1912 1065 -1826 -418 5030 -1378
1353 -1378 3034 -3084 -3688 9625 -4274 582 7148 -4285 -1782 2594 1016 6090 -1130 -4463
1367 -4463 3516 -4804 7636 3418 -7730 3530 -4627 -1417 10157 -1245 -6397 145 -2223 8088
1381 8088 -1274 -6329 6529 -6383 990 3436 -5880 4669 -196 -8533 3666 -325 -2129 3987
1395 3987 -7581 3781 -2034 -6845 10079 -1689 -4216 1836 -6287 2556 7677 -6133 1031 -4680
1409 -4680 -3637 9832 -3631 1027 -3008 -8866 10082 4827 -7301 999 -1369 2195 6569 -8282
1423 -8282 4322 3129 -3350 5121 -5261 1699 7229 -4968 367 3968 -5738 4827 1312 -278
1437 -278 4933 -9530 2583 6821 -43 2800 -5535 -4708 8724 2979 -1028 -747 -9539 6183 5876
1452 5876 -2257 -1604 -8668 4331 8290 -5095 -5857 1121 1961 5352 -5875 -7129 6346 732 2243
1467 2243 -5175 -6313 4075 2308 -992 -511 -4828 -3718 5856 1254 579 -5790 -4637 5601 1798
1482 1798 954 -2997 -3757 698 5094 -411 -1862 -2479 -1694 5646 1000 -1779 -4924 1435 7366 1549
1498 1549 -6835 -3649 7372 4872 1085 -7367 -2453 7211 6029 -1063 -6578 -1282 3571 6922 -1648
1513 -1648 -3152 -4049 2209 9273 -3146 -4448 -48 3724 2864 -151 -4127 986 2326 -440 1937
1528 1937 -4470 1701 -412 -3060 4789 -825 -6154 -537 3913 1836 -997 -8875 2653 5201 -880
1543 -880 -551 -8710 1840 7075 -2006 -4246 -2242 -1875 5583 985 -5762 -812 -3403 7192 1858
1558 1858 -8201 733 1330 1775 2773 -4388 -2052 6031 -2016 1081 -358 -2082 4386 -4140 2392
1573 2392 3909 -4844 432 3986 -477 2640 -1973 -2177 7396 -1390 1060 -1518 -2233 7448 -889
1588 -889 -3080 1789 -1796 619 4918 -3989 -386 -1051 516 7188 -5603 -1914 2392 -1060 2560
1603 2560 -754 -4080 3373 -480 -3110 2740 -3009 2551 -1774 -4286 4439 -2147 -2026 2187 -1730
1618 -1730 -952 690 -3367 3625 -75 -3668 1091 -3263 3334 1072 -3979 1097 -948 -2772 3752
1633 3752 795 -2809 98 -2716 4511 687 -2483 2201 -1595 993 1655 -1698 1295 2357 -3960
1648 -3960 468 1744 1410 1964 -3755 2299 891 -1091 2554 1247 -964 554 -560 917 4033
1663 4033 -2187 306 -894 294 2486 -1351 1480 -445 -2505 -10 3324 -124 -149 -2002 -1015 2611
1679 2611 -1571 753 -576 -385 -928 -1420 1312 1623 -2165 -3614 891 -737 1062 -1262 -1206 -120
1695 -120 -2275 312 612 1198 -1830 -1624 -1097 2005 602 -1597 462 -1787 406 -540 1449 892 -1529
1712 -1529 -1924 221 2633 -10 721 -1250 1361 -249 146 2714 999 198 -2598 1220 1680 2051
1728 2051 -1240 -198 664 -190 1576 -76 2314 -1476 -1078 797 2651 1264 -1065 109 -660 1310
1744 1310 -681 1589 69 -1259 -1215 -993 2983 -93 -1102 -1902 796 -359 -117 1022 -699 -345
1760 -345 -2892 1508 672 519 -1422 -2582 376 129 -112 -1481 1264 -2098 -1579 -283 1649 1208 -2757
1777 -2757 -261 -1068 1191 686 317 -1035 -853 -745 -229 3262 -753 -1257 -2006 1413 1968 -501 816
1794 816 -61 285 -801 1873 799 1728 -701 -1569 1755 425 1645 -743 914 55 -1281 439
1810 439 3024 968 -2654 4 -503 3050 777 -507 -482 -955 1532 676 1051 -719 -1569 -2080 2906
1827 2906 780 -2612 -153 -1303 1214 -720 -893 365 637 -623 -1116 -956 910 1861 -2532 327
1843 327 -1349 -1928 1574 998 -384 -3188 -2041 1579 3142 -1688 -2147 -1868 858 3744 -1936 -386
1859 -386 -737 -684 1247 1491 -539 -646 -404 778 2540 -2822 77 1175 1561 1411 -3178 -282 3675
1876 3675 2015 -1115 -655 -1494 2859 2102 -16 37 -3891 1922 3732 662 -1648 -2443 95 4715
1892 4715 991 -3661 90 -91 3346 -252 -2422 381 -463 1109 992 -2163 -1995 1608 -265 1972
1908 1972 -2650 -4296 2288 1699 1051 -3779 -2790 2191 2842 -1052 -1606 -2318 -426 3703 -1573 -332
1924 -332 -2099 -2212 2348 1442 -776 -2941 -1114 2369 3169 -2983 -973 117 1197 3634 -2666 -1728
1940 -1728 523 2617 1325 -546 -2612 -304 3051 2135 385 -5224 1304 4564 1230 -1171 -2263
1955 -2263 993 2811 2138 -2148 -246 -223 1695 1268 -687 1050 -2875 77 3078 843 -3187 -650
1971 -650 848 1779 1378 -3799 -80 356 2422 83 -3536 -652 1265 837 252 -1089 -4421 1762
1987 1762 1971 -178 -1612 -3238 1996 1472 -215 -1332 -1304 118 2545 -1060 -1408 990 -2961 1864
2003 1864 1128 -1032 -1313 -1465 2129 1913 -1718 -2042 1068 416 3412 -1811 -2368 2731 -252 1469 256
2020 256 -1025 -335 823 1208 1816 -2565 -1272 3405 -478 1861 -2044 -1606 3605 946 -1063 -369
2036 -369 73 962 1917 -1360 835 -1947 -372 3666 -1513 -782 -1145 -976 2465 1322 -3278 -245 155
2053 155 556 1047 -3089 1334 -786 -1099 1957 -1776 -1562 995 -447 -24 -168 -3839 1872 1005 -812
2070 -812 -420 -3472 2535 2072 -1570 -340 -827 -884 2431 -29 -973 671 -2926 2407 688 -919 727
2087 727 -2310 1239 2017 -1624 196 1960 -1521 1594 -375 285 2337 -1635 1165 292 -776 1465
2103 1465 298 -172 1447 -2027 -699 3780 -484 345 -1877 -156 2788 -277 -76 129 -924 665
2119 665 1112 -1023 1659 -1461 -1409 1602 -896 868 -716 -748 126 -1153 -215 1630 -667 -1382 -100
2136 -100 -1476 2157 -575 -1335 201 -1149 -399 -16 592 430 -1200 -2637 1663 1126 -89 27 -1891
2153 -1891 900 -18 321 693 131 -765 -458 365 1173 1638 -1906 554 -175 286 1063 396 679 -978
2171 -978 -49 644 2008 -384 61 -616 443 1363 -711 1345 -279 -446 -839 1058 1516 -259 -1135
2188 -1135 -842 1149 -173 725 -679 -73 -21 -1025 892 608 409 -1891 -451 28 723 -323 -755
2205 -755 166 -1908 -16 -259 1072 -669 -1291 -671 150 739 -309 -1 -965 293 -1200 290 1309
2222 1309 -844 -842 -1381 1012 348 69 -732 -123 -79 151 1015 9 1088 -1442 -294 1122 1089 -48
2240 -48 -949 447 -19 738 34 1388 -620 -389 472 16 2027 -304 -175 40 741 117 349 522 34
2259 34 -699 -1521 2092 60 29 -521 -1093 761 310 309 84 -646 -1327 582 210 1152 -640 -2363 1623
2278 1623 -41 -496 -587 -689 -102 -175 -953 -112 392 -972 448 -1997 453 781 -1319 1055 -488 -1526
2296 -1526 -17 1187 711 -204 -2263 132 959 -197 1635 -1799 -258 786 -155 1340 532 -1541
2312 -1541 0 1082 642 758 -2148 1436 1679 -1342 440 -436 936 1529 -859 -1153 1231 454 1450
2329 1450 -75 -1312 1078 -1191 2358 1453 -2316 -572 856 761 1140 -1182 -1943 1312 -47 1118
2345 1118 -813 -1844 1546 -842 333 786 -2089 -573 1919 -280 -442 -1779 -490 2285 -1191
2360 -1191 -363 -1333 -677 2693 -534 -2250 34 -113 241 1755 -1395 -442 -928 861 2343 -1954 -1188
2377 -1188 114 602 1530 -367 -2626 595 1631 416 232 -1896 1184 298 604 1250 -1761 -440
2393 -440 1880 1457 -878 -496 -908 2241 1272 -651 -1134 -863 2597 625 -996 84 152 148 1679 140
2411 140 -1723 -138 531 1735 -673 -1138 -587 273 2125 -1252 -2184 -824 1752 293 -189 -1322 -828
2428 -828 360 496 1267 -2383 -712 483 829 288 -1718 -1056 416 1462 -538 -1484 -1236 2024 391
2445 391 -1149 -242 -1069 1223 646 188 -605 -822 560 1848 140 -942 -515 -734 2970 73 -1343
2462 -1343 -230 -182 1529 178 -104 -93 -155 352 1996 -583 -601 724 -48 2211 -668 -916 585 743
2480 743 1057 -847 -1590 1056 1248 -784 579 -1608 176 1911 62 139 -1906 -426 1665 503
2496 503 -1011 -956 -1209 1485 540 -2304 499 -690 212 -219 -1099 935 -509 -1467 353 389 -534 545
2514 545 -1636 987 938 -2129 -136 -178 1304 416 -1926 -742 1001 531 855 -1061 -1855 1898 718
2531 718 778 -767 -1425 1457 1084 -132 -302 -307 566 1003 -1149 359 1274 -393 557 -829 882 1056
2549 1056 -539 327 823 24 -91 -251 278 1836 -1349 -752 139 764 991 -1375 -1058 270 578 274
2567 274 511 -1019 -294 198 -145 782 -1466 -91 -79 -246 -117 -377 -168 248 -496 -989 891 -238 36
2586 36 -827 -493 427 -381 447 271 -438 -809 135 86 886 -232 -878 400 -207 633 -120 174 245 -505
2606 -505 -81 781 693 -539 -185 -239 1080 429 192 218 62 636 -397 696 869 233 -868 109 548
2625 548 608 499 -58 75 -375 713 451 111 47 -643 47 219 315 -756 225 -278 -91 4 36 573 -909
2646 -909 -400 -322 576 159 -471 -264 -401 158 -605 281 -274 -170 -1341 -163 817 -285 -501 -704 57
2665 57 -355 531 26 254 -311 -882 298 -53 861 -928 -164 254 -83 99 91 575 -273 -22 -227 934
2685 934 83 -132 159 -217 951 96 504 134 56 -56 0 619 274 255 -628 580 64 552 -132 -75 292
2706 292 -505 581 320 247 -552 -298 -84 443 -242 -598 354 -783 147 -643 90 321 -608 -350 -14 252
2726 252 -69 -159 -691 300 -629 -196 666 -631 -245 -963 -119 203 -263 -455 -57 -153 -264 411 -391 752
2746 752 -725 -379 506 -52 427 -113 -83 -102 121 -277 731 -233 -335 185 -767 1402 -126 -408 700
2765 700 -46 253 396 -62 364 464 -683 1229 51 -34 460 -902 782 324 -657 418 213 -562
2783 -562 386 -730 675 656 -1506 877 -591 -375 886 -743 -369 224 -1096 578 354 -1372 632
2800 632 -1036 435 636 -1894 789 -152 -1084 736 -320 -477 920 -1380 251 684 -1353 1137
2816 1137 -1367 126 1324 -1820 280 1065 -793 1027 -502 -803 2064 -936 53 337 -1436 1881
2832 1881 58 -836 1089 -787 244 1788 -1568 603 628 -592 2237 -1260 66 1572 -1413 877
2848 877 291 -1109 1343 -453 -900 2134 -1325 264 492 -1408 1817 -1517 -966 1676 -1244 17
2864 17 399 -1632 1717 133 -1795 1560 -1718 678 923 -1903 887 -635 -959 1749 -1050 -1302
2880 -1302 1097 -1899 1708 195 -2264 1870 -913 -135 1042 -1453 597 503 -1563 1357 -681 -1004
2896 -1004 2121 -1656 403 310 -1306 2273 -220 -1553 935 -300 853 916 -2133 1674 390 -972
2912 -972 1844 -1423 865 778 -1891 1313 845 -1232 760 -787 123 1949 -1835 825 699 -798
2928 -798 1527 -1293 -180 1873 -1090 -518 216 -915 1676 -702 -1403 751 -1191 1377 410 -2058
2944 -2058 357 252 -785 458 -1191 4 675 -2024 443 -476 -262 1164 -2108 185 863 -669
2960 -669 115 73 -424 1028 -939 73 1455 -1222 67 -732 -138 1787 -353 -653 441 -113 816
2977 816 310 -960 884 -558 268 1032 -641 838 538 -371 359 135 4 916 -698 -333 543 -603
2995 -603 1050 -584 4 819 -761 191 568 364 -343 -418 -171 1113 -528 -329 -183 -298 1462 -792
3013 -792 -675 103 -170 -389 -292 -182 453 21 -854 374 -325 720 -189 -847 408 -700 -133 241 -21
3032 -21 -331 -405 -410 412 385 -228 272 -1115 129 313 -44 268 -429 -91 375 421 59 231 -356 571 -370
3053 -370 -149 703 -307 28 -414 399 673 245 -16 447 49 104 366 -157 839 -366 -113 413 234 621
3073 621 -449 -274 87 398 -261 367 -332 -118 135 -239 1009 -478 -36 -193 -254 -37 -266 -213 6 -310
3093 -310 -756 437 -82 -22 -41 -390 412 -359 173 156 -98 -775 -42 -279 318 -151 -930 403 -512 392
3113 392 3 -367 365 -447 -354 309 434 -441 387 -419 692 280 -242 442 -275 422 73 316 352 329 -498
3134 -498 211 199 279 521 -344 217 -36 115 355 340 250 -212 -141 -3 790 -681 81 -133 -150 222 -327 650
3156 650 -63 -263 -114 261 75 -266 -157 -146 139 -551 -28 -215 -61 -257 -318 154 -35 -273 -411 231 -316
3177 -316 -121 -125 -33 188 -790 219 -99 393 -109 -324 170 -79 72 -516 93 -632 123 -357 285 198 -322
3198 -322 237 -20 474 -157 382 -158 149 -94 -327 275 88 470 -498 313 265 125 -44 204 303 -235 369
3219 369 48 481 -348 -41 36 297 362 -359 -287 -29 158 -258 -153 -60 -75 -59 -199 365 -645 -211 -19 -177
3241 -177 -277 -220 16 51 -18 -418 -9 -364 -90 -61 -388 5 -476 -452 30 201 -353 -189 38 51 -125 -323
3263 -323 205 177 277 -313 -320 367 -125 23 -101 469 -440 224 306 151 -37 -444 697 502 585 -386 -161
3284 -161 160 619 23 -343 86 -50 11 139 304 62 331 592 -324 9 -274 205 250 293 -273 -264 -93 -4
3306 -4 77 -580 337 -599 -257 217 -116 -475 -305 -15 510 284 -944 -171 200 601 -297 -1203 343 444
3326 444 8 -369 -600 26 230 -169 -231 -301 256 616 -623 204 -342 -340 634 63 -413 -109 133 12 591
3347 591 -351 213 -244 -129 988 -420 142 123 159 663 493 -371 38 410 -1 395 -738 509 423 -387
3367 -387 214 -586 241 632 -187 -363 129 -616 582 79 32 22 -1087 679 411 -331 -137 -272 -35 479
3387 479 -398 -415 166 -953 319 -538 -354 705 -1055 -13 -148 -619 591 81 -958 165 -662 -105
3405 -105 613 -1126 458 -200 -445 429 -565 171 690 -1022 -149 544 59 1034 -990 -350 1577 -763
3423 -763 528 -540 -325 1121 -456 -662 1210 -237 224 334 -903 1278 -10 -265 937 -910
3439 -910 662 600 -565 418 -151 -693 1082 -650 138 1011 -1321 746 -433 -193 1210 -940 -846 510
3457 510 -104 589 -33 -1307 1167 -985 -155 584 -986 582 -290 -966 1192 -113 -643 922 -982
3474 -982 128 144 -752 1314 -585 -585 661 -593 335 334 -982 357 -316 -712 1187 -677 422 435 -1010
3493 -1010 1223 91 -412 560 -324 -10 979 -876 851 322 -701 1099 -478 377 718 -973 532
3510 532 447 -536 721 63 -205 913 -692 659 473 -514 950 -613 155 538 -445 -23 257 -853
3528 -853 297 242 -293 471 -797 115 383 -685 608 -193 -496 349 -357 -40 639 -780 -282 -213 -359
3547 -359 837 -538 -94 489 -812 -195 553 -307 330 -376 -299 1029 -355 82 -363 -141 443 -315 33
3566 33 343 -265 -289 259 -47 676 -22 40 398 -2 373 179 163 190 84 -21 461 178 -63 238 -399 354
3588 354 339 120 495 -265 -63 322 163 65 -129 -306 229 125 -45 403 -248 -72 -346 -99 236 -25 -515
3609 -515 -314 -75 26 294 -167 1 -228 -266 -129 -227 130 -232 -133 -105 143 -244 -172 89 -195 137 -383 370
3631 370 -174 -221 -299 33 230 -306 -49 -162 -59 -563 231 184 -90 44 -94 315 -62 119 -238 578 165
3652 165 103 35 -89 467 -326 134 140 299 -105 -63 261 -6 360 -265 389 -260 -2 -171 -83 66 -430 -142
3674 -142 103 -26 -213 69 -294 41 -59 -264 318 -193 169 -560 -96 -107 -412 -324 -50 197 -230 266 -398
3695 -398 114 -311 -204 -25 -280 346 -121 -24 -163 112 -540 249 -12 -394 345 -409 536 -248 -359 34
3715 34 226 -270 -116 133 -257 461 -477 579 321 -265 288 -269 567 236 -28 84 307 38 606 -4
3735 -4 84 546 -629 428 287 -220 88 -76 309 216 -194 61 51 -211 207 -31 -41 674 -527 -16 69
3756 69 -234 -24 40 -418 -51 -274 -62 519 -474 278 -184 -385 189 -315 -305 65 -419 -319 229 -159 191
3777 191 -561 -450 727 -162 -3 -110 -243 325 -20 -474 465 276 -252 208 -357 512 282 -365 38 -267
3797 -267 -63 150 189 -220 338 -540 707 216 -250 338 -78 448 277 -289 451 206 -506 416 178 -258
3817 -258 417 -729 525 99 -325 371 -94 198 -288 -342 -50 769 -557 -42 -238 -236 408 -600 24 -27
3837 -27 -374 260 -113 -430 201 -84 -224 521 -944 133 117 -539 295 -595 -74 661 -484 10 277 -662
3857 -662 827 -240 -407 745 -800 402 269 70 301 -392 -449 614 -96 -325 312 -664 733 -32
3875 -32 -100 709 -274 125 203 -201 271 404 -500 567 -407 -319 883 -649 658 -211 -234 896 93 -183
3895 -183 305 -304 -122 292 -678 672 -144 -409 532 -584 652 -198 -603 569 425 -508 167 -392 -203
3914 -203 470 -913 366 -128 -652 417 -832 -99 395 -326 347 317 -736 720 -164 209 393 -889
3932 -889 581 155 -41 320 -387 -295 524 23 344 248 -703 557 -56 -17 513 -553 269 519 -400 445
3952 445 452 -278 480 -633 265 249 -655 708 25 -238 242 -438 100 509 -541 -2 524 -198 802 -773
3972 -773 -16 659 -311 172 77 -243 65 -404 -381 487 -471 201 189 -784 435 -468 34 208 -706 159 293
3993 293 -333 267 -172 -472 573 -611 27 37 -641 405 -713 -209 490 -35 -332 412 -227 480 190
4012 190 -394 579 -300 -33 306 -166 682 -53 -326 325 57 -20 670 -474 597 80 -86 740 -276
4031 -276 35 291 242 -48 328 -271 144 -183 -332 467 -310 410 -68 -280 96 -239 -189 244 -158 38 173
4052 173 -373 385 100 -308 302 -297 -99 -49 -303 120 -27 -154 457 94 -119 314 -587 351 116 -165
4072 -165 284 -24 168 -61 -64 -141 126 -461 64 107 -125 182 -447 168 42 -31 99 210 -50 155 40 12
4094 12 342 -348 451 154 138 252 118 167 101 19 -106 207 60 188 -267 316 364 -424 186 -111 209 -116
4116 -116 15 -77 67 80 -242 48 -418 59 -462 -218 158 -187 88 225 -205 -77 -37 -224 82 -397 -219
4137 -219 160 -357 43 -293 -214 332 17 -212 -81 -406 130 269 -339 373 -129 -181 79 -705 310 -93
4157 -93 -170 37 -134 -234 117 -112 18 210 -600 872 -146 -90 404 -318 296 -136 -31 382 358 -358 437
4178 437 -59 141 625 -436 656 41 -120 522 -85 196 87 -288 356 476 -614 710 -466 -12
4196 -12 522 -313 423 -1 -413 132 -51 -353 525 -805 -73 330 -768 712 -465 -460 31 -596 224 306
4216 306 -884 423 -65 -481 817 -1048 39 345 -1063 209 148 -340 656 -247 -214 424 -861 383
4234 383 97 -923 1013 -867 -235 746 -670 344 120 -363 994 -180 -310 902 -1006 538 353
4251 353 -828 1106 -308 -227 837 -555 298 340 -642 712 -161 -672 1258 -1085 194 470 -1054
4268 -1054 463 62 -451 430 -577 -275 926 -909 377 -144 -810 996 -471 -181 658 -788 211
4285 211 200 -993 736 -697 -418 560 -905 558 200 -1021 671 -480 -705 773 -561 128 429
4302 429 -966 786 -43 -406 858 -904 241 381 -686 772 -116 -855 887 -237 -38 829 -1261
4319 -1261 997 285 -731 927 -458 -55 587 -587 370 516 -821 1008 -514 -207 1019 -865
4335 -865 590 428 -682 842 75 -100 530 -928 -224 494 -595 723 -292 -733 571 -457 47
4352 47 432 -731 363 292 -611 613 -308 25 691 -936 291 71 -572 421 -715 -122 406 -343 27
4371 27 171 -688 575 -303 -266 688 -683 -27 34 -492 692 -103 -616 637 -333 5 655 -659 709
4390 709 -260 -266 726 -424 -121 205 -65 199 214 -415 477 -162 -90 436 -187 364 -20 -125 290 -181 -82
4411 -82 595 -103 46 274 -473 504 -139 136 203 -225 526 150 -282 168 -229 -342 755 -289 -163 -101
4431 -101 -434 530 92 -173 -53 18 -159 132 -263 -109 115 -87 101 -408 219 -46 -344 113 -32 94
4451 94 50 71 -217 168 -42 201 8 -118 328 123 13 176 153 336 184 49 152 292 -67 130 64 217
4473 217 429 4 98 -86 186 127 69 -264 150 -11 -258 51 105 250 69 203 215 -6 -103 198 -61 77
4495 77 -116 -307 83 -161 152 -102 -311 -130 75 288 48 -73 -165 8 -78 -115 -35 -40 35 -227 -85 128 -214
4518 -214 6 -256 48 -23 -109 -192 264 -354 -74 246 -262 218 22 68 -47 31 -310 44 12 333 -34 57
4540 57 66 -166 183 137 135 100 -23 -4 4 153 -214 121 -145 125 343 -3 24 -126 59 -166 -11 118 -45 58
4564 58 101 15 -264 -157 -86 173 150 -215 -20 42 107 -99 -136 -300 -107 -292 -137 -44 -349 -79 -3 -152 -186 189
4588 189 -286 170 -12 -202 28 -443 10 -273 -24 98 -210 -30 4 -75 92 239 -261 -9 -139 -57 147
4609 147 -242 207 41 31 123 68 -59 374 -154 345 187 -133 163 -389 -100 70 138 381 53 43 179 16
4631 16 72 233 -399 211 -104 -154 493 -285 96 45 70 213 -184 -164 62 40 -254 65 -211 73 -195 -352
4653 -352 120 -165 22 192 -288 -66 232 -330 219 -48 -241 443 -395 195 -107 -392 -21 -20 18 609 -76
4674 -76 -229 369 -335 266 267 -224 250 -147 3 278 -522 122 120 -311 476 -140 -148 623 -365 227 -1 -137
4696 -137 378 -78 294 292 -318 333 540 -448 850 135 -245 422 -505 239 303 -462 204 3 -272 467 -413
4717 -413 -17 543 -596 443 97 -414 427 -475 -118 362 -393 131 18 -859 260 -181 -69 332 -846
4736 -846 396 159 -509 361 -250 -483 784 -609 -117 295 -836 664 -187 -340 619 -226 181 228 -661
4755 -661 502 124 -359 858 -444 -92 681 -639 409 -107 -419 490 -76 -159 653 -462 95 523
4773 523 -712 735 -215 -299 712 -327 579 192 -560 512 -15 -361 551 -406 238 435 -672 739
4791 739 -153 -460 707 -229 60 112 -638 496 -40 -737 579 -440 241 679 -794 322 -140 -411
4809 -411 510 -150 -213 543 -835 167 662 -653 741 -419 -183 563 -825 445 283 -725 47 -83
4827 -83 -323 619 -379 232 522 -831 745 101 -441 478 -453 -8 621 -790 279 278 -308 860 -235
4846 -235 134 590 -500 621 266 -485 391 -165 -137 563 -415 273 497 -477 536 -196 -325 589 -349
4865 -349 240 438 -591 404 -76 -414 378 -690 127 178 -279 436 -187 -454 654 -173 -261 331 -551 198
4885 198 49 -479 595 -413 -58 266 -357 246 64 -571 640 -190 -288 370 -463 350 -29 -94 498 -8
4905 -8 -129 476 -47 13 230 -332 348 2 -537 511 -329 172 128 -152 466 136 -236 185 -46 19 368
4926 368 -409 260 261 -66 333 94 134 170 -307 78 -91 -355 128 61 -184 234 -134 149 162 -284 75 -11
4948 -11 74 -12 -265 -114 200 -239 -5 -185 -214 406 -65 -77 -195 7 6 106 -110 187 -238 -165 198 -141 153
4971 153 7 -196 115 -3 208 170 -232 -121 222 -110 118 -123 83 -55 -273 302 252 -21 98 135 282
4992 282 -13 79 92 175 142 382 -167 102 100 11 -33 123 231 -145 -130 -275 -97 262 82 262 -165 109 -232
5015 -232 99 39 101 86 -127 80 -43 34 -103 160 -361 90 -63 -209 44 174 -141 84 -12 52 16 -193
5037 -193 -156 -22 -196 -75 245 64 -361 34 -204 -114 -63 58 191 -54 262 -274 -127 -115 255 246 39 -90
5059 -90 135 176 0 344 124 24 79 -278 76 -1 270 -12 -87 81 323 -108 -76 -3 75 0 31 15 183 17
5083 17 -166 79 217 24 -23 188 47 -114 186 6 -179 -109 -98 63 -65 -300 -162 27 -111 54 103 -125
5105 -125 239 -190 0 -109 -218 -202 -64 -230 -9 -356 -218 23 -97 187 -157 -149 175 -228 -28 17 -181
5126 -181 318 -100 24 -120 230 174 204 132 119 62 -134 80 131 164 8 -162 177 115 69 149 -158 -100 53 -3
5150 -3 64 165 -110 93 133 -89 151 -195 -177 172 -237 -99 116 -19 116 -48 57 96 -172 -110 81 -256
5172 -256 82 -27 -120 -90 -389 -53 -195 -265 378 -187 -166 -20 -401 102 119 -313 41 -228 -61 169 -289 224
5194 224 68 -219 206 112 -97 50 -117 91 187 -77 319 3 -39 142 -146 216 96 -3 168 107 -416 -3
5216 -3 -53 -51 313 -52 250 387 136 3 -76 -53 374 -11 -176 133 -225 370 284 -135 123 -48 353 331 -172
5239 -172 128 -169 -349 250 90 -200 241 -268 -102 133 -384 171 130 -233 -58 -2 43 12 -207 45 -286
5260 -286 27 328 -150 41 292 -376 115 147 -274 256 -70 -176 293 -481 33 0 -59 347 55 194 291
5281 291 97 118 303 -475 88 54 -112 243 -129 39 12 -24 64 269 196 278 -160 -63 293 -78 270 -110 -212
5304 -212 279 -256 124 135 -407 -76 342 -215 -48 -230 60 408 -98 140 57 -133 114 -96 -165 212 -341
5325 -341 -94 216 -410 298 -149 -315 299 94 -50 -50 138 36 -71 8 178 -80 -38 9 -257 200 -217 -17
5347 -17 333 -12 -165 290 219 -11 -17 -277 -2 18 -24 218 -166 109 -124 -192 332 62 -1 319 -32 -62 203
5370 203 -160 337 -62 -252 348 -112 -96 274 -95 113 114 -110 105 -5 -2 117 -209 44 -4 -384 83 -27
5392 -27 -65 83 -50 151 -112 -86 85 -305 -113 83 -80 -132 -107 -111 113 16 -185 -47 -313 38 222 -153 42
5415 42 -56 -92 -153 -177 -36 311 -110 -51 49 -316 173 76 41 24 -135 -76 162 -97 -97 -69 49 216 -58 -44 -64
5440 -64 245 -36 -13 254 -76 -76 34 184 -90 139 15 15 342 -122 -51 -87 -72 100 -50 -122 149 -3 176
5463 176 107 -304 52 45 -79 -23 144 -104 51 -209 -74 15 -121 -27 -149 -20 57 -197 -7 -181 49 51 -100
5486 -100 -222 79 -34 -158 -45 129 280 -328 -193 30 -60 91 -131 -47 112 -68 -124 8 -4 38 217 30
5508 30 21 10 -167 110 -43 71 -128 175 67 -5 121 174 257 117 -3 -56 373 -72 15 -68 48 -66 -146 -107
5532 -107 261 10 40 15 62 -14 94 -347 44 53 -184 -242 -156 -182 82 6 -240 17 -121 127 -4 -132 -76 69
5556 69 146 -41 160 -27 -124 -125 -34 108 48 137 -64 171 -88 274 33 0 200 -17 -18 17 105 45 70 133 -144
5581 -144 154 -240 -129 0 98 120 122 -54 30 58 161 170 -305 166 130 64 16 136 -271 -100 202 -10 63 209
5605 209 116 -143 62 -358 25 -48 -52 23 -165 100 -77 -127 167 -265 4 -126 87 -50 -208 -180 -116 -132 -5
5628 -5 -214 -136 10 -78 59 -324 -103 -128 -40 50 103 -52 -156 -61 -144 -35 -184 90 -80 -52 72 3 252 5
5652 5 -73 32 98 -120 -84 78 -319 42 161 -19 -38 191 257 -18 -41 10 93 9 -71 -66 -106 212 -283 177 0
5677 0 -39 61 -22 -15 -92 -133 32 -36 172 134 5 -215 -237 -246 -52 -96 -186 167 81 23 204 -342 -150 51 -334 -95
5703 -95 -173 -27 2 -228 -123 -132 -18 139 112 -199 -77 9 -82 35 102 238 3 -133 145 111 122 76 -240 -21
5727 -21 172 19 110 -9 49 146 -174 177 -111 -112 316 10 0 188 56 272 -27 -164 174 -243 116 -62
5749 -62 137 195 -161 -49 91 -51 119 190 -48 74 93 74 -20 -187 153 7 -67 -117 51 11 -53 85 64 43
5773 43 -144 -253 156 -243 90 -73 15 10 -68 -32 191 -266 71 -147 43 139 -165 93 200 -9 -47 -210 86
5796 86 247 52 29 68 -138 -177 54 -73 -107 -46 -54 214 -11 -162 357 87 -180 155 133 89 52 42 3 -18 78
5821 78 31 -222 -32 -66 22 -131 9 58 -7 -116 -138 -57 47 49 11 4 -109 178 -187 169 1 188 242 31 61
5846 61 45 -27 -359 -60 -251 -68 -302 430 34 -349 18 -10 101 -49 1 -192 -90 18 -20 90 -27 125
5868 125 29 -136 -323 281 57 -25 36 60 -106 -21 -196 117 366 -167 33 -163 -42 -135 114 45 187 -97
5890 -97 10 104 277 55 308 -196 25 58 -126 -191 -115 -121 -189 127 -269 -218 -81 98 77 154 -320 -81 180 160
5914 160 -144 -134 100 248 27 -78 -159 -250 36 169 -138 78 -66 -281 -185 -221 6 -4 -206 -334 249 -30
5936 -30 151 -59 70 -11 165 11 -111 -49 -231 -19 -222 10 19 206 32 -285 29 29 131 129 65 41 391 106
5960 106 -17 -33 -4 171 15 52 57 37 105 -100 135 -241 -166 100 -75 186 -4 30 13 20 -129 242 -77 51
5984 51 114 -93 56 -59 178 138 28 17 -216 -36 -51 157 -82 -138 -104 -48 -11 -8 183 -142 -128 -243 -143 -182
6008 -182 -123 14 -44 -62 -16 -234 -21 64 85 -42 -52 49 72 -99 158 -273 32 -84 141 84 -259 175 -15
6031 -15 162 -200 63 -163 -16 -4 -156 -152 -5 218 -12 171 141 50 -21 -48 94 157 128 24 20 19 8 50 -46 296
6057 296 90 80 -109 56 -283 -73 201 43 145 -105 40 -95 -266 -49 -122 -34 -36 36 -7 158 -69 -51 2
6080 2 69 282 27 123 -177 2 -248 -127 231 177 -108 117 34 -95 -7 225 75 169 -109 55 274 49 -45
6103 -45 72 -129 0 152 20 151 37 12 -14 159 -153 112 214 -244 -102 -23 80 -38 64 115 -16 92
6125 92 -302 39 -49 -193 91 70 -84 -57 7 -77 -196 -421 -49 234 95 -134 -54 244 3 5 111 191 -231
6148 -231 -85 -132 3 -42 -77 -23 63 -20 184 -125 -64 93 -177 -175 98 20 59 0 53 -75 -211 81 216 -23
6172 -23 -103 -95 195 335 41 -233 -5 -63 -15 -11 -58 260 211 -262 112 353 40 8 135 396 -184 168 127 72
6196 72 180 -68 -154 -115 96 -206 51 142 -97 245 9 287 -28 71 -39 -216 -165 42 111 -154 112 -169
6218 -169 -158 -389 -120 205 -108 157 -37 -181 -117 6 -66 129 74 107 66 14 63 -305 -250 78 4 16 118 -196
6242 -196 -69 40 -17 45 -27 -170 376 115 22 110 113 32 -21 -64 -6 -90 174 109 -103 60 180 340 -23 156
6266 156 476 166 78 192 145 -84 136 -13 -52 300 8 96 -299 130 156 -37 -198 228 -60 -14 -98 -85 185
6289 185 -252 -209 -52 -102 6 108 227 80 -124 -54 -90 -309 -307 -44 -154 -48 19 -24 -129 -196 -74 -192 -201 -141
6313 -141 141 331 206 -62 14 -199 38 19 215 177 -71 28 -26 124 -48 -123 80 -246 -38 109 -80 26
6335 26 -106 -18 117 11 -14 -30 -67 55 434 102 -150 144 164 -129 50 60 179 -43 62 -54 128 85 -59
6358 -59 91 99 147 -338 -170 -105 -130 4 93 -211 -5 -120 -15 -253 38 -160 6 -207 -125 130 -128 -131 -4
6381 -4 -174 -166 -309 63 98 -40 260 -36 92 103 -47 67 30 -71 180 -12 119 -92 -7 249 243 42 285
6404 285 31 239 -25 -226 118 -71 7 -38 62 -21 267 272 296 39 -52 173 -221 118 5 139 -78 -14 -13
6427 -13 -58 -44 164 -9 33 -61 -314 44 155 -174 -10 -81 -27 -96 33 -12 -87 -57 -180 -142 31 -216 43 -121
6451 -121 23 126 -123 88 61 26 177 26 300 183 -43 211 -153 -61 -151 -132 -319 18 -248 -92 230 102
6473 102 167 -30 255 -73 -54 -27 108 88 29 182 64 454 231 47 -107 135 -4 23 -15 85 137 15 232
6496 232 87 -164 -96 -86 114 -70 -20 -173 -162 19 -10 182 75 -25 -25 -99 -278 -17 -105 148 87 -15 -66 -25
6520 -25 8 -125 30 3 69 -61 -16 163 -101 89 -4 212 3 -119 39 91 -98 -101 4 -150 -9 -2 -187 -166
6544 -166 47 54 44 94 125 -126 3 -116 108 -79 -203 17 139 128 -351 44 34 122 36 -47 -56 -79 -101 302 -48
6569 -48 -105 -37 -18 286 146 90 82 -61 9 111 65 134 -83 181 152 120 122 -23 -158 67 -17 76 -116 -36 -81 13
6595 13 6 -35 -105 -30 -3 -112 208 84 -3 -67 23 -9 -203 62 176 -333 16 -51 70 -65 243 67 124 73 -47
6620 -47 61 76 -51 -177 320 -31 8 -52 40 367 116 110 27 -25 145 206 -39 116 7 90 -20 -5 -136 -262
6644 -262 -33 157 301 35 -54 -40 -2 37 -226 13 72 -136 172 10 -75 -155 -11 -200 -204 -54 -326 253 4
6667 4 44 193 -107 149 -138 121 151 -40 -46 -122 95 -183 -65 -162 -188 31 113 -47 -110 -57 -54 141 106 21 -37 103
6693 103 132 -16 141 -88 85 -75 -40 146 -88 117 -119 -61 87 85 307 -118 148 92 231 206 37 -17 -271
6716 -271 -37 150 -136 -116 -50 53 -58 -225 -200 147 -256 143 -56 -3 174 -3 41 -298 -46 -262 -133 -204
6738 -204 38 -12 -194 -153 -235 103 -70 -213 -22 24 -2 -84 4 -89 -122 -145 123 65 87 -116 -114 -29 -115 -63 33 95
6764 95 -75 80 -204 -73 -69 -320 -103 -18 93 250 -147 -81 -43 31 135 130 84 126 -143 78 308 -33 66 110
6788 110 -33 203 -81 -186 171 142 84 150 60 54 64 -125 -80 -139 -186 1 150 117 70 22 183 -15 -139 -92 73
6813 73 -129 105 78 67 -82 120 -137 -198 -156 -124 15 5 -140 -63 26 -222 -23 54 162 -263 89 -48 -121 -177
6837 -177 82 -97 82 74 -127 79 43 -204 285 -17 89 75 203 -37 -161 4 -149 -200 -136 280 184 100 150
6860 150 -63 -55 -228 -28 123 301 98 2 174 -95 47 47 97 38 -86 120 -154 -91 35 23 -53 -99 179 202
6884 202 -192 -50 258 -145 42 -182 -90 -167 60 76 84 -127 -71 -81 -135 -100 -109 19 -79 -35 270 -155 -81 19 -174
6909 -174 8 74 64 -36 -43 230 -39 -180 9 59 147 -283 117 -113 244 -40 100 -30 151 37 -66 68
6931 68 85 82 -277 -45 62 98 22 -73 102 -92 -99 27 -47 -281 -85 54 17 34 -164 214 59 -104 115 -142
6955 -142 -87 65 -63 -27 20 -259 -282 44 -214 -6 -24 -32 20 38 26 -25 38 6 -11 -249 -191 -152 -75 -92 11 -50
6981 -50 -216 107 -33 -275 -65 172 23 116 -10 -51 40 -55 351 -89 -249 212 148 -114 -11 -1 -102 16
7003 16 177 206 49 -112 53 -152 177 123 -63 96 23 -62 160 -94 -219 -110 49 14 132 264 -22 -149
7025 -149 5 96 -191 -216 -68 24 -129 -74 -239 78 -87 -45 -343 -92 136 -105 93 19 -62 -20 134 -108 187
7048 187 -152 52 -172 7 143 -194 -193 34 -190 -186 31 51 -323 199 -142 13 64 -239 184 -120 282 138
7070 138 -21 37 -74 -239 -8 -30 -153 196 48 103 94 183 265 186 167 -37 272 99 128 -50 22 37 -114 232
7094 232 -275 147 169 -168 59 107 -204 -2 -109 89 -256 -156 298 -115 61 128 -114 -125 -294 -193 211
7115 211 -286 20 -56 -282 0 295 -370 -39 3 -126 -23 -143 -72 -159 9 147 6 -66 -128 -1 265 71
7137 71 149 -16 121 96 -41 -121 100 20 -140 78 245 -180 -10 -79 36 -12 -67 53 132 171 117 112 -174 295
7161 295 -168 107 -30 85 -81 207 89 -132 -127 -114 163 -265 46 -89 -185 -130 -97 -80 30 74 -85 -133 99
7184 99 -4 -101 -224 118 -298 -32 -43 47 -99 -42 -28 -89 -84 -115 141 -90 62 57 -55 -106 -108 121 -83 -54 -73 -138
7210 -138 -208 -84 269 -97 84 23 -130 -61 116 -43 -72 14 -11 -109 88 75 -259 127 -56 164 208 124 241
7233 241 -15 17 78 -103 55 74 45 -107 275 -7 322 293 -165 -30 -53 79 103 251 -146 -144 -314 108 -235
7256 -235 -64 -33 -267 245 6 -118 15 -359 9 51 162 -41 189 -28 13 105 -161 88 -89 39 80 143
7278 143 102 303 -82 -46 -8 -77 62 -32 211 -121 328 262 13 24 298 -171 -31 200 -83 159 137 -24 -36
7301 -36 77 0 -63 59 -22 -42 151 -175 -27 -6 -16 -32 32 139 51 245 -64 -11 -89 254 118 -42 -80 -122 -74
7326 -74 -71 218 -17 -52 -11 94 160 162 -25 -67 171 -233 139 13 -244 -54 -60 97 58 -241 -76 9 -171 -19
7350 -19 -80 -264 -232 11 -172 -85 -54 85 181 -189 106 -91 -57 -193 18 -9 -31 323 -184 147 -90 154 -27
7373 -27 83 107 -83 288 -112 66 114 -72 111 -152 13 -63 182 49 -116 41 5 401 65 79 -166 -61
7395 -61 88 5 -22 89 -20 -243 9 69 -218 -258 17 -76 -141 -65 -34 -178 71 -269 -115 -47 -33 57 -117 -40
7419 -40 -194 -44 33 -117 -74 -237 -37 23 -239 -13 183 -265 -41 -128 -53 -228 -211 50 126 -8 13 28 221
7442 221 68 87 101 62 162 102 -114 -19 133 293 150 -3 60 -51 -88 96 -28 113 49 198 -71 182 -18
7465 -18 -153 -106 84 -118 -263 76 -104 93 -109 -112 72 92 -181 50 -34 -508 -131 12 -95 -4 84 -99 -45
7488 -45 2 70 23 277 -147 105 120 -190 -123 161 344 -3 -11 77 238 -121 -163 27 66 31 -192 -315 54 -41
7512 -41 100 -94 49 -3 77 122 49 32 127 106 -27 38 109 65 7 -70 -33 -7 -84 -91 216 72 131 314 47 144 -217
7539 -217 1 41 -101 114 6 -124 113 -34 68 -199 -184 41 74 157 -15 327 135 57 -82 -52 -23 -171
7561 -171 109 -43 -150 243 63 125 163 -32 -10 -98 -89 81 15 183 -131 -77 71 -108 157 117 90 -76 73
7584 73 -76 -52 -24 25 185 9 207 4 -84 53 155 83 -51 95 -199 69 135 285 23 -104 46 143 -27
7607 -27 71 -78 -73 120 -104 -183 -43 112 -64 33 -95 -40 -205 239 -209 -217 -97 -187 -65 -46 78 61 -310 -225
7631 -225 -6 -128 -133 -131 -152 82 133 92 -92 0 164 -174 -235 110 -133 41 96 -172 244 57 -20 -153 -84 -111
7655 -111 78 -4 128 37 -189 172 -43 -147 283 137 -17 140 12 167 21 -128 32 87 322 114 -88
7676 -88 84 145 -12 8 -266 350 30 61 20 55 -65 -100 -29 -120 -141 245 78 123 15 69 66 3 33 140 -17
7701 -17 218 2 -1 77 -201 -91 -89 -61 -81 -47 161 -29 -32 -68 -184 -92 -229 129 75 216 -36 -73 43 -66 114
7726 114 -201 -12 157 -346 -24 -116 37 238 42 101 192 -122 162 120 82 130 -2 93 60 -201 -48 224 161
7749 161 -133 122 -132 53 -42 126 98 14 -280 73 -21 123 69 -211 -195 -238 93 -80 109 -52 -216 -42
7771 -42 7 187 -46 42 132 -5 -204 46 177 114 -34 -130 -109 5 -53 -169 -86 59 40 -58 -277 -76 -74 -168 -111
7796 -111 -24 -280 99 -235 127 114 74 -295 -101 -43 44 132 -8 1 189 -41 28 55 39 338 198 161 -230 169
7820 169 -14 67 -22 40 -273 -121 -15 72 -62 -12 -162 -63 192 69 68 -290 -88 -322 -99 20 -32 -95 346
7843 346 36 42 182 -158 -149 -36 245 135 -165 16 284 -42 28 -9 187 39 29 -75 30 -96 -78 -162 126
7866 126 -202 61 -146 -156 64 -81 68 -37 -229 -152 58 29 7 165 80 184 132 -186 127 247 4 -219
7888 -219 -141 222 13 -224 -39 -73 -4 3 230 163 47 -38 -67 37 -86 1 32 20 -59 -23 -175 95 -128 -311
7912 -311 13 -170 133 166 200 -95 93 135 -224 0 -114 73 -39 -193 -133 49 75 -282 -27 -9 250 -71
7934 -71 134 -267 76 91 -102 141 44 217 43 -46 -169 -83 -46 293 -38 -65 -37 33 -25 -151 -159 49 -198 -60
7958 -60 -23 -124 -14 300 -66 -50 287 118 -104 -33 -188 -65 -34 -100 87 -7 45 -41 -139 -77 -66 -34 128 -6
7982 -6 -171 189 104 -125 250 -192 -176 201 -105 10 -89 273 48 -140 -142 4 -276 -73 263 -23 9 -88 -142
8005 -142 13 -205 -169 -1 -213 -128 -49 -225 -60 -324 -215 49 33 98 88 184 127 -52 -1 294 -122 93 81
8028 81 -33 -98 130 10 12 62 53 106 -159 -38 -3 86 111 -109 166 59 29 18 129 125 -32 169 212 127 208 -35
8054 -35 -73 -190 64 76 94 117 202 76 78 -157 24 -10 -86 35 -152 -69 -90 -67 27 -243 83 136 -184 -114 101
8079 101 -65 -114 9 19 -124 -2 67 -148 -138 -209 150 -252 75 -217 23 117 165 44 33 225 371 358 213
8102 213 12 -117 224 -87 159 -171 133 -149 -60 -26 108 -159 -155 131 257 -13 -317 -44 -187 255 -154
8123 -154 47 -309 -207 211 76 -16 25 152 -86 -55 103 -32 41 -183 -133 130 -27 -106 -121 102 100 -97 269
8146 269 -148 -107 178 -284 -144 104 204 10 -92 -132 87 -42 -145 88 -103 -253 184 -20 20 -33 61 -130
8168 -130 -158 91 -122 -60 -41 -64 -36 288 65 41 -185 -45 7 -14 66 294 189 -5 -85 5 367 -113 -100
8191a00
$$ Imaginary data points
##PAGE= N=2
##DATA TABLE= (X++(I..I)), XYDATA
0 0 0 0 0 0 0 0 -8 8 -8 16 -16 24 -24 40 -48 64 -80 94 -112 131 -160 188 -224 264 -308 359 -415 476 -548
29 -548 629 -722 821 -930 1051 -1183 1329 -1491 1669 -1863 2076 -2308 2558 -2834 3134 -3462
45 -3462 3823 -4218 4646 -5118 5634 -6202 6832 -7532 8313 -9191 10182 -11315 12619
58 12619 -14146 15953 -18136 20828 -24246 28730 -34882 43860 -58155 84290 -146655 569738
70 569738 434658 -863418 270820 -563237 451788 745367 -857226 74858 10732 -167460
80 -167460 919358 -733880 -290885 685105 -548621 458916 79351 -714793 603594
89 603594 -169088 -27577 468226 -744197 233585 319176 -429189 639848 -459697 -436822
99 -436822 731771 -302788 199664 34812 -757057 594162 178457 -249409 241798 -669888
109 -669888 284685 603090 -611182 218870 -166349 -229145 716744 -397849 -204436 269942
119 269942 -334325 431737 -34678 -487022 432626 -241800 67311 382679 -620798 179146
129 179146 206928 -219426 361273 -334598 -165560 436672 -254929 164895 22034 -422708
139 -422708 428837 -66933 -135932 288115 -377947 110406 224859 -260431 241614 -122086
149 -122086 -177643 360584 -208021 45637 126133 -311084 299663 -1704 -200633 222492
159 222492 -201626 56471 229472 -274399 81105 1489 -87512 309012 -231325 -105802
169 -105802 196951 -127680 173136 -37159 -231432 211093 -34218 -39590 121091 -209905
179 -209905 98699 62713 -165957 174398 -93087 -69743 137731 -126499 61080 39961
189 39961 -146187 132137 -20314 -79542 108389 -123725 56336 68458 -132136 82361
199 82361 -44822 -43087 121422 -78463 -23269 39845 -77421 107752 -1724 -97434 77632
210 77632 -45669 39084 45104 -92504 52811 12465 -42553 58168 -34838 -2454 51329
221 51329 -78716 52787 23135 -55734 51319 -18914 11172 20738 -41666 40842 25295 -42472
233 -42472 33013 -15076 -6341 49912 -46225 15141 5418 -22567 23988 -10475 4323 6279 -31574
246 -31574 14928 32006 -35450 12031 -3899 -4252 18120 -27902 14943 -792 -13867 -4360 -4101
259 -4101 2071 2505 -25067 -2067 21491 -29138 4109 -2921 5705 540 -19046 9758 954 2416
273 2416 -9969 -2155 -266 11211 -18794 -6438 18143 -12796 -842 -8545 17957 -6473 -9983
286 -9983 11303 7757 3168 -7980 9362 1739 15639 -11217 2290 11818 -1312 241 -7955
299 -7955 22779 -6392 -6555 1311 13487 3749 -4817 5801 -1398 15236 -9550 9518 5667 2615
313 2615 -4997 -9107 18815 110 -5741 -14392 11811 -1738 -5696 -1044 1067 5707 -22386 7969
327 7969 6766 3217 -11630 -6630 4376 747 464 -12656 8000 -12680 -3673 -8375 3434 11685
341 11685 -21818 -11215 581 13648 -6309 -1895 -5606 1749 -5977 -1519 23573 -13104 -5195
354 -5195 -10029 4362 13318 -2225 -8880 -2537 3816 -6537 8337 1101 17295 -16720 -11490 27097
368 27097 535 4866 150 1938 1856 318 -2532 20745 5453 -12309 -8803 -12543 45048 4447
382 4447 -27378 314 1099 11636 12790 306 -4696 -6731 -7931 31658 -6872 -9031 7649 -21932
396 -21932 17194 -1111 -15459 8038 2402 -8693 -5598 -14033 18013 12514 -27266 14021 -18964
409 -18964 -6043 26110 -4917 28 -21447 -22502 25233 20150 -18168 -13880 -29955 23703 23978
422 23978 -30680 10376 -12681 -7715 18105 -1222 3532 -2350 -18472 20298 10220 -19649 9160
435 9160 -15703 25409 13643 -45436 3673 24246 19834 -3944 -38493 -866 44031 5342
447 5342 2909 -20972 -20553 41233 10508 3818 -15124 -21065 23501 13745 -7580 2408 -9617 -3757
461 -3757 18279 -12450 10605 1459 -8876 6548 -5830 16674 -6582 -17590 15911 18544 -19952
474 -19952 -22825 -699 31515 15825 -45160 -22077 4434 42112 8328 -46777 -12896 8109
486 8109 20653 9909 -15967 -18767 794 58 22390 -5975 -22767 6230 -17860 23690 3717
499 3717 -30484 7862 5829 3733 558 -22859 8911 24487 -12002 17592 -34451 -13590 59659
512 59659 -7191 -5402 -23444 -21161 52112 14205 -25915 -324 -28007 28701 37680 -41507 29519
525 29519 -18378 -22436 53572 -10347 7801 -5865 -42946 52178 22676 -44318 15034 -28300
537 -28300 34771 39923 -87007 22641 23697 -3128 36102 -68141 -14389 68424 -18248 15943
549 15943 -25005 -63965 84888 -5398 -19811 18199 -78264 46534 36948 -51966 29349 -33719
561 -33719 -19172 65542 -54716 16720 26817 -75354 60295 -8175 -24499 46373 -67755
572 -67755 26797 50214 -73328 25002 -2221 -18731 81012 -81215 -22344 64473 -36928
583 -36928 58847 -31724 -67288 81349 -14279 2521 39724 -90819 42470 41747 -49117 62127
595 62127 -60982 -12696 81183 -62262 25533 12913 -54543 74349 -26235 -36285 74495
606 74495 -60969 25579 36478 -73254 62710 -21972 -25842 74983 -63410 -5007 37589
617 37589 -51490 66240 -15678 -71672 72863 -36259 11943 39989 -81670 42563 8326
628 8326 -37766 62802 -48774 -22656 57851 -55738 34690 2638 -65470 71937 -30209
639 -30209 -23542 44573 -54505 32066 20517 -61831 48820 -14814 -23668 61854 -57854 12220
651 12220 23501 -52731 61299 -12815 -42949 41968 -29389 17261 30078 -62589 39128 6464
663 6464 -32657 53294 -37601 3285 35467 -44587 32086 8681 -34472 37942 -17988 -4225
675 -4225 33809 -49424 29512 19579 -38599 31121 -18097 -1735 36537 -32325 6360 16138 -27335
688 -27335 32945 -9824 -17871 31266 -34396 13891 17945 -33928 16852 -1095 -11582 19340
700 19340 -23176 1256 22733 -28983 15562 -3276 -14911 25249 -21855 -903 15503 -19186
712 -19186 2371 3274 -11318 14542 -17174 -6967 22398 -20879 4583 1291 -7705 13754 -9644
725 -9644 -4545 12856 -5713 -1515 5979 -10392 13164 -5854 -6260 14940 -10364 1209 1834 987
739 987 6388 -2658 -5074 11429 226 -3755 9192 -3999 8574 -5157 -1021 10576 -1199
752 -1199 -956 -2679 2704 2721 2449 -6892 7433 84 -5447 4214 980 7284 -7844 -950 2935 2404
768 2404 -1049 -1337 432 -3620 462 -6491 7058 -835 -6200 -6065 -376 7820 -5636 -1248 -1682
783 -1682 754 -5641 1596 3641 -674 -3096 -10109 5294 873 1257 -6140 -3323 1256 -4389 511
798 511 3274 4088 -10434 -446 979 7795 3192 -7561 3275 -2274 3185 1344 3740 1118 -2322
813 -2322 -7548 5013 11298 -4913 2072 -6614 4533 4095 -734 8925 -386 -5181 -276 5793 4414
828 4414 8118 -12586 -100 7350 -4959 8388 -3503 313 -2056 -6990 6291 9177 -6539
841 -6539 -2310 -2145 -2961 14193 -9977 1955 4679 -13204 2216 734 3784 3411 -13624 -7253
855 -7253 9528 -5798 7270 -2726 -15156 9708 -8840 5737 10431 -13404 -3375 240 -143
868 -143 11179 -8980 -7246 12450 -15927 6411 5806 -8027 11160 -13247 -3940 14178 -3194
881 -3194 2722 2515 -11193 12203 -5334 -708 23857 -17771 -3497 3010 -2386 20345 -4943
894 -4943 -13932 7339 -4360 9002 11366 -16336 11778 -7444 -5912 26367 -11300 -2429 4534
907 4534 -7905 12494 -2464 -9647 16317 -11056 -1281 6888 -19149 21846 -101 -16078 10702
920 10702 -13490 3515 16865 -10360 203 -11727 -9810 32816 -10632 -12921 1989 -17977
932 -17977 24130 1509 -21121 8951 -7739 -71 12517 -17695 9044 1351 -17315 24139
944 24139 -13588 -6563 14939 -13907 13773 -3245 -22435 19586 2992 -4519 8321 -28538
956 -28538 13554 18845 -13673 15845 -23105 -6300 31676 -4967 3126 -6880 -22906 32976
968 32976 9587 -18345 7154 -20411 23312 14820 -31390 14582 -2325 -536 21871 -24581
980 -24581 -2251 21778 -14286 18160 -7844 -22602 25826 -9544 12736 3679 -38132 19225
992 19225 12338 -10640 15176 -25762 -9608 29264 -14172 12966 -11264 -25245 31007 -7315
1004 -7315 1194 5335 -34204 20016 20722 -28500 6076 -10395 2335 28212 -34477 652 6635
1017 6635 -8221 29401 -21614 -19651 24519 -9696 11457 12242 -37676 13409 7296 1485 19016
1030 19016 -37264 3995 21013 -11346 16366 -12498 -19543 32758 -6821 -6186 15000 -22676
1042 -22676 18853 4622 -10893 16586 -20803 6842 24491 -22449 1857 5691 -13703 27847
1054 27847 -8563 -17866 14068 -10683 19449 1767 -21701 12223 -6140 2495 23600 -25413
1066 -25413 -10013 18009 -7180 14990 -14546 -16292 20581 -5615 1951 -4272 -15404 19626
1078 19626 877 -19989 15126 -6821 -3893 13040 -15676 7006 -2553 -8600 12382 -6845
1090 -6845 -1651 3609 -15590 10023 11919 -18775 6417 -2825 -1862 13953 -8290 -831 -2344 446
1104 446 15076 -6060 -12980 12217 -840 2170 5538 -16184 9047 7803 -4078 -1147 -2918
1117 -2918 8036 3196 -8656 6323 5765 -8950 7939 -1489 -387 7530 -8314 417 4178 1696
1131 1696 -2099 -4274 1191 7245 -6215 -821 5108 -7390 5975 1884 -4356 -1182 8 2954
1145 2954 225 -3954 -3333 1336 -583 4030 -8188 -4075 6750 -2465 -2945 -683 982 -2890 -153
1160 -153 -172 2210 -2812 -3416 2479 -1613 2931 -3396 -2859 2386 1222 -3544 -551 3848 -1888 286
1176 286 -2462 4275 708 -780 2314 -31 1246 -461 1736 1810 3711 -5167 -1189 5325 1782 391
1192 391 -4339 3205 1065 574 1013 2908 -634 -1295 2477 0 4958 -2700 31 644 -246 435 -1017
1209 -1017 2678 -954 -2421 -3764 4758 894 -1796 -1818 -1654 3095 -3038 1294 445 -189 -3957 -1801
1225 -1801 1972 1190 -947 -6252 1615 -1486 -49 -868 -496 611 -4248 -306 608 3561 -2347 -1889
1241 -1889 -1929 1567 1118 -2590 3241 -1785 -1112 -2609 3475 2473 -1723 -1984 -768 3849 -1248 2320
1257 2320 -612 2381 -1334 -1181 4559 2094 1401 -4218 1396 2000 2880 -813 346 1406 -2618 2188
1273 2188 369 4618 -1349 -2615 378 2869 3274 -1484 339 -1183 1087 -3340 3683 1989 -4004
1288 -4004 -1531 -2439 3068 -329 -42 -2251 -1038 -1479 216 1608 428 880 -8472 1464 3935 -414
1304 -414 -1929 -3451 -402 -1677 -109 629 1903 -5330 -966 -1270 1018 6864 -5853 -2633 1179
1319 1179 1151 50 1327 1210 -548 -3847 -171 6633 -3304 2916 -1588 -4976 4429 1234 1943 2037
1335 2037 -2269 -3179 2860 3737 6881 -6284 -5183 8812 -2083 2485 2449 -3655 679 353 -747
1350 -747 4541 -182 -1638 465 -5203 8267 191 -5335 7158 -3809 -4377 3794 1043 1309 -984
1365 -984 -7510 3278 -1104 803 5606 -10604 390 1251 -3956 8010 -414 -9819 1334 1061
1379 1061 3507 1868 -10048 4949 -1094 -4131 6414 -5570 136 2983 -7897 1714 4934 -4795
1393 -4795 3864 -3500 -926 4909 -7135 8164 2789 -8231 3215 -1134 291 8630 -5100 -3671
1407 -3671 2380 -4170 9992 188 -5368 2685 -6058 8078 8081 -9178 -1058 4295 -259 6556 -5507
1422 -5507 -1460 7762 -5904 2851 -1366 -2026 7587 -4222 -3828 5542 -3729 559 5119 -4728 3476
1437 3476 -5730 -1746 10030 -3082 -1790 -3603 -5425 7422 3904 -6908 -1459 -5845 2634 8957
1451 8957 -6788 -2984 -4292 2087 8947 -5801 -7600 3457 3513 1438 -3333 -8174 7345 3350
1465 3350 -2937 -2573 -5939 5699 4420 -2520 -1692 -1922 -2240 6767 2884 -2856 -2381 -3236 7495 3390
1481 3390 -2186 -1993 -1999 2540 4937 115 -3944 331 -432 5099 1629 -3484 -2011 1729 7599 -30
1497 -30 -6045 -2878 8550 3984 -2996 -5770 -2478 8359 3545 -3527 -7213 -222 5225 4247 -3282
1512 -3282 -5737 -341 1450 7596 -3646 -7274 1520 3235 1480 -2545 -3966 -915 3607 -2561 85
1527 85 -3070 -1036 2800 -3970 3050 398 -5864 -207 5299 302 -2345 -5703 1015 8573 -3352
1542 -3352 -1770 -4558 774 8985 -2482 -5741 129 1377 3924 2805 -6557 515 1614 4045 4715
1557 4715 -8863 934 5322 926 1407 -2803 -2807 6589 238 -2683 2726 -3011 3877 -818 -1171 5671
1573 5671 -4307 -1098 5174 -349 -378 181 -3708 5885 -16 -4016 1100 -3490 5091 320 -6365 1572
1589 1572 318 -1395 3951 -3371 -3832 2474 -1204 5129 -3771 -5434 4532 -853 46 -118 -4584 1549
1605 1549 1891 -4886 2103 -971 -1091 1392 -5067 3807 718 -3690 2774 36 -2047 1897 -1308
1620 -1308 1301 2947 -5246 1669 -20 1139 2972 -4246 664 1777 -1666 2947 2929 -3721 1022
1635 1022 139 2416 3130 -4127 2051 206 -309 2348 -1017 239 2615 -3096 -1012 4055 -833 1390
1651 1390 -2768 265 3066 -2203 1643 929 -1782 -612 274 -513 2771 -2341 -2591 866 -1413 2163
1667 2163 -1812 -854 -68 -2566 157 2452 -432 -2341 -711 -1667 3100 -1555 -1063 18 -1764 42
1683 42 -1338 1409 877 -1561 -3152 1887 1225 185 634 -1987 1501 -1049 906 1780 882 -994 -1348
1700 -1348 724 1623 1979 -2140 703 -415 450 1474 915 1827 -1780 -410 1063 3544 252 -503
1716 -503 -100 442 1464 -910 2593 -144 -558 -1776 987 2499 154 -947 -1790 1518 -292 1244
1732 1244 -66 320 -761 -2596 1788 1222 618 -2836 -565 -503 305 -180 -581 443 -2892 -533 -776
1749 -776 2045 -300 -2571 -965 239 1267 -1049 1139 -1019 -837 -1539 893 1719 -920 -831 -2552
1765 -2552 1519 959 115 -761 732 54 -1689 2159 1557 1853 -2595 76 1332 889 1556 -374 89
1782 89 -762 1080 82 2746 282 -1789 -218 1193 3128 -1182 101 419 144 -87 1426 1318 -348
1799 -348 38 -2042 1647 624 173 -744 -906 693 -1734 288 1738 491 -3676 -295 533 1236 1083
1816 1083 -3210 -559 -1252 887 244 -706 -1186 -1873 -1221 1512 2092 -3693 -368 -52 705 226 -1446
1833 -1446 907 224 -357 -1256 390 198 1678 -2039 -1182 869 -1623 2424 1264 -845 -1957 -400
1849 -400 2685 3143 -1135 -2606 824 1053 4280 -1250 -1726 1213 -237 1669 958 -613 -1225 551
1865 551 613 2407 -1895 -1030 2698 105 1099 -2260 -439 3459 1357 -2524 -1283 -427 1403 2488
1881 2488 -2669 -1022 -2616 933 3979 -1202 -2569 -2143 989 3311 1065 -5075 -343 964 1185
1896 1185 161 -3986 464 247 141 385 -2032 -1818 1445 833 -247 -898 -3902 3022 2936 -854 -2798
1913 -2798 -2326 3482 2748 -1468 -2384 -156 -88 3944 -545 -2058 388 -1396 3337 1858 -1091 -2072
1929 -2072 174 3173 2529 -2331 -2125 2412 740 2634 -2096 -2484 2044 2462 867 -1753 -1847 -225
1945 -225 3450 1082 -835 -3653 442 5798 -521 -2388 -2238 1370 2127 897 -2510 -1555 908 166
1961 166 1260 -2144 -106 -1834 -953 2849 -58 -3410 -1266 2343 325 560 -3514 -740 2133 721
1977 721 -9 -4150 -312 1858 956 -990 -902 -2737 1042 3916 -1866 -1181 -2007 2587 2404 -1083 -1211
1994 -1211 -666 1355 1882 -110 -2293 2014 -1086 753 2604 -1801 -206 -270 2645 1962 -1657 -1942
2010 -1942 2250 1389 1515 -334 -3560 3314 889 -66 426 -1712 -353 1062 831 266 -1262 -2065 3416
2027 3416 -211 -805 -300 -2560 3572 697 -2468 -990 330 196 1160 -1877 -1382 -86 -1619 3241
2043 3241 -1447 -2681 325 -837 2024 891 -3343 -1126 2036 -363 905 -2545 -157 1701 -2303
2058 -2303 1638 -537 -2148 1514 610 -848 794 -2058 988 3028 -1921 239 -1670 1826 3345
2073 3345 -2081 -412 785 -174 1921 1280 -2193 1387 -1180 1150 2840 -2092 778 -695 675
2088 675 2664 -1290 -1098 2549 -744 -172 1356 -1244 2230 -1294 -690 1066 -1300 798 667 -1247
2104 -1247 220 -937 -1065 3472 -556 -1907 -526 -1083 2778 -674 -1701 -178 -976 -77 1033 -1214
2120 -1214 -116 -367 -2605 1863 -280 -321 167 -1358 720 -471 -168 1270 -178 -2111 827 -409
2136 -409 1343 1096 -2123 878 -417 -16 841 769 311 -525 -1531 1587 2511 -907 336 -1172 1313
2153 1313 1350 -252 948 -33 -25 -157 1162 873 1152 -1748 -152 1229 -578 1495 -453 -83 -902 -369
2171 -369 874 1098 -502 -1714 -58 -188 1592 -960 272 105 -1577 -337 330 1300 -1162 -1072 -1000
2188 -1000 1317 42 -295 -319 -1365 386 -1401 428 266 -350 -1641 -687 659 170 37 -1609 562
2205 562 -917 126 840 378 -110 -1436 535 545 1071 -801 -205 0 294 511 -190 1950 -817 -646
2223 -646 15 1168 835 34 -79 -339 809 79 1550 -68 388 -452 -642 2007 464 -360 -1086 778
2241 778 248 360 312 518 59 -1246 986 -212 1004 -489 -1210 416 -331 -2 -407 306 -783 -460
2259 -460 -1410 1114 520 -1669 -147 -1292 992 131 -144 -333 -502 -992 217 716 -725 -60 -2517
2276 -2517 1363 1074 -1301 -90 -644 227 -114 -269 290 964 -670 356 -344 -423 1828 -1326 761
2293 761 422 -1171 734 1574 269 -487 -1321 209 2523 -324 899 -632 -786 2169 301 587 275
2310 275 -1176 -164 1849 242 -77 -1525 188 2579 -1944 65 130 -138 1417 -1243 -1492 1388
2326 1388 855 -254 204 -2101 960 -216 55 1463 -3120 -1044 1408 452 49 -956 -2150 1182
2342 1182 534 -677 -34 -2456 1617 253 -791 953 -1613 -903 1961 26 -1423 -514 -479 2179
2358 2179 -534 -1840 155 -318 2391 15 -2312 438 1327 188 1111 -694 -899 1016 481 2434
2374 2434 -1509 -1805 1417 1209 1044 -320 -2043 744 3004 -398 -259 -1066 1026 2035 -472 573
2390 573 -1470 -625 1918 973 -1695 -831 -370 1195 1319 -1924 -759 -616 1960 712 -2192 -271 280
2407 280 74 641 -165 -2087 -68 416 876 -1016 -2490 237 55 1393 -940 -2452 89 2061 640
2424 640 -1300 -835 -611 1250 528 297 -1689 -1285 1729 974 224 -1521 -712 1078 1530 -660 -1341 -333
2442 -333 1755 1246 -1879 489 185 854 1173 -383 -369 -548 937 1498 135 -1438 170 258 1867 822
2460 822 -2663 580 477 1524 416 -1219 -14 125 498 1251 -333 -1633 1349 -323 618 -428
2476 -428 -1972 781 275 202 -1023 -1366 492 1369 -1209 -686 -821 -716 2272 -603 -839 -1230 -457 1921
2494 1921 216 -1651 -858 -83 772 1484 -2064 229 636 -613 618 -819 737 360 -1000 163
2510 163 1132 -669 157 -476 109 1793 -1815 -300 1158 1126 669 -1611 -293 1900 808 72 -342
2527 -342 -1472 1798 1391 -516 117 -1437 1473 1230 -400 -570 98 331 772 -850 -625 1536 -891
2544 -891 154 -371 165 1231 -1204 -218 476 -250 -896 -144 -482 775 -1156 -1652 841 351 701 -1474
2562 -1474 -1263 512 591 -136 -292 -1055 -514 629 -883 238 -1064 -675 739 -471 170 -344 -12 191
2580 191 7 -827 888 680 -48 111 -604 786 140 167 319 -511 -229 355 859 481 173 -918 768
2599 768 699 465 140 -357 748 -192 186 1080 764 -707 -394 129 586 513 -804 110 -328 -13 -233 148
2619 148 887 -416 -816 -366 946 -52 4 -673 -89 22 -162 451 -825 -582 -803 47 190 -7 -658
2638 -658 -535 27 -459 281 -75 392 -1115 -652 308 433 216 -688 -241 -205 677 -182 48 119 -298 -226 -392
2659 -392 1120 54 -268 -66 551 559 166 519 -153 216 -358 937 108 457 -58 -587 501 190 429
2678 429 -240 516 -100 -218 471 556 408 -522 -80 72 853 -122 -457 192 -160 -65 -260 625 -331 -215 -892
2699 -892 557 361 -334 118 -629 128 -594 75 122 -78 -725 -697 107 118 -153 -898 286 -310 -314 159 -267
2720 -267 503 -778 -421 182 578 99 -423 -302 -314 297 -399 1102 -387 -370 -152 -39 539 109 -269 -40
2740 -40 479 -238 622 -212 514 211 -912 1264 176 288 282 -18 229 420 108 365 514 -743 685
2759 685 -237 742 471 -1232 629 285 -177 -36 97 -468 163 -778 428 282 -1135 479 -1080 142
2777 142 439 -1026 412 313 -942 -162 20 -268 793 -1312 154 435 -1018 1317 -478 -702 364
2794 364 -380 135 863 -1221 -1 230 -351 1187 -1509 363 1138 -1051 414 118 -728 965 -466
2811 -466 -742 1525 -1030 543 517 -852 1777 -1045 -259 1905 -291 -115 526 -944 1814 12 -1404
2828 -1404 1328 -1123 909 896 -1438 889 -17 -576 1738 -1089 -645 1642 -1048 845 -269 -1243
2844 -1243 1905 -1029 -526 887 -1370 516 371 -1679 1201 -705 -1521 1473 -1358 745 -312 -1980
2860 -1980 1636 -219 -1231 889 -1418 351 1424 -2347 971 -169 -779 2062 -1852 -174 794
2875 794 -1225 1135 -16 -1709 1530 -347 210 1482 -2303 1313 816 -1223 1381 -728 -307 1757
2891 1757 -1086 633 888 -1633 2332 -299 -900 1790 -1554 1358 814 -1757 1091 608 -360 1109
2907 1109 -1413 131 1848 -1840 1427 -224 -906 1615 -1577 378 1679 -1521 -61 495 -704
2922 -704 1508 -1618 -802 1713 -1448 941 -473 -975 1780 -621 -1317 654 -294 898 249 -2399
2938 -2399 1230 -224 105 994 -2266 300 941 -657 222 -261 -545 1460 -1346 -37 1283 -873
2954 -873 1139 -1170 -512 1886 -475 -570 733 -167 364 128 -675 1745 -472 -490 472 -523 1927 -361
2972 -361 -1133 701 652 154 705 -844 289 481 -593 1185 -647 262 622 -826 419 325 -406 118
2990 118 -295 -930 861 -483 366 -270 -840 723 -606 -112 418 -405 -607 -229 -149 939 -83 -1370
3008 -1370 -78 -281 737 -414 -1211 482 -41 -315 -29 14 241 278 -1036 530 220 -258 461 -1023
3026 -1023 439 -194 -204 582 -82 1 -84 231 334 421 -665 334 -301 326 967 46 371 -375 -45 492
3046 492 233 -147 12 -292 236 167 -487 720 -146 -142 53 -147 805 -95 -367 79 37 -237 332 -490 170
3067 170 -459 -716 536 54 147 -296 -517 55 210 -312 33 -96 -752 180 -487 268 -120 -729 -4 -138
3087 -138 95 -6 -514 -435 205 -572 383 209 -516 -195 -500 504 35 62 118 47 -392 331 277 132 -31
3108 -31 -780 405 351 90 381 -405 681 241 127 534 777 -285 -166 224 228 876 -518 398 -150 373
3128 373 187 -132 566 45 -272 -151 814 -56 92 -575 -27 201 -662 265 -141 -42 -602 -27 -13 -19 -230
3149 -230 -513 275 -420 93 -136 316 -137 -602 162 146 121 -620 133 -380 216 -188 -349 176 -301 433 -229
3170 -229 457 9 46 -204 50 214 -135 136 -21 131 -331 315 264 -8 11 -156 411 373 77 -246 453
3191 453 180 -59 318 114 758 -194 213 485 224 168 45 346 -179 32 -430 274 31 96 -104 -33 369
3212 369 -276 -6 -135 167 -361 -59 78 -47 -324 -719 246 -217 168 -503 -110 19 -308 -40 -447 165
3232 165 -207 163 -290 71 -295 -490 318 -256 -71 -205 103 -134 49 -515 -154 286 -117 231 -352 104
3252 104 -95 -312 455 243 -49 -121 402 210 286 -443 209 391 16 274 -441 455 161 -86 101 330 -135
3273 -135 159 483 -68 -70 -445 484 251 108 -269 -441 666 418 37 -555 59 51 138 -139 -334 2 -327
3294 -327 709 -547 -347 -443 102 -82 -28 -438 -287 424 -258 -95 -654 -76 30 -502 97 -168 -549 -338
3314 -338 332 290 146 -704 -230 555 172 -50 -1049 391 890 -271 -301 -76 320 402 -18 -606 115 256
3334 256 951 -83 -619 712 16 554 241 -569 -210 557 390 203 -214 -447 260 -344 729 -39 -527
3353 -527 152 -293 611 381 -392 37 297 -168 30 -736 147 1062 -710 170 -427 -163 625 -439 -373 1
3373 1 -419 344 815 -782 149 -814 27 990 -1155 -302 -105 28 624 -370 -352 664 -344 104 221 -929
3393 -929 1001 -454 -112 584 -392 450 602 -710 -25 434 -382 1173 -582 -44 659 -867 735 238
3411 238 74 1078 -414 -417 1084 -59 393 -95 -751 1856 -316 -362 161 -626 981 91 -763 932
3429 932 305 -407 844 -1002 949 475 -1035 888 -689 -39 925 -674 92 560 -822 573 -49
3446 -49 -851 838 -1170 -221 381 -873 839 -464 -1123 676 216 -458 227 -1582 700 225 -1105
3463 -1105 1095 -827 112 547 -1255 688 498 -871 692 -437 -513 1061 -855 686 258 -1231
3479 -1231 1201 -224 28 857 -632 -85 731 -757 1188 167 -495 1124 -516 1035 952 -1057 452
3496 452 245 -304 937 -520 -315 1008 -904 528 276 -442 972 -927 -234 741 -682 202 363
3513 363 -652 410 -356 -559 997 -1108 -110 242 -421 822 -495 -656 343 -512 -179 644 -802 252
3531 252 -618 -126 833 -640 -170 348 -447 166 343 -478 484 -488 -537 585 -157 688 -127 -467 650
3550 650 -272 48 490 5 -36 153 -184 1108 151 -442 15 -359 459 36 87 341 51 -537 496 9
3570 9 153 458 -505 352 106 2 285 -234 148 -247 -311 365 62 -679 228 -72 -44 274 -349 152 -373
3591 -373 -42 51 202 -98 -217 -214 -103 296 -471 142 -329 -125 -144 -246 255 -184 -180 -76 239 -155 220 -283
3613 -283 -77 185 -315 156 -153 348 -98 151 -52 71 -140 -471 302 -257 469 -8 115 313 -289 31
3633 31 238 445 -295 438 -45 170 47 145 268 -463 136 -110 320 112 153 -28 246 274 70 155 -278 479
3655 479 -237 -141 281 -31 58 -376 70 -124 291 -282 42 10 -232 156 -339 446 -314 -136 -33 224 35
3676 35 -228 1 -244 -46 -641 128 35 -65 -129 -25 200 -266 -149 163 261 -383 145 -102 -116 538 -364 32
3698 32 -73 146 82 -73 400 -2 -188 141 134 -77 443 -166 143 427 -510 285 229 -55 -143 213 224 353
3720 353 -286 -49 320 -363 116 -141 93 279 -118 -120 -109 133 145 -1 -418 532 -216 -216 381 -466 -275 -88
3742 -88 -185 146 -189 -202 319 -151 -222 374 -210 448 -469 -350 244 -370 -222 -199 -258 -165 -171 -285 507 -519 -308
3765 -308 336 -280 409 -97 -224 393 1 -290 779 15 150 -44 -501 737 -182 -412 304 -47 166
3784 166 36 -121 479 604 -219 172 -124 446 507 -746 445 151 -131 406 152 -173 52 -54 149 300
3804 300 -568 360 -170 129 359 -488 59 -5 -803 -102 198 -647 135 -125 -187 412 -570 195 28 -157 -83
3825 -83 -328 -111 804 -417 -639 328 -471 917 -140 -373 130 -330 66 101 -410 221 175 -487 676 -14
3845 -14 -236 515 -396 384 -89 188 776 -326 -296 520 -208 222 684 -640 694 -260 -237 799 -387
3864 -387 103 69 -203 725 323 -683 446 -86 191 549 -749 535 -11 -608 535 -95 -32 233 -726
3883 -726 111 183 -827 816 -638 -372 254 -738 652 43 -381 156 -221 -364 599 -483 43 273 -1079
3902 -1079 633 164 51 182 -948 195 381 -680 17 87 -370 689 -643 155 64 -894 606 -335
3920 -335 -82 274 -158 -23 566 -734 499 616 -323 589 -583 314 897 -347 580 134 -422 617
3938 617 145 -155 685 -453 285 397 -440 504 -345 30 474 -592 -144 722 -441 162 -177 -451 617
3957 617 -640 167 126 -783 388 -133 -142 530 -691 -342 435 -590 334 -250 -540 725 -414 -34 318
3976 318 -708 379 -160 -692 513 -75 -331 350 -780 357 205 -443 456 -450 -317 741 -318 136
3994 136 380 -402 539 40 -296 668 -444 345 3 -353 604 -9 -442 394 58 -154 346 -473 526 124
4014 124 -244 596 -327 300 101 -358 309 430 -364 353 43 -107 474 -496 323 -127 -340 297 -251 -146
4034 -146 22 -291 -31 15 -455 463 -57 35 153 -605 208 193 -377 30 -137 -524 5 -229 -115 -19 -913
4055 -913 153 -99 -146 -98 -240 281 55 -441 -427 213 -222 338 -188 -86 432 -218 270 35 -239 158 133
4076 133 32 60 -96 11 507 -193 477 -341 182 259 -317 254 221 180 111 297 -212 394 -505 -126 159 -68
4098 -68 332 -34 85 158 117 -77 139 234 -227 45 -389 421 -357 -176 23 -356 59 63 4 81 -26 -512 182
4121 182 -22 -136 80 -147 426 -182 -73 88 -100 -45 104 -223 63 239 -294 225 -245 66 174 -279
4141 -279 579 50 -153 273 153 56 450 98 -65 461 -186 529 -85 183 47 -166 265 -74 -337 281
4161 281 413 -185 424 -400 446 451 -296 411 -424 -12 266 -185 168 402 -494 43 101 -197 534 -456 203
4182 203 184 -716 112 -121 -290 -1 -356 -27 297 -566 27 27 -588 260 -547 -122 191 -642 292 111 -542
4203 -542 255 -426 -347 684 -692 345 108 -781 547 -164 -280 584 -344 114 371 -488 615 -199 -635
4222 -635 946 -687 194 349 -580 658 64 -356 929 -304 2 949 -707 621 162 -637 1250
4239 1250 -741 -449 617 -447 523 316 -1045 874 -409 -161 947 -1114 193 279 -706 593 -393
4256 -393 -566 704 -478 -65 700 -1079 853 -235 -663 1057 -862 215 463 -864 504 -123 -688
4273 -688 907 -471 -117 622 -1042 995 -11 -856 877 -432 -317 643 -988 441 120 -866 966
4290 966 -114 -268 942 -1019 452 404 -832 909 225 -487 1022 -769 367 1026 -999 766 -285
4307 -285 -566 1060 -535 183 478 -974 673 469 -484 713 -963 61 837 -915 645 299 -482
4324 -482 697 -422 54 753 -822 399 34 -1054 639 -559 -323 799 -1071 200 101 -458 513
4341 513 -354 -991 860 -795 25 474 -1241 836 -364 -302 277 -899 -140 507 -474 243 200 -717 624
4360 624 -918 -124 544 -796 210 6 -162 827 -78 -305 719 -396 379 183 -288 1001 -582 -203
4378 -203 564 -234 430 326 -608 514 336 -379 646 -383 -1 264 -499 461 -275 -416 305 -300 -92
4397 -92 266 -450 65 293 -520 814 59 -220 254 -488 305 79 -328 308 134 -355 170 -596 237 -18
4417 -18 -795 291 -136 -32 255 -381 -296 -90 -380 251 71 -270 209 -291 532 35 -305 247 -142 -111 107
4438 107 26 -125 327 -140 -46 178 99 421 -136 105 113 -128 290 -17 -170 110 -19 13 206 59 160 48
4460 48 -321 507 -75 205 23 -314 -146 546 -149 -102 8 -321 120 -149 -60 -39 -51 -129 24 -217 226 200
4482 200 -239 50 -155 -4 -103 -72 -259 28 -55 -239 128 -168 380 -2 -76 48 4 156 -87 -228 -56 -98
4504 -98 -89 -121 -103 -21 46 36 23 -47 133 36 -75 49 -24 213 -393 160 -62 92 213 -2 66 47 265 -41 40
4529 40 -107 190 307 133 -85 -9 438 -72 -28 34 76 204 -235 -182 98 161 -168 112 -81 61 17 -4 -101
4552 -101 120 366 -356 113 -210 -167 117 -217 41 -283 -28 -226 17 -239 -160 41 -293 116 -61 -17 -200
4573 -200 67 -270 -25 49 -20 -176 6 188 -317 237 108 98 83 -101 226 -314 -107 13 -38 -36 49 -167 -49
4596 -49 277 -113 150 49 197 74 7 4 59 81 90 238 -330 278 40 -453 195 -17 -39 124 90 27 144 -224
4620 -224 52 -1 76 12 -63 -51 -35 -137 193 296 -79 -25 -254 -255 54 -449 141 -79 -145 257 -151 -143 108 -377
4644 -377 -31 107 -337 44 -28 71 238 -277 256 -16 -260 104 -301 -154 291 -136 247 335 -577 244 -99
4665 -99 14 318 -70 265 4 -119 179 202 -235 263 -178 288 494 -469 339 7 -373 121 -131 284 475
4686 475 -71 -181 192 -386 369 -505 -162 321 -225 442 49 -177 290 -89 -209 440 -636 -79 123 -333
4706 -333 231 -254 -586 353 -577 -59 147 -374 350 -217 -555 556 -517 -417 463 -522 419 101 -368
4725 -368 377 -205 -186 167 -415 420 262 -273 458 -370 -19 450 -463 74 150 -469 396 16 -194 834
4745 834 -532 20 438 -701 483 -45 -177 687 -455 86 562 -490 402 116 -684 823 -245 -111
4763 -111 427 -656 365 88 -293 601 -279 -515 537 -624 319 198 -747 486 -424 -304 304 -635
4781 -635 291 196 -691 344 -173 -575 663 -905 -106 346 -725 572 -159 -667 564 -509 121 534
4799 534 -676 230 82 -403 602 -342 -120 506 -523 309 -28 -455 943 44 -181 754 -589 302
4817 302 238 -596 852 -153 -119 677 -396 -2 353 -501 676 -59 -273 763 -288 274 520 -874
4835 -874 516 176 -248 779 -314 -206 873 -686 585 72 -437 643 -184 -213 334 -700 212 18
4853 18 -546 472 -235 -392 479 -516 436 206 -600 514 -157 -663 222 -535 -184 351 -877 310 -400
4872 -400 -399 708 -169 28 78 -454 484 99 -692 347 -254 -125 480 -402 330 137 -193 613 -589 -98
4892 -98 362 -290 144 186 -366 352 -89 -192 352 -565 273 279 -356 199 -103 23 349 -274 125 42 -487 312
4914 312 161 -339 185 -319 -1 358 -216 -61 82 -241 100 -235 -187 339 -610 53 41 -163 167 -64 -79
4935 -79 18 -275 -86 130 -418 -113 -284 -87 282 -162 -214 -79 -231 40 42 16 313 -354 -59 203 -174 270
4957 270 54 -166 296 -223 -72 76 -77 38 -36 -57 205 17 -93 393 -55 217 270 -70 162 -107 -60
4978 -60 253 -167 -56 -10 28 280 36 -52 52 76 62 243 105 22 -51 -8 311 -321 -160 -16 -273 28 -250
5001 -250 109 -109 -1 175 55 -193 37 7 -385 98 -138 151 -142 44 10 110 -183 30 182 -85 37
5022 37 -103 38 -49 -102 130 67 22 31 -281 141 113 -247 162 112 -189 56 -354 -39 25 141 150 73 -21 47 39 -61
5048 -61 -31 4 282 -142 119 138 -128 24 200 203 261 166 331 -11 147 117 -27 82 346 -62 191 134 172 -50
5072 -50 45 106 -238 -132 -37 138 49 -92 69 -205 -280 -141 252 -25 111 13 -67 -157 -70 -44 -384 1 195 123
5096 123 142 -92 48 -22 -76 -62 -63 -238 201 -12 -125 335 -29 -234 -93 -308 158 249 17 74 3 -158 199
5119 199 -362 62 147 -157 195 11 159 9 27 57 204 -249 131 -130 166 405 -155 -72 -31 -80 -154 -33
5141 -33 -212 121 66 -75 284 -339 69 101 81 154 -97 -122 82 -67 -131 -169 -233 94 -70 -261 -14 -363 -1
5164 -1 -104 -161 149 -233 -111 120 -282 -163 -41 -95 101 86 -393 383 -156 -288 -34 -141 298 46 27 -27
5186 -27 -93 26 403 -236 201 262 -217 353 -87 117 -70 -179 104 363 -81 313 134 -85 248 -267 195
5207 195 52 -53 370 121 -87 161 -169 149 184 -221 62 44 -496 196 -145 -19 194 -284 1 136 -297
5228 -297 215 -201 35 310 -287 81 118 -198 99 -85 -292 189 -293 41 303 -470 341 15 -81 112 -140
5249 -140 132 67 -70 14 25 -67 348 -140 -44 153 -174 455 12 -68 84 -280 201 -77 -145 123 -14 -289
5271 -289 540 -263 -91 477 -166 85 -98 23 209 244 -151 105 -155 48 424 -255 281 -269 -195 352 -191
5292 -191 13 365 -120 105 -17 72 145 -389 -23 311 -288 14 -277 -264 67 -182 44 143 -218 -172 -14 -269
5314 -269 -117 -326 -294 -35 -298 104 -17 -418 204 -21 -322 214 -84 136 110 -207 187 -27 -256 195 93
5335 93 105 417 -76 -36 195 -29 148 -51 66 227 -318 300 88 54 320 68 -112 196 211 108 96 -140
5357 -140 211 117 -136 524 -86 163 232 -361 217 84 -262 387 -183 -59 296 -149 453 57 8 -15 52 64
5379 64 186 -143 199 -104 -348 -28 -165 105 -160 -295 92 208 -31 -50 91 -23 69 -280 -94 157 -21
5400 -21 182 171 -123 -47 -136 278 20 -107 261 13 -139 130 95 2 18 82 20 113 -143 74 341 225 180 -75
5424 -75 -225 113 9 143 103 39 67 151 -60 149 125 82 -259 -417 -132 66 213 -84 -168 123 -125 15 23
5447 23 -195 -186 -71 -130 -209 -26 -230 202 -91 -61 29 -247 -12 -176 -203 -178 6 -5 60 44 68 48 -248 -75 -168
5472 -168 -217 -178 -42 -87 44 2 46 8 -69 -87 -65 256 -35 117 34 452 55 -289 318 -159 104 -154 237
5495 237 134 40 103 -265 -248 229 31 103 90 198 245 87 -124 -134 -31 136 -82 172 -90 8 65 163 159 -120
5519 -120 9 -478 -4 -59 -72 173 -229 70 -61 -24 36 -42 -104 -263 -42 -7 -62 -279 4 -50 -71 51 -161
5542 -161 129 10 123 -78 -97 107 201 -210 -74 106 -135 250 -105 169 137 -120 -193 80 -51 -63 160 -42
5564 -42 82 -83 105 73 65 263 131 297 246 99 -81 332 78 4 -186 81 368 21 43 175 17 23 148
5587 148 -210 93 -175 72 88 -128 -40 196 -32 370 140 147 220 -178 81 49 -191 -128 32 -338 243 -163
5609 -163 -272 106 -7 -170 -7 -211 153 167 -100 103 -59 45 -75 -168 -179 101 68 -88 -174 -65 176 59
5631 59 -18 -147 56 23 -105 -20 285 151 -209 140 -113 -33 86 222 39 -265 -54 -214 84 119 62 144 177
5654 177 25 82 185 -240 133 56 -67 31 -7 115 112 -194 390 -21 -27 -136 118 -60 114 -48 -164 -187 -220
5677 -220 293 -101 12 -35 -45 15 -191 -47 -53 -78 -180 -243 -279 -380 -62 -55 150 14 23 307 -313 159 -86 89
5701 89 61 -204 -49 88 122 -124 -15 86 196 -107 66 32 223 -36 271 37 184 273 -49 -116 215 81
5723 81 45 -212 -83 -163 -54 63 239 -87 201 176 -108 61 20 119 -27 136 109 -59 -68 185 -164 -358 126
5746 126 3 270 -347 -25 86 148 175 -139 -29 4 -12 -326 -212 -181 -142 41 226 118 38 155 -73 23 -141
5769 -141 -158 -286 -11 110 77 275 -141 -36 53 67 -28 38 -168 171 132 28 -25 119 162 -134 -264 336 -180
5792 -180 184 -37 202 86 227 129 41 73 101 59 -121 76 -105 -16 8 6 81 204 -29 -103 38 -281 46 320
5816 320 60 -65 -133 -111 87 -201 157 65 -305 -144 243 -218 -395 -213 -64 21 -154 -72 -179 -78 -185 -54
5838 -54 -52 -121 -183 16 153 -166 132 -83 -203 -95 -15 -82 83 172 11 140 52 -41 -41 -17 -43 -26 -4 301 -55
5863 -55 236 12 -87 93 73 257 21 83 172 72 64 122 -109 138 -212 -107 262 -24 55 -144 52 112 -100
5886 -100 -72 -7 372 -245 -69 11 -58 155 142 28 43 -42 1 -153 -211 68 78 6 -108 -194 -70 164 -36 17
5910 17 35 -122 -56 -42 -204 -81 -117 -7 16 -74 305 -125 86 173 -49 -47 41 -185 17 -90 -323 132 47 137
5934 137 -9 45 92 -117 65 -151 -7 334 98 -110 44 -148 157 18 219 123 98 28 123 170 177 -60 53
5957 53 34 117 110 -26 -117 -74 34 -96 -13 101 -187 76 63 117 107 430 -15 -42 -193 -44 -164 150 -16 -163
5981 -163 -85 -193 -90 -226 65 -200 36 -155 -146 85 -238 101 55 11 -13 -81 -64 7 136 -192 -99 -182 -254 49
6005 49 -68 69 -136 -122 167 -116 198 27 145 110 253 -105 69 -60 -165 112 -30 78 -110 -93 120
6026 120 294 75 128 -184 -226 -160 -14 182 -138 39 -159 31 -79 -114 133 182 -93 -241 -139 -279 67 -31
6048 -31 16 -144 -143 57 54 -65 104 -130 -50 -375 -79 -152 -198 -75 170 -29 134 218 238 -63 29 26 -122 113 14
6073 14 64 11 -212 -68 -30 131 -226 -184 26 -45 -11 -131 -3 151 -90 -58 -26 78 234 87 -82 287 -78
6096 -78 -149 101 279 50 46 169 84 -107 30 110 -84 339 -136 -44 -253 102 1 90 184 53 -187 -15 354
6119 354 148 164 -39 100 44 27 -272 -171 5 -44 -100 12 -157 -129 -62 -39 -103 -132 -21 -139 120 232 -132
6142 -132 -218 -120 -274 120 21 -192 261 34 46 84 -110 149 -76 212 -50 -94 -224 -74 -170 285 83 -144
6164 -144 -57 -2 91 227 -139 -42 -80 62 -40 236 -227 210 0 222 93 295 -83 21 -76 64 188 -19
6186 -19 -50 -53 -90 -58 -61 192 -24 135 -163 -3 42 99 -42 -112 -33 101 -63 -455 47 67 -188 183 -82 -5 -24
6211 -24 -557 164 -123 -9 263 20 -1 48 -183 50 88 -236 33 164 131 59 146 307 -145 337 174 -1
6233 -1 119 -36 -99 32 -273 -3 311 259 102 147 61 -56 147 -113 207 -28 -152 478 -65 221 20 34
6255 34 -3 166 -69 -67 -122 132 -16 -108 273 -47 28 -22 -41 16 185 7 41 37 -211 -27 -92 104 -271 -37 -87
6280 -87 -66 -118 275 110 -102 212 -54 53 -87 -211 137 -12 37 116 17 -27 -113 224 -172 -123 -192 -58 95
6303 95 -9 -40 106 154 -115 81 211 -253 134 199 -167 216 127 43 140 232 -181 -24 247 26 -145 181 231
6326 231 -6 -161 -267 106 -7 -128 -36 84 -159 -127 -91 -149 100 112 -46 -167 -61 -53 20 -4 -24 -218 -91
6349 -91 -174 -108 -72 126 283 -56 -133 -192 -87 90 2 64 -75 -78 50 91 -45 33 -122 -97 -55 -54 159 62 27 11
6375 11 121 121 134 120 194 -68 36 17 -8 115 102 10 -274 10 62 111 261 155 151 139 -185 231 196 335 -31
6400 -31 -38 38 161 96 111 55 -90 -30 113 213 56 -89 84 88 190 -88 18 -330 -72 -60 -38 -304 -3 -202
6424 -202 -108 -30 -95 66 -122 -72 -289 28 -23 -34 -123 -111 -73 -18 69 -64 -34 -99 95 175 1 -74 124 92 143 -11
6450 -11 -148 -137 64 179 -96 97 56 62 89 224 42 139 -55 15 229 -120 -52 214 133 133 -155 -67 34 120 -10
6475 -10 268 50 164 168 -150 1 -74 68 -24 147 -58 94 -97 -86 -196 -58 -78 -142 -50 -154 101 -34 133
6498 133 -59 -6 8 164 -173 -105 -273 47 -25 -40 25 -10 22 -131 -12 187 -198 -35 -92 -207 134 364 -190
6521 -190 -136 -21 70 125 134 -30 180 6 67 0 66 120 40 87 18 230 59 -23 -179 76 -53 -4 -152 69 -10
6546 -10 161 -135 -52 133 108 16 -18 65 14 -96 -16 -39 -72 162 200 -399 -48 67 -32 52 -292 25 -115 58
6570 58 142 -192 -93 -114 -43 -102 -97 -33 -129 -104 -4 110 157 -133 46 -234 -239 -69 -47 69 -116 -13 -89 -191 104
6595 104 -137 44 52 -82 75 276 32 274 54 -109 -133 -80 4 253 165 13 -198 -55 151 134 54 124 3
6618 3 29 303 -28 -197 72 144 57 -61 10 15 -20 -37 6 103 -94 -208 -25 68 37 -214 -72 -112 90 -60 -52 -126
6644 -126 -358 172 -18 -144 108 -100 -21 67 78 -124 -160 -136 20 34 105 -92 -195 -1 -75 13 -121 13 -153
6667 -153 -68 50 126 -17 -99 205 202 -132 -74 -108 252 212 -76 74 75 -110 7 41 124 45 -194 112 -180 -188 96
6692 96 103 85 -39 -60 -113 408 -42 25 348 -61 63 239 -147 58 5 65 -107 195 100 -44 25 4 -105 342
6716 342 86 -129 75 -9 -60 -80 -330 6 38 20 -220 -254 -97 -173 -71 54 160 -323 -110 -56 78 -207 167
6739 167 -198 41 -246 -119 53 -23 94 123 126 204 -13 139 -107 64 -149 45 -69 1 109 -45 266 -160
6761 -160 52 -24 -46 42 -28 162 150 -12 2 -18 50 120 -59 70 80 -84 -35 -43 -7 -112 -196 -82 248 70 40
6786 40 -4 -82 136 37 -176 151 -120 201 -55 63 -158 -84 -93 138 177 194 72 -76 -76 173 219 158 80 -58 -80
6811 -80 84 -23 -53 -75 64 -110 -186 -365 -106 -93 348 -41 26 -8 -306 105 -43 60 -217 -174 126 -10 -89
6834 -89 311 105 -184 91 -197 -224 46 -301 181 27 9 63 132 -113 166 190 222 63 -64 70 47 114 98
6857 98 2 125 -65 126 -287 -64 -319 45 -187 4 -25 -227 -74 -3 7 -63 143 -56 44 23 -260 -246 -84
6880 -84 -126 46 -16 -176 70 106 220 38 90 -40 -53 90 137 107 41 -12 42 119 36 -212 102 71 172 148 36
6905 36 276 116 211 191 150 -141 50 -207 29 -181 178 34 -119 270 70 174 75 -135 -125 -79 -161 390 -234
6928 -234 -53 64 192 168 214 20 16 2 241 -148 -59 29 74 68 -132 -426 -28 -61 85 -9 -76 -221 -73 15 -34
6953 -34 -28 95 82 -204 -2 67 18 53 126 18 136 -44 241 -65 -33 112 -90 50 -182 50 -64 121 162
6976 162 -20 166 -211 253 -82 -54 -75 36 244 113 78 89 55 36 -31 30 22 -129 139 102 -155 25 -159 -239
7000 -239 48 143 192 -43 290 -227 139 18 76 246 -179 15 43 -115 94 94 -22 92 -148 -61 -2 151 55
7023 55 -182 -104 -265 -1 -7 -124 -105 40 -155 -103 4 180 -90 -174 -76 -16 -219 259 -87 45 79 -102 48
7046 48 -113 52 196 -40 -182 95 -86 20 203 -19 -123 159 -5 -228 79 -135 174 185 171 159 -45
7067 -45 -34 168 228 -122 -186 -27 -98 150 -110 151 -81 73 -46 -116 141 -184 50 84 84 46 121 -203 -188 -30
7091 -30 -239 -77 -51 21 176 -314 44 -79 -91 215 -199 18 138 -223 -113 105 -195 42 -43 109 164 -64
7113 -64 -93 -101 37 51 -17 -36 82 -30 202 -43 78 -148 47 -1 -71 17 86 52 89 218 102 156 -126 226 223
7138 223 15 54 143 -10 45 37 -7 -27 78 -291 101 -74 3 -54 -31 120 92 104 -23 182 115 -45 -104 -46 19
7163 19 -145 -218 -137 117 -136 -164 -87 156 -140 -104 -266 78 93 -27 192 50 76 -48 -23 -106 322 224 127 -38
7187 -38 -98 87 170 -376 57 149 -42 115 -47 73 320 -37 -126 65 -91 -95 -108 36 38 -67 -12 55 58 159 -47
7212 -47 -2 -62 26 32 -52 -77 4 74 -42 164 184 -43 -67 -259 13 -53 -205 -112 201 -3 -207 -46 150 251 119
7237 119 222 -12 87 88 -41 -90 135 -57 93 -10 134 122 97 -165 96 -138 70 188 9 154 -53 -8
7259 -8 172 -28 -95 -108 98 -4 116 -67 88 102 12 -239 -94 -25 119 85 25 -9 -139 -65 -23 -77 387 145
7283 145 57 5 -244 -89 24 163 168 9 200 -69 -125 9 -20 232 252 65 91 -143 -221 -82 10 -77 -125 194
7307 194 -260 2 -288 77 6 31 -26 -21 -105 39 36 24 -5 -15 -38 -96 -79 128 -194 87 84 -92 170 -119 -183 -153
7333 -153 -90 -11 155 -168 -143 -16 -257 -30 -229 162 252 111 228 72 119 -229 135 -6 205 80 60 203
7355 203 -78 5 43 -152 90 133 112 -65 161 112 -308 183 204 -46 36 -124 -183 -189 123 71 -29 160 58 205
7379 205 -16 136 -187 38 36 163 85 122 71 106 -13 106 -51 -155 170 -140 107 84 -63 -30 -11 2 -107
7402 -107 -124 -24 -3 -168 29 -28 18 96 44 90 -38 -2 -116 -105 183 -121 -17 57 -48 152 4 66 69 -217
7426 -217 172 131 195 -70 89 -273 -28 -220 -127 -38 -81 5 28 -114 57 -143 -122 -40 76 21 -100 249 -164
7449 -164 -263 54 -103 145 8 71 -93 8 -103 -97 -156 -191 124 -47 66 -38 99 -36 -253 149 -105 -3
7471 -3 68 -62 -51 135 156 -5 121 -271 100 97 21 -74 -119 -78 207 9 -73 -181 71 -57 48 2 -6 170 -50
7496 -50 -154 130 -289 -111 161 98 -217 -165 123 -109 291 -247 153 93 -6 -46 316 52 -42 191 -116 6
7518 6 -2 36 105 -27 217 97 -63 26 78 -255 -15 -220 204 64 -57 64 312 27 -192 -98 -220 -52 -216
7541 -216 -52 -139 -7 -101 -311 101 9 1 32 208 -34 157 -54 88 54 2 -276 182 62 -193 -246 -133 49
7564 49 -86 128 -6 155 369 299 30 -224 -219 0 256 -42 -203 45 19 58 131 -56 60 50 110 140 128 145
7588 145 87 63 -9 -69 136 -172 40 169 8 -162 100 64 77 -40 65 -28 -46 145 -213 -377 -96 -5 422
7611 422 127 -101 156 -137 -215 42 146 15 230 -29 15 187 -201 -57 153 184 2 136 57 -152 -106 -287
7633 -287 -40 147 107 -164 4 104 -157 177 59 -77 343 96 266 -48 4 207 104 73 159 -189 109
7654 109 184 -15 196 308 -27 -31 100 -71 26 75 82 -77 228 -256 53 125 -14 -54 271 81 -80 -152 -116 -161
7678 -161 -6 73 141 -83 -25 63 -95 -173 155 112 46 -269 211 -46 57 -21 -249 -36 -155 261 -42 -89 -187
7701 -187 -279 -99 122 -179 79 -36 58 42 -81 107 279 -11 -30 -38 103 38 -220 414 31 -96 30 247
7723 247 79 210 -2 -16 10 -116 181 -287 84 40 64 -54 258 -27 -122 3 -197 -123 -69 127 18 -85
7745 -85 80 31 -128 -83 -14 120 -35 -172 105 274 -66 15 15 24 -275 -221 -125 187 -83 -143 -80 -200 162 28
7769 28 59 -68 -45 216 -12 -58 9 -43 20 -33 -252 98 106 105 126 -93 -127 10 -33 -59 71 -20 -144 -32 -15 64
7795 64 55 -40 174 -33 -96 -42 3 -147 -102 220 46 -84 -343 38 24 20 158 144 242 -92 155 -156 -226 160 -8
7820 -8 17 -38 -220 -46 35 -33 -51 118 10 64 -72 -87 -95 -237 -60 180 150 -12 -40 -45 57 -13 -4 149 28 18
7846 18 -30 0 145 207 -8 171 50 200 44 -331 60 -72 264 47 -36 -154 66 182 108 -86 98 -18
7868 -18 -172 -169 307 137 89 266 68 -7 141 87 266 -165 79 126 39 183 179 7 -95 -30 13 185 -215 87
7892 87 10 190 115 -157 -99 -125 -101 109 13 -127 -7 120 229 133 -120 47 -20 -184 7 123 -40 -67 -63 217
7916 217 -103 -71 40 -231 -14 -133 124 219 -39 127 112 142 24 -77 -66 62 118 -99 184 -24 -164 131
7938 131 70 -74 70 56 67 62 -95 -64 -89 39 60 -308 171 60 -111 141 -97 -129 138 -140 98 -61 173
7961 173 -87 70 -183 -13 -122 -59 41 355 220 65 268 -68 101 -53 230 -162 93 -61 26 104 -1
7982 -1 -74 79 -28 -343 67 -6 -262 12 177 9 -137 -7 -164 -333 -36 -257 -252 -130 -133 -146 13 79 49 87
8006 87 -224 39 -156 167 347 99 -166 107 67 0 -66 194 262 33 42 -14 -53 -184 -129 34 92 -13 236 95
8030 95 0 -169 55 -84 -144 -69 -61 -7 64 -11 91 -72 38 256 -95 352 -21 14 123 -42 107 48 79 52
8054 52 -188 84 -146 -124 -207 9 -127 -123 102 26 -54 -66 92 -62 84 254 136 -36 64 16 34 134 -28
8077 -28 -48 78 2 7 223 -30 223 50 48 -38 -153 58 267 39 207 29 -55 -52 -60 107 -147 15 129 216 86
8102 86 54 129 98 51 -63 177 0 -55 126 145 -57 -196 68 -64 65 279 -21 -86 10 243 37 -19 119
8125 119 10 44 -292 12 -57 113 69 -23 5 31 55 -50 67 201 -208 -18 -58 72 85 -70 36 -121 -100
8148 -100 -96 116 124 -45 313 90 -162 344 -207 -126 30 192 187 -2 159 45 36 74 -127 -227 -50 -19 7 252
8172 252 93 -71 66 70 -54 -19 65 106 134 -138 15 -145 270 103 -146 -123 123 13 -119
8191a19
##END NTUPLES=NMR FID
##END=
