##TITLE=1H_LR-718-RK1
 CDCl3+DMSO-d6, 8 sc, 
 10.7.2020
##JCAMPDX= 6.0         $$ Bruker NMR JCAMP-DX V2.0
##DATA TYPE= NMR FID
##DATA CLASS= NTUPLES
##ORIGIN= UXNMR, Bruker Analytische Messtechnik GmbH
##OWNER= root
$$ XWIN-NMR		Version 3.5
$$ Fri Jul 10 10:52:06 2020 Russian Standard Time (UT+4h)  she@DPX200
##.OBSERVE FREQUENCY= 200.1315
##.OBSERVE NUCLEUS= ^1H
##.DELAY= (6, 6)
##.ACQUISITION MODE= SIMULTANEOUS
##.ACQUISITION SCHEME= undefined
##.AVERAGES= 8
##.DIGITISER RES= 18
##SPECTROMETER/DATA SYSTEM= spect
##.PULSE SEQUENCE= zg30
##.SOLVENT NAME= CDCl3
##.SHIFT REFERENCE= (INTERNAL, CDCl3, 0, 15.7039)
##AUDIT TRAIL= $$ (NUMBER, WHEN, WHO, WHERE, WHAT)
$$ ##TITLE= Audit trail, XWIN-NMR		Version 3.5
$$ ##JCAMPDX= 5.01
$$ ##ORIGIN= Bruker BioSpin GmbH
$$ ##OWNER= she
$$ F:/spectra/data/she/nmr/H-F/1/audita.txt
$$ ##AUDIT TRAIL=  $$ (NUMBER, WHEN, WHO, WHERE, WHAT)
(   1,<2020-07-10 10:50:53.03 +0400>,<she>,<DPX200>,
      <created by zg, POWCHK disabled, PULCHK disabled
       configuration hash MD5:
       00 E9 B6 7A A2 85 ED C7 34 08 36 98 17 FE 4E 26
       data hash MD5: 16K
       4B 0C F9 E2 C2 D3 42 B7 5C 8F 90 DF 2A C5 CD 78>)
$$ ##END=
$$ 
$$ hash MD5
$$ B0 57 D8 E9 CF 39 25 F3 1F 8A EF 16 BC 57 9C 46
##$RELAX= 
##$RELAX= 
##$RELAX= 
##$RELAX= 
##$RELAX= 
##$RELAX= 
$$ Bruker specific parameters
$$ --------------------------
##$DU= <F:/spectra>
##$EXPNO= 1
##$NAME= <H-F>
##$PROCNO= 1
##$TYPE= <nmr>
##$USER= <she>
##$AMP= (0..31)
100 100 100 100 100 100 100 100 100 100 100 100 100 100 100 100 100 100 
100 100 100 100 100 100 100 100 100 100 100 100 100 100 
##$AQSEQ= 0
##$AQ_mod= 1
##$AUNM= <au_zg>
##$AUTOPOS= <>
##$BF1= 200.13
##$BF2= 200.13
##$BF3= 200.13
##$BF4= 200.13
##$BF5= 200.13
##$BF6= 200.13
##$BF7= 200.13
##$BF8= 200.13
##$BYTORDA= 1
##$CFDGTYP= 0
##$CFRGTYP= 5
##$CHEMSTR= <none>
##$CNST= (0..31)
1 1 145 1 1 1 1 1 1 1 1 1 1 1 1 1 1 1 1 1 1 1 1 1 1 1 1 1 1 1 1 1 
##$CPDPRG= <>
##$CPDPRG1= <>
##$CPDPRG2= <>
##$CPDPRG3= <>
##$CPDPRG4= <mlev>
##$CPDPRG5= <mlev>
##$CPDPRG6= <mlev>
##$CPDPRG7= <mlev>
##$CPDPRG8= <mlev>
##$CPDPRGB= <>
##$CPDPRGT= <>
##$D= (0..31)
0 1.2 0 0 0 0 0 0 0 0.06 0 0.03 0 0 0 0 0.0002 0 0 0 0 0 0 0 0 0 0 0 0 
0 0 0 
##$DATE= 1594363852
##$DBL= (0..7)
120 120 120 120 120 120 120 120 
##$DBP= (0..7)
150 150 150 150 150 150 150 150 
##$DBP07= 0
##$DBPNAM0= <>
##$DBPNAM1= <>
##$DBPNAM2= <>
##$DBPNAM3= <>
##$DBPNAM4= <>
##$DBPNAM5= <>
##$DBPNAM6= <>
##$DBPNAM7= <>
##$DBPOAL= (0..7)
0.5 0.5 0.5 0.5 0.5 0.5 0.5 0.5 
##$DBPOFFS= (0..7)
0 0 0 0 0 0 0 0 
##$DE= 6
##$DECBNUC= <off>
##$DECIM= 24
##$DECNUC= <off>
##$DECSTAT= 4
##$DIGMOD= 1
##$DIGTYP= 9
##$DL= (0..7)
0 120 120 120 120 120 120 120 
##$DP= (0..7)
150 150 150 150 150 150 150 150 
##$DP07= 0
##$DPNAME0= <>
##$DPNAME1= <>
##$DPNAME2= <>
##$DPNAME3= <>
##$DPNAME4= <>
##$DPNAME5= <>
##$DPNAME6= <>
##$DPNAME7= <>
##$DPOAL= (0..7)
0.5 0.5 0.5 0.5 0.5 0.5 0.5 0.5 
##$DPOFFS= (0..7)
0 0 0 0 0 0 0 0 
##$DQDMODE= 0
##$DR= 18
##$DS= 0
##$DSLIST= <SSSSSSSSSSSSSSS>
$$ [...]
##$SUBNAM2= <"">
##$SUBNAM3= <"">
##$SUBNAM4= <"">
##$SUBNAM5= <"">
##$SUBNAM6= <"">
##$SUBNAM7= <"">
##$SUBNAM8= <"">
##$SUBNAM9= <"">
##$SW= 24.9337058887773
##$SWIBOX= (0..15)
0 0 2 0 0 0 0 0 0 0 0 0 0 0 0 0 
##$SW_h= 4990.01996007984
##$TD= 16384
##$TD0= 1
##$TE= 0
##$TE2= 300
##$TE3= 300
##$TEG= 300
##$TL= (0..7)
0 120 120 120 120 120 120 120 
##$TP= (0..7)
150 150 150 150 150 150 150 150 
##$TP07= 0
##$TPNAME0= <>
##$TPNAME1= <>
##$TPNAME2= <>
##$TPNAME3= <>
##$TPNAME4= <>
##$TPNAME5= <>
##$TPNAME6= <>
##$TPNAME7= <>
##$TPOAL= (0..7)
0.5 0.5 0.5 0.5 0.5 0.5 0.5 0.5 
##$TPOFFS= (0..7)
0 0 0 0 0 0 0 0 
##$TUNHIN= 0
##$TUNHOUT= 0
##$TUNXOUT= 0
##$USERA1= <user>
##$USERA2= <user>
##$USERA3= <user>
##$USERA4= <user>
##$USERA5= <user>
##$V9= 5
##$VALIST= <valist>
##$VCLIST= <CCCCCCCCCCCCCCC>
##$VD= 0
##$VDLIST= <DDDDDDDDDDDDDDD>
##$VPLIST= <PPPPPPPPPPPPPPP>
##$VTLIST= <TTTTTTTTTTTTTTT>
##$WBST= 1024
##$WBSW= 4
##$XGAIN= (0..3)
0 0 0 0 
##$XL= 0
##$YL= 0
##$YMAX_a= 216287
##$YMIN_a= -101024
##$ZGOPTNS= <>
##$ZL1= 120
##$ZL2= 120
##$ZL3= 120
##$ZL4= 120
##$ABSF1= 10
##$ABSF2= 0
##$ABSG= 5
##$ABSL= 3
##$ALPHA= 0
##$AQORDER= 0
##$ASSFAC= 0
##$ASSFACI= 0
##$ASSFACX= 0
##$ASSWID= 0
##$AUNMP= <proc_1d>
##$AZFE= 0.1
##$AZFW= 0.1
##$BCFW= 1
##$BC_mod= 2
##$BYTORDP= 1
##$COROFFS= 0
##$CY= 11.3945322036743
##$DATMOD= 1
##$DC= 2
##$DFILT= <>
##$DTYPP= 0
##$F1P= 16.9975609425685
##$F2P= -3.02152046262296
##$FCOR= 0.5
##$FTSIZE= 0
##$FT_mod= 4
##$GAMMA= 1
##$GB= 0.15
##$INTBC= 1
##$INTSCL= 1
##$ISEN= 128
##$LB= 0.24
##$LEV0= 0
##$LPBIN= 0
##$MAXI= 10000
##$MC2= 0
##$MEAN= 0
##$ME_mod= 0
##$MI= 1.114404
##$NCOEF= 0
##$NC_proc= 0
##$NLEV= 6
##$NOISF1= 3.799351
##$NOISF2= 2.8
##$NSP= 1
##$NTH_PI= 0
##$NZP= 0
##$OFFSET= 15.70392
##$PC= 1
##$PHC0= -9791.038
##$PHC1= 8.20092
##$PH_mod= 1
##$PKNL= yes
##$PPARMOD= 0
##$PSCAL= 0
##$PSIGN= 0
##$REVERSE= no
##$SF= 200.130013532006
##$SI= 16384
##$SIGF1= 3
##$SIGF2= 2
##$SINO= 400
##$SIOLD= 16384
##$SREGLST= <1H.CDCl3>
##$SSB= 0
##$STSI= 0
##$STSR= 0
##$SW_p= 3612.71676300578
##$SYMM= 0
##$S_DEV= 0
##$TDeff= 0
##$TDoff= 0
##$TI= <>
##$TILT= no
##$TM1= 0
##$TM2= 0
##$TOPLEV= 0
##$USERP1= <user>
##$USERP2= <user>
##$USERP3= <user>
##$USERP4= <user>
##$USERP5= <user>
##$WDW= 1
##$XDIM= 8192
##$YMAX_p= 0
##$YMIN_p= 0
$$ End of Bruker specific parameters
$$ ---------------------------------
##NTUPLES= NMR FID
##VAR_NAME=  TIME,          FID/REAL,        FID/IMAG
##SYMBOL=    X,             R,               I
##VAR_TYPE=  INDEPENDENT,   DEPENDENT,       DEPENDENT
##VAR_FORM=  AFFN,          ASDF,            ASDF
##VAR_DIM=   8192,          8192,            8192
##UNITS=     SECONDS,       ARBITRARY UNITS, ARBITRARY UNITS
##FACTOR=    0.0002004,     1,               1
##FIRST=     0,             0,               0
##LAST=      1.6414764,     0,               0
##MIN=       0,             -101024,         0
##MAX=       1.6414764,     216287,          0
$$ Real data points
##PAGE= N=1
##DATA TABLE= (X++(R..R)), XYDATA
$$ [...]
2002a06j1j90L34N2K53J71j51rL2j21L65j45K45Q1l03j66l6j51J82j81j57l3J40
$$ -106 -117 -307 27 79 332 503 352 343 375 254 619 474 719 800 497 331 295 144 326 145 -12 -45 95
2025I5l53L3m0j67p6J4n3J44Oq4k26K7J76n6L17l5J93k65M51k73J29K95k86K46
$$ 95 -258 -225 -265 -432 -508 -494 -547 -403 -397 -481 -707 -680 -504 -560 -243 -278 -85 -350 101 -172 -43 252 -34 212
2049B12K56q2K51k92L29J1k30R1j63J13Q1k98j05q6K68k73j23L18j64k99j09j51
$$ 212 468 386 637 345 674 685 455 546 383 496 577 279 174 88 356 83 -40 278 114 -185 -294 -445
2071d45j38N00l52J63K5n3om04J57K58k44J66K0L03j09K21j64j04K24J57j38L33
$$ -445 -583 -83 -435 -272 -247 -300 -306 -710 -553 -295 -539 -373 -353 -50 -159 62 -102 -206 18 175 37 370
2093C70J68l14K03m06K53M2j0k67K79Jk29j46r8k85L12m03K51J37k53r5q7pJ43
$$ 370 538 224 427 21 274 316 306 39 318 319 90 -56 -154 -439 -127 -530 -279 -142 -395 -490 -577 -584 -441
2116d41l78J87J56J18j07k5q2K98Q4k73K45k42L85K66k36j35J82M3Q9k74M60k20
$$ -441 -819 -632 -476 -358 -465 -490 -572 -274 -190 -463 -218 -460 -75 191 -45 -180 2 45 134 -140 320 100
2138A00M64j95K8j88R2k21k24O7K05l06k74L40j41Q6q2p1n4O5j6k07k69K66J03
$$ 100 564 369 397 209 301 80 -144 -77 128 -178 -452 -112 -253 -167 -249 -320 -374 -309 -325 -532 -801 -535 -432
2161d32r7J81J89j1K7N8j53O01j06r8J09k4K41j32p1L79j20K6K20O7l04M8j89
$$ -432 -529 -348 -159 -170 -143 -85 -238 363 257 159 268 244 485 353 282 661 541 567 787 854 550 598 409
2184D09J9J05m1m7k72j06J51k40K81j98j57j2P6j50j45J88J05j4j65J18j11J76
$$ 409 428 533 492 445 173 67 218 -22 259 61 -96 -108 -32 -182 -327 -139 -34 -48 -213 -95 -206 -30
2206c0KJ30r6J28Q3O5J61p0qM39l17J6Pj48L28j72N3j61j6Nj05j47l1j37N2o3
$$ -30 -28 102 6 134 217 282 443 373 365 804 487 503 510 362 690 518 571 410 394 399 294 147 116 -21 31 -32
2232c2K11j44K3r5r1j1l77K25J63k57J39m14M32k02K69k1R0K20m14K92J31n9K86
$$ -32 179 35 58 -37 -128 -139 -516 -291 -128 -385 -246 -660 -228 -430 -161 -182 -92 128 -286 6 137 78 364
2255C64j74k70K55j5K01j83k43M58j81K04j63J60m42J23N3k20j39j5J66k61P9
$$ 364 190 -80 175 160 361 178 -65 393 212 416 253 413 -29 94 147 -73 -212 -227 -61 -322 -243
2276b43J20j88l82K10j42K83j25J34j27Q6j24J06k8J25o7K52R8k24K97j12J14
$$ -243 -123 -311 -693 -483 -625 -342 -467 -333 -460 -374 -498 -392 -420 -295 -362 -110 -12 -236 61 -51 63
2297F3J06M1K5O0K77l4j03j09n1k86K5L89p0o11L75j46Q9k08N3j79n6J8K40K3
$$ 63 169 210 235 295 572 538 435 326 275 -11 14 403 333 -278 97 -49 40 -168 -115 -294 -350 -332 -92 -69
2321f9J56m19j05J97pL20k47j4jK71l0p07P55k4J87j99O6p6K46j61K0K40l7J34
$$ -69 87 -332 -437 -240 -247 73 -174 -188 -189 82 52 -655 100 76 263 64 130 54 300 139 159 399 362 496
2345D96k13N8k62J58j46J24j61J35j01j23k80j03N5J50l4j53l8J76m5j64L7rj01
$$ 496 283 341 79 237 91 215 54 189 88 -35 -315 -418 -363 -213 -247 -400 -438 -262 -307 -471 -434 -443 -544
2368e44K06Q9l32J62R4J32J94r7Q0l9J61k61Q8P4R2j5k94M67k18L14N3l99J57
$$ -544 -338 -249 -581 -419 -325 -193 1 -96 -16 -55 106 -155 -67 7 99 84 -210 257 39 353 406 7 164
2391A64q6P4l41M43k67j60Mj60M2J71o7p5n40N19K02q8J16n52M06k20P0L57j96
$$ 164 78 152 -189 254 -13 -173 -169 -329 -287 -116 -183 -258 -798 -279 -77 -165 -49 -601 -195 -415 -345 12 -184
2414a84Q1O1l80M72j36J24K41m97L87L92p6k20Mk26K37k6j24J31l67N52k31o8
$$ -184 -103 -42 -422 50 -86 38 279 -218 169 561 485 265 269 43 280 254 130 261 -106 446 215 147
2436A47k38K06j38J5o0J55k4Ok01K34j70l52o0M68l96M39k43p5N32r8n0O7K80
$$ 147 -91 115 -23 -8 -68 87 63 69 -132 102 -68 -420 -480 -12 -408 31 -212 -287 245 147 97 164 444
2459D44m62r0K97PM5p3j4J27J33j43j42m5J14O3l50K71j43m6J99o39M37k27P5
$$ 444 -18 -108 189 196 241 168 154 281 414 271 129 84 198 261 -89 182 39 -7 192 -447 -10 -237 -162
2482a62k62J45jL71n45j01K69N6q0K57q3l69K01k88K80M26j03q2M9O3J32j90o8
$$ -162 -424 -279 -280 91 -454 -555 -286 -230 -310 -53 -136 -505 -304 -592 -312 114 11 -71 -22 41 173 -17 -85
2505h5J2K97q0J27m4J07Q2m19j22J50k3l7k5K32m10j00R9j99Q8N23o34J11m34
$$ -85 -73 224 144 271 227 334 416 -3 -125 25 2 -35 -60 172 -238 -338 -239 -438 -350 173 -461 -350 -784
2528g84O98l07J69KPj37j33J8K43J63j57r3r3L21Q3N5K13k59k8O1J46N9J51Q9
$$ -784 -86 -393 -224 -222 -215 -352 -485 -467 -224 -61 -218 -311 -404 -83 0 55 268 9 -19 42 188 247 398 487
2552D87j07P8l05J95p3o1k07J1QN0j45J9K23l1l45k6q2K39J06l04R8L81m03N4
$$ 487 380 458 153 348 275 214 7 18 26 76 -69 -50 173 142 -203 -229 -311 -72 34 -270 -172 209 -194 -140
2576a40Q8j72K76K24l98K4K34L19k72l1k7M4M23j95J3L5pm2O6R0j22j34j54j21
$$ -140 -52 -224 52 276 -122 -98 136 455 183 152 125 169 592 397 410 445 438 396 462 552 430 296 142 21
2600B1j74K79M3k03n3J00j21J95K31p22L75j10L6J67j62L8M6J33j13j98j41O07
$$ 21 -153 126 169 -34 -87 13 -108 87 318 -404 -29 -139 -103 64 -98 -60 -14 119 6 -192 -333 274
2622B74k25J14L5j15Q9M6RL80m39K32m24J43Q8o8K80k76k05N7L02k31J42k51j73
$$ 274 49 163 198 83 172 218 227 607 168 400 -24 119 207 139 419 143 -62 -5 297 66 208 -43 -216
2645b16O6N0l31K5J13J06j22J25k1l65K94l00L47j47J01j51L78j76J96J42K0l13
$$ -216 -150 -100 -431 -406 -293 -187 -309 -184 -205 -570 -276 -576 -229 -376 -275 -426 -48 -224 -28 114 134 -179
2667a79J50L05K60k42m1l6J12J03l62j08L72p8l58l8M15K97n71j7j67L54m96L30
$$ -179 -29 276 536 294 253 217 329 432 70 -38 334 256 -102 -140 275 572 1 -16 -183 171 -325 5
2689En53O9M30o0j15m1l7J17o6l39M22K67k88N5j76M39r6M2k7j54K07J30J2k99
$$ 5 -548 -479 -49 -109 -224 -265 -302 -185 -251 -590 -168 99 -189 -134 -310 129 33 75 48 -106 101 231 243 -56
2713e6M9M88k7k05J36j42O6j09K49m24mJ52l08L10j81l13K20N5j04m21N36j87
$$ -56 -7 481 454 249 385 243 309 200 449 25 21 173 -135 175 -6 -319 -99 -44 -148 -569 -33 -220
2735b20n9J27k5L8K8J24m5K90l70K35l61J90R3J77j8j13j06m4K86L9n15J89J25
$$ -220 -279 -152 -177 -139 -111 13 -32 258 -112 123 -238 -48 45 222 204 91 -15 -59 227 266 -249 -60 65
2758F5P6o6J3j84K90k89pq2J64K26k52m1j73j93J8J04l7J37J0p1mJ37P7j73O4
$$ 65 141 75 88 -96 194 -95 -102 -184 -20 206 -46 -87 -260 -453 -435 -331 -368 -231 -221 -292 -296 -159 -82 -255 -191
2783a91J57l56L92j6r2K35k25k36L77k66OL82j13Q5j42K35J20k37R6m8j42R5j86
$$ -191 -34 -390 2 -14 -106 129 -96 -332 45 -221 -215 167 54 139 -3 232 352 115 211 163 21 116 -70
2806g0j5m6N1j64K02q4M9j03k01M72o77L29J76R2k61K24j78P6Q8L7J32R5K2M5
$$ -70 -85 -131 -80 -244 -42 -126 -77 -180 -381 91 -586 -257 -81 11 -250 -26 -204 -128 -40 -3 129 224 246 291
2830B91k13K53j18L5j04j61N20j55L1j56M04l23M3r9k66L44Q7k74j63R8K11n1
$$ 291 78 331 213 248 144 -17 503 348 379 223 627 304 347 248 -18 326 413 139 -24 74 285 234
2852B34k39j96L95l74L21j79k9N7l20N72m86K46j44J52k1K51Q1j3j24m8L0K6j43
$$ 234 -5 -201 194 -180 141 -38 -67 -10 -330 242 -244 2 -142 10 -11 240 321 308 184 136 166 192 49
2875D9M51j59k5K00m47L85k21k43K45Pp3q0k66j9L30n3K5l02N6l09M73k20j79
$$ 49 500 341 316 516 69 454 233 -10 235 242 169 89 -177 -196 134 81 106 -196 -140 -449 24 -196 -375
2898c75Q7J09j77J8R9J1L19j94j22J24R8j1j59pJ36q3K93k43M98k14l13K95P5
$$ -375 -288 -179 -356 -338 -239 -228 91 -103 -225 -101 -3 -14 -173 -180 -44 -127 166 -77 421 207 -106 189 264
2921B64j40J6j09K62l20P0J5j05l73K52M59l75k99j2P7M04l09J58j60R0rK25l61
$$ 264 124 140 31 293 -27 43 58 -47 -420 -168 291 -84 -383 -395 -318 86 -223 -65 -225 -135 -144 81 -280
2944b80r5M32j33k15J67j43k0L30j42j05O2L71r7P0k52J21J51J65k64K5j09K70
$$ -280 -375 57 -76 -291 -124 -267 -287 43 -99 -204 -142 229 132 202 -50 71 222 387 123 148 39 309
2966C09m45K67J7L94j99m84k1K07k5j50k46N16N4l60l8K78k21Mk88K11J77K91
$$ 309 -136 131 148 542 343 -141 -162 45 20 -130 -376 140 194 -166 -204 74 -147 -143 -431 -220 -43 248
2988B48m24q1L63o8l19J45K26J92j69J03j94N0k3L06J50l33J78J28j56n75L66
$$ 248 -176 -257 106 38 -281 -136 90 282 113 216 22 72 49 355 505 172 350 478 322 -253 113
3009A13j80J93O8p6J1m92K01L30P1m44Q8l70M68j99k85N11k20m1l33J33L12K47
$$ 113 -67 126 194 118 129 -363 -162 168 239 -205 -117 -487 -19 -218 -503 8 -212 -253 -586 -453 -141 106
3031A06k00k11J71J31J40l24N34j79k19J15k34J00K52k4o2j64K80j80k31J97R6
$$ 106 -94 -305 -134 -3 137 -187 347 168 -51 64 -170 -70 182 158 96 -68 212 32 -199 -2 94
3052I4j00J35j40j50k39J13L03l32K00o1j35J37O0M6k26K04n5K23j93p6Q5M7m7
$$ 94 -6 129 -11 -161 -400 -287 16 -316 -116 -177 -312 -175 -115 -69 -295 -91 -146 77 -116 -192 -107 -60 -107
3075a07O4M8j7J20k17K1L71m6q4K64l42R6J53J99m18R7j9k66LJ16J75pR0j28l0
$$ -107 -43 5 -12 108 -109 -88 283 237 153 417 75 171 324 523 105 202 183 -83 -80 36 211 204 294 166 136
3100A36l8P8j53k17P7R0K1j40K61o0j85LLJ24J79o2l59L36o9P9J65p7o9J56r1
$$ 136 98 176 23 -194 -117 -27 -6 -146 115 55 -130 -127 -124 0 179 117 -242 94 25 104 269 192 123 279 188
3125A88M0j28K40k16L14l77J05r5Q2k6o5j39J34Q1l58K84l3k20l24N08PJ97k34
$$ 188 228 100 340 124 438 61 166 71 153 127 62 -77 57 138 -220 64 31 -189 -513 -5 2 199 -35
3148c5j88K23j07j14L59l64K81m86K64j06N7J51M0l4J61p5K50j79k06M61m18K29
$$ -35 -223 0 -107 -221 138 -226 55 -431 -167 -273 -216 -65 -25 -59 102 27 277 98 -108 353 -65 164
3170A64k79j1o1k9K29J15l11R1j49N0j06K02M2l10J55L7k04o4M48k50j2K0M8o
$$ 164 -115 -126 -187 -216 13 128 -183 -92 -241 -191 -297 -95 -53 -363 -208 -171 -375 -439 9 -241 -253 -233 -185 -191
3194a91K70m06k85P46%k88j23K05L81l11k00N96k89k02j24M24K9K7J89k37l5l75
$$ -191 79 -327 -612 134 134 -154 -277 -72 309 -2 -202 394 105 -97 -221 203 232 259 448 211 176 -199
3216a99J67m4K63j17j11K3k42N11l99k0R2k57J30k72L79J82k0L5k64K62k02j76
$$ -199 -32 -76 187 70 -41 -18 -260 251 -148 -168 -76 -333 -203 -475 -96 86 66 101 -163 99 -103 -279
3238b79M14l5k17K42k31K39K54k11J58j24J23p2kl75M28n53O62k8m13K51l31J05
$$ -279 135 100 -117 125 -106 133 387 176 334 210 333 261 259 -116 312 -241 421 393 -20 231 -100 5
3260EL19l29J19j94k71J99J30P8l35j14J08J75j78K77j38k81K56K06p6J21J38
$$ 5 324 -5 114 -80 -351 -152 -22 56 -279 -393 -285 -110 -288 -11 -149 -430 -174 32 -44 77 215
3281B15k24r5l8q3K7K79O2j18J06j02J34j79J35m31N10n13J69K85q1k44k86N31
$$ 215 -9 -104 -142 -225 -198 81 143 25 131 29 163 -16 119 -312 198 -315 -146 139 58 -186 -472 59
3303E9j86mJ08l9j43q5k51L70j51K19J48m54K15j45L31p0k09L57J06k69O5K02
$$ 59 -127 -131 -23 -62 -205 -290 -541 -171 -322 -103 45 -409 -194 -339 -8 -78 -287 70 176 -93 -28 174
3325A74J32k46l3L94n1n30Q6J46KJ52l59L52j06L2j37n0J82N2N9l21J29J42k72
$$ 174 306 60 27 421 370 -160 -74 72 74 226 -133 219 113 145 8 -42 140 192 251 -70 59 201 -71
3348g1j13J3L77k09q6J03k92K98j99K30J11l02K37q5k3J55j26K74p8N9o5P7j73
$$ -71 -184 -171 206 -3 -89 14 -278 20 -179 51 162 -140 97 12 -11 144 18 292 214 273 208 285 112
3371A12J47J14o7J21j67j61j40M62q2l15M19l12K75J72l40j71k88N50l88J81N7
$$ 112 259 373 306 427 260 99 -41 421 339 24 443 131 406 578 238 67 -221 329 -59 122 179
3392A79k90J33j93j84M96k48l5J18K93k63M2r5Q7kl11K09K01j00kJ6j11J43k57
$$ 179 -111 22 -171 -355 141 -107 -142 -24 269 6 48 -47 40 38 -273 -64 137 37 35 51 -60 83 -174
3415a74L68j15j56R4j53J55l27Q7K85K11n07L35j27k95J21j26n2L09k36K15k05
$$ -174 194 79 -77 17 -136 19 -308 -221 64 275 -232 103 -24 -319 -198 -324 -376 -67 -303 -88 -293
3436b93j08J50J72j37K2r5k39O03q4k79l2K02J14J42l2l01L14l06J55j4J91j90
$$ -293 -401 -251 -79 -216 -194 -289 -528 75 -9 -288 -320 -118 -4 138 106 -195 119 -187 -32 -46 145 -45
3458d5m5k16K49L1j02J40j05p8N19j80j76J75k66R8m16O39O6m42l7K9J27k20J99
$$ -45 -90 -306 -57 -26 -128 12 -93 -171 348 168 -8 167 -99 -1 -417 222 288 -154 -191 -162 -35 -255 -56
3481e6j53M28m31J88L42l34j0j81O31q54L41K02j05J17k5J88n4J9k45L12k9k64
$$ -56 -209 219 -212 -24 318 -16 -26 -207 424 -430 -89 113 8 125 100 288 234 253 8 320 291 27
3503B7nN5O2j5o1M0J3nq6k05K67k34J63k7j83Q2J77J98n32K07Q1m5J07j43N27
$$ 27 22 77 139 124 63 103 116 111 25 -180 87 -147 16 -11 -194 -112 65 263 -269 -62 19 -26 81 -62 465
3528D65m03J9j43M20n22K24j53O2J25n3J23k55K27j27j90L1K79k4M2k74Oj77L78
$$ 465 62 81 -62 358 -164 60 -93 -31 94 41 164 -91 136 9 -181 -150 129 105 147 -127 -121 -298 80
3551H0j24n0r2k1k2L16l28m9K46n5k60L37j87j22j9L00o1r7j3M39m93J26K9M7
$$ 80 -44 -94 -186 -207 -229 87 -241 -290 -44 -99 -359 -22 -209 -331 -350 -50 -111 -208 -221 218 -275 -149 -120 -73
3575g3K19j72J45l31K47L2q5lj69K38l7j37K86l44L05j41J30j10o6n0o9r0j8L4
$$ -73 146 -26 119 -212 35 67 -18 -21 -190 48 11 -126 160 -184 121 -20 110 0 -66 -116 -185 -275 -293 -259
3599b59L47l72K04r4L79k68k25K44M3K89n62K71p6J98m19L31J93J65l03L43p70
$$ -259 88 -284 -80 -174 205 -63 -288 -44 -1 288 -274 -3 -79 119 -300 31 224 389 86 429 -341
3620c41N10j89K73o5P9q5j6O2K29j65k52J45k90R1K33m02L52O7m21K78j28o0n7
$$ -341 169 -20 253 188 267 182 166 228 457 292 40 185 -105 -14 219 -183 169 236 -185 93 -35 -95 -152
3643a52J1J94k81N57m43o4M01k54q6L00p2n0J07j90p2L08l02J07K92o1o1K77k82
$$ -152 -141 53 -228 329 -114 -178 223 -31 -117 183 111 61 168 -22 -94 214 -88 19 311 250 189 466 184
3666A84J15R1R8l28o9J71j34k26p2L37j62J24j27o0J96R9j93m62k9J7J89K34j19
$$ 184 299 390 488 160 91 262 128 -98 -170 167 5 129 2 -58 138 237 44 -418 -447 -430 -241 -7 -126
3689a26K74jj08k52L41j56J07k87K9J98r7K0K01k15J34j03o4k07O03J0j91j09
$$ -126 148 147 39 -213 128 -28 79 -208 -179 19 -78 -58 143 -72 62 -41 -105 -312 291 301 110 1
3711AQ2P7j50J74k74K21J2j96k32nJ11j8K8rJ53k29L36m63L22L81m79M6K69j56
$$ 1 83 160 10 184 -90 131 143 -53 -285 -290 -179 -197 -169 -178 -25 -254 82 -381 -59 322 -157 -111 158 2
3735BMj63L84l64J80M5K58k89NJ69n9K03l43Q9K65m25l7L17j41j34l3Q6j27N3
$$ 2 6 -157 227 -137 43 88 346 57 62 231 172 375 32 121 386 -39 -76 241 100 -34 -67 19 -108 -55
3759e5K70k85O2k4J40j67O2J7j09J76Q4j90K73l64K37o4K55k11k40K08nJ08l4
$$ -55 215 -70 -8 -32 108 -59 3 20 -89 87 171 -19 254 -110 127 63 318 107 -133 75 70 178 144
3782A44M6j48R8l33K95l9O4m6J16J07JM1q6l32j9J61m0k88K04j10n7J71o5L9O1
$$ 144 190 42 140 -193 102 63 127 81 197 304 305 346 260 -72 -91 70 30 -258 -54 -164 -221 -50 -115 -76 -15
3807a5k58J13L46m07J80k47j38L86m11K93O1M02k77l21P6J08Q0j00J51j82L38
$$ -15 -273 -160 186 -221 -41 -288 -426 -40 -451 -158 -97 305 28 -293 -217 -109 -29 -129 22 -160 178
3828A78r9J93j23o1j39M2j73J82K15m55L30j13j77K3k13M06m35M43k53p9L81N6
$$ 178 79 272 149 88 -51 -9 -182 0 215 -240 90 -23 -200 -177 -390 16 -419 24 -229 -308 73 129
3850A29k39j86N22r1m89K82l6j8K19Nj66n2K52l38R6K86k27nK22n0O4m0l05Q9
$$ 129 -110 -296 226 135 -354 -72 -108 -126 93 98 -68 -120 132 -206 -110 176 -51 -56 166 116 180 140 -165 -76
3874g6RL16j22k48K75Q8l51O5N1K94j93j00q3K1J61j61j68K97J28k64J51k70J09
$$ -76 -67 249 127 -121 154 242 -109 -44 7 301 108 8 -75 -54 107 -54 -222 75 203 -61 90 -180 -71
3897g1K54ll9n83N33j41J14j71K16J23k11J3P4l85M30o0j6J35K42k83j82j72M73
$$ -71 183 180 141 -442 91 -50 64 -107 109 232 21 34 108 -277 153 93 77 212 454 171 -11 -183 290
3920B90q9m21M40m54J19J65j38K94j35m47M33j92R5k95L01j33K11j49n5M0N3k09
$$ 290 201 -220 220 -234 -115 50 -88 206 71 -376 57 -135 -40 -335 -34 -167 44 -105 -160 -120 -67 -276
3942b76M36l35K0K63k10r8J43j52J48j82J54k77M77j7o0k31j65K60J76n20L29
$$ -276 160 -175 -155 108 -102 -200 -57 -209 -61 -243 -89 -366 111 94 34 -197 -362 -102 74 -446 -117
3963a17j02J4O7K4pJ89n6l67l4r3N35n26K42Q9M9kl9J82q1P9j57K31r3J05j82
$$ -117 -219 -205 -138 -114 -121 68 12 -355 -389 -482 53 -473 -231 -142 -93 -95 -134 48 -33 46 -111 120 27 132 -50
3988e0J88j79J67K69m9j65J1l09N07l59J4k07L01l3K29j87k09O6K23p1o6J00l22
$$ -50 138 -41 126 395 346 181 192 -117 390 31 45 -162 139 106 335 148 -61 5 228 157 91 191 -131
4011a31L98q7r1j63M84l43m1L10k42L6k90Q0J76P0k74K95l95Q26m45l5k14M6L79
$$ -131 267 180 89 -74 410 67 26 336 94 130 -160 -80 96 166 -108 187 -208 618 173 138 -76 -30 349
4034C49l40P5k6j65J60J10j3Q5j59J76J25l36J92j08nn1l28L33m00M01j29J0J99
$$ 349 9 84 58 -107 53 163 150 235 76 252 377 41 233 125 120 69 -259 74 -326 75 -54 -44 155
4057A55j48M8l56J80O9k49O63k33K19m52P2K27j99j06L89j60j43k41K19L8j11
$$ 155 7 55 -301 -121 -52 -301 362 129 348 -104 -32 195 -4 -110 279 119 -24 -265 -46 -8 -119
4078a19PL08j50J36k17j40m5J65J38k15K65k42k7n4J25l3j5J7Ql41M27l32K22
$$ -119 -112 196 46 182 -35 -175 -220 -55 83 -132 133 -109 -136 -190 -65 -98 -113 -96 -88 -429 -2 -334 -112
4101a12p2J1K5j95k8L90k8l05J90M7j00j04J3K79n2L20m27K27j42n1J48j16J34
$$ -112 -184 -173 -148 -343 -371 19 -9 -314 -124 -77 -177 -281 -268 11 -41 279 -148 79 -63 -114 34 -82 52
4124E2k82J80L67j81l40L60j60k23R4K6K2M8K85j88O1j09m87L87PL5J04%j01J93
$$ 52 -230 -50 317 136 -204 156 -4 -227 -133 -107 -85 -37 248 60 121 12 -475 -88 -81 -46 58 58 -43 150
4148A50q2k12J49N9k36j1K94R2k06J2P4J07l02L01J35n26M42J17l14j2R6q4O3
$$ 150 68 -144 5 64 -172 -183 111 203 -3 9 83 190 -112 189 324 -202 240 357 43 31 127 43 106
4171A06mk12K49l80K26p4K8Q6O7l2k07J95l46l5L34j28K89l88J84K75k09N2Q1
$$ 106 102 -110 139 -241 -15 -89 -61 25 92 60 -147 48 -298 -333 1 -127 162 -226 -42 233 24 76 157
4194A57k28K3J92K29l17o8K06j83K%J30k47K81ql91L35k5Lk41L25R0m37R9R4K2
$$ 157 -71 -48 144 373 56 -12 194 11 13 13 143 -104 177 169 -222 113 88 91 -150 175 265 -172 -73 21 43
4219D3k21J00p6l8K42K7l27J48j42J08r6k9J18J66l26L86l12K09J32P5j09%N4
$$ 43 -178 -78 -154 -192 50 77 -250 -102 -244 -136 -232 -261 -143 23 -303 83 -229 -20 112 187 78 78 132
4242A32j61J79j02r9M7K20l9m15J91j98J55k9n9J62J78m13J73j76K97l02L67l79
$$ 132 -29 150 48 -51 -4 216 177 -238 -47 -245 -90 -119 -178 -16 162 -251 -78 -254 43 -259 108 -271
4264b71N9Ko8P7j2L08l69M43o4m8m9k58P0L7R8N3J12R3m00L20M5k50j5k1J79J2
$$ -271 -212 -210 -278 -201 -213 95 -274 169 105 57 8 -250 -180 -143 -45 8 120 213 -187 133 178 -72 -87 -108 71 83
4290H3j01K57K4j59l19J96k35PN32j74p9m1J65J11j94m0j4q5l9K32J16l16L5n
$$ 83 -18 239 263 104 -215 -19 -254 -247 285 111 32 -9 156 267 73 33 19 -66 -105 127 243 -73 -38 -43
4314d3j58K50Jm2n9K13j63J72k67J52l71J91L2K46o4P4k37O9l7nP6p1K84r5j98
$$ -43 -201 49 50 8 -51 162 -1 171 -96 56 -315 -124 -92 154 90 164 -73 -4 -41 -46 30 -41 243 148 -50
4339e0o3k2RK00j54j39Q0J31j78N8M8Q5j45j58Q3L0J12jk57K72q3jJ14j2N6K2
$$ -50 -113 -135 -126 74 -80 -219 -139 -8 -186 -128 -80 5 -140 -298 -215 -185 -73 -74 -331 -59 -142 -143 -29 -41 15 37
4365C7m36J89L66j45k6L9M8K72j26k10j14J23pj19J01p7O4j5l72K07Q5r8N0j5
$$ 37 -399 -210 156 11 -15 24 72 344 218 8 -106 17 10 -109 -8 -85 -21 -36 -408 -201 -116 -214 -164 -179
4389a79L08m23K65j96n9K74L3n7r5K37o5k1K25k71k26J72M05J10l77J98j67j95
$$ -179 129 -294 -29 -225 -284 -10 23 -34 -129 108 43 22 247 -24 -250 -78 327 437 60 258 91 -104
4411a04N21j34q6r9k76L35j67J23j48J93k6R5k77J69J22k40o7J31n3p2O2M9K3
$$ -104 417 283 197 98 -178 157 -10 113 -35 158 132 227 -50 119 241 1 -66 65 12 -60 2 51 74
4434G4k71L99j29K05j98k32K97l4R7N5k5l30J41j46K56k91K86K1R3j27m73L62
$$ 74 -197 202 73 278 80 -152 145 111 208 263 238 -92 49 -97 159 -132 154 175 268 141 -332 30
4456C0M6m2n1k9O1J71l08J89k40J9L31n0m2Q3l89L3j0M30k30l06L10j35K87n10
$$ 30 76 34 -17 -46 15 186 -122 67 -173 -154 177 127 85 168 -221 -188 -198 232 2 -304 6 -129 158 -352
4480c52K45j74M32M4o9k89K29k17J13o6N1j40L49l07k3K35P3l88Q8N2r0o0J23
$$ -352 -107 -281 151 195 126 -163 66 -151 -38 -104 -53 -193 156 -151 -174 61 134 -254 -166 -114 -204 -264 -141
4503a41p6K59J97k64J88m88J15K35m43L39l9j03P0j0J28rj41J28K66l33K8p5L0
$$ -141 -217 42 239 -25 163 -325 -210 25 -418 -79 -118 -221 -151 -161 -33 -42 -183 -55 211 -122 -94 -169 -139
4526a39J54K2j71M3N9K44L56m88j42L48k73k4K53j58J72l34K68j95K03j19J02
$$ -139 15 37 -134 -91 -32 212 568 80 -62 286 13 -11 242 84 256 -78 190 -5 198 79 181
4547A81j39p8R0k9q1J12j9K02j52J26j72J70K5k34l0J49K10j32l25K17j98j79
$$ 181 42 -36 54 25 -56 56 37 239 87 213 41 211 236 2 -28 121 331 199 -126 91 -107 -286
4569b86M21k43N91k93j52o1K19J16m40K30L1j52j90J43R1j35K03L2k21k22L70
$$ -286 135 -108 483 190 38 -23 196 312 -128 102 133 -19 -209 -66 25 -110 93 125 -96 -318 52
4590E2j9j9M2m5M8j58J56j74K63l51K17j4P2k66L28j73j00k11L25J76j51L12k77
$$ 52 33 14 56 11 59 -99 57 -117 146 -205 12 -2 70 -196 132 -41 -141 -352 -27 149 -2 310 33
4613C3l23L30j77L6k3l0k4L03k31J74J46l09M8m3K30k71J04j40M6j39K26J03k74
$$ 33 -290 40 -137 -101 -124 -154 -178 125 -106 68 214 -95 -47 -90 140 -131 -27 -167 -121 -260 -34 69 -205
4636b05Q0Q8j68J00K07n45L50n2K46j25k08l4M42m05K56J48k18q5J94J25M9N5
$$ -205 -125 -37 -205 -105 102 -443 -93 -145 101 -24 -232 -266 176 -229 27 175 -43 -128 66 191 240 295
4658B95l05K17k78LK36r2R9k79K77J9j26O6l4j70q2o9M68j99n4oQj64J92k44K67
$$ 295 -10 207 -71 -68 168 76 175 -104 173 192 66 132 98 -72 -154 -223 245 46 -8 -14 -6 -170 22 -222 45
4683D5N8Rk8l13O11k88j66J02J02J54k90j42L41k69R9k93O25m78K91k05pJ23j96
$$ 45 103 112 84 -229 382 94 -72 30 132 286 -4 -146 195 -74 25 -268 357 -121 170 -35 -42 81 -115
4706a15K47l19O39m68j16J80j14p5nL43m46M15j47k41P9J04J02L1j90QO4o8K94
$$ -115 132 -187 452 -16 -132 48 -66 -141 -146 197 -249 166 19 -222 -143 -39 63 94 -96 -88 -24 -92 202
4729B02k41rM1j7j55k6K42j17j31J81j11o6K46J3Q6l16o9L65j15j15oP7RP2k23
$$ 202 -39 -48 -7 -24 -179 -205 37 -80 -211 -30 -141 -207 39 52 138 -178 -247 118 3 -112 -118 -41 -32 40 -183
4754a83j7L44j72j15o0K2n1O7o8p2M19m04K91J63Rj28K1o4L8jj66K45j10o2J50
$$ -183 -200 144 -28 -143 -203 -181 -232 -165 -233 -305 114 -290 1 164 173 45 66 2 40 39 -127 118 8 -54 96
4779I6j75Q7j00l1j01L67J48l44J93j37L5Q6j31K2j62M29l73K6P1j42O7O5P5m5
$$ 96 -79 8 -92 -123 -224 143 291 -53 140 3 38 124 -7 15 -147 282 -91 -65 6 -136 -69 -4 71 26
4803B6L94n34L95j25k96J33JJ6L5J28j13K10l01j47K08N0K03k42K08k33N6k5j34
$$ 26 420 -114 281 156 -140 -7 -6 10 45 173 60 270 -31 -178 30 80 283 41 249 16 72 47 -87
4826h7J09k47J70K79r3k73J81J69j92l0M2m4O0j88K65q1Q0J24j59Rj07k08J86
$$ -87 22 -225 -55 224 131 -142 39 208 16 -14 28 -16 44 -144 121 40 120 244 85 94 -13 -221 -35
4849c5J76m40J64J35M9m3n3J75l29L43k18o8J23j99K44Q6K73k21o9Q1k21K19k94
$$ -35 141 -299 -135 0 49 6 -47 128 -201 142 -76 -144 -21 -220 24 110 383 162 93 174 -47 172 -122
4872a22j3K42j90j50P1J41l71L74l48L00j68K60L42m43J67m45M54l03j93K10p6
$$ -122 -135 107 -83 -233 -162 -21 -392 -18 -366 -66 -234 26 368 -75 92 -353 101 -202 -395 -185 -261
4893b61J49K09k65J11J86r7m10M55p6n8j01J06r1M2O2j5Q9j16rL93k96n5l9J31
$$ -261 -112 97 -168 -57 129 32 -378 77 1 -57 -158 -52 -143 -101 -39 -54 35 -81 -90 303 7 -48 -87 44
4917D4j14n2r6J93j7K2r5J03P0k46N0K81L2O2m66O2J78k15M15k75J17l71L73n5
$$ 44 -70 -122 -218 -25 -42 -20 -115 -12 58 -188 -138 143 175 237 -229 -167 11 -204 211 -64 53 -318 55 0
4941@K04%Q5P5k12j08K5j2Pj01K40m25M08j68p1J17l02N08j48J42j68k9L6j49
$$ 0 204 204 289 364 152 44 69 57 64 -37 203 -222 186 18 -53 64 -238 270 122 264 96 67 103 -46
4965d6J79k07k0J80j60J45R5l09L65l03J03Q0k84L54k38Om62K01L05K4J10O3k78
$$ -46 133 -74 -94 86 -74 71 166 -143 222 -81 22 102 -182 172 -66 -60 -522 -321 -16 8 118 181 -97
4988i7R1QJ15L9K20l40J50k04N3R8m71L59LJ89j74K1k66K28l45K00RL01j92j84
$$ -97 -6 2 117 156 376 36 186 -18 35 133 -338 21 24 213 39 60 -206 22 -323 -123 -114 187 -5 -189
5012a89N6J10k94N18m66K55n8j60L37n8k79J16J56l55K03K62l26j5K36k25RJ87
$$ -189 -133 -23 -317 201 -265 -10 -68 -228 109 51 -228 -112 44 -311 -108 154 -172 -187 49 -176 -167 20
5034B0m2m0J82p5Oj33J96l72K37K43k80K6J15l05K35j67jR7n2K23r7OK08j87J03
$$ 20 -22 -62 120 45 51 -82 114 -258 -21 222 -58 -32 83 -222 13 -154 -155 -58 -110 113 16 22 230 43 146
5059A46j05o7n2L42k78K95k50K5JJ85m84J57j52L08M13m87K9Oj76J95n0K05n5
$$ 146 41 -26 -78 264 -14 281 31 56 57 242 -242 -85 -237 71 484 -3 26 32 -144 51 1 206 151
5082A51L9J38k08Q2k58L77j00j00q9j74K35J1l28L84j98J64o3r1qK8O7K8j5p0
$$ 151 190 328 120 202 -56 321 221 121 32 -142 93 104 -224 160 -38 126 63 -28 -36 -8 59 87 72 2
5106BJ82j19j9j70l1J06j20L14l8k83M13m29N4J03K3q4K97q8p7L4J20j73n2O1
$$ 2 184 65 46 -124 -155 -49 -169 145 107 -176 237 -192 -138 -35 -12 -96 201 113 36 70 190 17 -35 26
5130B6j8k86L23J26k17j0p8J10M6j65N4L62m60M59m01K21n16M84j66M4K78k97
$$ 26 8 -278 45 171 -46 -56 -134 -24 22 -143 -89 273 -187 272 -129 92 -424 60 -106 -62 216 -81
5152h1N3j1j16R2j6J67k10J11l9R6j20k9jl53M67J97m0j14l20K59k22K77jm81
$$ -81 -28 -39 -155 -63 -79 88 -122 -11 -50 46 -74 -103 -104 -457 10 207 167 53 -267 -8 -230 47 46 -435
5176d35N82j72K57k32k84Q7Q0J37j02K66k53K82q5O5Q5j12k03J10p2P6J05l34
$$ -435 147 -25 232 0 -284 -197 -117 20 -82 184 -69 213 128 193 278 166 -37 73 1 77 182 -152
5198a52J93K41r0j60K77p1q0j95J83J83l92M8L9l47N26l66J23J32K54k01j94J25
$$ -152 41 282 192 32 309 238 158 -37 146 329 -63 -15 24 -323 203 -163 -40 92 346 145 -49 76
5220G6rM5k36K17j27l04L45K4PK28j87l70M58m49J18N30m39K09l16P1j9J17m1
$$ 76 67 112 -124 93 -34 -338 7 31 38 266 79 -291 167 -282 -164 366 -73 136 -180 -109 -128 -11 -52
5243e2J66k45K66k35M2J62l29L80j06lN5l0k31j58J10K3R9q2K37r4K95l47p7K16
$$ -52 114 -131 135 -100 -58 104 -225 155 49 46 101 71 -160 -318 -208 -185 -86 -168 69 -25 270 -77 -154 62
5267F2M0k43J95q2Mk0k36K96k07j55N21m81J83K8K58lj40J42q6l19J87m3J2J69
$$ 62 102 -141 54 -28 -24 -44 -280 16 -191 -346 175 -306 -123 -95 163 160 20 162 76 -243 -56 -99 -87 82
5291H2K47l56l4L20l39oKk76L29q0l7J86Q8O7l38L63k77O0j99L51K04k45k51j16
$$ 82 329 -27 -61 259 -80 -86 -84 -360 -31 -111 -148 38 126 193 -145 218 -59 1 -198 153 357 112 -139 -255
5315b55L02p4J09k52Q0K12k57K53N3J62n06N50l20k01l8J87L45k70L3J24J15k22
$$ -255 47 -27 82 -170 -90 122 -135 118 171 333 -173 377 57 -144 -182 5 350 80 113 237 352 130
5337A30j25K01r2k21K04K5l65K54M2r1L75n34M3J09J24L18j08l68J75J39j54M7
$$ 130 5 206 114 -107 97 122 -243 11 53 -38 337 -197 -154 -45 79 397 289 -79 96 235 81 128
5359A28m2Q3m6k3j87j8L09j39L0J25K2j84J83k20J14r8j4j51J57j13K68l40k2
$$ 128 86 169 123 100 -87 -105 204 65 95 220 242 58 241 21 135 37 23 -128 29 -84 184 -156 -178
5382a78L2L63l30J11J46k46O0J73q4J17l08R9p5N3J57J67j87J02k00p4K27k07
$$ -178 -146 217 -113 -2 144 -102 -42 131 47 164 -144 -45 -120 -67 90 257 70 172 -28 -102 125 -82
5404h2J46Q4k47j28K66j46J45k07M04o98M93Qk6j89j47N4M9K81N1j88J99q7k04
$$ -82 64 148 -99 -227 39 -107 38 -169 235 -463 30 38 12 -177 -324 -270 -221 60 111 -77 122 35 -169
5427a69o0K30m82L46L14k39p6K15j40m7L29j91J41k10m1J2j50N12q0l54K86o8
$$ -169 -229 1 -481 -135 179 -60 -136 79 -61 -108 221 30 171 -39 -80 -68 -218 294 214 -140 146 78
5449G8k76K65J86k05rP7j29K56k78J86l51O8M05K11l07k36N0k9J26k11J1J30K64
$$ 78 -198 67 253 48 39 116 -13 243 -35 151 -200 -132 273 484 177 -59 -9 -38 88 -123 -112 18 282
5472B82j67r4j75M05p7k90K88m61L34l81M91o3j12J18p3J08k38k8K37ko3k7k91
$$ 282 115 21 -154 251 174 -116 172 -289 45 -336 155 92 -20 98 25 133 -105 -133 104 102 39 12 -279
5495b79M76p7k32m6L58o7k63J01L8k16J10j30L30p8K49k47j2p9Q6m5J2k92L63
$$ -279 197 120 -112 -158 200 133 -130 -29 9 -207 -97 -227 103 25 274 27 15 -64 22 -23 -11 -303 60
5518F0l10O8J2J94Q5q1k67L66J94k06k20K35k30qK07j82J85m85M31r8L3L5k33
$$ 60 -250 -182 -170 24 109 28 -239 127 321 115 -105 130 -100 -108 99 -83 102 -383 48 -50 -17 18 -215
5541b15n5j6M38j71J62L26l88k25N5R0o7m2O0J80k85j24N9L24l72J66J37k20K81
$$ -215 -270 -286 152 -19 143 469 81 -144 -89 1 -66 -108 -48 132 -153 -277 -218 106 -266 -100 37 -183 98
5564I8j53j81L67R9m83K57O3q3J79k37K40l20mK10j47J25P3m64M64o5J6J84k67
$$ 98 -55 -236 131 230 -253 4 67 -16 163 -74 166 -154 -158 52 -95 30 103 -361 103 38 54 238 -29
5587b9Q0r7m4K67k25K84p2k60K44k41p1j80N27j08k50nJ53j02N82n42O4K10n8
$$ -29 51 -46 -90 177 -48 236 164 -96 148 -93 -164 -344 183 75 -175 -180 -27 -129 453 -89 -25 185 127
5610A27j47J9l2j33M21m85L66l1j80R3K39o3k44j96J61N2J02k67J77K18j55J25
$$ 127 -20 -1 -33 -166 255 -230 136 105 -75 18 257 194 -50 -246 -85 -33 69 -198 -21 197 42 167
5632A67j73m2K57m23L97J6m95N51j59j52Q5m4KJ08k25K5K05l5j45N14m15k1q6
$$ 167 -6 -48 209 -214 183 199 -296 255 96 -56 29 -15 -13 95 -130 -105 100 65 -80 434 19 -2 -88
5655h8P3j92K09m6J98L8J08j56j82k17K64M1J16j32J62j27o4J17k29P0K17L9k3
$$ -88 -15 -207 2 -44 154 192 300 144 -38 -255 9 50 166 34 196 69 5 122 -107 -37 180 219 196
5678A96j54k18M18m77K30j96L05j53J07j51P5J04L6r2q1K2m0r8K86j03K39j09
$$ 196 42 -176 242 -235 -5 -201 104 -49 58 -93 -18 86 122 30 -51 -29 -69 -167 119 16 255 146
5700A46m56L76q4J13j01J81n4k53J82j86J40k10M16k6k34J91r0J78l11J6K04J7
$$ 146 -310 66 -18 95 -6 175 121 -132 50 -136 4 -206 210 184 -50 141 51 229 -82 -66 138 155
5722A55j39l6k33L98k08j84J77M9N3Pp6k2rK72j94j70J06Q0j77K29m3K46n3l25
$$ 155 16 -20 -253 145 -63 -247 -70 -21 32 39 -37 -59 -68 204 10 -160 -54 26 -151 78 35 281 228 -97
5746i7q0M63l00k25K00j33J32R8k52N11k53K61l88L99l62Nk4o6JK38k95J62l45
$$ -97 -177 286 -14 -239 -39 -172 -40 58 -194 317 64 325 -63 336 -26 -21 -45 -111 -110 128 -167 -5 -350
5769c50L97K1K2m2M7k89K19P7o4M1l37J90K00k19L57k69l42L28r3J68l4l23L45
$$ -350 47 68 90 48 95 -194 25 102 38 79 -258 -68 132 -87 270 1 -341 -13 -106 62 28 -295 50
5792E0Q8J1k14K9L61k48J86j75j75J46J1j1q9j63L06K3j52K17m84K12J28o9j43
$$ 50 138 149 -65 -36 325 77 263 88 -87 59 70 59 -30 -193 113 136 -16 201 -283 -71 57 -12 -155
5815a55L6L49n2n32L14j14L39j11j19p7m9K30q1K6k57N6K45K19m67K54j04K3L9
$$ -155 -119 230 178 -354 -40 -154 185 74 -45 -122 -171 59 -22 4 -253 -197 48 267 -200 54 -50 -27 12
5838A2%N2J01j34j47m6P2J78j92J84l03K21J27p4j91J72m5P2k82J01L51k04k0
$$ 12 12 64 165 31 -116 -162 -90 88 -104 80 -223 -2 125 51 -140 32 -13 59 -223 -122 229 25 5
5861EJ1k79N82m66J01l5o9K18K52k68k48J88J51N6k73K45k28m1J22J57k39k99
$$ 5 16 -263 319 -147 -46 -81 -150 68 320 52 -196 -8 143 199 -74 171 -57 -98 24 181 -58 -357
5883c57J32N29n12K20M2J62m19M51j86J95l4l89N57k09m03jK55q2L28l48J52j39
$$ -357 -225 304 -208 12 54 216 -203 248 62 257 223 -166 391 182 -221 -222 33 -49 279 -69 83 -56
5905e6k07J00J40J11J58l33K9r6k9p6M04m24J05q2L23M6J34m37L29p0j68J54J1
$$ -56 -263 -163 -23 88 246 -87 -58 -154 -183 -259 145 -279 -174 -256 67 113 247 -190 139 69 -99 55 66
5928F6j68O2r7O7j73J64J84j06j8j08o1K90j45j44K50j96J31O2k08K66l78k5M87
$$ 66 -102 -40 -137 -70 -243 -79 105 -1 -19 -127 -188 102 -43 -187 63 -133 -2 60 -148 118 -260 -285 202
5951B02k09j00j95N4O29k29R2O7M6j39l00p1K00k08k1K03M6l86M63l1j00j5J2
$$ 202 -7 -107 -302 -248 381 152 244 311 357 218 -82 -153 47 -161 -182 21 67 -319 144 113 13 -2 10
5974A0pPk16N7L58j06n06M47J12m37l8J15K22K69n27L02j6j33K08j16J79m27L96
$$ 10 3 10 -206 -149 209 103 -403 44 156 -281 -319 -204 18 287 -240 62 46 -87 121 5 184 -243 153
5997A53k15K98j49j62J51P9j79l5j0o0K8J6J83j38P5J16m39N28l71j30L75J36
$$ 153 -62 236 87 -75 76 155 -24 -59 -69 -129 -101 -85 98 -40 35 151 -288 240 -131 -261 114 250
6019B50k0j63K31p7l04J16k46M79j23k33J54J33j51%mL0p5L99l83j92L92m10L00
$$ 250 230 67 298 221 -83 33 -213 266 143 -90 64 197 46 46 42 72 -3 396 13 -179 213 -197 103
6042A03n1k51K87J11p7Qk61j4J01j34QK80J11j11l3Q8j67Q2p7N5n8j26q7J32L4
$$ 103 52 -199 88 199 122 130 -131 -145 -44 -178 -170 110 221 110 77 165 -2 80 3 58 0 -126 -213 -81 -47
6067d7L37m70K13j24N4J41j62RJK17o1O7j46K2j00J99L8j88K91q62M97O3%q7K5
$$ -47 290 -180 33 -91 -37 104 -58 -49 -48 169 108 175 29 51 -49 150 188 0 291 -571 -74 -11 -11 -98 -73
6092g3N5K05j33r6j69J88j09M00l67j9k29L58j36j6L78l88K15j22J03K29p1o8
$$ -73 -18 187 54 -42 -211 -23 -132 268 -99 -118 -347 11 -125 -141 237 -151 64 -58 45 274 203 135
6114A35l30l4J07J43J6l9q5L51k02lk5k78J62L36l06K1J55%j23J80l97O4j23L70
$$ 135 -195 -229 -122 21 37 -2 -87 264 62 59 34 -244 -82 254 -52 -31 124 124 1 181 -216 -152 -275 95
6138I5j27l06M44j0k82K05r7QK89l25oK76j14K59j41l41NK06j33J30Q9j13j19
$$ 95 -32 -338 106 96 -186 19 -78 -70 219 -106 -112 164 50 309 168 -173 -168 38 -95 35 124 11 -108
6161a08Q4J02J3p8M0j83j59N16k96L70j01n11N35m74J09OJ25J23J99j99k07n0
$$ -108 -24 78 91 13 53 -130 -289 227 -69 301 200 -311 224 -250 -141 -135 -10 113 312 113 -94 -144
6183a44L08k17l5K53k69J79k04L72k44q7J96K79m36L3M9K63l29K2J09n1k27L50
$$ -144 164 -53 -88 165 -104 75 -129 243 -1 -88 108 387 -49 -16 33 296 -33 -11 98 47 -180 170
6205A70l53j75L40Q2j50J90J91l83n4jK76j23j74J44m3J11q3P3q4j65K17k9OJ1
$$ 170 -183 -358 -18 64 -86 104 295 -88 -142 -143 133 10 -164 -20 -63 48 -35 38 -46 -211 6 -23 -17 -6
6229fJ27k52N9M80n46o5Q6j0M67k22j36J84n1L2n8l6k05J96O0k99J79R7L14n07
$$ -6 121 -131 -72 408 -138 -203 -117 -127 340 118 -18 166 115 147 89 53 -152 44 104 -195 -16 81 395 -112
6253a12J78Nj64K76l23P7Q4j51P5J02k85J89R6n4j12K14j56j12K11n1k09j16L43
$$ -112 66 71 -93 183 -140 -63 21 -130 -55 47 -238 -49 47 -7 -119 95 -61 -173 38 -13 -222 -338 5
6276Eo7K31k3j62P4lk00Q4J38K4j61J48n55M79O7K42r3m69n8K93R1m2j7J69k47
$$ 5 -62 169 146 -16 58 55 -145 -61 77 101 -60 88 -467 12 79 321 228 -241 -299 -6 85 43 26 195 -52
6301e2K35q2k06K9L67l61k0j31L05k11K63j76j3k36K83M0O5J23m5j10M6N0n9q
$$ -52 183 101 -105 -76 291 -70 -90 -221 84 -127 136 -40 -53 -289 -6 34 99 222 177 67 113 163 104 96
6325I6j23O2r2Q2m05K93K05n2l38K24O5J33J10m9l71K31l00J26j62J89P1j05p5
$$ 96 -27 35 -57 25 -380 -87 118 66 -272 -48 17 150 260 211 -160 71 -229 -103 -265 -76 -5 -110 -185
6348a85J05J57k71J49K27m43L52Q7k86l9K10J4k08J85K9j15m13K88J68P1j37N5
$$ -185 -80 77 -194 -45 182 -261 91 178 -108 -147 63 77 -131 54 83 -32 -445 -157 11 82 -55 0
6370@O5p9Q1O1k96P7j71K45po7J12l0J26M5j05j00O7m21N68r1l2J16o8n7m5L31
$$ 0 65 -14 67 128 -168 -91 -262 -17 -24 -91 21 -9 117 162 57 -43 24 -397 171 80 48 164 96 39 -6 325
6396C25k53j47K30K2k48M9M8P3J8k08P8J93j53k79L76l69M60K0q1j92O11o91P0
$$ 325 72 -75 155 177 -71 -22 26 99 117 -91 -13 180 27 -252 124 -245 215 235 154 -38 573 -118 -48
6419d8k9nR5K25J89k20k60j21J8L93k09k00M97l03j26K30j53m8O5M9K71k44k17
$$ -48 -77 -82 13 238 427 207 -53 -174 -156 237 28 -172 325 22 -104 126 -27 -75 -10 39 310 66 -151
6442a51M00k74J68l7m04N94k55n4j26L93k51k3J01OP8l97M85m86K1M24j27m91
$$ -151 249 -25 143 106 -298 296 41 -13 -139 254 3 -20 81 87 165 -232 253 -233 -212 212 85 -406
6464d06K94L12M1j90K04l21P9j42M48k35O6P7n66K69j86q0M27j96mJ96k21k28
$$ -406 -112 200 241 51 255 -66 13 -129 319 84 150 227 -339 -70 -256 -336 91 -105 -109 87 -134 -362
6486c62K21K27r1Kk35M09K7m06J89J48l2l26K08K4O3P8k32J65J5jl7J44N5k70
$$ -362 -141 86 -5 -3 -238 171 198 -208 -19 129 97 -229 -21 3 66 144 -88 77 92 91 54 198 253 -17
6510a7k3J81l09n3M37l22J35k0j45P1q0J03K32k04J21L4m6k23K64r4k99K77j18
$$ -17 -40 141 -168 -221 216 -106 29 9 -136 -65 -145 -42 190 -14 107 141 95 -128 136 42 -257 20 -98
6533i8L5K22l55J74K05R0k53L40m78o2L05J49k89m0J0J94p5L9j4r8j17j41K39
$$ -98 -63 159 -196 -22 183 273 20 360 -118 -180 125 274 -15 -55 -45 149 74 113 99 1 -116 -257 -18
6556a8j3K80j84k12K41J77j35J48k67j85J50m0Jj47J62K12j72l6J11M7L1p7N2
$$ -18 -31 249 65 -147 94 271 136 284 17 -168 -18 -58 -57 -204 -42 170 -2 -38 73 120 151 74 126
6579A26k8K0o5j21L17p9J29j82k89M36n2l41M34m60K36j23K15o6K24qm19J62j00
$$ 126 98 118 53 -68 249 170 299 117 -172 264 212 -129 305 -155 81 -42 173 107 331 323 -96 66 -34
6602c4j05O0N5K17k24p6j03J65J12P8m9l2M2j07q7M5l7LM6p8L9J93N1p9l76K16
$$ -34 -139 -79 -24 193 -31 -107 -210 -45 67 145 96 64 106 -1 -88 -43 -80 -77 -31 -109 -70 123 174 95 -281 -65
6628f5m9K70l08L1rL8L81m17jM03l64j50K8L11M3k30k17K00K65l07j40O40k99
$$ -65 -114 156 -152 -121 -130 -92 289 -128 -129 274 -90 -240 -212 99 142 -88 -305 -105 160 -147 -287 353 54
6651E4j10M5M8l71N33j82j9J20J62j32o5o2R0k44N0Qm1J71m0k80K01k10K92J59
$$ 54 -56 -11 37 -334 199 17 -2 118 280 148 83 21 111 -133 -83 -75 -116 55 15 -265 -64 -274 18 177
6675A77j85N5m3J38n11M11k0j36N2J79j65n9L93l24o9O0K4K40l18j47L99q5J84
$$ 177 -8 47 4 142 -369 42 22 -114 -62 117 -48 -107 286 -38 -107 -47 -23 217 -101 -248 151 66 250
6698B50j09k95K56N6J84l75O5k0j76R0J75k58J32K70l19J1K43O0J31m57L54l55
$$ 250 141 -154 102 158 342 -33 32 12 -164 -74 101 -157 -25 245 -74 -63 180 240 371 -86 268 -87
6720h7L4m0L9p6J65k5j17K5J25J9j56M46l08N6o1J16j42r6o4J98J18J40j15k57
$$ -87 -53 -93 -54 -130 35 10 -107 -82 43 62 -94 352 44 100 39 155 13 -83 -147 51 169 309 194 -63
6744f3PR3j2j01J11n5k4K6m2J76O8l61K58l21L61r7r4m0P4J21K3l5J44l21J28
$$ -63 -56 37 25 -76 35 -20 -44 -18 -60 116 184 -177 81 -240 121 24 -70 -110 -36 85 108 73 217 -104 24
6769B4n2l60P49n54m3K09J20J09j91q1q8K93j01j80J82l51L68j33K5J94l09M78
$$ 24 -28 -388 361 -193 -236 -27 93 202 11 -70 -158 135 34 -146 36 -315 53 -80 -55 139 -170 308
6791C08l07q3J80M7j35k44J60P0j64J92P2k46J77j56N9M2n9m2K22l88K23j14K5
$$ 308 1 -82 98 145 10 -234 -74 -4 -168 24 96 -150 27 -129 -70 -28 -87 -129 93 -295 -72 -186 -161
6814a61L72o46K51K2N4J18J35l74J00L10l91j1M67l24N8M07k18O7J7k47P2j35
$$ -161 211 -435 -184 -162 -108 10 145 -229 -129 181 -210 -221 246 -78 -20 387 169 236 253 6 78 -57
6836e7J48l8J70ko8J66l68R6j93K84l23K10j34L3J37k05k31L88r7l84O85k65J58
$$ -57 91 53 223 221 153 319 -49 47 -146 138 -185 25 -109 -76 61 -144 -375 13 -84 -468 217 -48 110
6859A10k88k95P22l87L23j51j11Q8j85N1m3m0L23n3J14m15K55J49l37L33m7q2
$$ 110 -178 -473 249 -138 185 34 -77 11 -174 -123 -166 -206 117 64 178 -237 18 167 -170 163 116 34
6881C4k5oq3J87P4l18M9k0q8k5J23J9L60k96O2l45O31m48k8j26J35P7O5j50K87
$$ 34 9 3 -80 107 181 -137 -88 -108 -196 -221 -98 -79 281 -15 47 -298 333 -115 -143 -269 -134 -57 8 -142 145
6906A45k50K25k90J69q4K07l81L21l66M5k8J52J51n67N44J28J74l56K72k01J5
$$ 145 -105 120 -170 -1 -85 122 -259 62 -304 -259 -287 -135 16 -551 -7 121 295 -61 211 10 25
6927B5J46l53K46m83N15k02K08j31o4L8j09J7K47J01k11L2j38oP5J18K7n8k09
$$ 25 171 -182 64 -419 96 -106 102 -29 -93 -55 -164 -147 100 201 -10 22 -116 -122 -47 71 98 40 -169
6950a69M45l83J06L9L78n02K92k95Q2r2PK7O8K52l71p0K27k14k5R5j17J21J37
$$ -169 276 -107 -1 38 416 -86 206 -89 -7 -99 -92 -65 3 255 -116 -186 41 -173 -198 -103 -220 -99 38
6973C8j21L26k67J10k13J41k72k8K23q4L39j39K15k39JR8k61J71J45j84q5J95
$$ 38 -83 243 -24 86 -127 14 -258 -286 -63 -147 192 53 268 29 30 128 -133 38 183 -1 -86 109
6995A09l15M07k26J1Q2qJ37k59M0P1n2N4j89M5K39j73p4p4j00K86J82r4k37L82
$$ 109 -206 201 -25 -14 68 60 197 -62 -22 49 -3 51 -138 -93 146 -27 -101 -175 -275 11 193 99 -138 244
7019B44j64J03l83J6M5P6K4K07j29K17k90j50L13l82r9M86j79Q1J3k68M6J92J47
$$ 244 80 183 -200 -184 -139 -63 -39 168 39 256 -34 -184 129 -253 -352 134 -45 36 49 -219 -173 19 166
7042A66m97M41k39J69M6k00mL57l96K50j32l2L57l69k06L87k24J00J82l90M84
$$ 166 -331 110 -129 40 86 -114 -118 239 -157 93 -39 -71 286 -83 -289 98 -126 -26 156 -234 250
7063B50l74k3J92k3j45R3n7N7j31L45j94K3K1l31J58J36p9M5Pj00J98j14K5j07
$$ 250 -124 -147 45 22 -123 -30 -87 -30 -161 184 -10 13 34 -297 -139 -3 -82 -37 -30 -130 68 -46 -21 -128
7087a28K65k90K27n9j16K67j87J30k23PJ65q2J67k8r1J71j31j62Q8J81k30J6K39
$$ -128 137 -153 74 15 -101 166 -21 109 -114 -107 58 -24 143 115 24 195 64 -98 -10 171 -59 -43 196
7110A96n95M56r6J4J77j6K9q0j24J29N2j34K5K8q5K39j24m17K01L25j38k76L06
$$ 196 -399 57 -39 -25 152 136 165 85 -39 90 142 8 33 61 -24 215 91 -326 -125 200 62 -214 92
7133I2m8l71J8N33k42j38M59n48L61m44M03P7q6K36n7k99J81m42L95j40R1J77
$$ 92 44 -327 -309 224 -18 -156 303 -245 116 -328 75 152 66 302 245 -54 127 -315 80 -60 31 208
7155B08j10K72n44L4j37N75l07r3R3j17K02O3k38j30M16m21m7M55o2j28J81r0
$$ 208 98 370 -174 -140 -277 298 -9 -102 -9 -126 76 139 -99 -229 187 -234 -281 174 112 -16 165 75
7177G5J47k11o4K27l08j3J13K99P9o20K46N9j54K58l00L95j0k54J6j52K47l73
$$ 75 222 11 -53 174 -134 -147 -34 265 344 -276 -30 29 -125 133 -167 228 218 -36 -20 -172 75 -298
7199b98N55k80L50l08q4m4L25j28k73M15o31M97Jl97M65l9p5o0K28k62n1j48K71
$$ -298 257 -23 327 19 -65 -109 216 88 -185 230 -401 96 97 -300 165 126 51 -9 219 -43 -94 -242 29
7222B9P4J49l39J69J79jk43j37K8m6K72q7q8L71m38J88j88M8J02j15Q3K03l24
$$ 29 103 252 -87 82 261 260 17 -120 -92 -138 134 47 -41 330 -108 80 -108 -60 42 -73 10 213 -111
7245a11j5J55N3o8k90N62k96M58l21k60J05N8n0L1j24k07M54j08J4J3P0j70M1
$$ -111 -126 29 82 14 -276 286 -10 448 127 -133 -28 30 -20 11 -113 -320 134 26 40 53 123 -47 -6
7268fRj2P7m5J12K50l79j40JL20l05K48Q8j81J78p9m45M33J80k75J00J37k15K51
$$ -6 3 -9 68 23 135 385 6 -134 -133 187 -118 130 218 37 215 136 -309 124 304 29 129 266 51 302
7292C02k91j93r4M14j65JJ64Q7m37j0M15k74K84k36j58J57k25Q5L44j69l13K29
$$ 302 11 -182 -276 138 -27 -26 138 225 -212 -222 193 -81 203 -33 -191 -34 -259 -174 170 1 -312 -83
7314h3J01J26p3O7j79J31K6m0j46L10k82M7n2l5J9K33j02l1k0k04M29l65J46K05
$$ -83 18 144 71 138 -41 90 116 76 -70 240 -42 5 -47 -82 -63 170 68 37 17 -187 242 -123 23 228
7338B28l60J07k23K54l06P8O0J33K45m97K76n1K9L22k15k58M62j60l90J28J68
$$ 228 -132 -25 -248 6 -300 -222 -162 -29 216 -281 -5 -56 -27 295 80 -178 284 124 -266 -138 30
7359C0j21r5J73R3J63m16J85J6J99m75M26j60j21K82m16M70j99k69R0k7K87k55
$$ 30 -91 -186 -13 80 243 -173 12 28 227 -248 178 18 -103 179 -237 233 34 -235 -145 -172 115 -140
7381a40N2N1K81k06P2J24m3m63N07j37m4K0l19L12p1J37j51J41k39LJ16r2Q9K81
$$ -140 -88 -37 244 38 110 234 191 -272 235 98 54 74 -245 67 -4 133 -18 123 -116 -113 3 -89 0 281
7405B81j62l4j33K94l07mJ26p7J86k18J09l70J42M8J58J22m55M86Mk5m36K12l2
$$ 281 119 85 -48 246 -61 -65 61 -16 170 -48 61 -309 -167 -119 39 161 -294 192 196 171 -265 -53 -85
7428h5R2r0J85m7jk76M9K73M4k73J82J02J61l75k4P4J40N4l19K95j00O0q4J73
$$ -85 7 -83 102 55 54 -222 -173 100 144 -129 53 155 316 -59 -83 -9 131 185 -134 161 61 121 37 210
7452B10j33j44j07K20J0R6m38N24j11M0k89n1K61l41L64j94J74n2j53K51m10l5
$$ 210 77 -67 -174 46 56 152 -286 238 127 167 -122 -173 88 -253 111 -83 91 39 -114 137 -273 -308
7474c08Q7M76j11Q7k40J39J73l77j41j65L40R6M1Q0k73L23k76J22k50J4j21O71
$$ -308 -221 255 144 231 -9 130 303 -74 -215 -380 -40 56 97 177 -96 227 -49 73 -177 -163 -284 387
7496C87q66N65j18k96L59j94J57j45K69N6l40J64oL8l0k4O4O7j47J6K34m2k43
$$ 387 -479 86 -32 -328 31 -163 -6 -151 118 174 -166 -2 -8 30 0 -24 40 107 -40 -24 210 168 -75
7519g5j2R7r9J90J06K56k47k68K38k41J89m74K98q6N21j84O1l08n1N6k4j27J35
$$ -75 -87 10 -89 101 207 463 216 -52 186 -55 134 -340 -42 -128 393 209 270 -38 -89 -33 -57 -184 -49
7542d9J7J48j77J00p5n8r8J05M42m88K69k92M18m95L08j66L51j39q8j29r7K40
$$ -49 -32 116 -61 39 -36 -94 -192 -87 355 -133 136 -156 262 -233 75 -91 260 121 33 -96 -193 47
7564D7m05K63P8j08J31M5J43k96j28K97k08L40k77P4P0M8p3q2J48m19M11J07O2
$$ 47 -358 -95 -17 -125 6 51 194 -102 -230 67 -141 199 -78 -4 66 114 41 -41 107 -312 99 206 268
7587B68l28R8M2k6j24J06Q8k04Pj21K12J78k54o4NJ71J92l19J6K35l01K83k74
$$ 268 -60 38 80 54 -70 36 124 -80 -73 -194 18 196 -58 -122 -117 54 246 -73 -57 178 -123 160 -114
7610a14K31J48l24P6j52r2Q2J16K50l48K95pk59r3J56m2J2P3J3l22M97J27l79
$$ -114 117 265 -59 17 -135 -227 -145 -29 221 -127 168 161 -98 -191 -35 -77 -65 8 21 -301 196 323 -56
7633e6p2K59k11k5m1J68k17K60j2K7k39L98n47J60K03L2J84k15J02K5j09j54K89
$$ -56 -128 131 -80 -105 -146 22 -195 65 53 80 -159 239 -308 -148 55 87 271 56 158 183 74 -80 209
7656B09j32k79J98Q4r7r8l46N30k78L03r9K3j51K88k72M21k90L31l37j60R1j5
$$ 209 77 -202 -4 80 -17 -115 -461 69 -209 94 -5 18 -133 155 -117 304 14 345 8 -152 -61 -76
7678g6J34m26K50j36J79J57nK70k90j78K61k41m8N5J76M1j09J6j98L56M2j58K
$$ -76 58 -368 -118 -254 -75 82 77 347 57 -121 140 -101 -149 -94 82 123 14 30 -168 188 230 72 74
7701G4J59k84q2L67l98K48j4j37N41k74j86j9K91k39p6L06m97L01n00O77m26K05
$$ 74 233 -51 -133 234 -164 84 70 -67 474 200 14 -5 286 47 -29 277 -220 81 -419 258 -168 37
7723C7n0P1m7m0J00mok79N9M07j14k16L89m89P6R6p2K26j8N5j89J58l66L69k28
$$ 37 -13 58 11 -29 71 67 61 -218 -159 248 134 -82 307 -182 -106 -10 -82 144 126 181 -8 150 -216 153 -75
7748g5J41j06o1n4J21l0J1lQ4J6o8JJ20k22N02j62k22K8M71o72L24RJ54r1J22
$$ -75 66 -40 -101 -155 -34 -64 -53 -56 28 44 -24 -23 97 -125 377 215 -7 21 492 -180 144 153 307 216 338
7773C38n28J56K12j93M9j89K7J61j89J19l7J91n6j4J6o9M4m5M4j52K39l75L36
$$ 338 -190 -34 178 -15 34 -155 -128 33 -156 -37 -74 117 61 47 63 -6 38 -7 37 -115 124 -251 85
7796H5M5j82j9K25j08q9n3K70K0k70k6K52q6nL6J83j09j04j62l5L05l10N08n01
$$ 85 130 -52 -71 154 46 -43 -96 174 194 -76 -102 150 64 59 95 278 169 65 -97 -132 173 -137 371 -130
7820a30J52j68K33R4l01L78n54J62J23k30K47J62l0k38J96k56J60J26m0R1j50
$$ -130 22 -146 87 181 -120 258 -296 -134 -11 -241 6 168 138 -100 96 -160 0 126 86 177 27
7841B7J33l80L97o4j61q6K80j08p8K3l9j09q4J60m4M7K56l19J57J35l54J76J9
$$ 27 160 -220 177 113 -48 -134 146 38 -40 -17 -56 -165 -249 -89 -133 -86 170 -149 8 143 -211 -35 -16
7864a6J09j45K34J51n01q5M12K01m13K6J67j48J12k09L13o02L20J49j28R1k65
$$ -16 93 -52 182 333 -168 -253 159 360 -53 -27 140 -8 104 -105 208 -394 -74 75 -53 38 -227
7885b27K52j1J06J16J08k49j06K2L2oj59J58q3P4J35l10K46j71J34k78L87k30
$$ -227 25 14 120 236 344 95 -11 11 43 37 -122 36 -47 27 162 -148 98 -73 61 -217 170 -60
7907f0P2l9L03j66j33j38J73K72l11j51K06q1k8J98p3r9M08j97p5m0O6k5m8J1
$$ -60 12 -27 276 110 -23 -161 12 284 -27 -178 28 -53 -81 117 44 -55 353 156 81 41 107 82 34 45
7931D5j57K13m07K52M2l1L51j98m6k36K85K24l33j62J90J46j06P3k68J65Pk88
$$ 45 -112 101 -306 -54 -12 -43 308 110 64 -172 113 337 4 -158 32 178 72 145 -123 42 49 -239
7953b39K51j22j43J45J30j13L37l43K43J56n89K59J12o2O3J3k5j61K76M1j09P4
$$ -239 12 -110 -253 -108 22 -91 246 -97 146 302 -287 -28 84 22 85 98 73 -88 188 229 120 194
7975A94k54J36q3k79O5K13L43l15N0j92L80l6n45K34P8j68J68P2k03J17m2QK6
$$ 194 -60 76 -7 -286 -221 -8 335 20 70 -122 258 222 -323 -89 -11 -179 -11 61 -142 -25 -67 -59 -33
7998c3k5O4n29M10J58j31J54k79J13l0K32l04P1J20J39j33j28j3J82k94N11j53
$$ -33 -58 6 -523 -113 45 -86 68 -211 -98 -128 104 -200 -129 -9 130 -3 -131 -144 38 -256 255 102
8020A02j66J21j35m9K85j05R6j99q4J07p7L11k16R8r2P1o7J62j09K64l41k13R1
$$ 102 -64 57 -78 -127 158 53 149 -50 -134 -27 -104 207 -9 89 -3 68 1 163 54 318 -23 -236 -145
8043a45L32j55J57j74N0j46L1N2j10j79K49N0L0O4L2K8k10K9m7J71l52L90j34
$$ -145 187 32 189 15 65 -81 -50 2 -108 -287 -38 12 42 106 138 166 -44 -15 -62 109 -243 147 13
8066A3r1L20l95J94Oj41J73k1k15J50N16k87m64Q2K24j30j1J12K13j06k92L5n4
$$ 13 -78 242 -153 41 47 -94 79 58 -157 -7 509 222 -242 -160 64 -66 -77 35 248 142 -150 -115 -169
8089a69K40j45J31J40j12Lj29m8k13N61j53m7L3K0Jj37m5K4J24L57l49l2l33N59
$$ -169 71 -74 57 197 85 88 -41 -89 -302 259 106 59 92 112 113 -24 -69 -45 79 436 87 55 -278 281
8113B81l94K67j19n0P6k27L62j33Q8j37j32N7o2Jk07J12p8K12J13K78m88J81R2
$$ 281 -113 154 35 -15 61 -166 196 63 151 14 -118 -61 -123 -122 -329 -217 -295 -83 30 308 -180 1 93
8136I3m0k37J64J8L0k44K95j79j05N9J74k5K0j22K01j33P8P8k41l0p7j49K8K55
$$ 93 53 -184 -20 -2 28 -216 79 -100 -205 -146 28 3 23 -99 102 -31 47 125 -116 -146 -223 -372 -344 -89
8160h9J3J61J21l08pO0j30K37j49J18P8m0j89K15K95m50J85k81M14k32j37p5K37
$$ -89 -76 85 206 -102 -109 -49 -179 58 -91 27 105 65 -124 91 386 -64 121 -160 254 22 -115 -190 47
8183D7J45l45j01K08J33J8k59K07
$$ 47 192 -153 -254 -46 87 105 -154 53
8191E3
$$ Imaginary data points
##PAGE= N=2
##DATA TABLE= (X++(I..I)), XYDATA
0@%%%%%%%pJ5j6J6j6K4l2M0m8N6o7P6r0J06j28J51j70J95k26K58k93L33l78M26
$$ 0 0 0 0 0 0 0 0 -7 8 -8 8 -8 16 -16 24 -24 32 -35 41 -49 57 -71 80 -90 105 -121 137 -156 177 -201 225
31B25m80N39o03O73p49Q35r29J029j141J266j401J551j717J901k110K344k607
$$ 225 -255 284 -319 354 -395 440 -489 540 -601 665 -736 815 -902 999 -1111 1233 -1374
48a374K911l261L671m163M761n507O471p769R629j2538J7770l0172J15089J20769
$$ -1374 1537 -1724 1947 -2216 2545 -2962 3509 -4260 5369 -7169 10601 -19571 95518 216287
62B16287j11601n2769r515N6463J9331j2415m2700p663J9125K2170l0882n9317
$$ 216287 104686 51917 42402 98865 118196 105781 63081 55418 74543 96713 65831 6514
74F514m8237N277L2277K7980j0479l3437k7646N525J4563m431k2354L85L6645
$$ 6514 -41723 -36446 -4169 23811 13332 -20105 -47751 -42226 -27663 -32094 -54448 -54063 -17418
87a7418M3651K668m1344m0495J0451N8739N2683Q21l6952j8730K7655L9849M57
$$ -17418 26233 28901 -12443 -52938 -42487 16252 68935 69756 32804 14074 41729 81578 82035
100H2035l9717k8320K4358N9061L6462k0819n9811m4600K563L3181K1192o749
$$ 82035 42318 13998 38356 97417 133879 113060 53249 8649 11212 44393 65585 58836
112E8836j9688r152L052j807k3117l8266k2888J6746L6287J3707k5369l5778j0746
$$ 58836 39148 29996 33048 31241 8124 -30142 -53030 -36284 3 13710 -11659 -47437 -58183
125e8183J1463O835j4919j8296J3420M4834L2087j7382m7050k0250L0228N2385
$$ -58183 -46720 -39885 -54804 -73100 -59680 -14846 17241 -141 -47191 -67441 -37213 15172
137A5172K9049p043k0830l800J9490K2410N55j9367j2679J4848L3078J8011k0244
$$ 15172 44221 37178 16348 12548 32038 54448 55003 35636 22957 37805 70883 88894 68650
150F8650m6958l2813N173K7435J2449j7144k3694q074J905j0979k9786k4770N145
$$ 68650 21692 -11121 -5948 21487 33936 16792 -6902 -14976 -13071 -24050 -53836 -78606 -73461
163g3461K9032K2713p206k8566j9034P978J9571N185r144L58K5731L3093J2994
$$ -73461 -44429 -21716 -28922 -57488 -76522 -68544 -48973 -43788 -52932 -52574 -26843 6250 19244
176A9244j6979k8449q250K4394L9798K4505o054k2574j1761Q704J4958r9j7533
$$ 19244 2265 -26184 -34434 -10040 29758 54263 48209 25635 13874 22578 37536 37437 19904
189A9904j2579J2348K5420L453k9964l6769j0713J5571J5733l163j4253p345J466
$$ 19904 7325 19673 45093 48546 18582 -18187 -28900 -13329 2404 -759 -15012 -22357 -20891
202b0891k972j7380k0515l311J8329K3091P429j2849k0484r455Q197J7459R991
$$ -20891 -23863 -41243 -61758 -65069 -46740 -23649 -16220 -29069 -49553 -59008 -50811 -33352 -23361
215b3361j715p70J2985K1950R713j4399k3200l185K7441L6285J4471j4776k1615
$$ -23361 -25076 -25846 -12861 9089 18802 4403 -18797 -21982 5459 41744 56215 41439 19824
228A9824n055J1177O706p454j0099K812J2804N254j3491k5864j9432j496R971
$$ 19824 14769 25946 32652 25198 15099 17911 30715 35969 22478 -3386 -22818 -24314 -14343
241a4343N315n434r980n082j878n998j1653j0023J316J6897K1514P864j2409j9841
$$ -14343 -9028 -14462 -24442 -29524 -31402 -37400 -49053 -59076 -57760 -40863 -19349 -11485 -23894 -43735
255d3735m503J6874K3417J0403m021j735J3699J8337J878j7922j4302R441K6113
$$ -43735 -48238 -31364 -7947 2456 -1565 -3300 10399 28736 30614 12692 -1610 7831 33944
268C3944J8644k122j4987j2776n005k16m33j917r58J542J982l793j3677j9381
$$ 33944 52588 50466 35479 22703 17698 17482 17049 15132 14174 15716 17698 13905 228 -19153
282a9153j1951K667J3192P110o630j1692m681M211L73r115q203P391K1644J8133
$$ -19153 -31104 -28437 -15245 -8135 -14765 -26457 -31138 -26927 -26554 -35669 -43872 -36481 -14837 3296
296C296L9j5961j3904M133J8856J6808M113j629L356Q423M644m894q821l027R195
$$ 3296 3335 -12626 -26530 -22397 -3541 13267 17380 15751 19107 27530 32174 27280 18459 15432 24627
311B4627J5373R344l927j4016j3295n158J531J365k231l140J06J990n390j7534
$$ 24627 40000 49344 45417 31401 18106 12948 14479 15844 13613 10473 10579 12569 7179 -10355
325a0355j8880l949J2129J3502N77j1196q949P87M410r22o109O9J3643J7815Q765
$$ -10355 -29235 -33184 -21055 -7553 -6976 -18172 -27121 -26334 -21924 -22846 -28955 -28886 -15243 2572 11337
340A1337n277j0412n061N259J3307J3957P099n04k586J286J425l258p472k670
$$ 11337 6060 -4352 -9413 -4154 9153 23110 30209 29705 27119 28405 29830 26572 19100 16430
354A6430Q965J2890K954j2090j7774r125J230K037l184m691K03K770k490j1100
$$ 16430 25395 38285 41239 29149 11375 2250 3480 5517 2333 -2358 -2155 615 -1875 -12975
368a2975j5576q955L850J2190R687j508q230n558P62K938J453J556N505J0549
$$ -12975 -28551 -37506 -33656 -21466 -11779 -13287 -21517 -27075 -26313 -23375 -21922 -20366 -14861 -4312
382d312J1041N022m808q578l158O966J5274J0573J758m754k953J290j419o899
$$ -4312 6729 11751 6943 -1635 -4793 2173 17447 28020 29778 25024 22071 23361 21942 15043
396A5043o872L647J1034N684p820j4859j1395m349M58M14r75q81j58j587m929
$$ 15043 8171 11818 22852 28536 20716 5857 -5538 -9887 -9429 -9015 -9990 -10871 -11029 -12616 -17545
411a7545q521q094k497O115J1711Q915n79p484o027K737O938N067K260N565R970
$$ -17545 -26066 -34160 -36657 -30542 -18831 -9916 -10495 -17979 -24006 -21269 -14331 -9264 -7004 -1439 8531
426H531Q764m68q326o806K637J0870J0205L474l173l178k370l148n087m242p55
$$ 8531 17295 16827 8501 1695 4332 15202 25407 28881 25708 22530 20160 17012 11925 7683 6928
441F928M130N127Q69q196j2948r811k368L633L364L06k339k046j802l394n531
$$ 6928 11058 16185 17054 8858 -4090 -13901 -16269 -12636 -9272 -8966 -11305 -13351 -15153 -18547 -24078
456b4078m674J194R507J0917M725l942o844j259M897O515L228L518P104Q408K461
$$ -24078 -28752 -27558 -18051 -7134 -2409 -6351 -13195 -14454 -9557 -3042 186 3704 10808 19216 21677
471B1677n588p359o00N436P450N672J633l630o672n317k745j964k859j508J633
$$ 21677 16089 8730 8130 13566 21016 26688 28321 24691 18019 12702 9957 7993 5134 3626 5259
486E259L529j646j0096j3106o484J947N916J738j729j234m85j614l653l170R85
$$ 5259 8788 7142 -2954 -16060 -22544 -20597 -14681 -12943 -14672 -15906 -16391 -18005 -21658 -24828 -23843
501b3843O560R291O996J210l947k793J149N071M957M147M517L713K637r32m486
$$ -23843 -17283 -7992 -996 214 -3733 -6526 -5377 -306 4651 8798 13315 17028 19665 18733 14247
516A4247n460j534M514O734L733k919p848p021l403p92j805k291kK506Q85m781
$$ 14247 8787 7253 11767 18501 22234 19315 11467 4446 1043 251 -1554 -3845 -3847 -1341 -456 -5237
532e237r580o995m99M088L918K261m6l68j461k045j950N52L993P238O751M066
$$ -5237 -14817 -21812 -22311 -18223 -14305 -12044 -12090 -12458 -13919 -15964 -17914 -17362 -13369 -6131 620 4686
548D686o20l444k720K085O632N342K753N32K347J803j554n871m822J339N800M615
$$ 4686 4066 622 -2098 -13 6619 11961 14714 15246 17593 19396 17842 11971 7149 8488 14288 18903
564A8903j004n678o380m313l089j921k75L64K09r69k157m129o439l394J122M987
$$ 18903 17899 12221 5841 1528 -1561 -3482 -3757 -3393 -3184 -4153 -6310 -10439 -16878 -20272 -19150 -14163
580a4163L818J726k77o17p84j4K35K579M651P312O145K042l180l998l75M167N853
$$ -14163 -10345 -8619 -8896 -9513 -10297 -10311 -10076 -7497 -2846 4466 10611 12653 9473 5475 5100 9267 15120
597A5120L312m4o10L39n99m465n695j740J598L168M70k135m780o136n340j828
$$ 15120 18432 18388 17778 18117 17518 13053 7358 5618 7216 10384 10854 8719 3939 -2197 -7537 -9365
613i365N91J457K05n32l62k231l460l688o64L767N435L426l9j373N33J037J03
$$ -9365 -8774 -7317 -7112 -7644 -8006 -10237 -13697 -17385 -18049 -14282 -8847 -5421 -5460 -6833 -6300 -5263 -5160
630e160M76K775N287N621K941j247l732k884J144L714L676J962J26k199k816k183
$$ -5160 -4684 -1909 3378 8999 11940 10693 6961 4077 5221 8935 12611 14573 14699 12500 9684 7501
646G501k718k423j316J050K020j70l125n594m759k497n04J035J166O36J5n55k434
$$ 7501 4783 2360 1044 2094 4114 3944 819 -4775 -9534 -12031 -12535 -11500 -10334 -9698 -9683 -10238 -12672
663a2672l663j567K959N035M717J780o79j022J358J964J145J565L514M637L241
$$ -12672 -16335 -17902 -14943 -9908 -5191 -3411 -4090 -5112 -3754 -1790 -645 920 4434 9071 12312
678A2312O93j603k586k121R3L239M265R16l303l368k634k532k333j717o42J709
$$ 12312 13005 11402 8816 6695 6788 10027 14292 15208 11905 8537 5903 3371 1038 -679 -1321 388
694C88J076k246m491m121j687p91J58J652K569J200o1j462j559j278P28L707N529
$$ 388 1464 -782 -5273 -9394 -11081 -11872 -11714 -10062 -7493 -6293 -6354 -7816 -9375 -10653 -9925 -6218 -689
711f89M104Q53j055j117Q58J640J722K034K412K078J623m85k687l045j180O15
$$ -689 3415 4268 3213 2096 2954 4594 6316 8350 10762 12840 14463 13978 11291 8246 7066 7681
727G681K978J929r16l333l437k334k641k284J12J550P92r87l111l656k441n91
$$ 7681 10659 12588 11672 8339 4902 2568 -73 -2357 -2245 -695 97 -890 -4001 -7657 -10098 -10689
743a0689M76J688J618J490Q89n37j044j095M6J897L769M825L485r74j909j304
$$ -10689 -10213 -8525 -6907 -5417 -4528 -5065 -6109 -7204 -7158 -5261 -1492 3333 6818 5844 3935 2631
759B631J120K494J572J653J520R60K44k482k776j837p99R55J111J67j531k997
$$ 2631 3751 6245 7817 9470 10990 11950 12194 9712 6936 5099 4300 5255 6366 6533 5002 2005
775B005m230k562j469j73Q7J058M25r81l118l102q86J305J829K177J789J171J23
$$ 2005 -2225 -4787 -6256 -6429 -6342 -5284 -4859 -5840 -8958 -12060 -12946 -11641 -9812 -7635 -5846 -4675 -4552
792d552j75k45K40R87K103M265L643J861j921k088q68J245J706J773Q30R26p35
$$ -4552 -4727 -4972 -4732 -3745 -1642 2623 6266 8127 6206 4118 3250 4495 6201 7974 8804 9730 8995
809H995j791l185j752o13k83Q5J015n10k088l295k775j229m85R2P02J715O47j260
$$ 8995 7204 4019 2267 1654 1371 1456 2471 1961 -127 -3422 -6197 -7426 -7911 -7819 -7117 -5402 -4755 -6015
827f015k649k260Q04K612K648J568J305K75N04k05j21J198J396K368L093J904
$$ -6015 -8664 -10924 -10120 -7508 -4860 -3292 -1987 -1712 -1208 -1413 -1534 -336 1060 3428 6521 8425
843H425m3j222k291l03R63J578J551J76o71k117k110k200k021K14N20M57n39j590
$$ 8425 8382 7160 4869 4566 5529 7107 8658 8834 8163 6046 3936 1736 -285 -71 449 906 367 -1223
861a223k095k647j621n44N10M57J298J129K34j280k359l40J460L385K233J715
$$ -1223 -3318 -5965 -7586 -8130 -7620 -7163 -5865 -4736 -4502 -5782 -8141 -8481 -7021 -3636 -1403 312
877C12K81N6L54p77O15J818J924J540J463L05p83j806j838l05J423R25J11p31
$$ 312 593 649 1003 226 841 2659 4583 6123 7586 7891 7108 5302 3464 3159 4582 5507 5618 4887
895D887j184j810k434k195p10N60Q84M8j330j596j514j896q04Q95J588N39P20
$$ 4887 3703 1893 -541 -2736 -3446 -2886 -2002 -1954 -3284 -4880 -6394 -8290 -9094 -8199 -6611 -6072 -5352
912e352O92M24j072j364M84K648K736J743J156n9k21l03J60J034J848J240R51
$$ -5352 -4660 -4236 -5308 -6672 -6188 -3540 -804 939 2095 2036 1815 1512 1672 2706 4554 5794 6745
929F745j24j06q28j979r30k2O92N82q65o57j419j856j932j697L08J146M95l39
$$ 6745 6621 6515 5687 3708 2778 2756 3448 4030 3165 2508 1089 -767 -2699 -4396 -4088 -2942 -2447 -2786
947b786j082j224j331k84M08J098J420J053N77J99K38m30J4J008K136K907J068
$$ -2786 -3868 -5092 -6423 -6707 -6299 -5201 -3781 -2728 -2151 -1952 -1714 -2144 -2130 -1122 1014 3921 4989
964D989J09m26l09J40J54Q14J294Q55J70p88r94j499r80n50J21M99l3j057j380
$$ 4989 5098 4672 4363 4503 4657 5471 6765 7620 7790 7002 6008 4509 3529 2979 3100 3599 3566 2509 1129
983A129j459j033j494r59P00J137M54q34q70r01n51K38Q46J768J195K63J08N89
$$ 1129 -330 -1363 -2857 -3816 -3116 -1979 -1525 -2359 -3229 -4130 -4681 -4443 -3597 -1829 -634 -371 -263 326
1001C26K74Q3K48J185J856J917K83o86n89j88K39n62O50J465M1q63j117j754q00
$$ 326 600 683 931 2116 3972 5889 6172 5486 4897 4709 4948 4386 5036 6501 6542 5679 4562 2808 2008
1020B008j231p7k19L84n20j214j154j050j110o40k04R19P24J72l08p48m00k5N24
$$ 2008 777 700 481 865 345 -869 -2023 -3073 -4183 -4823 -5027 -4108 -3384 -3212 -3520 -4268 -4668 -4693 -4169
1039d169J297J623J289m6J56n6K26N76N71J381J259N47m23m66p41k59j87K13K40
$$ -4169 -2872 -1249 40 -6 150 94 320 896 1467 2848 4107 4654 4231 3765 3024 2765 2578 2791 3031
1058C031M24k63j483j079j120j015k93l13K26J19m53j330j529l60n7l2N16R90
$$ 3031 3455 3192 1709 630 -490 -1505 -1798 -2111 -1885 -1766 -2219 -3549 -5078 -5438 -5495 -5527 -5011 -4021
1076d021K00N83n53m18MR47R59J074J303P77J62j51r4J33O46R62R47O16K05n90
$$ -4021 -3821 -3238 -3791 -4209 -4205 -3258 -2299 -1225 78 855 1017 866 772 905 1551 2513 3460 4076 4281 3691
1096C691r57p37l08J92q1J24j17l54j254j591j041l12j1k49O06j24j119q95o49
$$ 3691 2734 1997 1689 1881 1800 1924 1807 1453 199 -1392 -2433 -2745 -2756 -3005 -2399 -2523 -3642 -4537 -5186
1115e186K70K34J24Q16J002O96j37n10p4O49Q49J129J157J050L10k81k40k46M58
$$ -5186 -4916 -4682 -4558 -3742 -2740 -2044 -2181 -2691 -2765 -2116 -1267 -138 1019 2069 2379 2098 1858 1612 2070
1134B070N72M33L56N00m76r19j427o35L02o2n2r3j98j045r99j313m47j88L04K27
$$ 2070 2642 3075 3431 3931 3455 2536 1109 474 776 714 662 569 371 -674 -1673 -2986 -3433 -3621 -3317 -3090
1154c090K39j16q43k90k65J35L27J404O66J60Q68n24J14J27Q38R65M51J064M43
$$ -3090 -2851 -2967 -3810 -4100 -4365 -4230 -3903 -2499 -1833 -1673 -805 -1329 -1215 -1088 -250 715 1166 2230 2673
1173B673N2k64q80M32L77L33K35Q4J88r52j262p31n14M88jl02m02j54p59q36j012
$$ 2673 2725 2461 1581 2013 2390 2723 2958 3042 3230 2278 1016 285 -229 259 258 -44 -446 -600 -1359 -2195 -3207
1194c207%L16P25j57O9O9k98m42j28Q08J369P00M11M26L88j69P0j20J056J107
$$ -3207 -3207 -2891 -2166 -2323 -2254 -2185 -2483 -2925 -3053 -2245 -876 -176 235 661 1049 880 950 830 1886 2993
1214B993N81M91q2m01o44l04L8N61K30l24N2j13j016j088q83L34j97j64M9o70
$$ 2993 3574 4065 3983 3582 2938 2634 2672 3233 3463 3139 3191 3078 2062 974 91 425 228 64 113 -557
1234e57j38o50q43m36M92O03L81R9J3L7k74j51N11R00N53L04O88P06J45l73l00
$$ -557 -695 -1345 -2188 -2624 -2132 -1529 -1148 -1049 -1036 -999 -1273 -1424 -913 -13 540 844 1532 2238 2383 2010 1710
1255A710L69P80P88J29j28J02p86k87n84K13m2J46Jj139k84o03j185k75P1j99
$$ 1710 2079 2859 3647 3776 3648 3750 2964 2677 2093 2306 2264 2410 2411 1272 988 385 -800 -1075 -1004 -1203
1275a203K53j16n85l67m42k47N5J53M64P91J67n31K43j86M08O39P38O28M85m8
$$ -1203 -950 -1066 -1651 -2018 -2460 -2707 -2652 -2499 -2035 -1244 -1077 -1608 -1365 -1551 -1143 -504 234 862 1347 1299
1295A299r4J05J38k00K57Q53K77l05k67n14k95p12j33N6J22J70j004n68k75q09
$$ 1299 1205 1310 1448 1248 1505 2358 2635 2330 2063 1549 1254 542 409 465 587 757 -247 -815 -1090 -1899
1315a899m72q6K41J77N2n28k39K4m37K19J33P74N77K86j3j03M88J40J5R37O83
$$ -1899 -2371 -2457 -2216 -2039 -1987 -2515 -2754 -2730 -3167 -2948 -2815 -2041 -1464 -1178 -1191 -1294 -806 -666 -651 286 969
1336I69N64Q8l24J83m0l24M46K73L7L50n26n44l45l57j82k22r1L01l43m97o57
$$ 969 1533 1621 1297 1480 1440 1116 1562 1835 1872 2222 1696 1152 807 450 268 46 -45 256 -87 -584 -1241
1357a241j90n58q5K82j67M42j95j77J9j47M88K9K9J067O09Q1k63K71R8L76N42
$$ -1241 -1431 -1989 -2074 -1792 -1959 -1517 -1712 -1889 -1870 -2017 -1529 -1500 -1471 -404 205 286 23 294 392 768 1310
1378A310K90M75J55J27l51l9m5j85k9K34K52Mq67n50j59m17j52n28M3J26o11k13
$$ 1310 1600 2075 2230 2357 2006 1967 1922 1737 1708 1942 2194 2198 1331 781 622 205 53 -475 -432 -306 -917 -1130
1400a130p09l21P2j45N25K24p3K5j33R0J21M09L30L8P15M05K28k27M91R4Q8L03
$$ -1130 -1839 -2160 -2088 -2233 -1708 -1484 -1557 -1532 -1665 -1575 -1454 -1045 -715 -677 38 443 671 444 935 1029 1117 1420
1422A420M38K48j53j84m69Nj83J35m06M43p5o59r4j000j86k13r0l81K50jj31m44
$$ 1420 1858 2106 1953 1769 1300 1305 1122 1257 851 1294 1219 560 466 -534 -720 -933 -1023 -1404 -1154 -1155 -1286 -1730
1444a730l65k08K78P9M18P6L10L98p37J88O64J60L87O80J85K38J06l74J52N36
$$ -1730 -2095 -2303 -2025 -1946 -1528 -1452 -1142 -744 -1481 -1293 -629 -469 -82 598 783 1021 1127 753 905 1441
1464A441K58n7K52M1K4m78l54l72L45j72k5l63j43l49l10l08k55l56K39K21r9
$$ 1441 1699 1642 1894 1935 1959 1481 1127 755 1100 928 903 540 397 48 -262 -570 -825 -1181 -942 -721 -820
1485h20j72m33o2j85L93K33L46J40L34Q3J44r9J28L21P48J63J8N20P7k78m4K4
$$ -820 -992 -1425 -1487 -1672 -1279 -1046 -700 -560 -226 -143 1 -98 30 351 1099 1262 1280 1800 1877 1599 1555 1579
1507A579L98N8j66J25K22l94o81m68L02l64L7o9o40Q2M2o98l99KK20lj74K30m58
$$ 1579 1977 2035 1869 1994 2216 1822 1141 673 975 611 648 579 -61 21 63 -635 -1034 -1032 -812 -815 -989 -759 -1217
1530a217K05j92j79L95M80K41j05N61k4o9r6M81L25O27k95K79K5O1j19l14K54
$$ -1217 -1012 -1204 -1383 -988 -508 -267 -372 189 165 96 0 481 806 1433 1138 1417 1442 1503 1384 1070 1324
1551A324j33m1L30n67l31L07o47m93J81p5l64J73o90L75r04l02L00o2M73j53k27
$$ 1324 1191 1150 1480 913 582 889 242 -251 -70 -145 -509 -336 -1026 -651 -1555 -1857 -1557 -1619 -1146 -1299 -1526
1572a526Q6J28j27p4K87L55M63K62j7P8K26j1J99J18M9L31K38%J1k34o3k72l96
$$ -1526 -1440 -1312 -1439 -1513 -1226 -871 -408 -146 -163 -85 141 130 329 447 496 827 1065 1065 1076 842 779 507 111
1595A11M02J14J54o17j63l12k29j46m5K9l17Q6o13N37n54k55K50L79o1K98j56
$$ 111 513 627 781 164 1 -311 -540 -686 -731 -702 -1019 -933 -1546 -1009 -1563 -1818 -1568 -1189 -1250 -952 -1108
1616a108J64J01L19l35K62M91N98j96J31K12j04Mj51P15L05M6n08J11Jj81k62
$$ -1108 -944 -843 -524 -859 -597 -106 492 296 427 639 535 539 388 1103 1408 1454 946 1057 1058 877 615
1637F15m90N12L1m8l55l04j84J03k26m64J30J59j97j46p6J94m36J12J56K87P4
$$ 615 125 637 668 620 265 -39 -223 -120 -346 -810 -680 -521 -718 -864 -940 -746 -1182 -1070 -914 -627 -553
1658e53k9J25L28j63J94K08N9L73L96q1j60M13k58J27K30m0J09O6j61K40n52j89
$$ -553 -582 -457 -129 -292 -98 110 169 542 938 857 697 1110 852 979 1209 1169 1278 1344 1183 1423 871 682
1680F82k56k35R4j68J62m29l38p2l66J27n7J89j59j87l19MJ41J77p2J70L98J59
$$ 682 426 191 285 117 279 -150 -488 -560 -926 -799 -856 -667 -826 -1013 -1332 -1328 -1187 -1010 -1082 -912 -514 -355
1702c55K48o5j9J48J47K57J02L35K14k64J56r9Rq4Or8K10n3p5m58k13J18l34M4
$$ -355 -107 -172 -191 -43 104 361 463 798 1012 748 904 805 814 730 736 638 848 795 720 262 49 167 -167 -123
1726a23q2k1j43n0m16M1o5j8k41J98M01m71j17J89K62O82o55M48K95o7m19O34
$$ -123 -205 -226 -369 -419 -835 -794 -859 -877 -1118 -920 -519 -990 -1107 -918 -656 26 -629 -181 114 47 -372 262
1748B62J06L98k50R8K87J65j9l78J81j4j08J33J6l49L01l44j64k58n7m98K35l39
$$ 262 368 766 516 614 901 1066 1047 669 850 836 728 861 877 528 829 485 321 63 6 -492 -257 -596
1770e96J1R5K1j11l60J05J76j32O7n3J25N7J31j01J02M77m9K3r0L56K46kj50K41
$$ -596 -585 -490 -469 -580 -940 -835 -659 -791 -724 -777 -652 -595 -464 -565 -463 14 -35 -12 -102 254 500 498 348 589
1794E89K59jj4j38J92j48k59n9m06L52j4j89m6k78p6m30K9p6J91k11j17O2l11
$$ 589 848 847 833 695 887 739 480 421 15 367 353 164 118 -160 -236 -666 -637 -713 -522 -733 -850 -788 -1099
1817a099P5j64K00K92J97k37J85j42K24J66J56J47m7Q4L41l02L15q7j63J32K51
$$ -1099 -1024 -1188 -988 -696 -499 -736 -551 -693 -469 -303 -147 0 -47 37 378 76 391 304 141 273 524
1838E24J0J89l03L53j74m01j48K76M1m2m24J88l54j03l16k06J94J86k61j15K51
$$ 524 534 723 420 773 599 198 50 326 367 325 -99 89 -265 -368 -684 -890 -696 -510 -771 -886 -635
1859f35k85M92p6o4o9K84k41L56L37m8r6N4K17J09J22O1M34O0k94J46k35M12k30
$$ -635 -920 -428 -504 -568 -637 -353 -594 -238 99 51 -45 9 226 335 457 518 952 1012 718 864 629 1041 811
1882H11j9P8o1j51O9l96l15L19J74j76k39M7n03ML5p2J22J82j52j83K87k03j35
$$ 811 792 870 809 658 727 331 16 335 509 333 94 141 -362 -358 -323 -395 -273 -91 -243 -426 -139 -342 -477
1905d77J41M93m6J84j91qj7K58K81q3J53N1J12j99R2K28l37j55K12K8M82n07r4
$$ -477 -336 157 111 295 104 96 79 337 618 535 688 739 851 652 744 972 635 480 692 720 1202 695 601
1928F01j36q4%n52J4QJ36r4l71J04p9K51l18l15M64Mj58l9J44J40q2J94j19q7
$$ 601 465 381 381 -171 -157 -149 -13 -107 -478 -374 -453 -202 -520 -835 -371 -367 -525 -564 -420 -280 -362 -168 -287 -374
1952c74L85M8j54J90K17k47R9M39nK48l18p1J0p3j48n9j72J45l90L21l27n4nm07
$$ -374 11 59 -95 95 312 65 164 603 598 846 528 457 467 394 246 187 15 160 -230 91 -236 -290 -295 -702
1976g02RJ54L02o17L82k52J3j75L10J19k13K18J55l87M32J00J9k39L43J29j85
$$ -702 -693 -539 -237 -854 -472 -724 -711 -886 -576 -457 -670 -452 -297 -684 -252 -152 -133 -372 -29 100 -85
1997h5N59l71R2K27J57j4N3O2J2n00J19L7m20J45k07L57j90L06m61l65o8L31m05
$$ -85 474 103 195 422 579 565 618 680 692 192 311 348 -72 73 -134 223 33 339 -122 -487 -555 -224 -629
2020f29J31Q5j40J21k81n9L83O5k77M29k68L68q0j5L3J61P9k5K33L53l20K77k57
$$ -629 -498 -413 -553 -432 -713 -772 -389 -324 -601 -172 -440 -72 -152 -167 -134 27 106 81 314 667 347 624 367
2043C67Q6Q1l38K59M84l65l74L2k40J97k5m14L71k72K33l15j64k05O4N2k58L23
$$ 367 453 534 196 455 939 574 200 232 -8 189 164 -250 121 -151 82 -233 -397 -602 -538 -486 -744 -421
2065d21k98J43O2j19n5K13k93M79J20J61l26P4K06j98K57n8M61k25K35r5r0r8
$$ -421 -719 -576 -514 -633 -688 -475 -768 -289 -169 -8 -334 -260 -54 -252 5 -53 408 183 418 323 233 135
2087A35K82j39L2m23M11p6l76n5Q8n8P2m69L53j83M2M6J03q6k35m5K09Pp8K53
$$ 135 417 278 310 -113 298 222 -154 -209 -121 -179 -107 -576 -223 -406 -364 -318 -215 -301 -536 -581 -372 -365 -443 -190
2111a90k27J47J08j16R8O4K99q5R3j18P9K79j86L43p5Q9L4Nk36J73QM2k25O2l89
$$ -190 -417 -270 -162 -278 -180 -116 183 98 191 73 152 431 245 588 513 602 636 641 405 578 586 628 403 465 76
2136G6j26lK15N4k43K65j68l44n9j5j00j98K60K30N3k04K62R9j25K0O6J40q7J95
$$ 76 -50 -53 162 216 -27 238 70 -274 -333 -348 -448 -646 -386 -156 -103 -307 -45 54 -71 -51 15 155 68 263
2160B63J36L36j55J31j73Q0q9J56o6K03j21k16l41J50K0K79j69j17j61L32l47
$$ 263 399 735 580 711 538 618 529 685 619 822 701 485 144 294 314 593 424 307 146 478 131
2181A31k14r7Q5p6N6K8j58m4l18K75j48M79m81M58m11K67R6J42k12N6nJ34J63
$$ 131 -83 -180 -95 -171 -115 -87 -245 -289 -607 -332 -480 -1 -482 -24 -435 -168 -72 70 -142 -86 -91 43 206
2204B06J39k15N3K65l8q1m4J77k67L3J10n7j78J33k57J73l89Q7P8l87Q7J2J6k5
$$ 206 345 130 183 448 410 329 285 462 195 228 338 281 103 236 -21 152 -237 -150 -72 -459 -372 -360 -344 -369
2228c69m44P6K21j45K66j30j63L85K0l30M48p5R5n2J80k38J92j06L13j85K44k31
$$ -369 -813 -737 -516 -661 -395 -525 -688 -303 -283 -613 -165 -240 -145 -197 -17 -255 -63 -169 144 -41 203 -28
2250b8J75K12k79j87M17M3k98q8k78M36k1k57m28K80J98r1k18J00K10l89J57j80
$$ -28 147 359 80 -107 310 353 55 -33 -311 125 104 -153 -581 -301 -103 -194 -412 -312 -102 -491 -334 -514
2272e14J21J72J3o6rJ08N9k8j74J8K87K9j69M0K99j36J83LJ84Q5P7n03J10l3M19
$$ -514 -393 -221 -208 -274 -283 -175 -116 -144 -318 -300 -13 16 -153 -113 186 50 233 236 420 505 582 79 189 156 575
2297E75k06k38Ml25L17J3q2j34j4j48N5k37k08O56m85J1l99L55P4K81k02K09j30
$$ 575 369 131 135 -190 127 140 58 -76 -90 -238 -183 -420 -628 28 -457 -446 -845 -490 -416 -135 -337 -128 -258
2320b58l9K95l58N07P2J21k46o4R6J89k91L11j86k5O7n9K81j46j20K21j96j21
$$ -258 -297 -2 -360 147 219 340 94 30 126 315 24 335 149 124 191 132 413 267 147 368 172 51
2342E1l89K74K9q6J06m3k09O0j62l5L31l10J38l91Q0K79k04J77J01M34n15J72
$$ 51 -338 -64 -35 -121 -15 -58 -267 -207 -369 -404 -73 -383 -245 -636 -556 -277 -481 -304 -203 231 -284 -112
2364a12P4k96O61k20J23l5p9Q0m0K84Pj98O4J14k72J27j49m6k3K27k85Q2j87J91
$$ -112 -38 -334 327 107 230 195 116 196 156 440 447 249 313 427 155 282 133 87 64 291 6 88 -99 92
2388I2j15K19m50R5J85l46K11l79M13l39N02l05JQ2K61j9p9K1j2m99N39j68O91
$$ 92 -23 196 -254 -159 26 -320 -109 -488 -75 -414 88 -217 -216 -134 127 108 29 50 38 -461 78 -90 601
2411F01j23j17M5j26l5j08L34Q4j54n0j03N7j93j33J81j85l2L25o11J78p6M5l7
$$ 601 478 361 406 280 245 137 471 555 401 351 248 305 112 -21 160 -25 -57 268 -343 -165 -241 -196 -233
2434b33P9k48k5K81J96o61K67L08k49J53J95p6N7q5K31k14M02j50l06K71r4K78
$$ -233 -154 -402 -427 -146 50 -611 -344 -36 -285 -132 63 -13 44 -41 190 -24 378 228 -78 193 99 377
2456C77j85J4J82k72K15k04Q3l78R9k66N95k06p1q5k16J27m14K79J45r9O1j66
$$ 377 192 206 388 116 331 127 210 -168 -69 -335 260 54 -17 -102 -318 -191 -605 -326 -181 -280 -219 -385
2478c85j44K46nnj77L3J98j47j5J46L66j70J30k94N11l28J31k07L93Q5J6l88J08
$$ -385 -529 -283 -288 -293 -470 -437 -239 -386 -401 -255 111 -59 71 -223 288 -40 91 -116 277 362 378 -10 98
2501I8L2J14j27L1k46M59j88k21L16k68L01j19m81J79m7j78mK00j81K53q1jn0
$$ 98 130 244 117 148 -98 361 173 -48 268 0 301 182 -299 -120 -167 -345 -349 -149 -330 -77 -158 -159 -209
2524b09J04N55n84L48l38L61o8o5l5L89k00L05m80K26j01J02M7K5M15q21R5M34
$$ -209 -105 450 -134 214 -124 237 169 104 69 458 258 563 83 309 208 310 357 382 797 -24 71 505
2546E05k40l30N05j02R3m46M24m47J40l3J07l79J79L99o98L3N7K18J63r2k35Q2
$$ 505 265 -65 440 338 431 -15 409 -38 102 69 176 -203 -24 375 -323 -290 -233 -15 148 56 -179 -97
2568i7L85l29K3k4K16J83j41j22L04q4R3J23k91k91K53P1j36N10m74j74l9J17
$$ -97 288 -41 -18 -42 174 357 216 94 398 314 407 530 239 -52 201 272 136 646 172 -2 -41 76
2590G6k68J35J06pr3k4j09J83n60O6R8K66q7K22n88N09P8k75l5J65n3l6K59j46
$$ 76 -192 -57 49 42 -51 -75 -184 -1 -561 -495 -397 -131 -218 4 -584 -75 3 -272 -307 -142 -195 -231 28 -118
2614a18KO5K61k88j17N67j88j21jm75M07K81p5R7l31Q4k16m0j95J37j20P0j35
$$ -118 -116 -51 210 -78 -195 372 184 63 62 -413 -6 275 200 297 -34 50 -166 -206 -401 -264 -384 -314 -449
2637d49l9K33n7k03l0O6J83j33j26M01j50J16K30k85J15Q6K06Q0j4m0L7o2M6l82
$$ -449 -488 -255 -312 -515 -545 -479 -296 -429 -555 -154 -304 -188 42 -243 -128 -42 164 244 230 190 227 165 211 -171
2661a71N97r8L06j54m37J27m0K31k98N3k82L33j69J1j06J68j22l2m70L12M8J62
$$ -171 426 328 634 480 43 170 130 361 63 116 -166 167 -2 9 -97 71 -51 -83 -553 -241 -193 -31
2683c1k53M8r2M8L34l66K25M4R8l26J80M30j04o8l00K07L41l83O9J2J52L1r8l4
$$ -31 -284 -236 -328 -280 54 -312 -87 -43 55 -271 -91 339 235 167 -133 74 415 32 101 113 265 296 198 164
2707A64L5P6M2L8o8j93j90K30k29j39J88j56k5M0k46R9R0q1j01J44K23j58L63
$$ 164 199 275 317 355 287 94 -96 134 -95 -234 -46 -202 -227 -187 -433 -334 -244 -325 -426 -282 -59 -217 146
2730A46k78o8R2p6K56q8k57M22K5j11j07M6J38J22j78R8K72n44K66j33J09M5j97
$$ 146 -132 -200 -108 -184 72 -16 -273 149 174 63 -44 2 140 262 84 182 454 -90 176 43 152 197 0
2753@k97Q9M60k9k22m18K60k8J69j22j64m38O90L0m47mM37k23QK71L2N24n41N0
$$ 0 -297 -208 252 223 1 -417 -157 -185 -16 -138 -302 -740 -50 -20 -467 -471 -34 -257 -249 22 54 578 37 87
2777H7p3m6J94k23K47j29K96J66j19k04J22lq2K9J59l40K40M7l71L26m77J44J95
$$ 87 14 -32 162 -61 186 57 353 519 400 196 318 315 233 262 421 81 321 368 -3 323 -154 -10 185
2800A85k20J79l37L28m19L51j77J24J57P1k83K8K55j83L45p32M09J58J68o2k62
$$ 185 -35 144 -193 135 -284 67 -110 14 171 242 -41 -13 242 59 404 -328 81 239 407 345 83
2821H3L90j96K13l71L62r1J23m63L27j3lj87J04J16m66K53j24J60km05J02M2j5
$$ 83 473 277 490 119 481 390 513 50 377 364 361 174 278 394 -72 181 57 217 215 -190 -88 -46 -61
2844f1kJ46m18r1p2O41l25j54J70K51m59M24l35J12K71j20R8j99M1J43L01k78
$$ -61 -63 83 -335 -426 -498 143 -182 -336 -166 85 -374 50 -285 -173 98 -22 76 -123 -82 61 362 84
2866H4R2l84M03m4k19k17N05j12j88m1j8J83l25M0J14%J58m35K90m67J68L97m9
$$ 84 176 -208 195 151 -68 -285 220 108 -80 -121 -139 44 -281 -241 -127 -127 31 -404 -114 -581 -413 -16 -65
2889f5l01m88O31j54K33lk13K66k3k5j6j51K33J07o7J36k39K48J26j37QK51k14
$$ -65 -366 -854 -223 -377 -144 -147 -360 -94 -117 -142 -158 -309 -76 31 -36 100 -139 109 235 98 106 357 143
2912A43j18%k8Q1l37Q8J93n4q3J76Nm09K27o4J1q4K3J7j72J97J81l23K07K13l31
$$ 143 25 25 -3 78 -259 -171 22 -32 -115 61 66 -343 -116 -180 -169 -253 -230 -213 -385 -188 -7 -330 -123 90 -241
2937b41K15k84L66j08J24L5r4K18L3mj10k68L82K9m65N20j91L42j46n41L63Q8
$$ -241 -26 -310 56 -52 72 107 13 231 264 260 150 -118 264 293 -172 348 157 499 353 -188 175 263
2959B63N7l19O1j6j0k76J2L28k98P7J53k83R8J30k09n3Q3L66J4k30r1K48l82L57
$$ 263 320 1 62 46 36 -240 -228 100 -198 -121 32 -251 -153 -23 -232 -285 -202 164 178 -52 -143 105 -277 80
2983H0j59rKj20J11J31j09M54j36q0N0J07j46k43R4K1P2k76K06l12L88k96o5m5
$$ 80 -79 -88 -86 -206 -95 36 -73 381 245 165 215 322 176 -67 27 48 120 -156 50 -262 126 -170 -235 -280
3007b80L50l49M4K41M2n8k53k57M96k04m61N41L07j75k04n5J15J18J03O0k40J40
$$ -280 70 -279 -235 6 48 -10 -263 -520 -24 -228 -689 -148 159 -16 -220 -275 -160 -42 61 121 -119 21
3029B1r5J74l33K65K77j77J00p1J09k46l1j47M93J17l04l01K37M4k9r5o4R3j1
$$ 21 -74 100 -233 32 309 132 232 161 270 24 -7 -154 339 456 152 -149 88 132 103 8 -56 37 26
3052B6K11k08j32k2J22k19M47k17o2K29j11p5R4q6P3k7L63j92Rk30K36j7k74M44
$$ 26 237 29 -103 -125 -3 -222 225 8 -54 175 64 -11 83 -3 70 43 406 214 223 -7 229 212 -62 382
3076C82j23J10J94m01l5K50m8o0q9k0J63k94l63K02N3J77j18J76m21j0n8L54O7
$$ 382 259 369 563 162 127 377 329 269 180 160 323 29 -334 -132 -79 98 -20 156 -265 -275 -333 21 88
3099H8j26OK2oJ92j34R5j25K27n7o7o23O88k20J94j31l2J2n0Kj97L52K09k37j20
$$ 88 -38 -32 -10 -16 176 42 137 12 239 182 115 -508 180 -40 154 23 -9 3 -47 -45 -242 110 319 82 -38
3124c8Q9l7j8Pj44j66L8m2K05m27P23m44R0q6l78Q14n61J63R1j89K71m39K07M02
$$ -38 51 14 -4 3 -141 -307 -269 -311 -106 -533 190 -254 -164 -250 -628 186 -375 -212 -121 -310 -39 -478 -271 131
3148A31k14M3n0j90K94Jj73L89j80O9j96K17k41O2K17j65J28m3k99L14k19K22
$$ 131 -83 -40 -90 -280 14 15 -158 231 51 120 -76 141 -100 -38 179 14 142 99 -200 114 -105 117
3170A17j85K6j68l0M80l39rjo4J16n3Kj36K03J52p43O77j79J39K2OQ9J05J3k84
$$ 117 -68 -42 -210 -240 240 -99 -108 -109 -173 -57 -110 -108 -244 -41 111 -632 45 -134 5 27 33 122 227 240 -44
3195d4J69J3L45k34q1PK19l06j44J16mj35K57N7l4l13L32j93lJ74k60M3r7N3J
$$ -44 125 138 483 249 168 175 394 88 -56 60 56 -79 178 235 201 -112 220 27 24 198 -62 -19 -116 -63 -62
3220f2k41K73J63k92p0n5K08K98l36L78l01K14M2k01l8n7M80j64j28j75r0L34
$$ -62 -303 -30 133 -159 -229 -284 -76 222 -114 264 -37 177 219 18 -20 -77 403 239 111 -64 -154 180
3242A80O4oK19o63o1M34l24R7K46o31L52K93l32k8LR0J7j13l9j80L88j42l81L66
$$ 180 244 238 457 -206 -267 167 -157 -60 186 -445 -93 200 -132 -160 -157 -67 -50 -163 -202 -382 6 -136 -517 -151
3266a51l04Q1N1L42l24M14j82n6j76L22q0J84M3k89L28Nk65K24l94L02k4L24k85
$$ -151 -455 -374 -323 19 -305 109 -73 -129 -305 17 -63 121 164 -125 203 208 -57 167 -227 75 51 375 90
3289I0k5j68l26K37J09R2k06L47l67K87k48M2K00n1j12j10J59K05k06j83M52l44
$$ 90 65 -103 -429 -192 -83 9 -197 150 -217 70 -178 -136 64 13 -99 -209 -50 155 -51 -234 218 -126
3311a26L36N4k10L30q9q0J57k06RK72j98j36J93j00L05k54k42O5J12P2o5o9o4
$$ -126 210 264 54 384 295 215 372 166 175 447 249 113 306 206 511 257 15 80 192 264 199 130 66
3334F6m9L7J71L5j81n7R9J68q9l04J94k7j85J63j13J9j47L85j00o3K04k95L05
$$ 66 17 54 225 260 79 22 121 289 200 -104 90 63 -122 41 -72 -53 -200 185 85 22 226 -69 236
3357B36m09J82L99j10j23l60P13l62J50R0n12j4J48M45m97O7K80j80n6j22pJ93
$$ 236 -173 9 408 298 175 -185 528 166 316 406 -106 -120 28 473 -24 43 323 143 87 -35 -42 151
3379A51j45p4J98l9m19P3p8J18K36j01j09Q2R7Jl95L80k33Q1j21K99k0J37k80
$$ 151 6 -68 130 91 -328 -255 -333 -215 21 -80 -189 -107 -10 -9 -404 -24 -257 -176 -297 2 -18 119 -161
3402a61L33lJ04l25Lo5j00M73l08K5k1J44m74L01J66m9j88K0J08J85n12o0P8L43
$$ -161 172 169 273 -52 -49 -114 -214 259 -49 -24 -45 99 -375 -74 92 43 -145 -125 -17 168 -344 -404 -326 17
3426A7l92J74J73l99L99o2J03j28R5K41l75LM04k57K13p8K27J25n60K96K91m45
$$ 17 -375 -201 -28 -427 -28 -90 13 -115 -20 221 -154 -151 253 -4 209 131 358 483 -77 219 510 65
3448F5q6M24m64R2J3J10n9J77k85j20J36jo9m3K07r0J58l2r7k41J74J26L9k15
$$ 65 -21 403 -61 31 44 154 95 272 -13 -133 3 2 -67 -110 97 7 165 133 36 -205 -31 95 134 -81
3472h1J95k15L23j42J11N9N1l5M6o5q0J22n0r9L7r7k73K42P2J80n4P6j81J68m79
$$ -81 114 -101 222 80 191 250 301 266 312 247 167 289 239 140 177 80 -193 49 121 301 247 323 142 310 -169
3497a69M61k04l35K56K1j9J44m2j56j45J35j81K73o9l85J82K82M1k41J36J06j55
$$ -169 292 88 -247 9 30 11 155 113 -43 -188 -53 -234 39 -30 -415 -233 49 90 -151 -15 91 -64
3519f4l20M30l34J02r3K56j55L02j64O6Q8M7j45l06K5P1k4M17k59J79j89J01l90
$$ -64 -384 46 -288 -186 -279 -23 -178 124 -40 26 114 161 16 -290 -265 -194 -218 199 -60 119 -70 31 -359
3542c59J60r5L42k38p4K91j91p7k78J90L4J11j70L1L63o5k57L03j85O9J17j66
$$ -359 -199 -294 48 -190 -264 27 -164 -241 -519 -329 -295 -184 -354 -323 40 -25 -282 21 -164 -95 22 -144
3564a44N33m08M4j14L05j41R2Q7l04j11L70pk35J40j74J32J58k90L8k7K87m07
$$ -144 389 -19 25 -89 216 75 167 254 -50 -161 209 202 -33 107 -67 65 223 -67 -29 -56 231 -176
3586a76m8K70p8o0K61m45J64J85L7k89K75j50J37J01m3NR7l10R3J26k05K85q3
$$ -176 -224 46 -32 -92 169 -276 -112 73 110 -179 96 -54 83 184 141 146 243 -67 26 152 -53 232 149
3609A49k6J29J27k91r1j68N69j21J52n35L04p2j22L5J68l59l34P37P2m05k92O46
$$ 149 123 252 379 88 -3 -171 398 277 429 -106 198 126 4 39 207 -152 -486 251 323 -82 -374 272
3631B72l91O0N5J70M4l57K45k29j22J74qJ6J45J39j12j24K37k69K63L8j49q8J50
$$ 272 -119 -59 -4 166 210 -147 98 -131 -253 -79 -87 -71 74 213 101 -23 214 -55 208 246 97 9 159
3654A59k9R3k66L8J12l39J7K25k05J4J47J98j11k02l00L21j08J7J80o6J43j73
$$ 159 130 223 -43 -5 107 -232 -215 10 -195 -181 -34 164 53 -149 -449 -128 -236 -219 -39 -105 38 -135
3676a35J03m70L82k58L57l61J43M17k15q3K20L6j68j93K75N4P0l32k6M59l02J50
$$ -135 -32 -502 -120 -378 -21 -382 -239 178 -37 -120 100 136 -32 -225 50 104 174 -158 -184 275 -27 123
3698A23j37j11N0L05J6l09N7K16m63L75j91K44k01qk59K83k11P7P4J23j64j20
$$ 123 -14 -125 -75 230 246 -63 -6 210 -253 122 -69 175 -26 -34 -293 -10 -221 -144 -70 53 -111 -231
3720b31L06k59l6J83J20j08K86j32J68j00q2K24j89r8k83K96K1K20j99l9l0j5
$$ -231 75 -184 -220 -37 83 -25 261 129 297 197 115 339 150 52 -231 65 86 306 107 68 38 23
3742B3K09L1l2J62k72M5j53j30M08m90J87j69K82j59j70J76k66Q6J39q8L35l22
$$ 23 232 263 231 393 121 166 13 -117 291 -199 -12 -181 101 -58 -228 -52 -318 -232 -93 -181 154 -168
3764a68J56p9j55L14o4O6q0j37L24Kl7p7J01k01L8O9k2N9l37L37l7K17m43k32
$$ -168 -12 -91 -246 68 4 70 -10 -147 177 179 142 65 166 -35 3 72 50 109 -228 109 72 289 -154 -386
3788c86J57J59K80k87j16K68j58l34K95J70l47J30j40K56J39J6p41O71K47l00
$$ -386 -229 -70 210 -77 -193 75 -83 -417 -122 48 -299 -169 -309 -53 86 102 -639 32 279 -21
3808b1k33K12R0k63PJ92L3O2j86K57o0lL00l98q9K49j11k50J42m0J87L33l61%
$$ -21 -254 -42 48 -215 -208 -16 17 79 -107 150 90 87 387 -11 -100 149 38 -212 -70 -110 77 410 49 49
3832D9k57Q8L40m24j23K21N4n6l0O8J87R5j71j29P9JLm1J91l1o7n2M28l69rR1
$$ 49 -208 -120 220 -204 -327 -106 -52 -108 -138 -70 117 212 41 -88 -9 -8 -5 -46 145 114 47 -5 423 54 45 136
3858A36j19J98p4M1m29N55j19p4l49J33K27j64L41k96Lo0K37Q0j76Q8k2k02j2
$$ 136 17 215 141 182 -247 308 189 115 -234 -101 126 -38 303 7 10 -50 187 267 91 179 157 -45 -57
3881e7p7K30p5k75QL40j68k6J66O2k24q5jo3J02L69m23K31m6J81j15k51L33r6
$$ -57 -134 96 21 -254 -246 94 -74 -100 66 128 -96 -181 -182 -245 -143 226 -197 34 -12 169 54 -197 136 40
3905D0l67L55l3J50j05O7j58r7J14l18J35K5J32QP2j78j28P4l6r0J05K16j95L09
$$ 40 -327 28 -5 145 40 107 -51 -148 -34 -352 -217 -192 -60 -52 20 -158 -286 -212 -248 -338 -233 -17 -212 97
3929I7m29K96r1J91j29K91l8J37l66j7k5R8J08j60j08J8K04l06L52J5k03k09J76
$$ 97 -332 -36 -127 64 -65 226 188 325 -41 -58 -83 15 123 -37 -145 -127 77 -229 123 138 -65 -274 -98
3952i8j35N6KK14j38K92p8Pr9q4oj27K76q7J17P6j87qK0L05j09J69m04K7R4r7
$$ -98 -233 -177 -175 39 -99 193 115 122 23 -61 -67 -194 82 -5 112 188 1 -7 13 318 209 378 -26 1 95 -2
3978bM15m30M8P8K75j16r2j81L51L4l84L04j45j64j82L86m39R2L27j51J6k45k2
$$ -2 413 -17 31 109 384 268 176 -5 346 380 -4 300 155 -9 -191 195 -244 -152 175 24 40 -205 -227
4001b27K35K05j56j3o4L44l89j54kK66J26k28j36L48K9l27J17P5J54k22J70l02
$$ -227 8 213 57 44 -20 324 -65 -219 -221 45 171 -57 -193 155 184 -143 -26 49 203 -19 151 -151
4023a51K08j17j48J87L95k45k06j58l1K69K15l36L1J76j94k12J44K41j17n2k76
$$ -151 57 -60 -208 -21 374 129 -77 -235 -266 3 218 -118 -87 89 -105 -317 -173 68 -49 -101 -377
4044c77K19K59j07j56L06l78M1Q6j28K43j09P1m95O48j31kO7J75k59j63N28n51
$$ -377 -158 101 -6 -162 144 -234 -193 -107 -235 8 -101 -30 -525 123 -8 -10 57 232 -27 -190 338 -213
4066b13L75k40J12n31K15J44J34N2n0q4J2j36J26k1n8q4O2J08P7j77qN0J6K04
$$ -213 162 -78 34 -497 -282 -138 -4 48 -2 -86 -74 -210 -84 -105 -163 -247 -185 -77 0 -177 -185 -135 -119 85
4090H5l72K40j39K38k59N3r2k29N11J1j9j48k5J92J73o7r5J64m62K32L93k20k29
$$ 85 -287 -47 -186 52 -207 -154 -246 -475 36 47 28 -120 -145 47 220 153 58 222 -240 -8 385 165 -64
4113f4N52n05M0n6r7O7L72k38p4K17k07N5k71j20L48k29M55n74K06J08L43k53
$$ -64 488 -17 23 -33 -130 -63 309 71 -3 214 7 62 -209 -329 19 -210 245 -329 -123 -15 328 75
4135G5l03K38kJ33j27k8q6K20j95K90k07j57L36j27J29j2J02q4k34J55j14k69
$$ 75 -228 10 8 141 14 -14 -100 120 -75 215 8 -149 187 60 189 177 279 195 -39 116 2 -267
4157b67N01J55k89m55N64n83N35k55P9Pj51K1J49K16j58k68J71Q1R2m96O14l86
$$ -267 234 389 100 -355 209 -374 161 -94 -15 -8 -159 -138 11 227 69 -199 -28 53 145 -351 263 -123
4179a23Q9j16J03J47j06j59M02r0l54k4M6K62p9k7L05j87l19K19J36k34J59j19
$$ -123 -34 -150 -47 100 -6 -165 237 147 -207 -231 -185 77 -2 -29 276 89 -230 -11 125 -109 50 -69
4201f9p8J33j48O1n0N5j89K61J50m35J2O6m8J49OK26n8k29J19pJ31O2K9k77K43
$$ -69 -147 -14 -162 -101 -151 -96 -285 -24 126 -309 -297 -231 -279 -130 -124 102 44 -185 -66 -73 58 120 149 -128 115
4226A15n4K04k17N7R6O0k08R8K35o25M62K00l23N5j3j99K23k91J81P7k7j08k0
$$ 115 61 265 48 105 201 261 53 151 386 -239 223 423 100 155 142 -57 166 -125 56 133 106 -2 -22
4249b2L12m00L42l82J27j33K00L1J88k86j3j04J97M4l54L11J15l20J3M54Q4J9
$$ -22 290 -110 232 -150 -23 -156 44 75 263 -23 -36 -140 57 101 -253 58 173 -147 -134 320 404 423
4271D23k47oQ1k43J25j45J10K5j27j18J65l1j64N76m17N0l06j46J65L05k31j7
$$ 423 176 170 251 8 133 -12 98 123 -4 -122 43 12 -152 424 7 57 -249 -395 -230 75 -156 -173
4293a73L47p09M41J41j7j93L36p3m81L03m4J24l8K8j03J6J00J59j97K05k55L3
$$ -173 174 -535 -94 47 30 -163 173 100 -381 -78 -122 2 -36 -8 -111 -95 5 164 -33 172 -83 -50
4315e0J9J0J9m4n6j11J74K2K76k10j40K66l56R0M33m47J90m71L83n94M05K20l34
$$ -50 -31 -21 -2 -46 -102 -213 -39 -17 259 49 -91 175 -181 -91 342 -105 85 -386 -3 -597 -192 28 -306
4338c06M24k04l0l8L08m81M62o4m26K79K05k74K15j4j44M7j2K10q3J63j26l14
$$ -306 118 -86 -116 -154 154 -327 135 71 -355 -76 129 -145 70 56 -88 -41 -53 157 74 237 111 -203
4360b03L58k17K36j33O6k33K63J5j14P2k30K6K02k54M37L6n85K32k88K30J09k6
$$ -203 155 -62 174 41 107 -126 137 152 38 110 -120 -94 108 -146 291 327 -258 -26 -314 -84 25 -1
4382ap9L58m68K27j12L27j83j3p4J6K08j09o5k01J89K3J13q2R0j79J19j19j61
$$ -1 -80 278 -190 37 -75 252 69 56 -18 -2 206 97 32 -169 20 43 156 74 164 -15 104 -15 -176
4405a76o4N37j99j56J18j21K20PJ45j15m0j98kr6j64K80K49P1k63l42K35p8J42
$$ -176 -240 297 98 -58 60 -61 159 166 311 196 156 -42 -44 -140 -304 -24 225 296 33 -309 -74 -152 -10
4428a0K43m41J61m8K55r5q5M06l79J26p8Oo7L21l08j3M9j75K68j77M9J16m52J59
$$ -10 233 -208 -47 -95 160 65 -20 386 7 133 55 61 -6 315 7 -6 43 -132 136 -41 8 124 -328 -169
4452a69O5R4K2J2j95K20k9L3j3m05L56Q0j38R2j84P1K0j12P2K9l4N6K75m12K43
$$ -169 -104 -10 12 24 -171 49 20 53 40 -365 -9 71 -67 25 -159 -88 -68 -180 -108 -79 -113 -57 218 -194 49
4477D9J52m78M17n3m5K06l41J19j63K76j68k1Oq9Q5O2M04m69K9J91l24J16k57
$$ 49 201 -277 140 87 42 248 -93 26 -137 139 -29 -50 -44 -133 -48 14 418 -51 -22 169 -155 -39 -296
4500b96k0K95po5n7L26n3j78J06K28j47M3n0l54J80K05M0o7Mj6K67k84j31J71
$$ -296 -316 -21 -28 -93 -150 176 123 -55 51 279 132 175 125 -229 -49 156 196 129 133 117 384 100 -31 140
4524A40r6L60m64L02J81J6j85l51J95Q3J88m59L6M81l36j81m4o1J98n4J35m5J87
$$ 140 44 404 -60 242 423 439 254 -97 98 181 369 -90 -54 427 91 -90 -134 -195 3 -51 84 39 226
4547B26j35k10L5JJ42M2J57j32r0l1Q5k40K93j15R5j15N4k2Q4q0k3J09L86o89
$$ 226 91 -119 -84 -83 59 101 258 126 36 5 90 -150 143 28 123 8 62 40 124 44 21 130 516 -173
4571a73K61j90K90j61l94L10n7j01K43n0J37ko27M44o7Mn9j0J15k1J67M1l98N79
$$ -173 88 -102 188 27 -367 -57 -114 -215 28 -22 115 113 -514 -70 -137 -133 -192 -202 -87 -108 59 100 -298 281
4595B81k15j81l29M48j41M19l39J3Q6o4J09j20j16k25L22p5J72j65M24n09K22
$$ 281 66 -115 -444 4 -137 282 -57 -44 42 -22 87 -33 -149 -374 -52 -127 45 -120 304 -205 17
4616A7P5n4k11M4J41J02J22k68R7k45j19K80N9K35j99j50J19m9k5R4m3j16P3k79
$$ 17 92 38 -173 -129 12 114 236 -32 65 -180 -299 -19 40 275 76 -74 45 -4 -29 65 22 -94 -21 -300
4640c00K27K31N0J55k59J3j05r2j6j0M06l21J74q6O2n0l6M63k43m23M39j66m38
$$ -300 -73 158 208 363 104 117 12 -80 -96 -106 300 -21 153 67 129 79 43 506 263 -160 279 113 -325
4663c25M92m31M74N9o30J83M43k79M15n51P1J73j32K57k71J00j26R6k9R0J74m32
$$ -325 167 -264 210 269 -361 -178 265 -14 401 -150 -79 94 -38 219 -52 48 -78 18 -11 79 253 -179
4685a79M3K90r2p7j21J39J71J02k40m01L96J45J27n93k7N20n0k70j5L00m08J41
$$ -179 -136 154 62 -15 -136 3 174 276 36 -365 31 176 303 -290 -317 203 153 -117 -132 168 -240 -99
4707i9J88m23J61L84k45J4M1p7K1j7q9J15J09k01l2P0P9k5K10l59M4K37l75L65
$$ -99 89 -334 -173 211 -34 -20 21 -56 -35 -52 -141 -26 83 -118 -150 -80 -1 -26 184 -175 -131 106 -269 96
4731I6k12J02j26K9j73K09j00K24L0N3L7l35J37N3M9l20K95j20j4K52m55L18J86
$$ 96 -116 -14 -140 -111 -284 -75 -175 49 79 132 169 -166 -29 24 73 -247 48 -72 -86 166 -289 29 215
4754B15k59o8n8n2K63k26K99j01J44l25K84l30K57k61K32j96j57L65%M20n09L11
$$ 215 -44 -112 -170 -222 41 -185 114 13 157 -168 116 -214 43 -218 14 -182 -339 26 26 446 -63 248
4776B48m47L57l11L27k49K8l9J20J78m53L04p4j40m1L43k43J59K8q2o2J71M9l27
$$ 248 -199 158 -153 174 -75 -47 -86 34 212 -241 63 -11 -151 -192 151 -92 67 95 13 -49 122 171 -156
4799a56o6J04N00l23l1l7J24k31M11J49m37q4p1K15Nj92J39K9r5L26q4k4rq6j92
$$ -156 -222 -118 382 59 28 -9 115 -116 295 444 7 -77 -148 67 72 -120 19 48 -47 279 195 171 162 76 -116
4824a16M28k94k22L1J16J1j28J44K1L8m4q5J71n8k24Q2K68m42N94k66j68K81q3
$$ -116 312 18 -204 -173 -57 -46 -174 -30 -9 29 -15 -100 71 13 -211 -129 139 -303 291 25 -143 138 55
4847E5k3k61q4N17m55K21K5m6N15q46M20j73K19m6j4l0m7R6j79M52m84rJ25j60
$$ 55 32 -229 -313 204 -251 -30 -5 -51 464 -382 38 -135 84 38 24 -6 -53 43 -136 316 -168 -177 -52 -212
4871b12J08K63k37j03J46Q8k31r2N03k84K18L5k37k71L42j58K55r9J69j3k05j7
$$ -212 -104 159 -78 -181 -35 53 -178 -270 233 -51 167 202 -35 -306 36 -122 133 34 203 190 -15 -32
4893c2J71j46j39K20k50J73p0j6O8J14O8J23j91j06J5k7OJ30k26P3J54j28K30
$$ -32 139 -7 -146 74 -176 -3 -73 -89 -21 93 161 284 93 -13 2 -25 -19 111 -115 -42 112 -16 214
4916B14k52q7j20N6L00j72j53M3Q8L12r2k43J99K0P9k37Q3K51l05Q3M4m9J61k80
$$ 214 -38 -125 -245 -189 111 -61 -214 -171 -83 229 137 -106 93 113 192 -45 38 289 -16 67 111 62 223 -57
4940e7Q5N3L01l14N7j44n0K59m36K77l8p7K20K6k91r7K71l44L41o5k8O2j18J62
$$ -57 28 81 382 68 125 -19 -69 190 -246 31 -7 -84 136 162 -129 -226 45 -299 42 -23 -51 11 -107 55
4964E5j97M26k77j00K9K24k83P5M8m3m4J73L7n08M98k60q0j53N43j78l89L03q4
$$ 55 -142 284 7 -93 -64 160 -123 -48 0 -43 -87 86 123 -385 113 -147 -227 -380 163 -15 -404 -101 -185
4987a85l5K55j89K66j81K04j83m0j20P16n31p3Q4K0j54J39n8nK73j94J46k63K74
$$ -185 -220 35 -154 112 -69 135 -48 -88 -208 508 -23 -96 -12 8 -146 -7 -65 -70 203 9 155 -108 166
5010A66j65k14P0Q4L24n58M41j01N0k87K44K14kk93j69K04r6J1K46l03J20pj03
$$ 166 1 -213 -143 -59 265 -293 148 47 97 -190 54 268 266 -27 -196 8 -88 -77 169 -134 -14 -21 -124
5033a24j7O1l0K52J49n72K99J31j54K13l67Q8J60q2J48k59K42j76QJ40J31j2j69
$$ -124 -141 -80 -110 142 291 -281 18 149 -5 208 -159 -71 89 7 155 -104 138 -38 -30 110 241 229 60
5056F0P4J9l20L72j96K15l88M05k71J52R4j63l28J71j04L14M8m72L01J03J36m12
$$ 60 134 153 -167 205 9 224 -164 241 -30 122 216 53 -275 -104 -208 106 154 -318 -17 86 222 -190
5078a90J34R9J72j47l10J11K38n7pl2M38m23N9l04J50j78K81J13L8m4k05K99j22
$$ -190 -56 43 215 68 -242 -131 107 50 43 11 449 26 85 -219 -69 -247 34 147 185 141 -64 235 113
5101A13k80K53l36j35K35K91k79O2R3l66L78Q0k45O9J54L5k46R2k35J16M10k29
$$ 113 -167 86 -250 -385 -150 141 -138 -76 17 -349 29 109 -136 -67 87 122 -124 -32 -267 -151 259 30
5123C0j3jp4P9j45J20j07o6K96l67J21J09k03K45J4j43J22j86K5O0K45n34N57
$$ 30 17 16 -58 21 -124 -4 -111 -177 119 -248 -127 -18 -221 24 38 -105 17 -169 -144 -84 161 -373 184
5146A84m33K64J05m66K28K55j05l85L76L8q3P4j37qo2j75L99K14m76J26l8k9Q6
$$ 184 -249 15 120 -346 -118 137 32 -353 23 61 -22 52 -85 -93 -155 -330 69 283 -193 -67 -105 -134 -48
5169d8K28m08K12n8K82k65J81k01J26j09K38j55K18k41P3j8J88m03K56j46J0J88
$$ -48 180 -228 -16 -74 208 -57 124 -77 49 -60 178 23 241 0 73 55 243 -160 96 -50 -40 148
5191A48l98L24j84j19L54k9q4J21o9j51N7K79l02O1M0N7k43M46m55J38K83J04
$$ 148 -250 74 -110 -229 125 96 12 133 64 -87 -30 249 -53 8 48 105 -138 308 -147 -9 274 378
5213C78l92M17l67k2J22m55M83M7k41j59K11o0rM3K5J60l21M4q2K27j28Q8J28
$$ 378 -14 403 36 14 136 -319 164 211 -30 -189 22 -38 -47 -4 21 181 -140 -96 -178 49 -79 9 137
5236A37k22K82k5r8k15K76J2m00p6K84O5m3K8k51K50kM8k27K10R7j72J06j56J23
$$ 137 -85 197 172 74 -141 135 147 -253 -329 -45 20 -23 5 -246 4 2 50 -177 33 130 -42 64 -92 31
5260C1P7q6L19l93N6j67L74l58K57k87M31l88k96N42J29rm11L08Np4l84J48r4
$$ 31 108 22 341 -52 4 -163 211 -147 110 -177 254 -134 -430 112 241 232 -179 129 134 60 -324 -176 -270
5283b70K03K40j0j67L60k90Nr2J07r1k1n1N9K42j67r0P4N5P6QJ67j91l29J97J33
$$ -270 -67 173 163 -4 356 66 71 -21 86 -5 -26 -77 -18 224 57 -33 41 96 172 180 347 156 -173 24 157
5308A57Q9j72J48k34N05l59M4j53J57j98k6J46J76m62j1p3M06k28K49K60j13j88
$$ 157 246 74 222 -12 493 134 178 25 182 -16 -42 104 280 -182 -193 -266 140 -88 161 421 308 120
5330A20k24K49J04j57j48K02l18J88m2j56J06J4K79j52j80K00j16j0P3l4%K1J69
$$ 120 -104 145 249 92 -56 146 -172 16 -26 -182 -76 -62 217 65 -115 85 -31 -41 32 -2 -2 19 188
5353A88l15j28K29J10l90K66M2K9Ql4k75N12k84N5j51K41q0J2J58k14O0j91K5
$$ 188 -127 -255 -26 84 -306 -40 2 31 39 5 -270 242 -42 13 -138 103 23 35 193 -21 39 -152 -127
5376a27l56N73k68J83P9k13k8J69J69k09l53M96l48L0J5p6N21k26J84l38M4J7
$$ -127 -483 90 -178 5 84 -129 -157 12 181 -28 -381 115 -233 -203 -188 -264 257 31 215 -123 -79 -62
5398f2kj48M86r5k58k00R9J26j4n1L25l24K8M5J97j04J27J49l73J99l90N06m51
$$ -62 -64 -212 274 179 -79 -279 -180 -54 -68 -119 206 -118 -90 -45 152 48 175 324 -49 150 -240 266 -185
5421a85J32J0l47K20J24J81Q5n33L75j20K37J8k00m8m8J42J08j73j08J53N3j75
$$ -185 -53 -43 -390 -170 -46 135 220 -313 62 -58 179 197 -3 -51 -99 43 151 -22 -130 23 76 -99
5443i9K26K07l44M2k03M50j81q5m3K51k27j97N01l16P0J05n22L50J38l7l1k53
$$ -99 127 334 -10 32 -171 279 98 13 -30 221 -6 -203 298 -18 52 157 -365 -15 123 86 55 -198
5465a98J48L56l68l72M95R9q0k70L05Jj88p8K7M07n34L03K43k91j29L36l35M05
$$ -198 -50 306 -62 -434 61 160 80 -190 115 116 -72 -150 -123 284 -250 53 296 5 -124 212 -123 282
5487B82m03K59j67K73k81n8J24J6k28mQ6J85j24%N9j96j46M02j5j81L21j13J75
$$ 282 -121 138 -29 244 -37 -95 29 45 -183 -187 -101 84 -40 -40 19 -177 -323 79 64 -117 204 91 266
5510B66j66m6q9O0j92qJ52K62J44n5m55K04J05j61K2J8o6l47K54O4j71J30J61
$$ 266 100 54 -35 25 -167 -175 -23 239 383 328 -127 77 182 21 43 61 -5 -352 -98 -34 -205 -75 86
5533H6j45j8K20k7j78J47K0r1K11l66J89j7k19J52Q0J8k78L89k38j03K04j2L9
$$ 86 -59 -77 143 116 -62 85 105 14 225 -141 48 31 -188 -36 44 62 -216 173 -65 -168 36 24 63
5556F3j3o5p3l0J24l45L67K15l35j29j74J94L03R0j89P0K4j75L26l21Jj06L03
$$ 63 50 -15 -88 -118 6 -339 28 243 -92 -221 -395 -201 102 192 3 73 97 -78 248 -73 -72 -178 125
5579A25j08M4K77n49L55l52K17K02n0j71K70P5n97J53Q4J39Q8p4k44J95r9K33
$$ 125 17 61 338 -211 144 -208 9 211 161 -10 260 335 -262 -109 -25 114 202 128 -116 79 -20 213
5601B13j03k40L32r9j52J58q5QQ6J26l79j71K49K15qk13Q7o6M6j7R9L2O0N4k60
$$ 213 110 -130 202 103 -49 109 24 32 118 244 -135 -306 -57 158 150 -63 24 -42 4 -13 86 118 178 232 -28
5626b8qN0m1J85k86J8J28j08J16K29M9l38L4K58q6j62K05o8o4m4L1l14j45M01
$$ -28 -36 14 -27 158 -128 -110 18 -90 26 255 304 -34 0 258 172 10 215 147 83 39 70 -244 -389 12
5650A2k4J5j66K74o8j94n4L38j25O9l01K28O2k3PP1j60k7m0NK8J5N0k64R2J58
$$ 12 -12 3 -163 111 43 -151 -205 133 8 77 -224 4 66 43 50 121 -39 -66 -106 -101 -73 -58 -8 -272 -180 -22
5676b2n6j2O3j66J72L6r9J18j32K14J8j86K03j03q9n3J72j11J40K2k74J05k1L40
$$ -22 -78 -90 -27 -193 -21 15 -84 34 -98 116 134 -52 151 48 -41 -94 78 -33 107 129 -145 -40 -61 279
5700B79k5j23l29R9J40m68K58N2O9p0k87M34Mj68J67K5j66O6n0L69j02j00J3k75
$$ 279 254 131 -198 -99 41 -427 -169 -117 -48 -118 -405 29 33 -135 32 57 -109 -43 -93 276 174 74 87 -188
5724a88J18L11l07m7l28N14J5j56j22L76j44j78K68j63J75j15j78K69J14l79p6
$$ -188 -70 241 -66 -113 -441 73 88 -68 -190 186 42 -136 132 -31 144 29 -149 120 234 -145 -221
5745b21O1k32J70L26k27K24k63K27l50L4K70k05L87k51O4m0O3J4j07Q6Q8%j66
$$ -221 -160 -392 -222 104 -123 101 -162 65 -285 -251 19 -186 201 -50 14 -26 37 51 -56 30 118 118 -48
5768d8R7J4m14L98p8qJ3p4J81J40K7j93P1j64J95j17k13J17n7J0rR5j11J60N1
$$ -48 49 63 -351 47 -31 -39 -26 -100 81 221 248 55 126 -38 157 40 -173 -56 -113 -103 -112 -17 -128 32 83
5793H3j89m12M61j26J68J47q5j27J4j1L10j90k00K54K94m53L05l4l28L97l96J58
$$ 83 -106 -518 -57 -183 -15 132 47 -80 -66 -77 233 43 -157 97 391 -62 243 209 -119 278 -118 40
5815D0J08l19K96k09QJ42k71M74l33m4L66j78J7l60j2J69J50l4M45m31j80K44
$$ 40 148 -171 125 -84 -76 66 -205 269 -64 -108 258 80 97 -263 -275 -106 44 10 455 24 -156 88
5837H8n9o0p6J41J5J29o2N7o2k74l5M05l10J2J20k8J76Q6j90j67M52j49k30k23
$$ 88 29 -31 -107 34 49 178 116 173 111 -163 -198 207 -103 -91 29 1 177 263 73 -94 358 209 -21 -244
5861b44M66m28R5K31k35J27N2l21J81K01r2j07J95l34O8j18L21j68N5M57m15K03
$$ -244 222 -206 -111 120 -115 12 64 -257 -76 125 33 -74 121 -213 -145 -263 58 -110 -55 402 -13 190
$$ [...]
8191A5
##END NTUPLES=NMR FID
##END=
