##TITLE=1H_LR-718-M1
 CDCl3, 8 sc, 
 10.7.2020
##JCAMPDX= 6.0         $$ Bruker NMR JCAMP-DX V2.0
##DATA TYPE= NMR FID
##DATA CLASS= NTUPLES
##ORIGIN= UXNMR, Bruker Analytische Messtechnik GmbH
##OWNER= root
$$ XWIN-NMR		Version 3.5
$$ Fri Jul 10 10:41:42 2020 Russian Standard Time (UT+4h)  she@DPX200
##.OBSERVE FREQUENCY= 200.1315
##.OBSERVE NUCLEUS= ^1H
##.DELAY= (6, 6)
##.ACQUISITION MODE= SIMULTANEOUS
##.ACQUISITION SCHEME= undefined
##.AVERAGES= 8
##.DIGITISER RES= 18
##SPECTROMETER/DATA SYSTEM= spect
##.PULSE SEQUENCE= zg30
##.SOLVENT NAME= CDCl3
##.SHIFT REFERENCE= (INTERNAL, CDCl3, 0, 15.7039)
##AUDIT TRAIL= $$ (NUMBER, WHEN, WHO, WHERE, WHAT)
$$ ##TITLE= Audit trail, XWIN-NMR		Version 3.5
$$ ##JCAMPDX= 5.01
$$ ##ORIGIN= Bruker BioSpin GmbH
$$ ##OWNER= she
$$ F:/spectra/data/she/nmr/H-F/1/audita.txt
$$ ##AUDIT TRAIL=  $$ (NUMBER, WHEN, WHO, WHERE, WHAT)
(   1,<2020-07-10 10:40:42.57 +0400>,<she>,<DPX200>,
      <created by zg, POWCHK disabled, PULCHK disabled
       configuration hash MD5:
       00 E9 B6 7A A2 85 ED C7 34 08 36 98 17 FE 4E 26
       data hash MD5: 16K
       D2 DD 85 CD DE 0C 60 C6 32 1A C2 98 7E CA 6A 84>)
$$ ##END=
$$ 
$$ hash MD5
$$ 9C 5F 78 FA 0C F4 ED AC 52 8D 3B 6A 54 CE C0 7F
##$RELAX= 
##$RELAX= 
##$RELAX= 
##$RELAX= 
##$RELAX= 
##$RELAX= 
$$ Bruker specific parameters
$$ --------------------------
##$DU= <F:/spectra>
##$EXPNO= 1
##$NAME= <H-F>
##$PROCNO= 1
##$TYPE= <nmr>
##$USER= <she>
##$AMP= (0..31)
100 100 100 100 100 100 100 100 100 100 100 100 100 100 100 100 100 100 
100 100 100 100 100 100 100 100 100 100 100 100 100 100 
##$AQSEQ= 0
##$AQ_mod= 1
##$AUNM= <au_zg>
##$AUTOPOS= <>
##$BF1= 200.13
##$BF2= 200.13
##$BF3= 200.13
##$BF4= 200.13
##$BF5= 200.13
##$BF6= 200.13
##$BF7= 200.13
##$BF8= 200.13
##$BYTORDA= 1
##$CFDGTYP= 0
##$CFRGTYP= 5
##$CHEMSTR= <none>
##$CNST= (0..31)
1 1 145 1 1 1 1 1 1 1 1 1 1 1 1 1 1 1 1 1 1 1 1 1 1 1 1 1 1 1 1 1 
##$CPDPRG= <>
##$CPDPRG1= <>
##$CPDPRG2= <>
##$CPDPRG3= <>
##$CPDPRG4= <mlev>
##$CPDPRG5= <mlev>
##$CPDPRG6= <mlev>
##$CPDPRG7= <mlev>
##$CPDPRG8= <mlev>
##$CPDPRGB= <>
##$CPDPRGT= <>
##$D= (0..31)
0 1.2 0 0 0 0 0 0 0 0.06 0 0.03 0 0 0 0 0.0002 0 0 0 0 0 0 0 0 0 0 0 0 
0 0 0 
##$DATE= 1594363242
##$DBL= (0..7)
120 120 120 120 120 120 120 120 
##$DBP= (0..7)
150 150 150 150 150 150 150 150 
##$DBP07= 0
##$DBPNAM0= <>
##$DBPNAM1= <>
##$DBPNAM2= <>
##$DBPNAM3= <>
##$DBPNAM4= <>
##$DBPNAM5= <>
##$DBPNAM6= <>
##$DBPNAM7= <>
##$DBPOAL= (0..7)
0.5 0.5 0.5 0.5 0.5 0.5 0.5 0.5 
##$DBPOFFS= (0..7)
0 0 0 0 0 0 0 0 
##$DE= 6
##$DECBNUC= <off>
##$DECIM= 24
##$DECNUC= <off>
##$DECSTAT= 4
##$DIGMOD= 1
##$DIGTYP= 9
##$DL= (0..7)
0 120 120 120 120 120 120 120 
##$DP= (0..7)
150 150 150 150 150 150 150 150 
##$DP07= 0
##$DPNAME0= <>
##$DPNAME1= <>
##$DPNAME2= <>
##$DPNAME3= <>
##$DPNAME4= <>
##$DPNAME5= <>
##$DPNAME6= <>
##$DPNAME7= <>
##$DPOAL= (0..7)
0.5 0.5 0.5 0.5 0.5 0.5 0.5 0.5 
##$DPOFFS= (0..7)
0 0 0 0 0 0 0 0 
##$DQDMODE= 0
##$DR= 18
##$DS= 0
##$DSLIST= <SSSSSSSSSSSSSSS>
$$ [...]
##$SUBNAM2= <"">
##$SUBNAM3= <"">
##$SUBNAM4= <"">
##$SUBNAM5= <"">
##$SUBNAM6= <"">
##$SUBNAM7= <"">
##$SUBNAM8= <"">
##$SUBNAM9= <"">
##$SW= 24.9337058887773
##$SWIBOX= (0..15)
0 0 2 0 0 0 0 0 0 0 0 0 0 0 0 0 
##$SW_h= 4990.01996007984
##$TD= 16384
##$TD0= 1
##$TE= 0
##$TE2= 300
##$TE3= 300
##$TEG= 300
##$TL= (0..7)
0 120 120 120 120 120 120 120 
##$TP= (0..7)
150 150 150 150 150 150 150 150 
##$TP07= 0
##$TPNAME0= <>
##$TPNAME1= <>
##$TPNAME2= <>
##$TPNAME3= <>
##$TPNAME4= <>
##$TPNAME5= <>
##$TPNAME6= <>
##$TPNAME7= <>
##$TPOAL= (0..7)
0.5 0.5 0.5 0.5 0.5 0.5 0.5 0.5 
##$TPOFFS= (0..7)
0 0 0 0 0 0 0 0 
##$TUNHIN= 0
##$TUNHOUT= 0
##$TUNXOUT= 0
##$USERA1= <user>
##$USERA2= <user>
##$USERA3= <user>
##$USERA4= <user>
##$USERA5= <user>
##$V9= 5
##$VALIST= <valist>
##$VCLIST= <CCCCCCCCCCCCCCC>
##$VD= 0
##$VDLIST= <DDDDDDDDDDDDDDD>
##$VPLIST= <PPPPPPPPPPPPPPP>
##$VTLIST= <TTTTTTTTTTTTTTT>
##$WBST= 1024
##$WBSW= 4
##$XGAIN= (0..3)
0 0 0 0 
##$XL= 0
##$YL= 0
##$YMAX_a= 282932
##$YMIN_a= -128992
##$ZGOPTNS= <>
##$ZL1= 120
##$ZL2= 120
##$ZL3= 120
##$ZL4= 120
##$ABSF1= 10
##$ABSF2= 0
##$ABSG= 5
##$ABSL= 3
##$ALPHA= 0
##$AQORDER= 0
##$ASSFAC= 0
##$ASSFACI= 0
##$ASSFACX= 0
##$ASSWID= 0
##$AUNMP= <proc_1d>
##$AZFE= 0.1
##$AZFW= 0.1
##$BCFW= 1
##$BC_mod= 2
##$BYTORDP= 1
##$COROFFS= 0
##$CY= 11.3945322036743
##$DATMOD= 1
##$DC= 2
##$DFILT= <>
##$DTYPP= 0
##$F1P= 16.9975609425685
##$F2P= -3.02152046262296
##$FCOR= 0.5
##$FTSIZE= 0
##$FT_mod= 4
##$GAMMA= 1
##$GB= 0.15
##$INTBC= 1
##$INTSCL= 1
##$ISEN= 128
##$LB= 0.24
##$LEV0= 0
##$LPBIN= 0
##$MAXI= 10000
##$MC2= 0
##$MEAN= 0
##$ME_mod= 0
##$MI= 1.114404
##$NCOEF= 0
##$NC_proc= 0
##$NLEV= 6
##$NOISF1= 3.799351
##$NOISF2= 2.8
##$NSP= 1
##$NTH_PI= 0
##$NZP= 0
##$OFFSET= 15.70392
##$PC= 1
##$PHC0= -9791.331
##$PHC1= 13.00092
##$PH_mod= 1
##$PKNL= yes
##$PPARMOD= 0
##$PSCAL= 0
##$PSIGN= 0
##$REVERSE= no
##$SF= 200.130013532006
##$SI= 16384
##$SIGF1= 3
##$SIGF2= 2
##$SINO= 400
##$SIOLD= 16384
##$SREGLST= <1H.CDCl3>
##$SSB= 0
##$STSI= 0
##$STSR= 0
##$SW_p= 3612.71676300578
##$SYMM= 0
##$S_DEV= 0
##$TDeff= 0
##$TDoff= 0
##$TI= <>
##$TILT= no
##$TM1= 0
##$TM2= 0
##$TOPLEV= 0
##$USERP1= <user>
##$USERP2= <user>
##$USERP3= <user>
##$USERP4= <user>
##$USERP5= <user>
##$WDW= 1
##$XDIM= 8192
##$YMAX_p= 0
##$YMIN_p= 0
$$ End of Bruker specific parameters
$$ ---------------------------------
##NTUPLES= NMR FID
##VAR_NAME=  TIME,          FID/REAL,        FID/IMAG
##SYMBOL=    X,             R,               I
##VAR_TYPE=  INDEPENDENT,   DEPENDENT,       DEPENDENT
##VAR_FORM=  AFFN,          ASDF,            ASDF
##VAR_DIM=   8192,          8192,            8192
##UNITS=     SECONDS,       ARBITRARY UNITS, ARBITRARY UNITS
##FACTOR=    0.0002004,     1,               1
##FIRST=     0,             0,               0
##LAST=      1.6414764,     0,               0
##MIN=       0,             -128992,         0
##MAX=       1.6414764,     282932,          0
$$ Real data points
##PAGE= N=1
##DATA TABLE= (X++(R..R)), XYDATA
$$ [...]
1965b87K19l69k10K69N66j85p76j94Q40J05p33k20N42M17j48l96m61P43L33k66
$$ -287 -68 -437 -647 -378 188 3 -773 -967 -127 -22 -755 -975 -433 -16 -164 -560 -1021 -278 55 -211
1985b11o74j8Q01L02m19n05K79Q45k13p44l73N69M69l7r80M83Q14J69k42j100
$$ -211 -885 -903 -102 200 -219 -724 -445 400 187 -557 -930 -361 108 71 -909 -426 388 557 315 -785
2005g85M23M17M80r19k87M27R54o96j12n3M61O0l71n32N51K70k34o4J3M16K74
$$ -785 -362 55 535 -384 -671 -244 710 14 -98 -151 310 370 -1 -533 18 288 54 -10 3 419 693
2026F93m67k40K46K02j24J20l33L53L37m40K06j36K67l84j29l89P83L61n57j98
$$ 693 226 -14 232 434 310 430 97 450 787 347 553 417 684 300 171 -218 565 926 369 171
2046A71L7M09J53m09m38L50K77J00l27k23N03P6o34k72jQ50j72q20J63J54O59
$$ 171 208 617 770 361 -77 273 550 650 323 100 603 679 45 -227 -228 622 450 -370 -207 -53 606
2067F06l02l21m17L47M67m94o01M18M43j91n04L65K95L79m06o00k5L74J87n09
$$ 606 304 -17 -434 -87 380 -114 -715 -297 146 -45 -549 -184 111 490 84 -516 -541 -167 20 -489
2087d89o6L01J29K30n50pk6M09m15l73M32M63N1o07j20L62L43k08q73O26L90p0
$$ -489 -555 -254 -125 105 -445 -452 -478 -69 -484 -857 -425 38 89 -518 -638 -276 67 -141 -1014 -388 2 -68
2109f8m80J62J5L31k17n10M5O35K26l71k41M24K20n9q48j64Q66j07q2k68J15O86
$$ -68 -548 -386 -371 -40 -257 -767 -722 -87 139 -232 -473 -49 171 112 -736 -900 -34 -141 -223 -491 -376 310
2131C10K09q10m85M87M03k15m62K53K46J53J22l68k42M12R6K1n64L19N90l72K05
$$ 310 519 -291 -776 -289 114 -101 -563 -310 -64 89 211 -157 -399 13 109 130 -434 -115 475 103 308
2152C08p02O31l3J20p8k45J70K2j44k0O3K66k06O4j60M30J87m95j62K31K66m53
$$ 308 -394 237 204 324 246 1 171 193 49 29 92 358 152 216 56 486 673 178 16 247 513 60
2174F0J32J3K99J7m16j93K86M42j61m79j90N44J26k38k83K70M56L0p05j36K99
$$ 60 192 205 504 521 105 -88 198 640 479 0 -190 354 480 242 -41 229 685 715 10 -126 173
2195A73M71m35k36kO69J89p20m46J00L20K36k39j50K87L75l31o14j18P99Km19
$$ 173 644 209 -27 -29 640 829 109 -337 -237 83 319 80 -70 217 592 261 -353 -471 328 330 -89
2216h9m21M30j7J37l88j27K42K98m22n15N75L6j6j93K70j54K68l19J48j35L06
$$ -89 -510 -80 -97 40 -348 -475 -233 65 -357 -872 -297 -261 -277 -470 -200 -354 -86 -405 -257 -392 -86
2237h6k68m2j08L74K49j98m32M8K15O45q27l43J83M49L42m80j71J07Q78o25m04
$$ -86 -354 -396 -504 -130 119 -79 -511 -463 -248 397 -430 -773 -590 -141 201 -279 -450 -343 535 -90 -494
2258d94L54J26O7l95m48N13P94l10o39j98P33K57j24o68J83J29L26O4n68M39K05
$$ -494 -140 -14 53 -342 -790 -277 517 207 -432 -630 103 360 236 -432 -249 -120 206 270 -298 141 346
2279C46L9m45j8L40L79o32j14L01L72R5j93n51J53L99n35j53M49J46K37m66j83
$$ 346 385 -60 -78 262 641 9 -105 196 568 663 470 -81 72 471 -64 -217 232 378 615 149 -34
2300c4M7N60k45j84j83K93L04l11j15J33N52m90m21J6L48m2K08n68K54N82j96
$$ -34 13 573 328 144 -39 254 558 247 132 265 817 327 -94 -78 270 228 436 -132 122 704 508
2321E08j88o25K77N52Pq10J70L89J28m57J84j74K56J72m55k23J10K49K72n80p9
$$ 508 320 -305 -28 524 531 -279 -109 280 408 -49 135 -39 217 389 -66 -289 -179 70 342 -238 -317
2342c17K64N77n80m91M17J87q0r6l33K79M16j70n72K94J61j54l18k00M41M05l86
$$ -317 -53 524 -56 -547 -130 57 -23 -119 -452 -173 243 73 -499 -205 -44 -198 -516 -716 -275 130 -256
2363b56j57j87L62j27j11J66l1Q4J94o74J06M80M67p77R7j39P84m9p66j3K24N81
$$ -256 -413 -600 -238 -365 -476 -310 -341 -257 -63 -737 -631 -151 316 -461 -364 -503 281 232 -534 -547 -323 258
2385B58k29p80J94O09j27M5p73M74M00j55j18j25JM47j7k07r7K86Rq9j83J62J76
$$ 258 29 -751 -557 52 -75 -30 -803 -329 71 -84 -202 -327 -326 121 104 -103 -200 86 95 6 -177 -15 161
2408A61J38j53m40j37O17M0n06M56J88k15n4M2O0J73j41k85J73L87L1j53j53K20
$$ 161 299 146 -294 -431 186 226 -280 176 364 149 95 137 197 370 229 -56 117 504 535 382 229 449
2430D49j74M8n65K87L68N6k42n15N34N14j87l16n00M27M99m61l43K78K32L42m31
$$ 449 275 323 -242 45 413 469 227 -288 246 760 573 257 -243 184 683 222 -121 157 389 731 300
2451C00k31k48J028n20l21o9J72K92k31m07J14J78L10o39j85N39J48l1l73k06
$$ 300 69 -179 849 329 8 -61 111 403 172 -235 -121 57 367 -272 -457 82 230 199 -174 -380
2471c80O39L6l31m34K50J69L85m68m7J16J5P6j64l47O3M53l76j97M8M25j05K09
$$ -380 259 295 -36 -470 -220 -51 334 -134 -181 -65 -50 26 -138 -485 -422 31 -345 -542 -494 -69 -174 35
2493C5n67M71J80m39j0q6N01j66j26q4K59L52m78l29N69J69j28j33m74N9O79k88
$$ 35 -532 -61 119 -320 -330 -416 85 -81 -207 -291 -32 320 -158 -487 82 251 123 -10 -484 -425 254 -34
2515c4n25n1O07P4k77m70M69K81K5k29k22K92L55J62p07m1L58n8j01m51L76M26
$$ -34 -559 -610 -3 71 -206 -676 -207 74 99 -130 -352 -60 295 457 -250 -291 67 9 -92 -543 -167 259
2537B59k2m39J76J28L24j31o52N81J1K69k96j28k20M54o7l34J62K39N7k80L9K4
$$ 259 237 -202 -26 102 426 295 -357 224 235 504 208 80 -140 314 247 -87 75 314 371 91 130 154
2559A54K17j1k49j38M56M6k75m62L83L7Q7p9l84L23L75jq97P21M9Oj70k92K13
$$ 154 371 360 111 -27 429 475 200 -262 121 158 245 166 -218 105 480 479 -418 303 352 358 188 -104 109
2582A09M58k70n11Q3K82N16n03k40Q0K17K23j3m13m5J86k28k50R0J75K64k75j91
$$ 109 567 297 -214 -131 151 667 164 -76 4 221 444 431 18 -27 159 -69 -319 -229 -54 210 -65 -256
2604b56K38k0L73o79K6L82J94l20l73L47K31j68m68J57K34K53q4m06j39N56J7
$$ -256 -18 -38 335 -344 -318 64 258 -62 -435 -88 143 -25 -493 -336 -102 151 67 -339 -478 78 95
2625I5m79l11M92M18j83q6j92K61j6q6k33M69j45K47l41l80K46K45M1n48J74K72
$$ 95 -384 -695 -203 215 32 -54 -246 15 -1 -87 -320 149 4 251 -90 -470 -224 21 62 -486 -312 -40
2647d0M20l65l55O2L25j7j92k80J04R60q52k87M38j5L93m83K9jM54k58k6k83K90
$$ -40 380 15 -340 -278 47 30 -162 -442 -338 622 -230 -517 -79 -94 299 -184 -155 -156 298 40 14 -269 21
2670B1M29l32k04J11K27L02o34J67q0N7n3k7r0L96N0k90l38L01N97l76j36m23
$$ 21 450 118 -86 25 252 554 -80 87 7 64 11 -16 -106 290 340 50 -288 13 610 234 98 -325
2692c25N35K42l34j94M32J54l80n96%P28J91m1n96n7L84N09n05m04J40M96lm38
$$ -325 210 452 118 -76 356 510 130 -466 -466 262 453 412 -184 -241 143 652 147 -257 -117 379 376 -62
2714f2J09Q2M31m57m00n8N85J58o75n1M42L86J75r74J24L85n9o4m16J11J48M30
$$ -62 47 129 560 103 -297 -355 230 388 -287 -338 104 490 665 -309 -185 200 141 77 -339 -228 -80 350
2736C50o82O6L90ql29m17L55K86L1k45j2LO16o40k60R8J80J80l40q2K44L66j70
$$ 350 -332 -266 124 116 -213 -630 -275 11 42 -203 -215 -212 404 -236 -496 -398 -218 -38 -378 -460 -216 150 -20
2759b0k27q3M70P5l74k48j92N20K34m42J38p4J76k13p9j84L21K99k38k24j10K14
$$ -20 -247 -330 140 215 -159 -407 -599 -79 155 -287 -149 -223 -47 -260 -339 -523 -202 97 -141 -365 -475 -261
2781b61L29m57j14N09J19j76l20j58M83J78n6k63NM81j13j23p0J63q2q5rJ45j57
$$ -261 68 -389 -503 6 125 -51 -371 -529 -46 132 76 -187 -182 299 186 63 -7 156 74 -11 -20 125 -32
2804c2L05l57P5K43K19n61R6K51P0K05m00k04K02J55J07m42L06%j67Q6k96M90
$$ -32 273 -84 -9 234 453 -108 -12 239 309 514 114 -90 112 267 374 -68 238 238 71 157 -139 351
2826C51n5J36l88k15M58J21j67l79J38K74J22l42l28J2Q10m49k29M6J02M21j35
$$ 351 296 432 44 -171 287 408 241 -138 0 274 396 54 -274 -262 548 99 -130 -84 18 439 304
2847C04m03MK75J87l68k08L74K38j85j85j74M61J49r67J24K05N63k25k73k32N59
$$ 304 -99 -95 180 367 -1 -209 165 403 218 33 -141 320 469 -498 -374 -169 394 169 -104 -336 223
2868B23J0j28k65k24M91k6l72m24N78N30l58m57PM89J59n44Q8J98NM15p68RM45
$$ 223 233 105 -160 -384 107 81 -291 -715 -137 393 35 -422 -415 74 233 -311 -223 -25 -20 395 -373 -364 81
2891H1J62k97j89r1L09K88m21m55O62J78O1q09N3K16O15n03l35L44J61J50n49
$$ 81 243 -54 -243 -334 -25 263 -158 -613 49 227 288 -521 -468 -252 363 -140 -475 -131 30 180 -369
2912c69J5L38K93l13l71K81J73K67l02J2r1K79K6m27J50N9j22Q8j78P4K86J91
$$ -369 -354 -16 277 -36 -407 -126 47 314 12 24 -67 212 238 -189 -39 20 -102 -14 -192 -118 168 359
2934C59k59k38M9L88K09p53J91L09J67k28o92P33J55O0l68K3L85j67K2k89M28
$$ 359 100 -138 -89 299 508 -245 -54 255 422 194 -498 235 390 450 82 105 490 323 345 56 484
2955D84K55m7n89l91N13M24k93k38j46M62M1m88m09K66N34n5n00K89j3J66j12
$$ 484 739 692 103 -288 225 649 356 118 -28 434 475 -13 -422 -156 378 323 -177 112 99 265 153
2976A53l35L3N98k26m32k5K12J01L43m96j7P8L22k72l47K73J75K30j80l88j57
$$ 153 -182 -149 449 223 -209 -234 -22 79 422 -74 -91 -13 309 37 -310 -37 138 368 188 -200 -357
2997c57O22l11r9n1L38l3l47N2j7J31Q3m84j32K65Q10m40l73n3J18L07k89l34
$$ -357 265 -46 -145 -196 142 109 -238 -186 -203 -72 11 -473 -605 -340 470 30 -343 -396 -278 29 -260 -594
3019e94K13M76l63rm9K54J06m9k67J99J34j3n6n65L75L33l66l76J7M21J53k75
$$ -594 -381 95 -268 -277 -326 -72 34 -15 -282 -83 51 38 -18 -583 -208 125 -241 -617 -600 -179 -26 -301
3041c01n0J13M21j32o42K34M48P0k00m04M44J88R5k56P3j77N16m43j49J73L53
$$ -301 -351 -238 183 51 -591 -357 91 161 -39 -443 1 189 284 28 101 -76 440 -3 -152 21 374
3062C74l79Lj21J08K04j64j14k27K17L75N3l92k95Q50j5m67l79N55J94R0o55K51
$$ 374 -5 -2 -123 -15 189 25 -89 -316 -99 276 329 -63 -358 492 477 10 -369 186 380 470 -185 66
3084F6L18L56o66m31M30M23q3p00M53m9M99k46n26N5K70O22p24j26J25K93J27
$$ 66 384 740 74 -357 73 496 413 -287 166 117 616 370 -156 -101 169 791 67 -59 66 359 486
3105D86l27l11K40M86m43R6k39L19J2o22m5M81MK76n78L88j18K28k08k20Q1L95
$$ 486 159 -152 88 574 131 227 -12 307 319 -303 -348 133 137 413 -165 223 105 333 125 -95 -14 381
3127C81k20k33j94O25O8m34k61O7K13M8J64n01M56l71J70k11K5L46j45k05J07
$$ 381 161 -72 -266 359 427 -7 -268 -201 12 60 224 -277 179 -192 -22 -233 -208 138 -7 -212 -105
3148a05K20j35k54J31L7k70M50m23j05O99N5j63j46n29N79j1P2l88k55L98K87
$$ -105 115 -20 -274 -143 -106 -376 74 -349 -454 245 300 137 -9 -538 41 30 102 -286 -541 -143 144
3169A44k77q8J5N80m27l43K38O4K63j40K8k60K59l0r1j66L66q4r0j13M4L54j42
$$ 144 -133 -221 -206 374 -53 -396 -158 -94 169 29 57 -203 56 26 -65 -231 135 51 -39 -152 -108 246 104
3192A04l3l8k45N72l12M6k18N29j36k95J58m40L71J78k2l77L35L13r0n60J01M10
$$ 104 71 33 -212 360 48 94 -124 405 269 -26 132 -308 63 241 219 -158 177 490 400 -160 -59 351
3214C51l3j01m29M82L74k19m85K68m31M88j3n57M77J10n3p2j74K23m2L60q40M25
$$ 351 318 217 -212 270 644 425 -60 208 -223 265 252 -305 172 282 229 157 -17 206 164 524 -316 109
3236A09P2J95l14j25P2NJ04J77n82K90M53l73J61k52J17j60P6q7j26N14j5k94
$$ 109 181 376 62 -63 9 14 118 295 -287 3 456 83 244 -8 109 -51 25 -62 -188 326 311 17
3258A7l13L06J41k57j36J05L88j98J26m97K79K2j98k02K52P7M51m10j85J25J28
$$ 17 -296 10 151 -106 -242 -137 251 53 179 -318 -39 -17 -215 -417 -165 -88 363 -47 -232 -107 21
3279B1Mk64M0K89J0j89J91l11L1k7l7k12L33m3k4l16K93j2M86k92n5l0J69m21
$$ 21 25 -239 -199 90 100 -89 102 -209 -178 -205 -242 -454 -121 -164 -188 -504 -211 -223 263 -29 -84 -114 55 -366
3303c66Q9M0J63N1k21rj61L02J1j59j11J86L22o5k14r3J27R6J68l23J25o5J64
$$ -366 -277 -237 -74 -23 -244 -253 -414 -112 -101 -260 -371 -185 137 72 -142 -235 -108 -12 156 -167 -42 -107 57
3326E7n4j1J09L34l77p7oJ78j85J36j82K31J3J31l52j10L9K68j22k93J59K75J44
$$ 57 3 -8 101 435 58 -19 -25 153 -32 104 -78 153 166 297 -55 -165 -126 142 20 -273 -114 161 305
3349C05l85J58Q8J10M0m9l65J58K26k42p0P7j05J58j67o4j48M11K2l6k19R8L38
$$ 305 -80 78 166 276 316 267 -98 60 286 44 -26 51 -54 104 -63 -127 -275 136 158 122 -97 1 339
3372C39r4j74k19L54O8l96j6K73P7k94l8J05J55j34O8r7J40o7j07J6k03R2J10
$$ 339 245 71 -148 206 274 -122 -138 135 212 -82 -120 -15 140 6 74 -23 117 50 -57 -41 -244 -152 -42
3395d2o89P91R0j78j70k19L21j55L12j05m88N56Or0j39N9L16l25K92l43Q5J62
$$ -42 -731 60 150 -28 -198 -417 -96 -251 61 -44 -532 24 30 -60 -199 -140 176 -149 143 -200 -115 47
3417D7O3k66j23K03k8J55l99N2J13J79k63M6j55L74j65J51k98K78L8m9N2j04l3
$$ 47 110 -156 -279 -76 -104 51 -348 -296 -183 -4 -267 -221 -376 -2 -167 -16 -314 -36 2 -47 5 -99 -132
3440a32L39k95j15J70R5J65k92OJ18K00O7j34r1k81M68J3o14N24o7pm36M22l6
$$ -132 207 -88 -203 -33 62 227 -65 -59 59 259 326 192 101 -180 288 301 -313 211 144 137 -299 123 87
3463H7o2Q3m32L90K80n4m34J53k0K53Pl05k7N96l37j47K49N9j48j54K66k08J32
$$ 87 25 108 -324 66 346 292 -142 11 -9 244 251 -54 -81 515 178 31 280 339 191 37 303 95 227
3486B27P7j49k6k07K88k49L77n5l14J60k33Q1j95N70l03r6K59PJ74k45j45j17
$$ 227 304 155 129 -78 210 -39 338 283 -31 129 -104 -23 -218 352 49 -47 212 219 393 148 3 -114
3508a14K18j8m87M73m7j33P4L90j36p5k32J26l4l07p7M09J9l84L24O6K53l04j38
$$ -114 104 86 -401 72 25 -108 -34 356 220 145 -87 39 5 -302 -379 30 49 -335 -11 55 308 4 -134
3531a34L5K2J50n89K72L89k97K9j95L58q0r0p8j71L01l2n8J56j99J60m4k59r5
$$ -134 -99 -77 73 -516 -244 145 -152 -123 -318 40 -40 -130 -208 -379 -78 -110 -168 -12 -211 -51 -95 -354 -449
3554d49K18K99k1j63rk07L13o8j72r0J88K99o2r4pO9l32L39l82M57k3j3k94PJ01
$$ -449 -231 68 47 -116 -125 -332 -19 -87 -259 -349 -161 138 76 -18 -25 44 -288 51 -331 126 103 90 -204 -197 -96
3579i6J23k92J18L04k8qj66K15j44J60j72k4J08n4p9k71J11L39J39l31j18N31
$$ -96 27 -265 -147 157 129 121 -45 170 26 186 14 -10 98 44 -35 -306 -195 144 283 -48 -166 365
3601C65n32L64j93L6J85l26L74l44L99l56K07j02j89N20k56j51q0J35j27J89K
$$ 365 -167 197 4 40 225 -101 273 -71 328 -28 179 77 -112 408 152 1 -79 56 -71 118 120
3622A20k63L98k74K53k72j11K99nk8l78L63K18m22L6N0K53L3l63k83L45KL2O6
$$ 120 -143 255 -19 234 -38 -149 150 145 117 -261 102 320 -102 -66 -16 237 270 -93 -376 -31 -29 3 69
3645F9j01J36K19l90Q2j32M5m4J08M3o3L01l72J9j61L03k44j56J15K95j65J11
$$ 69 -32 104 323 -67 15 -117 -72 -116 -8 35 -28 273 -99 -80 -241 62 -182 -338 -223 72 -93 18
3667A8K23o76M70J23l96Q3j02K45k17k84M76P1J6k01l20L19J67K34o35M01l14
$$ 18 241 -435 35 158 -238 -155 -257 -12 -229 -513 -37 34 50 -151 -471 -152 15 249 -386 15 -299
3688b99m8K14j66J41j27L53j3l27K30KK06n42R5J22K23M5k08J39P2l7j85k44M51
$$ -299 -347 -133 -299 -158 -285 68 55 -272 -42 -40 166 -376 -281 -159 64 109 -99 40 112 75 -110 -354 97
3711I7P8p3k61J82J17m52O07m57j9J70J47k5mj53M34k06l6n87M19J32Q2k69J07
$$ 97 175 102 -159 23 140 -312 295 -162 -181 -11 136 111 107 -46 388 182 146 -441 -22 110 192 -77 30
3734C0K30O5m40k2L90l2o1l07J21j8L34l19M5K18q6J45k53nM34j35k70Q8o3J20
$$ 30 260 325 -115 -137 253 221 160 -147 -26 -44 290 -29 16 234 148 293 40 35 469 334 64 152 89 209
3758B09j01L5n2j94J09N15n32J12L4K76k24J99m26K05k34K13l16L36k79j26K90
$$ 209 108 143 91 -103 6 521 -11 101 135 411 187 386 -40 165 -69 144 -172 164 -115 -241 49
3779D9j11m2K23P5l65K97k07Q7J13k42O6K8J19l46J09N8m0J56m57K48N7L55l04
$$ 49 -62 -104 119 194 -171 126 -81 6 119 -123 -57 -29 90 -256 -147 -89 -129 27 -430 -182 -125 230 -74
3802g4M30m33J90q0k11J03j15K77k35q5J7K20J9K4L6j88J09M6j73L0J44k12J38
$$ -74 356 -77 113 33 -178 -75 -190 87 -148 -233 -216 4 23 47 83 -105 4 50 -123 -93 51 -161 -23
3825b3m46P02l47J02l4j67N20o61K68l3k6J61J60j96l7j68N09m0l29k19M32l1
$$ -23 -469 233 -114 -12 -46 -213 307 -354 -86 -119 -145 16 176 -20 -57 -225 284 244 -85 -304 128 97
3847I7k71J75J15J5o0l01K03L65j30q8k98o2O02n08N8j63K57K14l3R2m28J45L14
$$ 97 -174 1 116 131 71 -230 -27 338 208 120 -178 -240 362 -146 -88 -251 6 220 187 279 -149 -4 310
3870C10j74l31K82L57l76l4j33K79J87l41J52k99K96K41k12n34L08J49J46k11
$$ 310 136 -195 87 444 68 34 -99 180 367 26 178 -121 175 416 204 -330 -22 127 273 62
3890F2k25J80j45J70k62L24l3J00k33R3n8J42j47j28P1K69j12j95p5L53l26M8
$$ 62 -163 17 -128 42 -220 104 71 171 -62 31 -27 115 -32 -160 -89 180 68 -127 -202 151 -175 -127
3912a27l1L18l52J34j02j72K85L09l65l0j13M42m78J77k13M58k50K19l29J44m8
$$ -127 -158 160 -192 -58 -160 -332 -47 262 -103 -133 -246 196 -282 -105 -318 140 -110 109 -220 -76 -124
3933a24J09J26m36Om1N4k6Q7RL79n3j72m17N03p9j90L3RK39j8K4N5K8j26J84k68
$$ -124 -15 111 -325 -319 -360 -306 -332 -245 -236 143 90 -82 -499 4 -75 -265 -232 -223 16 -2 22 77 105 -21 163 -105
3959a05k36L13k85L60M4m92P02o98K92K73k35l0J74j43M3L70l11j48J53j09K02
$$ -105 -341 -28 -313 47 91 -401 301 -397 -105 168 -67 -97 77 -66 -23 347 36 -112 41 -68 134
3980A34m07K90M4Q4j63J11N1k71K15Lk6l71J81J43k92L34K06j63k8j06L0r3L53
$$ 134 -273 17 61 145 -18 93 144 -127 88 91 65 -306 -125 18 -274 60 266 103 75 -31 -1 -94 259
4003B59k02k25K78J31K35m78J08j13R7N8k70Q8J6L42j11r6lM8L2m70M81o6k01
$$ 259 57 -168 110 241 476 -2 106 -7 90 148 -122 -34 -18 324 213 117 114 162 194 -276 205 139 -62
4026f2k09L25L4j16J42m5J64k30N4K56k09k50L01J41k39j26J8K67Rm10N0j3L46
$$ -62 -271 54 88 -28 114 69 233 3 57 313 104 -146 155 296 57 -69 -51 216 225 -185 -135 -148 198
4049A98k60k82J62K39k54K78k22j24M29k44p0J49j53j32L05l70j9M87J29l18k78
$$ 198 -62 -344 -182 57 -197 81 -141 -265 164 -80 -150 -1 -154 -286 19 -351 -370 117 246 -72 -350
4070c50M65P4m41K66k35K19j15J37Q4k85L17j54L31m18Q6j55R0o3q0K30K22J04
$$ -350 115 189 -252 14 -221 -2 -117 20 104 -181 136 -18 313 -105 -19 -174 -84 -147 -227 3 225 329
4092C29n10J78N5J26k23p5N5M27j79j76K13kq5R3n33L16%j3M9J86k35K67k47q7
$$ 329 -181 -3 52 178 -45 -120 -65 362 183 7 220 218 133 226 -307 9 9 -4 45 231 -4 263 16 -71
4116g1K79q4j13K18k85R7K71p40L75L99k27k53O4nJ17K19m9m02M9K41O0Q4l99
$$ -71 208 124 11 229 -56 41 312 -428 -53 346 119 -134 -70 -75 42 261 212 -190 -141 100 160 244 -155
4139a55L19J38l91J99K6j71J82j72q0K32O6J69k50J34q2k02lK7M8K18j17j21j76
$$ -155 164 302 -89 110 136 -35 147 -25 -105 127 193 362 112 246 164 -38 -41 -14 34 252 135 14 -162
4162a62K67k2R9l90K51kK76k10l20J57L71m38Pl51O72q4j50p7n38N81j40J83k07
$$ -162 105 83 182 -208 43 41 317 107 -213 -56 315 -123 -116 -467 205 121 -29 -106 -644 -63 -203 -20 -227
4185b27K27Qo3Q8j61p2K77l30J60j4L10k15J9k33O7q3M8J32j5l4R1k9k21p5J31
$$ -227 0 8 -55 33 -128 -200 77 -253 -93 -107 203 -12 7 -226 -159 -242 -194 -62 -77 -111 -20 -49 -270 -345 -214
4210b14J72k1j29l2JQJ90n0k60M74l96L6K23j34K05j46l35J68N19j41l15o1J88
$$ -214 -42 -63 -192 -224 -223 -215 -25 -75 -335 139 -257 -221 2 -132 73 -73 -408 -240 279 138 -177 -238 -50
4233e0mR0p9L30m36L77l54Q3O9J22j90J05j05N6j41N7K5L01j25j96q5Q2K30j06
$$ -50 -54 36 -43 287 -149 228 -126 -43 26 148 -42 63 -42 14 -127 -70 -45 256 131 -65 -150 -68 162 56
4257E6J07k97L70qk6k33K27j53J98k54k04L34K49L2j68k7q7L9j78O5K4J58P7m47
$$ 56 163 -134 236 228 202 -31 196 43 241 -13 -217 117 366 398 230 203 116 155 -23 42 66 224 301 -146
4281a46k32J85L55k76k75K77L14q3k19Q1J68Q0m10L63m79K16J8r1J36K66j12j14
$$ -146 -378 -193 162 -114 -389 -112 202 119 -100 -19 149 229 -181 182 -297 -81 -63 -154 -18 248 136 22
4303B2k2P5J48k57J62p1j50J31J78l38j12J36p0J96l29N8J95J9K79n73O03n04
$$ 22 0 75 223 -34 128 57 -93 38 216 -122 -234 -98 -168 28 -301 -243 -48 -29 250 -323 280 -224
4325b24J54rj1J01j17K34k84K34n62M48m13L2n0L83R2j99j4J71J8ok4m53K80L02
$$ -224 -70 -79 -90 11 -106 128 -156 78 -484 -36 -449 -417 -467 -84 8 -191 -205 -34 -16 -22 -46 -499 -219 83
4349H3k13J74q6K35q8j09j12K19j70J43k33J90o1jp5j9J41j10Q1r8M16P6r0l2
$$ 83 -130 44 -42 193 105 -4 -116 103 -67 76 -157 33 -28 -29 -104 -123 18 -92 -11 -109 307 383 293 261
4373B61m86J2O71n43K53q9L13o5j92l53L15j8J12m26R0k3M30k60j07K83m1J16
$$ 261 -225 -213 458 -85 168 79 392 327 135 -218 97 79 191 -235 -145 -168 262 2 -105 178 137 253
4395B53p3m16K21J02O6r7j88K41J25M5m31K46J86r4j52j51O7N46j86l29n1J0L93
$$ 253 180 -236 -15 87 153 56 -132 109 234 279 -152 94 280 186 34 -117 -50 496 310 -19 -70 -60 333
4418C33n06K82L7o5L62n85J41J31J11k81J74j14j05L29m02j24k1K75J89m65M59
$$ 333 -173 109 146 81 443 -142 -1 130 241 -40 134 20 -85 244 -158 -282 -303 -28 161 -304 155
4439A55m87M82n04l3K73L55j6k22k97L46J17o9m05J81J66r5K0J4k36L67j24l02
$$ 155 -332 150 -354 -387 -114 241 225 3 -294 52 169 100 -305 -124 42 -53 -33 -19 -255 112 -12 -314
4461c14P2J35J17P1j19Mk3j43j7j84O72o76N26l89r2N08J7k26l85L82p8K59l61
$$ -314 -242 -107 10 81 -38 -34 -57 -200 -217 -401 271 -405 121 -268 -360 148 165 -61 -446 -64 -142 117 -244
4484b44j72L88m0R6r0j14Q4j8J22q4j83L79O5m1P8n5m9n04J53N29j52j68J58m0
$$ -244 -416 -28 -68 28 -62 -176 -92 -110 12 -72 -255 124 189 148 226 171 122 -382 -229 300 148 -20 138 98
4508I8l40N4J41j6J97n8m2Qkr0J70J26k99K2K33j45K29n02Q3M28j30K5k38JJ43
$$ 98 -242 -188 -47 -63 134 76 34 42 40 -50 120 246 -53 -31 202 57 286 -216 -133 295 165 190 -48 -47 96
4533I6j45K76l86K05Q8k34j6O35n30R5mj78J1L97l02J15J40k24J57k47k57M71
$$ 96 -49 227 -159 46 134 -100 -116 519 -11 84 80 -98 -87 310 8 123 263 39 196 -51 -308 163
4555A63n4J69k94k65L11o3mOJ23j79l9J10J06n5pj25Jk11K85K08k44q2M57l14
$$ 163 109 278 -16 -281 30 -33 -37 -31 92 -87 -126 -16 90 35 28 -97 -96 -307 -22 186 -58 -140 317 3
4579CK81k72o4J30k21K38j10J1m75N90k27r5MJ44J05l95l1N16k11k56PR5K79k27
$$ 3 284 12 -52 78 -143 95 -15 -4 -479 111 -116 -211 -207 -63 42 -353 -384 132 -79 -335 -328 -233 46 -181
4603a81K95m23K56r3J23L5l75J46L97l97p9M77l07K15M2k20N9pP4j61l8K52J59
$$ -181 114 -309 -53 -146 -23 12 -363 -217 180 -217 -296 181 -126 89 131 -89 -30 -37 37 -124 -162 90 249
4626B49j75L1M40m32J34k88L1J32J8j94J2PN7k55J55L3M01j43j45k2j44L54K4
$$ 249 74 105 545 113 247 -41 -10 122 140 -54 -42 -35 22 -233 -78 -45 356 213 68 46 -98 256 280
4649B80l88L8L55k12j38J94L2k34N17j78l42M37M4l38J61j93J73j86J94l37K98
$$ 280 -108 -70 285 73 -65 129 161 -73 444 266 -76 361 405 67 228 35 208 22 216 -121 177
4670A77j88k07K32o7K06m4J47n0j99J06k36R4P5J33l0M8m02J45J72j0j38l3K58
$$ 177 -11 -218 14 -53 153 109 256 206 7 113 -123 -29 46 179 149 197 -205 -60 112 102 -36 -69 189
4693A89j41J8M2l72M79l00N8l8j1J54k66J56k53J51JN12n28J03q5Q7P8j3j75L89
$$ 189 48 66 108 -264 215 -85 -27 -65 -76 78 -188 -32 -285 -134 -133 379 -149 -46 -131 -44 34 21 -154 235
4717B35l11Q9J01J31m74J20R7k05M13J69m84j27J43P7P3j34M8K33k50%j72j72
$$ 235 -76 13 114 245 -229 -109 -12 -217 196 365 -119 -246 -103 -26 47 -87 -39 194 -56 -56 -228 -400
4739d00M37j7j25j86O62l30j10l8N4K21l29M57l69m4J2J28j56m5L20j57r7m2O8
$$ -400 37 20 -105 -291 371 41 -69 -107 -53 168 -161 296 -73 -117 -105 23 -133 -178 142 -15 -112 -154 -86
4762h6J95j45K23p9k99J51P4j76K51j37P0J77j79p2J96J75n63K34O9J25J37n35
$$ -86 109 -36 187 108 -191 -40 34 -142 109 -28 42 219 40 -32 164 339 -224 10 79 204 341 -194
4784a94J87m3K11j74l30K54K66p7nj30Q4J15m3J43l05J09mQQ8j79j22J13J43l5
$$ -194 -7 -50 161 -13 -343 -89 177 100 95 -35 49 164 121 264 -41 68 64 72 160 -19 -141 -28 115 80
4808H0k18K32l20M47k40Q2n04K77J73q5K19k57J43k62M41j48J86l40j0J88k7j79
$$ 80 -138 94 -226 221 -19 63 -441 -164 9 -76 143 -114 29 -233 208 60 246 -94 -104 84 57 -122
4830a22K95m01K42j06J68q8K73n81K13o5j37K89o3q0l1M6J03R7k95L83q8k70J55
$$ -122 173 -228 14 -92 76 -12 261 -320 -107 -172 -309 -20 -83 -163 -194 -148 -45 52 -243 140 52 -218 -63
4853f3q5K69m67M07k19J70k69M50j11l37q9K59q5j1J51l5j42K39o8m5R3Q5m48
$$ -63 -148 121 -346 61 -158 12 -257 193 82 -255 -344 -85 -170 -181 -30 -65 -207 32 -36 -81 12 97 -351
4876c51K68k36L10j7k25J68K24M0k35j56J18K23j34K00j29n2J58l2l06K46K24
$$ -351 -83 -319 -9 -26 -251 -83 141 181 -54 -210 -92 131 -3 197 68 16 174 142 -164 82 306
4897C06k7k80j30j6N7K58k39j90K13r5o5L35j19K80k04j31K20k79K10P6k23q2
$$ 306 279 -1 -131 -147 -90 168 -71 -261 -48 -143 -208 127 8 288 84 -47 173 -106 104 180 -43 -125
4919a25k05L88J56j77j88K4J11K40l17M87j51p9j38j06R7L8k02k5M05l12k90N16
$$ -125 -330 58 214 37 -151 -127 -16 224 -93 394 243 164 26 -80 17 55 -147 -172 233 -79 -369 147
4941A47L1N4j05j5p0j03J32r5K41l85J67QO6k28j72K41JJ63j4j39L04l20K5K5
$$ 147 178 232 127 112 42 -61 71 -24 217 -168 -1 7 73 -155 -327 -86 -85 78 64 -75 229 -91 -66 -41
4965d1m1kp1N9Q3O9j02k50k02L98L9N5j60J90j11JqQ5q0N4l3K24K2j18J00j53
$$ -41 -82 -84 -155 -96 -13 56 -46 -296 -498 -100 -61 -6 -166 24 -87 -86 -94 -9 -89 -35 -68 156 178 60 160 7
4991Gk08L87k99j19J38J58m9k54K50p5J46J97m60K91j18M03j26o68M46K5k04J11
$$ 7 -201 186 -113 -232 -94 64 15 -239 11 -64 82 279 -181 110 -8 395 269 -399 47 72 -132 -21
5013b1k29M15l19N08n73O9J46J2K75k95j49L16k63J97nJ0k49L21o8l09K43q9L77
$$ -21 -250 165 -154 354 -219 -150 -4 8 283 -12 -161 155 -108 89 84 94 -155 166 98 -211 32 -57 320
5036C20k5k21K74j96o4J14O2q3j67O5r2m8J6j5Q0r9L68r5l03J19J82j37L09k32
$$ 320 295 74 348 152 88 202 264 181 14 79 -13 -61 -45 -60 20 -79 289 194 -109 10 192 55 364 132
5060A32j86J03q3j05P7L68m65L71P0k94J71j24l5LJ38j96J30N2k53M13m39j66
$$ 132 -54 49 -34 -139 -62 306 -159 212 282 -12 159 35 0 3 141 -55 75 127 -126 287 -152 -318
5082c18K30J20N3j46K11k51J60k65L85L8m65M23J73m24m3n8J35K2j80r7J1J14
$$ -318 -88 32 85 -61 150 -101 59 -206 179 217 -248 175 348 -76 -119 -177 -42 -20 -200 -297 -286 -172
5104a72J62k02j12K39j22O4L32l95K12j94p8o9L86m2J2l48J08L17j58k63J21k
$$ -172 -10 -212 -324 -85 -207 -143 189 -206 6 -188 -266 -335 51 9 21 -327 -219 98 -60 -323 -202 -204
5126b04M46k49o1J69j54J39N0k82L25q3j23q3J81K39j58N9l28j02J43J00k33O2
$$ -204 242 -7 -68 101 -53 86 136 -146 179 96 -27 -110 71 310 152 211 -117 -219 -76 24 -209 -147
5148a47L37J80k55J27K8k94J21K05k37K97j36m87K44M2j53K50k0j55j24K77N7
$$ -147 190 370 115 242 270 -24 97 302 65 362 226 -261 -17 25 -128 122 102 -53 -177 100 157
5169A57L75l74n8k17L19q3j93J85M0J62k86J59k74L8O7K04n47K76J83n6J11l35
$$ 157 532 158 100 -117 202 119 -74 111 151 313 27 186 -88 -50 17 221 -326 -50 133 77 188 -147
5191a47K37k71J16MO8K1N0k74L79L0k09j34J70j25j06J01k07N09j49l00K86j87
$$ -147 90 -181 -65 -61 7 28 78 -196 183 213 4 -130 40 -85 -191 -90 -297 212 63 -237 49 -138
5213a38J29J52m10L96l41JN35j08k68oK9O1l05J53K41r2p9l31N53j02k5k69J82
$$ -138 -9 143 -267 129 -212 -211 324 216 -52 -58 -29 32 -273 -120 121 29 -50 -381 172 70 45 -224 -42
5236d2j8J71J50l88o7k19K53K08J68j37r2J93j83j62M14n65J48J41R5k49J64j85
$$ -42 -60 111 261 -127 -194 -413 -160 48 216 79 -13 180 -3 -165 249 -316 -168 -27 68 -181 -17 -202
5258b02l7K16J2l46K78KK08j06j56j7K98j56P1k37l8J35K39k4l26M5J20J20l94
$$ -202 -239 -23 -11 -357 -79 -77 131 25 -131 -148 150 -6 65 -172 -210 -75 164 140 -186 -141 -21 99 -295
5281b95L37K52m39o0M11q9m6j62J97Mj08J76j8j79J7J6K21k8k07J71q0p0K36n37
$$ -295 42 294 -145 -205 206 117 71 -91 106 110 2 178 160 -19 -2 14 235 207 0 171 91 21 257 -280
5305b80J73k7K19KR5p5k39n6K13j25L33j55K0k79QL12k53l8K53JR7m9l9j49J13
$$ -280 -107 -134 85 87 182 107 -132 -188 25 -100 233 78 98 -181 -173 139 -114 -152 101 102 199 150 111 -38 75
5330G5O8l61J24J30q1p1J59J90o1n8j37j73J68j1J75j54j50K08p8M0r0jJ89k44
$$ 75 143 -218 -94 36 -45 -116 43 233 172 114 -23 -196 -28 -39 136 -18 -168 40 -38 2 -88 -89 100 -144
5354a44J12j49L24j88J2k45q7M07j15M6k65L15J45j85j62J32j3L15k98j42L32
$$ -144 -32 -181 143 -45 -33 -278 -365 42 -73 -27 -292 23 168 -17 -179 -47 -60 255 -43 -185 147
5375A47l76Q9K45o8K36l95q7K85R9k13m7M9L2k35l3M48j47K0p6%k1J14k63K03
$$ 147 -229 -140 105 37 273 -122 -209 76 175 -38 -85 -36 -4 -239 -272 176 29 49 -27 -27 -48 66 -197 6
5399FK00j03n3J49j87o0L11m39K28K27k14j20m6K15r8npJ47N9k46k41L83n2j03
$$ 6 206 103 50 199 12 -48 263 -176 52 279 65 -55 -101 114 16 11 4 151 210 -36 -277 106 54 -49
5423d9M0k66K51m3J66J2Q6j99R5J67k26l39N32p3jl60K93m5p0l1p8J88o0O1j53
$$ -49 -9 -275 -24 -67 99 111 197 -2 93 260 34 -305 227 154 153 -207 86 41 -29 -60 -138 50 -10 51 -102
5448a02j34J92n8N1J9j49O0J29l82Q6N13J4l01p2L98j55k1k73J84O4P6l60K02
$$ -102 -236 -44 -102 -51 -32 -181 -121 8 -374 -288 225 239 -62 -134 264 109 88 -185 -1 63 139 -221 -19
5471a9N0j02J7J40j98k8L32l03JJ69k19N0J10mK8j02p5Q3k66k7N60k61J3J71M8
$$ -19 31 -71 -54 86 -112 -140 192 -111 -110 59 -160 -110 0 -4 24 -78 -153 -70 -336 -363 197 -64 -51 120 168
5496A68j13j33j92K23L96k60l97J77L53k72k9l0PK22J2m28Q2L83j06qk08k11J82
$$ 168 55 -78 -270 -47 349 89 -308 -131 222 -50 -79 -109 -102 120 132 -296 -214 169 63 55 -153 -364 -182
5519a82K88j99J03R0k44J20K44k54K86p6j91Kp6%K20j73R2n62L47L12L3o6k13
$$ -182 106 -93 10 100 -144 -24 220 -34 252 176 -15 -13 -89 -89 131 -42 50 -512 -165 147 180 114 -99
5542i9K55Kj94m9L02m9l03K62j57L19r4j23l27M28j42k93K02R1M34n01j59J18
$$ -99 156 158 -36 -85 217 168 -135 127 -30 289 195 72 -255 173 31 -262 -60 31 465 -36 -195 -77
5564g7K43P6q9J0j94j32jK50l7j22K40J8l36R7j18K70jl29N54k78k05J73k00o
$$ -77 166 242 153 163 -31 -163 -164 86 49 -73 167 185 -151 -54 -172 98 97 -232 322 44 -161 12 -188 -194
5588a94L87M2o29L87p6K12j52j30K60k74K98l4j74J77J27n58K80L42j05k12r3
$$ -194 193 235 -394 -7 -83 129 -23 -153 107 -167 131 97 -77 100 227 -331 -51 291 186 -26 -119
5609a19K09j33J6n9k6m1J56k18m7J24J5L51k34N8q3l33K06M0j62J33M7j12N5j87
$$ -119 90 -43 -27 -86 -112 -153 3 -215 -262 -138 -123 228 -6 52 -31 -364 -158 -118 -280 -147 -100 -212 -157 -344
5633c44K98j07J96j71K57r0K43k50nl6n7j1P2M6n5N8L1j81N9j31J99j78L9L45
$$ -344 -46 -153 43 -128 129 39 282 32 27 -9 -66 -77 -5 41 -14 44 75 -106 -47 -178 21 -157 -118 227
5657B27j81j73J05j4N2k5m6P0l0n9K55j25J03k04Or0K32l15K07J30l42K69j30
$$ 227 46 -127 -22 -36 16 -9 -55 15 -15 -74 181 56 159 -45 -39 -129 103 -212 -5 125 -217 52 -78
5680g8Q0J9l38J95o3J98J27P4J6n6L5k1q9k41M9qL12j48k03O4j20j37J75M82l93
$$ -78 2 21 -317 -122 -185 13 140 214 230 174 209 188 99 -142 -93 -101 211 63 -140 -76 -196 -333 -158 324 -69
5705f9j05J47K44Lr2j51K72n41L53l18L34K4K12q0m45M65l29mJ9J18N6j99j3o
$$ -69 -174 -27 217 220 128 -23 249 -292 61 -257 77 101 313 233 -212 253 -76 -80 -61 57 113 -86 -99 -105
5729a05J34j23k11J92J93n2J64Qk73j85L06l1Qp5j18p6J77j77K01P5j5m1L5J43
$$ -105 29 -94 -305 -113 80 28 192 200 -73 -258 48 17 25 -50 -168 -244 -67 -244 -43 32 17 -24 11 154
5753A54l16NQ7k63K20L02oj29m63K38N58o81K84J87j29k42K67n9o0K86n1j33L6
$$ 154 -162 -157 -70 -333 -113 189 183 54 -409 -171 387 -294 -10 177 48 -194 73 14 -46 240 189 56 92
5776I2j29J66j41J8K2j10J84l42M0J28K11j04K0O2oo0j24J55l7QL60m26K16j94
$$ 92 -37 129 -12 6 28 -82 102 -240 -200 -72 139 35 55 117 111 51 -73 82 45 53 413 -13 203 9
5800Ijk81J91K16O7k7k74l81N69m6p2k13J95K28m14P9P9Q1j97K89k07R0J05K82
$$ 9 8 -273 -82 134 201 174 -100 -481 88 42 -30 -243 -48 180 -234 -155 -76 5 -192 97 -110 -20 85 367
5824C67l18N8J73K12l57k19J21j27P4L4j10K61pM1l18Q3L0j54J08K4pK44k7l40
$$ 367 49 107 280 492 135 -84 37 -90 -16 18 -92 169 162 203 -115 -32 -2 -156 -48 -24 -31 213 186 -154
5848a54L27n7j67J04m68K62pL03l88Q6O8N6J8n2K28j55P8K4j17m2l84K81M7k09
$$ -154 173 116 -51 53 -415 -153 -160 143 -245 -159 -91 -35 -17 -69 159 4 82 106 -11 -53 -437 -156 -109 -318
5872c18L75J63k79k46M5K05n8q5j2J92L3q2K00r4j31J89j3j76n8O4M64l30k05
$$ -318 57 220 -59 -305 -260 -55 -113 -198 -210 -18 15 -67 133 39 -92 97 84 -92 -150 -86 378 48 -157
5895a57J66j61J90k84j12L35q4k62K70J56l2K05j57j67J77J00k02P3p8K27j37
$$ -157 9 -152 38 -246 -358 -23 -107 -369 -99 57 25 230 73 -94 83 183 -19 54 -24 203 66
5916F6Rk88J75l14K67O7p6J89r8j61J38j83J79J76j25k43K50N6M8j93k81O81j41
$$ 66 75 -213 -38 -352 -85 -18 -94 95 -3 -164 -26 -209 -30 146 21 -222 28 84 132 -61 -342 339 198
5939A98l3r9K48o43O45l14J53j86l1J81q4j27J51J61l96Q1O2N88m13r6K05j67
$$ 198 165 66 314 -329 316 2 155 -31 -62 119 35 -92 59 220 -176 -95 -33 555 142 46 251 84
5961H4p7j17J76k17N3O8J43j53K14k07J32Q1jk06O0k2J19j20q4j44M9N8K02O3
$$ 84 7 -110 66 -151 -98 -30 113 -40 174 -33 99 180 179 -27 33 11 130 10 -74 -218 -169 -111 91 154
5985A54k84K0MJ72J5L4k89K56R2n04Q8K19j68K23k7m29J72J65K19k01J2K9j23
$$ 154 -130 -110 -106 66 81 115 -174 82 174 -330 -242 -23 -191 32 5 -424 -252 -87 132 -69 -57 -28 -151
6008a51O3j65J91R1k97J29J34K8J06k27J06j45k9j1j60L41L1O4r4m99J68P9M61
$$ -151 -88 -253 -62 29 -268 -139 -5 23 129 -98 8 -137 -166 -177 -337 4 35 99 5 -494 -326 -247 214
6031B14j09o1k15MQ3o9J99k06K18j06P5k55N28l05n5k13j22L47L02l05J77l9j22
$$ 214 105 44 -171 -167 -84 -153 46 -160 58 -48 27 -228 300 -5 -60 -273 -395 -48 254 -51 126 87 -35
6054c5j73K28j78J72J93k7m32K05J36M1k6p0m9J38k75J39O5K43k38j39L4m3K26
$$ -35 -208 20 -158 14 207 180 -252 -47 89 130 104 34 -15 123 -152 -13 52 295 57 -82 -48 -91 135
6077A35L6j95j40L92j17L00q03N49j24K07k56J9J50L3q6k65J56J04P2J2j74l0
$$ 135 171 -24 -164 228 111 411 -392 157 33 240 -16 3 153 186 100 -165 -9 95 167 179 5 -25
6099b5J24J46r7k79J83J93l70o8L66N0o2J16m87R4l6M9N7j89L82o2l05K87k02
$$ -25 99 245 148 -131 52 245 -125 -193 173 223 161 277 -210 -116 -152 -103 -46 -235 147 85 -220 67 -135
6122a35K93k33J09m13M88K26l73l2J64j02J8k29K46k5J54r4n0j68R9J75q9k20
$$ -135 158 -75 34 -379 109 335 -38 -70 94 -8 10 -219 27 2 156 62 12 -156 -57 118 29 -191
6144a91M3K31P3l05q0K14Q3j34Q7q6j40K05l78M57k4r2L70n44J63k74J31J64j33
$$ -191 -148 83 156 -149 -229 -15 68 -66 21 -65 -205 0 -378 79 55 -37 333 -211 -48 -322 -191 -27 -160
6167a60J49L00m0j45j56K82q8Q7n31L69O2L99m56np0N4m6n4J79k73L48k53j71
$$ -160 -11 289 249 104 -52 230 142 229 -302 67 129 528 72 67 -3 51 5 -49 130 -143 205 -48 -219
6190b19J26K45j62J92j70J9R2k13J01n6J07l7j6J3L1R5k52K68k89K75r8r0N5j56
$$ -219 -93 152 -10 182 12 31 123 -90 11 -45 62 25 9 22 53 148 -104 164 -125 150 52 -38 17 -139
6214a39J21K11M5k64P7r5L66P6m04R4R7l88P2K2K10Pj7L8Qj54N1K77l71L2J51
$$ -139 -18 193 238 -26 51 -44 322 398 -6 88 185 -203 -131 -109 101 108 91 129 137 -17 34 311 -60 -28 123
6239A23Ml16m6L41j72J7l25J71N9P3J9N5L37j40n01J91J10k60K68k47J9J70m7
$$ 123 127 -189 -235 106 -66 -49 -374 -203 -144 -71 -52 3 340 200 -301 -110 0 -260 8 -239 -220 -50 -97
6262i7J64j19R1o6o3Q6PM5k39j9K49K77l23O3Q9l98J41J52p6j95j35K42K81l92
$$ -97 67 -52 39 -27 -90 -4 3 48 -191 -210 39 316 -7 56 145 -253 -112 40 -36 -231 -366 -124 157 -235
6286b35R3Q0R8J39k45J63k10J47j7k43N9K34j81J25L2kL18l47k83K16L05l20L47
$$ -235 -142 -62 36 175 -70 93 -117 30 13 -230 -171 63 -118 7 39 37 355 8 -275 -59 246 -74 273
6309B73l18K25Pk23JM9j66R1l4J99k90J96Q0J3J47p3P8m17J79R9K3l5o3J06J93
$$ 273 -45 180 187 -36 -35 14 -152 -61 -95 104 -186 10 90 103 250 177 255 -162 17 116 139 104 41 147 340
6334C40m98N10m08K24j35k0j56K94J39m93M92m64K19L07m44L09l15o6R7j57K78
$$ 340 -158 352 -56 168 33 13 -143 151 290 -203 289 -175 44 351 -93 216 -99 -165 -68 -225 53
6355E3n6ml0Lj5P6J69k47J85j05p3j9K94m64J84Pk89K26j02J64j47R9Q7k3M6J49
$$ 53 -3 -7 -37 -34 -49 27 196 -51 134 29 -44 -63 231 -233 -49 -42 -331 -105 -207 -43 -190 -91 -4 -27 19 168
6381A68k33k86K70l00K96J66k66K05j39Q7J75n13K43Q7K34Q0k62m1mj72K9j31
$$ 168 -65 -351 -81 -381 -85 81 -185 20 -119 -32 143 -370 -127 -40 194 274 12 -29 -33 -205 -176 -307
6403c07N29k39p2N4k07J59j38J39K26Lj97K82m44K40j28l5K45j64n5K1r4K26k17
$$ -307 222 -17 -89 -35 -242 -83 -221 -82 144 147 -50 232 -212 28 -100 -135 110 -54 -109 -88 -182 44 -173
6426a73J32Q3q2J30j30p5K15K12l90J85j28j35R3L47j55l94J84l4L36j49j45J01
$$ -173 -41 42 -40 90 -40 -115 100 312 -78 107 -21 -156 -63 284 129 -265 -81 -115 221 72 -73 28
6448B8J09k30K15m1k90R3J43J35o9l47J20J54R9j91L7Q3r6N1J3q5q2M17j75n6
$$ 28 137 -93 122 81 -209 -116 27 162 93 -254 -134 20 119 -72 -35 48 -48 3 16 -69 -151 266 91 35
6472C5J42J21m05J87j67L0L39j46m6k39N0J28j85J42k02K27mR1r1q2QK90q5k35
$$ 35 177 298 -107 80 -87 -57 282 136 90 -149 -99 29 -156 -14 -216 11 7 98 7 -75 -67 223 138 -97
6496i7J49m6k49K09n3M3l40K75J14J16j28l71K21P9J58k81P7j06N4L25k58j8J55
$$ -97 52 6 -243 -34 -87 -44 -384 -109 5 121 -7 -378 -157 -78 80 -201 -124 -230 -176 149 -109 -127 28
6519B8r2K98j17M9l29J61K13l14rn3L6k06J63L13j03j71R1k10K43j42O2j0r3J00
$$ 28 -64 234 117 166 -163 -2 211 -103 -112 -165 -129 -335 -172 141 38 -133 -42 -252 -9 -151 -89 -99 -192 -92
6543i2pQ1p4j62K31K4j77L96m56L36o7k6j55r9J69J09k18J43J22q3j48M91l74
$$ -92 -99 -18 -92 -254 -23 1 -176 220 -236 100 33 7 -148 -247 -78 31 -187 -44 78 -5 -153 338 -36
6566c6K06m5l22J18K24J3k78j12K96k16j42N01j88J12r7p7K04p9m2o8o2J52j24
$$ -36 170 125 -197 -79 145 158 -120 -232 64 -152 -294 207 19 131 34 -43 161 82 40 -28 -90 62 -62
6589f2R8O1l67K48K05m46M98q5J57o51K57j00L46l97M78j52J5r1j21J48m3j49
$$ -62 36 97 -270 -22 183 -263 235 150 307 -344 -87 -187 159 -238 240 88 103 12 -109 39 -4 -153
6611a53r0M07k23P5l17L02l0j33L09j74K84k18M4O5j47N6j60O1J73J2m4K7l0p9
$$ -153 -243 164 -59 16 -301 1 -29 -162 147 -27 257 39 83 148 1 57 -103 -42 131 143 99 126 96 17
6635A7K6j26J57j87k53K51Q6N9j02j67K20oj1J19J5j68j13L35k99k05K18J95O4
$$ 17 43 -83 74 -113 -366 -115 -29 30 -72 -239 -19 -25 -36 83 98 -70 -183 152 -147 -352 -134 61 125
6658A25K54n49J67J10r6M8j58j51J99K84l22J39m9Q4j0j31J93q0j87K40o20L83
$$ 125 379 -170 -3 107 11 59 -99 -250 -51 233 -89 50 1 85 75 -56 137 57 -130 110 -510 -127
6680a27rn4L29m56L96l1oQ5k32N50o53K18k1K54m4l03M0J69j27j94J62J97j14
$$ -127 -136 -190 139 -317 79 48 42 127 -105 445 -208 10 -11 243 199 -104 -64 105 -22 -216 -54 143 29
6703B9R1k19K6k4p7J44J51p3P0J72j1k48Q5m0m1J55K4k5r6m9J6L14m93K47k56
$$ 29 120 -99 -73 -97 -174 -30 121 48 118 290 279 31 116 76 35 190 214 189 93 44 60 374 -119 128 -128
6728a28M96k59L4k69Ok8K36k75J83K14P9k51k4l4J40p4L08m66M45j57J11o1m13
$$ -128 368 109 143 -126 -120 -148 88 -187 -4 210 289 38 14 -20 120 46 354 -112 333 176 287 226 -187
6751a87L0R4j04k91L18N3L8j15K2J06j41L59n2k71n9J44K00l60J10P0m5P7j13
$$ -187 -157 -63 -167 -458 -140 -87 -49 -164 -142 -36 -177 182 130 -141 -200 -56 144 -216 -106 -36 -81 -4 -117
6774a17L84j91l53J38j9L44k00J58k47L43m26j9L8n0R7J22j09O1R0j60j10J30
$$ -117 267 76 -277 -139 -158 186 -14 144 -103 240 -186 -205 -167 -217 -120 2 -107 -46 44 -116 -226 -96
6796i6J66j7r3P1N5J64k10j33L1L6j69N54l87J12K02m62L46Rj91J74j59k27P9
$$ -96 70 53 -40 31 86 250 40 -93 -62 -26 -195 359 -28 84 286 -176 170 179 -12 162 3 -224 -145
6819a45O3Q6L18k35j10M2J65k02o7K0j72K97J7Kj76L44J3p0l99m9M76pk92n6K01
$$ -145 -82 4 322 87 -23 19 184 -18 -85 -65 -237 60 77 79 -97 247 260 190 -209 -258 218 211 -81 -137 64
6844F4r6L14j61k57K67j06N1j85J24J58J20j61l40L15o3J89l16l8L10k61j94J23
$$ 64 -32 282 121 -136 131 25 76 -109 15 173 293 132 -208 107 44 233 -83 -121 189 -72 -266 -143
6866a43J8K46J67k33J3J0j98M71m40o2J35K1j42L26l69M34m26R0n9N1K67l00J42
$$ -143 -125 121 288 55 68 78 -120 351 -89 -151 -16 5 -137 189 -180 254 -172 -82 -141 -90 177 -123 19
6889A9n5M6K10J2k61q9K28m2j3k3j04MJ88m25M38Qo4j44J91K5l2k6l60L04L9L75
$$ 19 -36 10 220 232 -29 -118 110 68 55 32 -72 -68 120 -305 133 141 77 -67 124 149 117 91 -269 35 74 449
6915D49n49m1K2j60K76J49l77K01M8k13R5j18L99k47J92k10J01J44k93L8J17R4
$$ 449 -100 -141 -119 -279 -3 146 -231 -30 18 -195 -100 -218 181 -66 126 -84 17 161 -132 -94 23 117
6937A17p2J32l65Q8j65J13J1K08K67k16j45J52l34J19J46k85K56j47Q6J81j06
$$ 117 45 177 -188 -100 -265 -152 -141 67 334 118 -27 125 -209 -90 56 -229 27 -120 -34 147 41
6958D1k10J76J38j98J91j35lO8n8k34J14Q4M7J14l79L37j18j80lN5j0L45j29J08
$$ 41 -169 7 145 -53 138 3 0 68 10 -224 -110 -26 21 135 -244 93 -25 -205 -208 -153 -163 182 53 161
6982A61j11j59pj03M36K6J1Om74L23J56k17j57K0K03k03L99o9n30R9L50k46L2
$$ 161 50 -109 -116 -219 217 243 254 260 -214 109 265 48 -109 -89 114 -89 310 241 -289 -190 160 -86 -54
7005e4K73k31Pk82L56j81J95j81J89j11n3J46K40m95K01j04J09k5K25j56l43K84
$$ -54 219 -12 -5 -287 69 -112 83 -98 91 -20 -73 73 313 -182 19 -85 24 -1 224 68 -275 9
7027IJ60j70j71P8J48k31j58K19R7o6Q1j17J39J14m15M06l11K86k17J31j85K9
$$ 9 169 -1 -172 -94 54 -177 -335 -116 -19 -85 -4 -121 18 132 -283 123 -188 98 -119 12 -173 -144
7049a44Q1K4J1k8j1L2q3K31j53l2N8l08J78k4N80l77k0Qm3J86m25L61N1ol22L26
$$ -144 -63 -39 -28 -56 -67 -35 -118 113 -40 -72 -14 -322 -144 -168 412 35 15 23 -20 166 -259 102 153 147 -175 151
7075A51j78o8K4J16J20p4j42j65M8K31j31k70L88j46L95l0l96N4K06N8j70O9j53
$$ 151 -27 -95 -71 45 165 91 -51 -216 -168 63 -68 -338 50 -96 299 269 -127 -73 133 191 21 90 -63
7098f3Lj08J88K50l16N2M0L11m36K31qj29j40l0K13J83j23M4o8J5l8j29J57M4
$$ -63 -60 -168 20 270 -46 6 46 357 -79 152 144 15 -125 -155 58 241 118 162 94 109 71 -58 99 143
7122A43l44K80K83m70J29J67k12k06J90Q3J7j55J93Q2k43J70j81p5L37l49L06
$$ 143 -201 79 362 -108 21 188 -24 -230 -40 43 60 -95 98 180 -63 107 -74 -149 188 -161 145
7143A45l67L53Lk00J70k74K37j39L36j51k98j05kL01p4K99n3k30p5J45J16k03
$$ 145 -222 131 134 -66 104 -170 67 -72 264 113 -185 -290 -292 9 -65 234 181 -49 -124 21 137 -66
7165f6K28j50J74k8R1k14m19K88J6J6K59m53k52M59Q7%J72j62j17pr7N5N8o3o5
$$ -66 162 12 186 158 249 35 -384 -96 -80 -64 195 -258 -510 -51 36 36 208 46 -71 -78 -175 -120 -62 -125 -190
7190a90J83J52l24K54n8J62K0k55P0J8j23K68k37L1M2k6j07J20o3P3P5q6j91K26
$$ -190 -7 145 -179 75 17 179 199 -56 14 32 -91 177 -60 -29 13 -13 -120 0 -63 10 85 -1 -192 34
7214C4r1J76J33q6NJ1j76n2M2j72K90j02N0m6J8L60l06ooR6j74j02L16j73R2m7
$$ 34 -57 119 252 166 171 182 6 -46 -4 -176 114 12 62 16 34 394 88 82 76 172 -2 -104 212 39 131 84
7240H4m1l9q5L83j98oL04l97kkQ0J71k7k22o9J98%j13m0K77j12q7l7q3k3R3N5
$$ 84 43 4 -81 302 104 98 402 5 3 1 81 252 225 3 -66 132 132 19 -21 256 144 57 20 -63 -86 7 62
7267F2J19j88k32L70k59K30k55K02k54J86K70k42J73m9J2LP6k32J46l88N69n19
$$ 62 181 -7 -239 131 -128 102 -153 49 -205 -19 251 9 182 133 145 148 224 -8 138 -250 319 -200
7289b00N64j66m88K92N2p7L2k76L71j40p5K00j23j5J73l12j08R8K46r2m8K3k2
$$ -200 364 198 -290 2 54 -23 9 -267 104 -36 -111 89 -34 -49 124 -188 -296 -198 48 -44 -92 -69 -91
7312i1R4N5j71J26q2o5l51M27K22j63M0j12n3O30o53L63k83j06J02J8M7j40L30
$$ -91 3 58 -113 13 -69 -134 -485 -58 164 1 41 -71 -124 506 -147 216 -67 -173 -71 -53 -6 -146 184
7335A84n91M33j05O9j74J99j16J74j85j22K42N5o6J14l14K92k17K51J03j91L7
$$ 184 -407 26 -79 -10 -184 15 -101 73 -112 -234 8 63 -3 111 -203 89 -128 123 226 35 72
7356G2k25K12J38j32QJ8J30n07J25j2L19k36J71k71L33q1L5l31K48r0K53j21K82
$$ 72 -153 59 197 65 73 91 221 -286 -161 -173 146 -90 81 -190 143 62 97 -234 14 -76 177 56 338
7379C38j48n8j09P8k94N37j93p0J91m0j17l04K43m9N56o36J87l29j65K78L53l45
$$ 338 190 132 23 101 -193 344 151 81 272 232 115 -189 54 5 561 -75 112 -217 -382 -104 249 -96
7401i6J60q2K39j16k24J93q9O8Q9r4N5N6k7l39N4J07L32k45l89J78K8J24k47J59
$$ -96 64 -18 221 105 -119 74 -15 53 142 48 103 159 132 -207 -153 -46 286 41 -348 -170 -142 -18 -265 -106
7425a06J85J41k73l6j14M60n06K60j07L15k71K71k99j20K50j93K39k51j1Q8j70
$$ -106 79 220 -53 -89 -203 257 -249 11 -96 219 -52 219 -80 -200 50 -143 96 -155 -166 -78 -248
7446b48M05l72M5K77j87j40L5J49J31j48K33l24J79J04l61J46M5J99l24j41L67
$$ -248 157 -215 -170 107 -80 -220 -185 -36 95 -53 180 -144 35 139 -222 -76 -31 168 -156 -297 70
7467G0k67O0L5M10l23L6l5j58M6J11K99k79J10J65j00l58m7K0J58n8P8k70N15
$$ 70 -197 -137 -102 308 -15 21 -14 -172 -126 -15 284 5 115 280 180 -178 -225 -205 -47 -105 -27 -297 218
7490B18J1j20J1k7J06j69j20M04m41Q4K69k79J43k04K07K1K63j61j91l4K84j38
$$ 218 229 109 120 93 199 30 -90 314 -127 -43 226 -53 90 -114 93 114 377 216 25 -9 275 137
7512A37j60J98j63N0k90L52k07L2N9L82k70q5K16m06J84j09j24K12k7Kj59N1K42
$$ 137 -23 175 12 62 -228 124 -83 -51 8 390 120 35 251 -155 29 -80 -204 8 -19 -17 -176 -125 117
7535A17k1k3L6j01j94N8J81j55K05k81r2J17k21L73k58J96lj34M5r8K85L68n19
$$ 117 96 73 109 8 -186 -128 53 -102 103 -178 -270 -153 -374 -1 -259 -63 -66 -200 -155 -253 32 400 -119
7558a19J88l2j94N1K01j09J13Ql50J05N1K34k59j5J02o3j10L14k13l8K37q7j51
$$ -119 69 37 -157 -106 95 -14 99 107 -243 -138 -87 147 -112 -127 -25 -88 -198 116 -97 -135 102 15 -136
7581a36J62J1Q0k40nJ72l8R3l84M29k44J52j20K74k50J31l3j18K60n59K87J16
$$ -136 26 37 117 -123 -128 44 6 99 -285 144 -100 52 -68 206 -44 87 54 -64 196 -363 -76 40
7603D0J93l33L28l7j89j52M0k27r5N03k45K04p9q4K54JJ90k60J3J07k30l65O12
$$ 40 233 -100 228 191 2 -150 -110 -337 -432 71 -174 30 -49 -133 121 122 312 52 65 172 -58 -423 189
7626A89K06l63J46m52M53j63q5O2o1q2J61j4K17k15L40n40L31j41m4J64m9r7L15
$$ 189 395 32 178 -274 179 16 -69 -7 -68 -150 11 -3 214 -1 339 -201 130 -11 -55 109 60 -37 278
7649B78J7m06O8K22K58o43L0M9K97l53J89j20Q3j29J10k91M92R1l22K80k70K77
$$ 278 295 -111 -43 179 437 -206 -176 -127 170 -183 6 -114 -31 -160 -50 -341 151 242 -80 200 -70 207
7671B07q1k13O6Q4k97J97k11L40r1J1N5l1k46K65k50L52j41k89K01J20J02k01
$$ 207 126 -87 -21 63 -234 -37 -248 92 1 12 67 36 -210 55 -195 157 16 -273 -72 48 150 -51
7693e1L54m48q5j40L15J82k32K11M8l05K87r2k5j04K30J01l88J93l49L05k59L70
$$ -51 303 -145 -230 -370 -55 127 -105 106 154 -151 136 44 19 -85 145 246 -142 51 -298 7 -252 118
7715A18j71P9p6j13J78J51j82j00J6K80k31Q7p8O9o7k44K84o1k45M73m14M29j42
$$ 118 -53 26 -50 -163 15 166 -16 -116 -100 180 -51 36 -42 27 -40 -284 0 -61 -306 167 -247 182 40
7738D0j88N11n08J26l02K49K10l4J02l09L34k94L04j57j25O6K50k44Rq6j31M98
$$ 40 -148 363 -145 -19 -321 -72 138 104 206 -103 231 -63 241 84 -41 25 275 31 40 -46 -177 321
7760C21m09J69J24j09l45L49Oq3m4J16j87M09j66j9K31m28m5L60n42N12j92p4
$$ 321 -88 81 205 96 -249 100 106 23 -21 95 -92 317 151 132 363 -65 -110 250 -292 220 28 -46
7782d6K00l94L98k35Q3K33j77j48RN1j2m03M00p6M29l33k14J06k28O13J0m77M4
$$ -46 154 -240 158 -77 6 239 62 -86 -77 -26 -38 -441 -41 -117 312 -21 -235 -129 -357 256 266 -211 -167
7805a67M67k60j62P0n8k6q4L34l13L62k75J2JP9K7k17J28J43r1P6J74j9j49n5
$$ -167 300 40 -122 -52 -110 -136 -220 114 -199 163 -112 -100 -99 -20 7 -210 -82 61 -30 46 220 201 52 -3
7829cK84j15j21K33n4n16N42m90J57L14j17M7L0J35n80M13k06J02O9m87M99j64
$$ -3 281 166 45 278 224 -292 250 -240 -83 231 114 161 191 326 -254 159 -47 55 124 -363 136 -28
7851b8l46K77LL5K1J29l21Q5P9j44L23K8q6k08N16m17K72M1k44p3J39k82R7N3
$$ -28 -374 -97 -94 -59 -38 91 -230 -145 -66 -210 113 141 55 -153 363 -54 218 259 15 -58 81 -201 -104 -51
7875e1J28l11J05K63k96J12M3L04m48K45j11k18J70J12r7J6Q0J91k92k91O3M84
$$ -51 77 -234 -129 134 -162 -50 -7 297 -151 94 -17 -235 -65 47 -50 -34 46 237 -55 -346 -283 201
7897B01l75J72j26K22O5k31L4j07R5J17l7J27j11J45j97r5K52j44j48K3K30L74
$$ 201 -174 -2 -128 94 159 -72 -38 -145 -50 67 30 157 46 191 -6 -101 151 7 -141 -118 112 486
7919D86p41K57L86m31L8J17Q3k69M6L28j97m1J61m79L67l6O5k20J77j03K57p5
$$ 486 -255 2 388 -43 -5 112 195 -74 -28 300 103 62 223 -256 111 75 140 -80 97 -6 251 176
7941A76k46k5M32l00j83J24l17N99j88q0k81J83J21M0Q0k29J85j06J36N3l03k23
$$ 176 -70 -95 337 37 -146 -22 -339 260 72 -8 -289 -106 15 55 135 -94 91 -15 121 174 -129 -352
7963c52L52r8K27k54L23m96M12j25L9J46k69J02n5j2Q5O7j17q8J08J33m36K77
$$ -352 0 -98 129 -125 198 -298 114 -11 28 174 -95 7 -48 -60 25 92 -25 -113 -5 128 -308 -31
7985c1J50j94O3K07q6J90k28J60n93M85k43R6o4J90j28K5k6K15k88N8j20n3K35
$$ -31 119 -75 -12 195 109 299 71 231 -362 123 -120 -24 -88 102 -26 -1 -27 188 -100 -42 -162 -215 20
8008B0j28K45l71L16j9j93K12K22k95j70J71jM29k25m7j38K5j05o6K53o8o7J01
$$ 20 -108 137 -234 82 63 -130 82 304 9 -161 10 9 438 213 166 28 53 -52 -118 135 67 0 101
8031A01j93m7L46l51J33R8mk38K62j11P6q7L46k50J14j96l6J62l96K63R1r3J9
$$ 101 -92 -139 207 -144 -11 87 83 -155 107 -4 72 -15 331 81 195 -1 -37 125 -271 -8 83 -10 9
8054Ir0p6J95j22L50j06j9op7J56l67K66j31o8J39J23m13p7K52J60o7J97m52M59
$$ 9 -81 -157 38 -84 266 160 141 135 58 214 -153 113 -18 -86 53 176 -237 -314 -62 98 31 228 -224 235
8078B35k97k7J84k59j2J88K0j64N62n70j2K0O6M77o97J73L46j30j85J66J5L2j69
$$ 235 -62 -89 95 -164 -176 12 32 -132 430 -140 -152 -132 -66 411 -286 -113 233 103 -82 84 99 131 -38
8101c8L98l03l7L17m84J81k8n3N2K4q5m0j25p7J30j6K60k86L17k13J18Po1r1k7
$$ -38 360 57 20 337 -147 34 6 -47 5 29 -56 -96 -221 -298 -168 -184 76 -210 107 -106 12 19 -42 -133 -160
8126a60K89j35k50N57n26M23j57k40K41k30L45K1jjj31J23k07J67k59P4J89j94
$$ -160 129 -6 -256 301 -225 198 41 -199 42 -188 157 178 177 176 45 168 -39 128 -131 -57 132 -62
8148f2J30Q3k02O5K80k15K51m46p8M66j54m1j4K36m88L99j89q2q9J78J59k23m24
$$ -62 68 151 -51 14 294 79 330 -116 -194 272 118 77 63 299 -189 210 21 -61 -150 28 187 -36 -460
8171d60M53q8J62l10J36J06J62k27J75O6q4k48J62J03m6K50jl98l9L44
$$ -460 -7 -95 67 -243 -107 -1 161 -66 109 175 91 -157 5 108 62 312 311 -87 -126 218
8191B18
$$ Imaginary data points
##PAGE= N=2
##DATA TABLE= (X++(I..I)), XYDATA
0@%%%%%%Qj6J6j6K4l2L2m0N6o4P2q8J05j22J45j71J96k26K65l05L46l94M50n12
$$ 0 0 0 0 0 0 0 8 -8 8 -8 16 -16 16 -24 32 -32 40 -48 57 -65 80 -91 105 -121 144 -161 185 -209 241 -271
30b71N76o47P26q12R05j010J126j250J387j540J705j887K091k315K565k845L160
$$ -271 305 -342 384 -428 477 -533 593 -657 730 -810 895 -992 1099 -1216 1349 -1496 1664
47A664l515L921m396M952n612O417p425Q724j0475J2985j6907K3958m0635J52249
$$ 1664 -1851 2070 -2326 2626 -2986 3431 -3994 4730 -5745 7240 -9667 14291 -26344 125905
61A25905J57027j75553n3988M3331Q3593l9646o2833q027O6249J6101m4192n0261
$$ 125905 282932 107379 53391 96722 180315 140669 77836 69809 136058 152159 107967 57706
73E7706J7225L1880J039l5475j3783O486M053k3572j6308J3990L0808j0344n2951
$$ 57706 74931 106811 107850 72375 58592 65078 69131 45559 29251 43241 74049 63705 10754
86A0754m1621J7626L9205K582l7879k2457J5177J9987j5251l4203j0253K1704
$$ 10754 -30867 -13241 25964 28546 -9333 -31790 -16613 3374 -11877 -46080 -56333 -34629
98c4629J5666j0824j8411l487N335R99j031L717K235r912j5398j334J7087J5183
$$ -34629 -18963 -29787 -48198 -51685 -46350 -45351 -46382 -42665 -40430 -50342 -65740 -67074 -49987 -34804
112c4804o159j5294J768J6386L784j5526j0270J4463K3927K044j9256r148J4498
$$ -34804 -40963 -56257 -54489 -38103 -34319 -49845 -60115 -45652 -21725 -19681 -38937 -48085 -33587
125c3587J3590m933o448R422J2408n761j5083j565J4789J1837m187p493L881J1631
$$ -33587 -19997 -24930 -31378 -21956 -9548 -15309 -30392 -31957 -17168 -5331 -9518 -17011 -13130 -1499
139a499L652j0166q471O046J4062M183j1018j0063P172J5516L015j0661n355P798
$$ -1499 2153 -8013 -16484 -10438 3624 7807 -3211 -13274 -6102 9414 12429 1768 -3587 4211
153D211N784o343p108N025J0440K84p851j898O391K432q119l597R532R891m281
$$ 4211 9995 3652 -3456 1569 12009 12293 4442 2544 8935 11367 3248 -349 9183 19074 14793
168A4793j1765j725Q965N600o248q062K020P957J491o976l218O471O380l836r175
$$ 14793 3028 1303 10268 15868 9620 1558 3578 11535 13026 6050 2832 9303 15683 11847 2672
183B672l270O125M286l990m891L807P279k801j1642m557Q543Q350m063r213l52
$$ 2672 -598 5527 9813 5823 932 4739 12018 9217 -2425 -6982 1561 9911 5848 -3365 -3717
198c717P791K668q069q147L708R345O7q333l919O603O604m160q429n17O632J874
$$ -3717 4074 6742 -1327 -9474 -5766 3579 3646 -4687 -8606 -2003 4601 441 -7988 -8505 -1873 1
214An684k799O108O807l519q003o10N897J162n367k641P457P363k509p740j486
$$ 1 -5683 -8482 -2374 4433 914 -7089 -7699 -1802 -640 -6007 -8648 -1191 6172 3663 -4077 -5563
230e563O668K333o158n735M597R279P01p344l239P250N797n597r384N74R527L826
$$ -5563 1105 3438 -2720 -8455 -3858 5421 6122 -1222 -4461 2789 8586 2989 -6395 -5821 3706 7532
246G532o794m963N407P572l289j1793k173R327N739n645p116L345Q897K49r289
$$ 7532 738 -4225 1182 8754 5465 -6328 -8501 826 6565 920 -6196 -2851 6046 6295 -2994
261b994o212N230O269k188p281l93P619L359m841o103J289N260m06o116k051N934
$$ -2994 -9206 -3976 2293 105 -7176 -7569 50 3409 -1432 -7535 -6246 -986 -1392 -7508 -9559 -3625
277c625M513l599n264J328N015k1n396k381M491M578k485n557J773O234L98o115
$$ -3625 888 -2711 -7975 -6647 -1632 -1653 -7049 -9430 -4939 -361 -2846 -8403 -6630 -396 2 -6113
293f113k825O257N012l490o553L10Q053L810o498n086N037Q265j497r143k166
$$ -6113 -8938 -2681 2331 -1159 -7712 -7402 651 4461 -2037 -7123 -2086 6179 4682 -4461 -6627
308f627Q172N410m815o771K535Q958J767q177m575N847O396k675p887j3P267M578
$$ -6627 1545 6955 2140 -4631 -2096 6862 8629 452 -4123 1724 8120 5445 -2442 -2455 4812 9390
324I390l813n398N44N314R19n767l558L973O021n59m923j486L758L231l825n920
$$ 9390 5577 179 723 6037 6956 1189 -2369 1604 7625 7066 2143 657 4415 7646 3821 -2099
340b099J353O199Q25n277j965M950M117l545o634J19M795J471m320k742N323M630
$$ -2099 -746 5453 6278 1001 -964 3986 8103 4558 -2076 -1957 2838 4309 -11 -2753 2570 7200
356G200l618o876P45N419O11n449l175M712N767j756o965j249N782L069m936n105
$$ 7200 3582 -3294 -2549 2870 3481 -1968 -5143 -431 5336 3580 -3385 -4634 1148 4217 -719 -5824
372e824K284N690P05n203k973L745L980j957n297l69N542K810l747l989Q62M610
$$ -5824 -3540 2150 2855 -2348 -5321 -1576 2404 447 -4850 -5219 323 3133 -614 -4603 -3741 869
388H69J328m075l328K330N321O1m882j827L871L010j912l773R08M251J389k988
$$ 869 2197 -1878 -5206 -2876 2445 2506 -2376 -4203 -332 2678 766 -3007 -2099 2152 3541 553
404E53k274K863K603k373l948J140M566J023k782p57K897J949k723l868Q55M035
$$ 553 -1721 1142 3745 1372 -2576 -1436 3130 4153 1371 614 3511 5460 2737 -1131 -276 3759
420C759M15k715k80L766K266l179m218n5M173J356l326k181L084M560m2n129l067
$$ 3759 4174 1459 1179 4945 7211 4032 -186 -241 3932 5288 1962 -219 2865 7425 7383 2254 -813
437h13K736L470k210m700J83O284L545m104n169J754M738j090o242j951M969N092
$$ -813 1923 5393 3183 -1517 -1334 4950 8495 4391 -778 976 5714 4624 -1618 -3569 1400 6492
453F492k228n634j67N479K381n597m686K342N290k40m175j383M304K427l078m449
$$ 6492 4264 -1370 -1537 3942 6323 726 -3960 -1618 3672 3432 -743 -2126 2178 4605 1527 -2922
469b922O50L699M63l180j231L084K435k110k989M70K636K43k998j177K170J806
$$ -2922 -2272 1427 1890 -1290 -2521 563 2998 888 -2101 -1631 1005 1248 -1750 -2927 -757 1049
485A049j599k140O88L031j29k667j943K114K791j324m015l33L977J960k642l177
$$ 1049 -550 -2690 -2002 1029 900 -1767 -3710 -1596 1195 -129 -4144 -4477 -500 1460 -1182 -4359
501d359J388M099j17n098k265L431L683j526m163N87M095J153m257l866K577M173
$$ -4359 -2971 1128 1011 -4087 -6352 -2921 762 -764 -4927 -4340 -245 908 -3349 -7215 -4638 -465
517d65p27m131p60M267K761l319l896J007L075Nl408j468L234K603q04l018J31
$$ -465 -1192 -5323 -6083 -1816 945 -2374 -6270 -5263 -2188 -2183 -5591 -7059 -3825 -1222 -2026 -5044 -4913
534d913K284N27k790k121K299K726m41j723j29J342J256j899j316P89K232m5j288
$$ -4913 -2629 -2102 -4892 -7013 -4714 -1988 -2429 -4152 -4281 -2939 -1683 -3582 -4898 -4109 -1877 -1922 -3210
551c210J62J982Q41j246k037N13K365Q07k493o20K505K558p00k841n30L074J723
$$ -3210 -3048 -1066 -225 -1471 -3508 -2995 -630 177 -2316 -2936 -431 2127 1427 -1414 -1944 1130 2853
568B853j682j975J175K687q8k127q38K008K158j040j810P59K519N18k323j590
$$ 2853 1171 -804 371 3058 2970 843 5 2013 4171 3131 1321 2080 4599 5117 2794 1204
584A204J607K267j64k327m90K380J617j385k315K87J930Q24k135j070J210J789
$$ 1204 2811 5078 4914 2587 2097 4477 6094 4709 2394 2681 4611 5435 3300 2230 3440 5229
600E229p07k347k77J658J57j797j638J323K076K18k351j059J490Q89k035k818
$$ 5229 4522 2175 1898 3556 3713 1916 278 1601 3677 3895 1544 485 1975 2864 829 -1989
616a989M67K746J312k006k224Q30K582j032l008j602K669K067j305k627L28K659
$$ -1989 -1522 1224 2536 530 -1694 -864 1718 686 -2322 -3924 -1255 812 -493 -3120 -2792 -133
632a33P49k654k699J280L202m50k864p11K751K449j742l659j80K733J636k202
$$ -133 616 -2038 -4737 -3457 -255 -705 -3569 -4280 -1529 920 -822 -4481 -4661 -1928 -292 -2494
648b494k430J546L739k55k917j368J570J657l01j651p2J926L26q91l66J430P01
$$ -2494 -4924 -3378 361 106 -2811 -4179 -2609 -952 -1253 -2904 -2976 -1050 -724 -1615 -1981 -551 150
665A50j359j317P80J391J38j183P4J402R53o30j788R6K062N80j677q54J204J280
$$ 150 -1209 -2526 -1746 -355 -217 -1400 -1326 76 1029 399 -1389 -1293 769 1349 -328 -1182 22 1302
683A302p43j244O67K431M14k143k042J853K419m10k805p01L124K459j256m008
$$ 1302 559 -685 -18 2413 2827 684 -1358 495 2914 2504 -301 -1002 2122 4581 3325 -683
699f83j50M012J327k905l044K264L482K90l568r13K747K247k019l544K69L623
$$ -683 -833 3179 4506 1601 -1443 821 4303 4593 1025 112 2859 5106 3087 -457 -188 3435
715C435J348k173j770J790J969j446k305q53J842K018q25j825N77J557o9j445
$$ 3435 4783 2610 840 2630 4599 3153 848 -5 1837 3855 3030 1205 1782 3339 3270 1825
731A825q11P15O89j70j458j76J692J214j540j361O57N32o48j631J58J891N20j361
$$ 1825 1014 1729 2418 2248 790 614 2306 3520 1980 619 1276 1808 1160 -471 -313 1578 2098 737
749G37j206Q05J574r45k280j68K077J082k324j916P96K537L16k336j598J650J911
$$ 737 -469 336 1910 965 -1315 -1483 594 1676 -648 -2564 -1768 769 1085 -1251 -2849 -1199 712
766G12r79k672n08K552J179j930k109R61K035L03j760j799J524J807q19k135l90
$$ 712 -267 -2939 -3447 -895 284 -1646 -3755 -2794 -759 -456 -2216 -4015 -2491 -684 -1503 -3638 -4028
783d028K110J279n85k033r00K178P02j493j168J262J945l50j497l71J409N27r81
$$ -4028 -1918 -639 -1224 -3257 -4157 -1979 -1277 -2770 -3938 -2676 -731 -1081 -2578 -2949 -1540 -1013 -1994
800a994j342J83J885P10q19m77J189P22r74j097K32J012j03k35J84K047L56p82
$$ -1994 -3336 -3153 -1268 -558 -1377 -1854 -665 57 -917 -2014 -1782 -770 -873 -1108 -924 1123 1479 697
818F97j116J23J263k39j415J16J612J473o62j240J61J496Q70j386j988R25J384
$$ 697 -419 -296 967 728 -687 -571 1041 2514 1852 612 773 2269 3139 1753 -235 690 2074
835B074N68j091l48R72J271o33k464J10K084R22p45k136L29K403K52k523r88J260
$$ 2074 2642 1551 1203 2175 3446 2813 349 459 2543 3465 2720 584 913 3316 3568 1045 57 1317
853A317K059r41k465l35K328O19j439j478R93Q95n86j642k46J281Q62j470j253
$$ 1317 3376 2435 -30 -365 1963 2582 1143 -335 658 1553 967 -675 -921 360 1222 -248 -1501
870a501O19J291m7j284o94Q7J182o22j621l44K036O86j323j855J269J273n21k469
$$ -1501 -882 409 362 -922 -1616 -1529 -347 -969 -2590 -2934 -898 -212 -1535 -3390 -2121 -848 -1369 -3838
888c838p14K753J537j686j832P46K527k03k744r54J829J932j181k082J67K728
$$ -3838 -4552 -1799 -262 -1948 -3780 -3034 -507 -710 -3454 -4408 -2579 -647 -1828 -3910 -3743 -1015
904a015Q92j574k461J113K373R4k504r61K202K532n51k798k52K342J312k060j495
$$ -1015 -123 -1697 -4158 -3045 -672 -578 -3082 -4043 -1841 691 140 -2658 -2910 -568 744 -1316 -2811
921b811J268K594l45j955o14J850J114j182j523P67J662N59j302k76R35J196n17
$$ -2811 -1543 1051 706 -1249 -1863 -13 1101 -81 -1604 -837 825 1384 82 -194 741 1937 1420
938A420j681j12J566R86r16q80R68J330o04j648J38J679Q69j434j434J060J491
$$ 1420 -261 -373 1193 2179 1263 383 1351 2681 2077 429 567 2246 3115 1681 247 1307 2798
955B798r1j632o08J966J268j536j690N90J746N65j901r47J200J060m33j285m35
$$ 2798 2707 1075 467 2433 3701 2165 475 1065 2811 3376 1475 528 1728 2788 2355 1070 635
972F35J653J349j319k100p2J896O28j387j026R47J793m93j648j144J806K69j049
$$ 635 2288 3637 2318 218 146 2042 2670 1283 257 1204 2997 2504 856 -288 1518 1787 738
989G38q77M62J279L26j483k54R20P02j581j203L44J541R3p38k47K94J054j088
$$ 738 -139 323 1602 1928 445 191 1111 1813 232 -971 -627 914 1007 269 22 316 1370 282
1007B82j697P8J464N76r37j004R61J182m99j897l52J048J644j464j606N27K281
$$ 282 -1415 -1337 127 703 -234 -1238 -277 905 406 -1491 -1843 -795 849 -615 -2221 -1694 587
1024E87M74j880j421J201J457o90k000l97K048J637j310j663J71J989K13k276
$$ 587 1061 -819 -2240 -1039 418 -272 -2272 -2669 -621 1016 -294 -1957 -1786 203 416 -1860
1040a860r43J072J942m66j702n46J752J406j141k265M30J422K32r01p00J297J155
$$ -1860 -2803 -1731 211 -255 -1957 -2503 -751 655 -486 -2751 -2321 -899 -667 -1568 -2268 -971 184
1057A84k71j542J45J198L03j805J7J063O67l20r24M57J340N38j576j273J161J787
$$ 184 -87 -1629 -1484 -286 17 -1788 -1771 -708 -41 -361 -1285 -828 512 1050 -526 -1799 -638 1149
1075A149r22j313L66K080O82j534j487N00J886k02j892m37K381J855j369k117
$$ 1149 227 -1086 -720 1360 2042 508 -979 -479 1407 1205 -687 -1124 1257 3112 1743 -374
1091c74K98K263L38j778j622J456K249j52k243m56K074J619j704k303L81J917
$$ -374 -76 2187 2525 747 -875 581 2830 2678 435 -21 2053 3672 1968 -335 46 1963
1107A963O70j577j150J237J951o80j874o01J142Q43o92j234J18J210O02j285q12
$$ 1963 2633 1056 -94 1143 3094 2414 540 -61 1081 1924 1232 -2 116 1326 1928 643 -169
1124a69P74M64o48j360J94J257O50j213p01P45M18k95j416p2J577P6j676m3P31
$$ -169 605 1069 421 -939 -745 512 1162 -51 -752 -7 411 116 -1300 -1372 205 281 -1395 -1438 -707
1143g07J144q85j951K03K081M15j715j598J154K038n27j785o72J862J379p03k385
$$ -707 437 -448 -2399 -2196 -115 300 -1415 -3013 -1859 179 -348 -2133 -2805 -943 436 -267 -2652
1160b652o4J852R58j597j389R07K455q0k190o24J451J372r79j773J31J936R15
$$ -2652 -2716 -864 94 -1503 -2892 -1985 470 390 -1800 -2424 -973 399 -580 -2353 -2222 -286 629
1177F29j232j748J117J834o27j410p53J420J093p90j296L84J539Q6j181p90Q52
$$ 629 -603 -2351 -1234 600 -27 -1437 -2190 -770 323 -467 -1763 -1379 160 246 -935 -1725 -873
1194h73R19o76j298O10J246N08r28p56P28J007j209r46M84J298P89j333o97N91
$$ -873 46 -630 -1928 -1318 -72 436 -492 -1248 -520 487 -722 -1668 -1184 114 903 -430 -1127 -536
1212e36J427j2j585n14J326J207j044j256O94J596P86j740j183R69J788m46j614
$$ -536 891 879 -706 -1220 106 1313 269 -987 -293 1303 2089 349 -834 135 1923 1477 -137
1229a37l8J614J235j517j340Q69J248L62j776p23Q17J432r7j406m7J300Q68j362
$$ -137 -175 1439 2674 1157 -183 686 1934 2296 520 -203 614 2046 1949 543 496 1796 2664 1302
1247A302j166L29J423l21j098l04J340P12j008j105J46J607N8k106n51J613P86
$$ 1302 136 465 1888 1567 469 165 1505 2217 1209 104 250 1857 1915 -191 -742 871 1657
1264A657p60j105J70J259J74j439j156Q46J512j24j667o23J975Q69j804j770Q50
$$ 1657 897 -208 -38 1221 1395 -44 -1200 -354 1158 1034 -633 -1256 719 1588 -216 -1986 -1136
1281a136J976l63j688r96J818J746n69k452l20K022Q09j643j918J313J963J60
$$ -1136 840 477 -1211 -2207 -389 1357 788 -1664 -1984 38 847 -796 -2714 -1401 562 722
1297G22k012q13J417J406p99j841oK008O63j619j054J245J326k82j662j97J012
$$ 722 -1290 -2103 -686 720 -79 -1920 -1926 82 745 -874 -1928 -683 643 361 -1301 -1498 -486
1314d86J211q90j464J176J486o43j325m80J351P74n29j461N13J622J04j591m05
$$ -486 725 -165 -1629 -453 1033 390 -935 -1415 -64 710 181 -1280 -767 855 959 -632 -1037
1331a037J137J384o71j766N21J413M28j357j070J217J887n97k134l38J767J146
$$ -1037 100 1484 813 -953 -432 981 1409 52 -1018 199 2086 1489 -645 -983 784 1930
1347A930j160j661L51K097Q23k235j285J664J895m15k400o32K193R18j329j425
$$ 1930 770 -891 -540 1557 2380 145 -1140 524 2419 2004 -396 -1028 1165 2083 754 -671
1363f71O51J939K90j874j165J638J257p84j872J42J681O05j252j134P23J414j78
$$ -671 -20 1919 2209 335 -830 808 2065 1281 -591 -449 1232 1837 585 -549 174 1588 1410
1380A410j762n85J562J133j414j129P47J592m17j972k28J318J010j118j529O25
$$ 1410 -352 -937 625 1758 344 -785 -38 1554 1137 -835 -1063 255 1265 147 -1382 -757
1396g57J899k2j887o08J154J259q37k041M02J426Q58j232j255L98J493K40j972
$$ -757 1142 1120 -767 -1375 -221 1038 201 -1840 -1438 -12 846 -386 -1641 -1243 250 490 -1482
1413a482r39J549J454n64k185k85K200J253j980j584J094J843n66j935l86J678
$$ -1482 -2421 -872 582 18 -2167 -2452 -252 1001 -979 -2563 -1469 374 -192 -2127 -2513 -835
1429h35J659j099j948M06J854N7j354j039J395J243j56j525o34J863L34p27j220
$$ -835 824 -275 -2223 -1817 37 94 -1260 -2299 -904 339 183 -1342 -1976 -113 221 -506 -1726
1446a726L38J382K81j251n64J227J231j244j123O29J431O6j735j01R17J654o17
$$ -1726 -1388 -6 275 -976 -1540 -313 918 -326 -1449 -820 611 677 -1058 -1159 -242 1412 795
1463G95j756M85J638J32j324r98R21J542k19j384n22J623J470j786j585M90J722
$$ 795 -961 -476 1162 1294 -30 -1028 -107 1435 1216 -168 -690 933 2403 617 -968 -478 1244
1480A244Q60j534j388J112K163o91j919n74K039P01j291j539P48K157l37j515
$$ 1244 2104 570 -818 294 2457 1766 -153 -727 1312 2013 722 -817 -69 2088 1751 236
1496B36p57J012J629q11j503l96J613R26r22j521Q93J040j77j353n91J395O92
$$ 236 -521 491 2120 1309 -194 -590 1023 1949 1027 -494 399 1439 1262 -91 -682 713 1405
1513A405j049j172P03J162q6j330n99J157Q52j026j407N40J587M53j598r32R25
$$ 1405 356 -816 -113 1049 963 -367 -966 191 1043 17 -1390 -850 737 1190 -408 -1340 -415
1530d15J311p42j528k51J692P77j073j533N91J769o0j611q20J314J588r64k018
$$ -415 896 154 -1374 -1625 67 844 -229 -1762 -1171 598 538 -1073 -1893 -579 1009 45 -1973
1547a973R8K118N02j506j274Q16J547j3j553p83J538J428q16j887N61J399M10
$$ -1973 -1875 243 745 -761 -2035 -1219 328 315 -1238 -2021 -483 945 129 -1758 -1197 202 612
1564F12j571p80Q78J573m30j641K61J267P91r65j314O47R84M40j511n42J305Q54
$$ 612 -959 -1739 -861 712 282 -1359 -1098 169 960 -5 -1319 -672 312 752 -759 -1301 4 858
1582H58p91o04M7J147M85j517o40R08J076k20j336l2J363P60j065j257N88J307
$$ 858 67 -537 -490 657 1142 -375 -1015 -107 969 749 -587 -619 744 1504 439 -818 -230 1077
1600A077J95j539n00J322J384p06j873L80J703M56j688q70R46J763l54j457l85
$$ 1077 1272 -267 -767 555 1939 1233 -640 -260 1443 1899 211 -659 287 2050 1696 239 -146
1617a46J268P30o73j243j09J761L35j213q47J053J357m51j521j99P10P38j043
$$ -146 1122 1852 1179 -64 -173 1588 1923 710 -137 916 2273 1822 301 102 812 1550 507
1634E07r29O74J564k17j307q3O92O91p80j218K70J096j92p16o81R04P23p48j476
$$ 507 -422 252 1816 1599 292 209 901 1592 812 -406 -136 960 768 52 -629 275 998 250 -1226
1653a226M35J326r3n89r22P42J044n35j314m87J260O59r86j019J12J732k70p46
$$ -1226 -791 535 442 -147 -1069 -327 717 182 -1132 -1619 -359 300 -686 -1705 -1593 139 -131 -877
1671h77j026Q24J225n11j411j47J555N84j174r23M17J384N0j534j60R57R68n47
$$ -877 -1903 -1079 146 -365 -1776 -1923 -368 216 -958 -1881 -1464 -80 -30 -1564 -1724 -767 201 -346
1689c46j098O9J094N87r59q26J015M95R6r74n55J132P97o41q04L99O83L37r23
$$ -346 -1444 -1375 -281 306 -653 -1479 -464 31 127 -847 -1402 -270 527 -114 -918 -519 164 501 -422
1708d22l79Q18N71j32p92k09J109M56j111m38P05P25m88o95l69J182Q36p53j276
$$ -422 -801 17 588 456 -336 -545 564 1020 -91 -529 176 901 413 -282 -651 531 1367 614 -662
1727f62N54J333n16r28o61J074Q87l99r80k66J449M54j255r57N29J242K14j201
$$ -662 -108 1225 709 -219 -880 194 1081 682 -298 -564 885 1339 84 -873 -344 898 1112 -89
1745h9j91O49J002p80r46j64J263K77p51q88P37R03k90p97k96O97N67o34q32N42
$$ -89 -280 369 1371 591 -355 -519 744 1021 270 -618 119 1022 732 -65 -361 336 903 269 -563 -21
1765b1O65M33j135m53P22M07N6p58L67qK20q72k29N42O96jr26j67Q35K71j112
$$ -21 644 1077 -58 -511 211 618 674 -84 283 275 495 -377 -606 -64 632 631 -295 -462 373 644 -468
1786d68n81O46P01Q4r79lN75L39m74q45K09J053L07j142m44M97Q43k90j076j63
$$ -468 -1049 -403 298 382 -597 -600 -25 314 -160 -1005 -796 257 564 -578 -1022 -525 318 28 -1048 -1211
1806a211J210K79o28o74N56Q99l2r88m44M95P66k53q70L1N36P08p82k02K81N54
$$ -1211 -1 278 -350 -1024 -468 431 399 -589 -1033 -538 228 -25 -895 -864 -328 380 -402 -604 -323 231
1826B31K15j005m00P28M68q1l43m02P31J26o20l45M07N94k39p35J37N52N62p84
$$ 231 446 -559 -959 -231 237 156 -187 -589 142 268 -352 -697 -290 304 65 -670 -533 19 581 -203
1846b03m04O51N59k55r40k0Q87L93n86m27L11O80j61m88m74M44O36n53k4p2P41
$$ -203 -607 44 603 348 -592 -612 275 668 82 -345 -34 646 485 -3 -477 -33 603 50 26 -46 695
1867F95L65p76n18N96M70N9q13k89R41N99l38o89j21K66M95l47m29J95O66p2m54
$$ 695 1060 284 -234 362 832 891 78 -211 730 1329 991 302 181 447 942 595 166 361 1027 955 501
1888E01m10Q58J35k04o60J51Q43l73k01o99M88O73m45m44K51J75L4l66k71J75
$$ 501 91 949 1084 880 220 371 1214 841 640 -59 429 1102 657 213 464 639 673 307 36 211
1908B11K63k81n27J49N15o5o16j32K49O70n23k77k44N88M53o24p85N61L68j32
$$ 211 474 193 -334 -185 330 265 -351 -483 -234 436 -87 -364 -608 -20 433 -191 -976 -415 -47 -179
1928a79l14j35K75L52k51p11j83J228K28q70k68J40O53j41j05l41M64N25l92p79
$$ -179 -493 -628 -353 -1 -252 -963 -1146 82 310 -560 -828 -688 -35 -176 -281 -622 -158 367 -25 -804
1948h04J02L69L46m86l97M94K96K70o01p7L90Jj9n56MN02L30l58k08J54L14p7
$$ -804 -702 -333 13 -473 -870 -376 -80 190 -411 -488 -98 -97 -116 -672 -668 -166 164 -194 -402 -248 66 -11
1970a1o38K8N96L2k30k55M71O05o00k94k12Q48K9k38m19K62L41L84p54k24L54
$$ -11 -649 -621 -25 7 -223 -478 -7 598 -2 -296 -508 340 369 131 -288 -26 315 699 -55 -279 75
1991G5N17j20p82j79P89N35n10n02L59N95j91m69r1K19L14j15l88k90M80P11o96
$$ 75 592 472 -310 -489 300 835 325 -177 182 777 586 117 26 245 559 444 56 -234 246 957 261
2012B61m31O43j47k9k14o9L94Q2j70j55O6L20k36k99k3M8N30l10j67j32K02K58
$$ 261 -170 473 326 297 83 14 408 490 320 165 231 551 315 16 -7 41 571 261 94 -38 164 422
2034D22m11m03K48N18k97l51q2P32j60k70m60L80M74m55n00l1O68L60l32j63l84
$$ 422 11 -392 -144 374 77 -274 -356 376 216 -54 -514 -134 340 -115 -615 -646 22 382 50 -113 -497
2055d97O57K22o27o19M55P33l51m59J80J69Q04j075k49J79K71J98o02q0L45N80
$$ -497 160 382 -245 -864 -409 324 -27 -486 -306 -137 667 -408 -657 -478 -207 -9 -611 -691 -346 234
2075B34o7r38oQ45K82n16n98J58L81J67l07k58N83R4j54l52kK82M7k51o5L95m9
$$ 234 167 -771 -777 68 350 -166 -764 -606 -225 -58 -365 -623 -40 54 -100 -452 -454 -172 -125 -376 -441 -46 -95
2098i5K18p47K27L57L79o11k32J49M62J35o44J30M29K12k18l77O9M98P8k80r8
$$ -95 123 -624 -397 -40 339 -272 -504 -355 107 242 -402 -272 157 369 151 -226 -157 341 419 139 41
2119D1L6J44k45k16J2O94J5j69l80L17P51k17r15K35mN62M6n10n36R26J39m61
$$ 41 77 221 -24 -240 -228 466 481 312 -68 249 1000 783 -132 103 99 661 707 197 -339 587 726 265
2141B65o30N46L09M8m12J01K1L71m1n41j00M88j85J49l64R8M32l44k05K59K17
$$ 265 -365 181 490 538 126 227 248 619 578 37 -63 425 240 389 25 123 555 211 6 265 482
2162D82J00m54j18J66J68j09j59J16j48K56l67N1Q8Q9K38p14j15N59j57Km72N8
$$ 482 582 128 10 176 344 235 76 192 44 300 -67 -16 72 161 399 -315 -430 129 -28 -26 -498 -440
2184d40P94J27n44m55P0L34P6j54m33P91j02p4n71K45K44K50m40n82L71L55L14
$$ -440 354 481 -63 -518 -448 -114 -38 -192 -625 166 64 -10 -581 -336 -92 158 -282 -864 -493 -138 176
2205A76m26m46K67P51k23p69J44L40J61k70l37L54O36l97m19j00M10J99m74J86
$$ 176 -250 -696 -429 322 99 -670 -526 -186 -25 -295 -632 -278 358 -39 -458 -558 -148 51 -423 -237
2225b37J87M0J77j77k69K83L6k82J10J2nJ04l4j76K27K46j01l06j87N81J10o80
$$ -237 -50 -10 167 -10 -279 4 40 -242 -132 -120 -125 -21 -55 -231 -4 242 141 -165 -352 229 339 -341
2247c41k74P10K83j25m45j78M52N09o00q4R1K02M51j033L71j9O68l07m37k66O26
$$ -341 -615 95 378 253 -192 -370 82 591 -9 -93 -2 200 651 -382 -11 -30 638 331 -106 -372 254
2268B54L38j00o86K71N26j09j9m81K45M23j45n84o3O78M7m14k14J46r2K93j94
$$ 254 592 492 -194 77 603 494 475 -6 239 662 517 -67 -130 548 595 181 -33 113 21 314 120
2289A20l41M47M3m53K2L13L03m37K50p03P22k83j8k87J67L43K2l48l03L59M12
$$ 120 -221 226 269 -184 -162 151 454 17 267 -436 286 3 -15 -302 -135 208 230 -118 -421 -62 350
2310C50j11o94j45N77J02k94j18M1L20M6l45m73N44M54m36m71K59N90k54k80j2
$$ 350 239 -455 -600 -23 79 -215 -333 -292 28 74 -271 -744 -200 254 -182 -653 -394 196 -58 -338 -350
2331c50k76Q60m38l23K73k44Q08n45k34l0K74L60l09m34J80L54Q5k51l20N63n1
$$ -350 -626 234 -204 -527 -254 -498 310 -235 -469 -499 -225 135 -174 -608 -428 -74 11 -240 -560 3 -48
2352d8m45J5K24L62k40j96j36N87K8r3j90o2J30K20o13Q5J57P42m30m24J32J84
$$ -48 -493 -478 -254 108 -132 -328 -464 123 151 58 -132 -194 -64 156 -457 -372 -215 527 97 -327 -195 -11
2374a1L16l25l29J63M67J4m63m6M17P07q62l58M4N03J08k66l14L47O67m11l39
$$ -11 305 -20 -349 -186 281 295 -168 -214 203 910 48 -310 -266 237 345 79 -235 112 779 368 29
2395B9J07L71J40l35k68j9L89m0k50k88N47K51l70k30K13Qj08J51k58K46L79m19
$$ 29 136 507 647 312 44 25 414 374 124 -164 383 634 264 34 247 255 147 298 40 286 665 246
2417B46m3j61J52R6j19l98L40J22J21l26j59M16r8K5l76J39L39J22l73j97K65
$$ 246 203 42 194 290 171 -227 113 235 356 30 -129 287 189 214 -162 -23 316 438 65 -132 133
2438A33L90l24m12M5M54j25l72r8L00J11P6m96R2J04K56k42m78L70K73J65l56
$$ 133 523 199 -213 -168 286 161 -211 -309 -9 102 178 -318 -226 -122 134 -108 -586 -216 57 222 -134
2459a34q1J44J71j13m63j26M9P07k81j67K84j69J80k68m12N94K29j44k28m5K44
$$ -134 -215 -71 100 -13 -476 -602 -553 154 -127 -294 -10 -179 1 -267 -679 -85 144 0 -228 -273 -29
2480b9K24k57k32J21K57Mn87K16L2N42n68J76Q1L72j04n15N3K13O16o11n2J23
$$ -29 195 -62 -294 -173 84 88 -499 -283 -251 291 -277 -101 -20 352 248 -267 -214 -1 615 4 -48 75
2502G5l3L46m85O8QK30L76n17j54J50L79J01o55J57L29M0j22j41K75M0lm82j4
$$ 75 42 388 -97 -29 -21 209 585 68 -86 64 443 544 -111 46 375 415 293 152 427 467 464 -18 -32
2525c2L24L38m58k79J11L04J37k15m82N39M18o0n58j70K73J50l60K17o4K81M3
$$ -32 292 630 172 -107 4 308 445 230 -252 287 705 645 87 -83 190 340 -20 197 133 414 457
2546D57n09L09o4L19l28n77M70K02q0k01k41M39J24l7m66K74J35L12o95m67P10
$$ 457 -52 257 193 512 184 -393 77 279 199 -2 -243 196 320 283 -183 91 226 538 -157 -624 86
2567H6K79k77m93L8L02K73n08k05K48L80j82k95Q5J10L29q3l97j80M41N0o0n73
$$ 86 365 88 -405 -367 -65 208 -300 -505 -257 123 -59 -354 -269 -159 170 87 -310 -490 -49 1 -59 -632
2589f32L14L90R1m11m58M38J34L3l83l30M81K55J53m62M70k8J38n41QN39k39m44
$$ -632 -318 72 163 -248 -706 -268 -134 -101 -484 -814 -333 -78 75 -387 83 55 193 -348 -340 199 -40 -484
2611d84J8K7N03k90R1j31N6K23Q3l24m3K80j32j46L4R5L61n5n20KN72Pl85M4j40
$$ -484 -466 -439 64 -226 -135 -266 -210 13 96 -228 -271 9 -123 -269 -235 -140 221 166 -354 -352 220 227 -158 -114 -254
2636b54O53k00n49j30K43P20o95pQ7M54K78o71j55O0P68m27p8l97P53K24n24l68
$$ -254 399 199 -350 -480 -237 483 -212 -219 -132 322 600 -71 -226 -166 602 175 97 -300 453 677 153 -215
2658b15J99N05j81l98j25L46J11J44n5m39N09j07j25l19R0M02J56m85l26O81L00
$$ -215 -16 489 308 -90 -215 131 242 386 331 -108 401 294 169 -150 -60 342 498 13 -313 368 668
2679F68n33n14L64M69l63k6m49N05J58j76m0m9Q8J36l69k34L84L35k70k18J37
$$ 668 135 -379 -15 454 91 65 -384 121 279 103 63 14 102 238 -131 -365 19 354 84 -134 3
2700Cj1L85k42l69%M43l44j75j53L28K47l65q8j63M61L11n80j88M07P6r5k36J02
$$ 3 -8 377 135 -234 -234 209 -135 -310 -463 -135 112 -253 -341 -504 -43 268 -312 -500 -93 -17 -112 -348 -246
2723b46J59J33K30p38l4O23K0m68j35L80J64j28j9n18N01J26n41K14J0P35k11
$$ -246 -87 46 276 -462 -496 127 147 -321 -456 -76 88 -40 -59 -577 -76 50 -491 -277 -267 468 257
2744B57k19n09O96M7o27n1K70K44J51l97k59L81L10q5n17Q4M28L28m34l55m2R12
$$ 257 38 -471 225 272 -355 -406 -136 108 259 -138 -397 -16 294 209 -308 -224 204 532 98 -257 -299 613
2766F13k33k88j90k9N33j89k60j43N06K70n60k00J67M32l53k49J96J90M06o07
$$ 613 380 92 -98 -127 406 217 -43 -186 320 590 30 -170 -3 429 76 -173 23 213 619 12
2786A2J3K0M49p2k05j95J88J84j22m62lM05M04n27j8j30M08k94j26K74j91M40
$$ 12 25 45 494 422 217 22 210 394 272 -190 -193 212 616 89 71 -59 349 55 -71 203 12 452
2808D52m19q1K37J15J0j57m01M53K04j25n17K28N81k20k38q9j13N21m02k21k39
$$ 452 33 -48 189 304 314 157 -244 209 413 288 -229 -1 580 360 122 33 -80 441 39 -182 -421
2829d21N97J44j63l83J93O2J04m55K0K61L8o1l23J40K13L47k69k82k56O17k14
$$ -421 176 320 157 -226 -33 29 133 -322 -302 -41 -3 -64 -387 -247 -34 313 44 -238 -494 123 -91
2850i1j1m69K92M35k89j54N5L43L5l25p4J40J96p7l42j39P53l98l4j48p0K29R3
$$ -91 -102 -571 -279 156 -133 -287 -232 111 146 -179 -253 -113 83 6 -336 -475 278 -120 -154 -302 -372 -143 -50
2873e0k86J9M86j51nl25P3L05j23k81J6K35J78q2j01j72M48j10j58l55M03L86
$$ -50 -336 -317 169 18 13 -312 -239 66 -57 -338 -322 -87 91 9 -92 -264 184 74 -84 -439 -36 350
2895C50k33l65K31j30M65j13l21m1k5O65m54k60K3M21n3n99J96N85J18k04j48
$$ 350 117 -248 -17 -147 318 205 -116 -157 -182 483 29 -231 -208 213 160 -439 -243 342 460 256 108
2916A08l56K99N21m17m21M92K41l72K3l84N23K27o16j44K51K05K6k96RL04K96
$$ 108 -248 51 572 155 -266 226 467 95 118 -266 257 484 -132 -276 -25 180 206 -90 -81 223 519
2937E19m45j29j83L02L28l19k7J62j7j01k2j16K09K98m29l03L92R8K1n16j10P02
$$ 519 74 -55 -238 64 392 73 46 208 191 90 68 -48 161 459 30 -273 119 217 238 -278 -388 314
2959C14K7m42l05Q8K10N27o12m76N27M26k71o41L59M65O3k58l79Q0L96j97k87
$$ 314 341 -101 -406 -318 -108 419 -193 -669 -142 284 13 -628 -269 196 259 1 -378 -298 98 -99 -386
2980c86P3K77k39K63m10J19mL20j72J5k35L49j6j91k27M37J19r0k99J82J71k7
$$ -386 -313 -36 -275 -12 -422 -303 -307 13 -159 -144 -379 -30 -46 -237 -464 -27 92 2 -297 -115 56 29
3002B9m20N8p0N46j04k85J44k8K19j90k27L82K34l48n13J84K31O20l97o16L75
$$ 29 -391 -333 -403 143 39 -246 -102 -130 89 -101 -328 54 288 -60 -573 -389 -158 462 65 -551 -176
3023a76L48K1j96m29Q6P58l75l04L66P9J84m18j48J36M86Qm71J32J89L50l18k25
$$ -176 172 193 -3 -432 -346 412 37 -267 99 178 362 -56 -204 -68 418 426 -45 87 276 626 308 83
3045H3j10L13n2K85m89K15K01j1n93J77K01j2k96M02k00K05J35l01j41J94R2L36
$$ 83 -27 286 234 519 30 245 446 435 -158 19 220 208 -88 314 114 319 454 153 12 206 298 634
3067F34p42K76J96j57J6l81N51j37K54q78K89L85k00m1k72m4L45M82o06K07J77
$$ 634 -108 168 364 207 223 -158 393 256 510 -368 -79 306 106 65 -207 -251 94 576 -30 177 354
3088C54j41l8m13Q1L38J30m92k24L30o2K34j28m62L56L88l77R7k95K91L23k66
$$ 354 213 175 -238 -157 181 311 -181 -405 -75 -137 97 -31 -493 -137 251 -126 -29 -324 -33 290 24
3109B4l02M5K71k5l18p6M33J23k09l09J65M70N4n45k28R3J33K39k18k08J99L14
$$ 24 -278 -233 38 13 -305 -381 52 175 -34 -343 -178 292 346 -199 -427 -334 -201 38 -180 -388 -189 125
3131A25k25r3k6J81m0l05K22J89J5j49m7J20O0o9n84O76l36M13l86J07j60N19
$$ 125 -100 -193 -219 -38 -78 -383 -161 28 43 -106 -153 -33 27 -42 -626 50 -286 127 -259 -152 -312 207
3153B07j30k32k38L70J77K83n80j30K39N28k91l61M3L91j7k82P0J9K03q5j77k14
$$ 207 77 -155 -393 -23 154 437 -143 -273 -34 494 203 -158 -115 276 259 -23 47 66 269 184 7 -207
3175b07M18j73Q7o7l05P15k44k50j59K32P3L27l22k86K28J9k3Q4Q6n2J0l39L70
$$ -207 211 38 125 58 -247 468 224 -26 -185 47 120 447 125 -161 67 86 63 147 233 181 191 -148 222
3198B22j09Q6m7m33M93K36j51l04k75L94K67k78k02o3K48K34k58k16J62L48k33
$$ 222 113 199 152 -281 212 448 297 -7 -282 112 379 101 -101 -164 84 318 60 -156 6 354 121
3219A21m19K82J59k7j53k51J36L76j99k52j63L34N0J03k78m4J76k6J74m64K68
$$ 121 -298 -16 143 116 -37 -288 -152 224 25 -227 -390 -56 -6 97 -181 -225 -49 -75 99 -365 -97
3240i7k2N9k46m8J7L59%l25K93J17J71m12k95L50J70k78k9k54K71K70k86J54l00
$$ -97 -119 -60 -306 -354 -337 22 22 -303 -10 107 278 -134 -429 -79 91 -187 -216 -470 -199 71 -215 -61 -361
3263c61J92K03o7k08K21o4o3J00l42N77q9j94k72L72r3q1j68L5N70m08l3K00k26
$$ -361 -169 34 -33 -241 -20 -84 -147 -47 -389 188 99 -95 -367 5 -88 -169 -337 -302 268 -140 -173 27 -199
3286a99K3R8KK30l47N26k61m54M49M0K44k27m84L34J08J5j28k52O48k17k8k49
$$ -199 -176 -78 -76 154 -193 333 72 -382 67 107 351 124 -360 -26 82 97 -31 -283 365 148 120 -129
3308a29K52j23J96p8j71M17j12Q9n38K67M5L8l18J36J43m5Kq7Q8K38j47j51P4
$$ -129 123 0 196 118 -53 364 252 341 -197 70 115 153 -165 -29 114 69 71 -16 72 310 163 12 86
3331H6J8M3l0K1k25L64J90j40k76k30M49k19J26k55M1L12R8o01J71O9R9J1j99
$$ 86 104 147 117 138 -87 277 467 327 51 -179 270 51 177 -78 -37 275 373 -228 -57 12 111 122 -77
3354g7K52Q7j46j46j05l6L57N7l64L74ml31K47j49j97P7J57P9l93K53J06m05P7
$$ -77 175 262 116 -30 -135 -171 186 243 -121 253 249 -82 165 16 -181 -104 53 132 -261 -8 98 -307 -230
3377b30K24M3o4K61m11J87k42K53k37J12k34L52j70k02M21j84K6K1q6P6K41j73
$$ -230 -6 37 -27 234 -177 10 -232 21 -216 -104 -338 14 -156 -358 63 -121 -95 -74 -160 -84 157 -16
3399a6Qk68L34j12r4k60M55R3j41j10j84K24k0nN3l05M83o9j51l09M50J77K7L
$$ -16 -8 -276 58 -54 -148 -408 47 140 -1 -111 -295 -71 -91 -96 -43 -348 135 66 -85 -394 56 233 260 263
3423B63k56J48j2j81N2J02r2K93j79Ml56M18J22n38N18k91j90M95q7m6J71j34
$$ 263 7 155 143 -38 14 116 24 317 138 142 -214 204 326 -212 306 15 -175 320 233 187 358 224
3445B24k57p1L06r3j30o9J44M6N2o9M1O9o6J93m55K61o8j5j9O6J88o4O1k48N0
$$ 224 -33 -104 202 109 -21 -90 54 100 152 83 124 193 127 320 -135 126 58 43 24 90 278 214 275 27 77
3470G7K27ko39q0P28j80K76n83K5K77n9J1K9l03L61j64J5J78k46K36k42J09m23
$$ 77 304 302 -337 -417 311 131 407 -176 -151 126 67 78 107 -196 165 1 16 194 -52 184 -58 51 -372
3493c72K91L07m81p8J93P7p9M1j61J91K17k00k20J0J80k94L52J26j54R2j17J65
$$ -372 -81 226 -255 -333 -140 -63 -142 -101 -262 -71 146 -54 -274 -264 -84 -378 -26 100 -54 38 -79 86
3515H6k83j6L3R8j14l29M53j2m9J60k92O1J19mp1K7K12k20L17j66J4M7k70P6J55
$$ 86 -197 -213 -180 -82 -196 -525 -72 -84 -133 27 -265 -204 -85 -89 -160 -133 79 -141 176 10 24 71 -199 -123 32
3540C2P0l90R1J17K85K8l46O3m5J88j41j26j78O03j91j02j26r6M08K94l50j40
$$ 32 102 -288 -197 -80 205 233 -113 -50 -95 93 -48 -174 -352 251 60 -42 -168 -264 144 438 88 -52
3562e2q2L96j68N0l36J92JJ37J54l24K10j69l0J71m9L16m73k21J42M45j19k23
$$ -52 -134 262 94 144 -192 0 1 138 292 -32 178 9 -21 150 101 417 -56 -277 -135 310 191 -32
3584c2l5J91J68l08K11j61K20j43j1k72K8M09k04k41N22r6lj04l2k62K45j55K90
$$ -32 -67 124 292 -16 195 34 254 111 100 -172 -144 265 61 -180 342 246 243 139 107 -155 90 -65 225
3607B25l25J14L04k6l28j64K98K5j56l28J95K33J40m15J41M9M1j81j67o3L86J58
$$ 225 -100 14 318 292 -36 -200 98 123 -33 -361 -166 67 207 -208 -67 -18 23 -158 -325 -388 -2 156
3629A56l25J34k99L48j58K6j81M2RK4j17L94j40N4p6j0O3J69j23j3N0m16J88R
$$ 156 -169 -35 -334 14 -144 -118 -299 -257 -248 -224 -341 53 -87 -33 -109 -119 -56 113 -10 -23 27 -389 -201 -192
3653a92ML17k27J3l19L56R7k08J16m7j26K9j3K21p0k06j6K52k8j43L48l89J78
$$ -192 -188 129 -98 -85 -404 -48 49 -159 -43 -90 -216 -187 -200 21 -49 -255 -271 -19 -47 -190 158 -231 -53
3676e3J74j23J40j39m34N5N93p8J88n92K65K56q9J24n93L11N3P8n0j07K63j46
$$ -53 121 -2 138 -1 -435 -380 213 135 323 -269 -4 252 163 287 -306 5 58 136 86 -21 242 96
3698I6Or5K06L3P5j96n0K32k59j8l3m3K24j38j63J72J19O2j62p6M1J69o7k05J54
$$ 96 102 7 213 246 321 125 75 307 48 30 -3 -46 178 40 -123 49 168 230 68 -8 33 202 135 -70 84
3723H4j03K41j22o6K10L9Lk58m8P8K04l59J35N8jP0rk68K79j56Q9k9k19J89K9
$$ 84 -19 222 100 34 244 283 286 28 -20 58 262 -97 38 96 95 165 156 -112 167 11 100 71 -148 41 70
3748G0J48m12l8l5K14K47m85J98m2m1L8l32M55m0J18l48J20J33R1J04k61J88j00
$$ 70 218 -194 -232 -267 -53 194 -291 -93 -135 -176 -138 -470 -15 -55 63 -285 -165 -32 59 163 -98 90 -10
3771a0K51k22k86N3oJ84k59J11J44o4J89k19lK55k63N9l3oP3K71m03J47k7J51
$$ -10 241 19 -267 -214 -220 -36 -295 -184 -40 -104 85 -134 -137 118 -145 -86 -119 -125 -52 219 -184 -37 -64 87
3795H7l57K66O4p5j78K16k86J17k16M34l4j49o6J60j51j43L96J30k66pJ14m3J81
$$ 87 -270 -4 60 -15 -193 23 -263 -146 -362 72 38 -111 -177 -17 -168 -311 85 215 -51 -58 56 13 194
3818A94j16K3N2k27L62q8j22L7J65l88q7j01O22j61j0k05J42K89n11M97m13K74
$$ 194 78 101 153 -74 288 200 78 115 280 -108 -195 -296 326 165 155 -50 92 381 -130 367 -46 228
3840B28k49J00m4p8K1J43L4l99M13R5j44l9k6p0Q7l9j48K29l8j73n6N04j16j69
$$ 228 -21 79 35 -43 -22 121 155 -244 169 264 120 81 55 -15 72 33 -115 114 76 -97 -153 351 235 66
3864F6J47m77K24K28k4pj74R9L0J10k18N6L80j27o6n77J38L5L33j87j23K03j39
$$ 66 213 -264 -40 188 164 157 -17 82 112 222 4 60 440 313 247 -330 -192 -157 176 -11 -134 69 -70
3887g0mm28L93K89k12j57J32l49K48J42j29k99K55M91m44l7R3k38J66k66K92J2
$$ -70 -74 -502 -109 180 -32 -189 -57 -406 -158 -16 -145 -444 -189 302 -142 -179 -86 -324 -158 -424 -132 -120
3909a20K65o3m28kK67j34P7k89L20O5o4l86O09k06J83j31m6J59n2j68L12l09K41
$$ -120 145 82 -346 -348 -81 -215 -138 -427 -107 -42 -106 -492 117 -89 94 -37 -83 76 24 -144 168 -141 100
3932A00k07J38J43k27N1j26K11pj44J15K4m45L09mJ97j81j70Q6L8N0Q1j64J67
$$ 100 -107 31 174 -53 -2 -128 83 76 -68 47 71 -374 -65 -69 128 -53 -223 -137 -99 -49 32 -132 35
3955C5j68K66r0j94L52Q5k04j08P2j78J69Q4M1j72K69N7k69M9K10k83o4RK68k34
$$ 35 -133 133 43 -151 201 286 82 -26 46 -132 37 121 162 -10 259 316 47 96 306 23 -41 -32 236 2
3979BJ65k76K15j94J58J73j81K42k82k79L18j2L2Mj38l0K26J3N3k20R6k91O04
$$ 2 167 -109 106 -88 70 243 62 304 22 -257 61 49 81 85 -53 -83 143 156 209 -11 85 -206 398
4002C98k13k49K48j06%j08j93J39J20r5K26p1R5PJ9l11o2L2K0nK90n8K26j57m41
$$ 398 185 -64 184 78 78 -30 -223 -84 36 -59 167 96 191 198 217 -94 -156 -124 -104 -109 181 123 349 192 -249
4027b49j48L82J14k42m4Q6j07K42Qr4J10j59j86L3N7K83j33k20J55J67j0k03J32
$$ -249 -397 -15 99 -143 -187 -101 -208 34 42 -52 58 -101 -287 -254 -197 86 -47 -267 -112 55 45 -158 -26
4050b6k36n0R1L34L0J48j06Q9k32O9k04M3p7J74j3k46J38L4j82K55J10o3m99J89
$$ -26 -262 -312 -221 113 143 291 185 274 42 111 -93 -50 -127 47 34 -212 -74 -40 -222 33 143 80 -419 -230
4074b30N21j44k30N0K89M9j51o0l7j63M42l4k10k29P8L27j0j52k26M92k41k15
$$ -230 291 147 -83 -33 256 305 154 94 57 -106 336 302 92 -137 -59 268 258 106 -120 372 131 -84
4096h4K13K41o60N14j06K6J40pq0j51m6J63j20j1J39J5J82l22j41M57n7m15m7
$$ -84 129 370 -290 224 118 144 284 277 197 46 0 163 43 32 171 186 368 46 -95 362 305 -110 -157
4119a57J75K69m15k8j4J44L53j81k35m4J76j14K1j3l93P42l18j40J92j46L53k57
$$ -157 18 287 -128 -156 -170 -26 327 146 -89 -133 43 -71 -50 -63 -456 286 -32 -172 20 -126 227 -30
4141c0J13J1k04QM2J11J47o6q4j90J73P2Q2j87k56j56O22k01j0r2j90K95J54m89
$$ -30 83 94 -110 -102 -60 51 198 132 48 -142 31 103 185 -2 -258 -414 208 7 -3 -95 -285 10 164 -325
4165c25R9o1Q2q9J14L3j91L17j57k01J65L44k97l33P47j89m4q7K5l81N86l61q5
$$ -325 -226 -287 -205 -294 -180 -147 -338 -21 -178 -379 -214 130 -167 -500 247 58 14 -73 -48 -429 157 -204 -289
4188b89L40l63L23m05K08N2K37k4r2k08J48K91l83M83m08J12j26J85k73K33R3
$$ -289 51 -312 11 -394 -186 -134 103 79 -13 -221 -73 218 -165 318 -90 22 -104 81 -192 41 134
4209A34k25R0J24K52k90o7K5J34J4j67J26j90L3J09o6r7K19j34J29j27q0K66K1
$$ 134 -91 -1 123 375 85 18 43 177 191 24 150 -40 -7 102 36 -61 158 24 153 26 -54 212 233
4232B33j12l52L21R5K2M6k84J43J86k97M0JJ89l1k44J68j12p7L22l01L5K5J44
$$ 233 121 -231 90 185 207 253 -31 112 298 1 41 42 231 200 -44 124 12 -65 257 -44 -9 16 160
4255A60m9k90M20k79K56k71r7J08o6j01pJ33Q6L03j52m49K10J40P3j65o2l9n0
$$ 160 111 -179 241 -38 218 -53 -150 -42 -108 -209 -216 -83 3 306 154 -295 -85 55 128 -37 -99 -138 -188
4278a88L36j06k33L84J35l70k36J55m4L41k84k67L14j96L01k55j21K57j06j62
$$ -188 148 42 -191 193 328 -42 -278 -123 -167 174 -110 -377 -63 -259 42 -213 -334 -77 -183 -345
4298c45J12J91M8M29n26k66M06k47j93J38K02J74J19o1k99J24r8K98k27Lq1K57
$$ -345 -233 -42 6 435 -91 -357 49 -198 -391 -253 -51 123 242 181 -118 6 -92 206 -21 -18 -99 158
4320A58k87P5K68j43J27m86L9K49k2J27Qj98J93P4k38J95m10M09N5l29M6J69n4
$$ 158 -129 -54 214 71 198 -288 -249 0 -22 105 113 -85 108 182 -56 139 -271 138 193 -136 -90 79 25
4343B5j30K51j62J54j95j4J46K30m2m06K18N8j91J95J78m17k22O63Nj24j13rr
$$ 25 -105 146 -16 138 -57 -71 75 305 263 -143 75 133 -58 137 315 -102 -324 339 344 220 107 98 89
4366H9j01j62J95K16j51q3k64M59K09m24k1J12k31O41l07k09j01J62Q1l34J35
$$ 89 -12 -174 21 237 86 3 -261 198 407 -17 -38 74 -157 484 177 -32 -133 29 110 -224 -89
4387h9K88q6P2o4k3k03M4L9m69K78L43k86O9K23j44J52j74o2J85J50n19J88l38
$$ -89 199 113 185 121 98 -105 -61 -22 -491 -213 130 -156 -87 136 -8 144 -30 -92 93 243 -276 -88 -426
4410d26P14k40J8k90L4J57Q6k28l77M58j02K46j61R5J1j35N6l75K48K06k04J44
$$ -426 288 48 66 -224 -190 -33 53 -175 -552 -94 -196 50 -111 -16 -5 -140 -84 -459 -211 -5 -209 -65
4432f5l30K43J53j84O3K21j61j60K14l83J14K32K26k49j46K02j0j82K2J76O9r
$$ -65 -395 -152 1 -183 -120 101 -60 -220 -6 -389 -275 -43 183 -66 -212 -10 -20 -202 -180 -4 65 56
4454E6j97M1K65k4j27j35l7L77l20L6k92M95p0j20R7j1l3l3J31o7m4j11K84k27
$$ 56 -141 -100 165 141 14 -121 -158 219 -101 -65 -357 138 68 -52 45 34 1 -32 99 32 -12 -123 161 -66
4478f6J24j65J18n8j66M45j10Q0o3r7J75K7j25o8l13K97j1k9L5j07n9N53k23k58
$$ -66 58 -107 11 -47 -213 232 122 202 139 42 217 244 119 51 -262 35 24 -5 30 -77 -136 417 194 -64
4502f4L75j2k6q9l04J68M55m60k34J44M86m29j1M9J3j00R4j54l5m5K2J68O8k11
$$ -64 311 299 273 184 -120 48 503 43 -191 -47 439 10 -1 48 61 -39 55 -99 -134 -179 -157 11 79 -132
4526a32K06k54jJ3L06r0o7L2j35K58k55O4j15L38k63j69j99K70K65j26J75m14
$$ -132 74 -180 -181 -168 138 48 -19 13 -122 136 -119 -55 -170 168 -95 -264 -463 -193 72 -54 121 -293
4548b93K35Llko3K03j45J39j83J8j09M88m33j57M37m01M64r2n35L86K09m5m55
$$ -293 -58 -55 -58 -60 -123 80 -65 74 -109 -91 -200 288 -145 -302 135 -266 198 106 -429 -43 166 121 -334
4571c34L15j27J94o1j68L3M44l95l52K40K41Qr7l18K31L30R6j45l06K54r2Qj60
$$ -334 -19 -146 48 -13 -181 -148 296 -99 -451 -211 30 38 -59 -377 -146 184 280 135 -171 83 -9 -1 -161
4594a61K05Q7Q3j55j49J7k7J85j62r8K59r2q0Qj01N11j41l06l9J59J14k2J85l59
$$ -161 44 131 214 59 -90 -73 -100 85 -77 -175 84 -8 -88 -80 -181 330 189 -117 -156 3 117 95 280 -79
4618g9O8Q4Q9j11R7j19K39n28j1K58K48j19l53R0J81K86k35j72N74l58J60m24
$$ -79 -11 73 162 51 148 29 268 -260 -271 -13 235 116 -237 -147 34 320 85 -87 487 129 289 -135
4640a35K73j35J11r1m75M20K29r9l52M94l26J66R3j69k10L87j12j09j68J17K5
$$ -135 138 3 114 23 -452 -32 197 98 -254 240 -86 80 173 4 -206 181 69 -40 -208 -91 -66
4661f6O0KK0j14J58J39l10o5J36L1o8P2j40m0L43j52l22Q0L00m07J87n7L59j35
$$ -66 -6 -4 16 -98 60 199 -111 -176 -40 -9 -77 -5 -145 -185 158 6 -316 -236 64 -343 -156 -213 146 11
4685A1M5O3k72n7P5J96k08j43J73kk37K90qM6l39J55J28J89M8k35Q9K47m83J96
$$ 11 56 119 -153 -210 -135 61 -147 -290 -117 -119 -356 -66 -74 -28 -367 -212 -84 105 153 -82 7 254 -229 -33
4709c3k16K27M7j45P0Q8Q8j81l7N0r3J26N3j41PJ28m0L7j61j18M04k76J88n6J90
$$ -33 -249 -22 25 -120 -50 38 126 -55 -92 -42 -135 -9 44 -97 -90 38 -2 35 -126 -244 160 -116 72 16 206
4734B06o5j20m2j57J18Q4K76k21j8Jj16L88l70K00j3j64l0L96r9j34J39M2l09
$$ 206 141 21 -21 -178 -60 24 300 79 61 62 -54 334 -36 164 151 -13 -43 353 254 120 259 301 -8
4757hQ9R6k48P0K02q2k10L22n8k16O6j41J67J86Nl49k06M05p8m9k80M04l20J67
$$ -8 81 177 -71 -1 201 119 -91 231 173 -43 23 -118 49 235 240 -109 -315 90 12 -37 -317 87 -233 -66
4781f6K14l51J19M3k2Q2q1J98k08K51m33J45N6j09L1j96J08M61k12l7q1j62L12
$$ -66 148 -203 -84 -41 -63 19 -62 136 -72 179 -254 -109 -53 -162 -131 -327 -219 242 30 -7 -88 -250 62
4804F2n14N60k39K91j58j27L92l67L24k66M1j75J03J06l35K14k33K41j37R1l32
$$ 62 -452 108 -131 160 2 -125 267 -100 224 -42 -1 -176 -73 33 -302 -88 -321 -80 -217 -126 -458
4825d58M64m6K54q2j50J41l02O9nj5L69j42k88J50K3K54m23n3K67Nj28j87K15
$$ -458 6 -40 214 132 -18 123 -179 -110 -115 -130 239 97 -191 -41 -18 236 -187 -240 27 32 -96 -283 -68
4848f8N0J16o8k90J85J52J48l55J76K1j34o7K70p5j40K26k9k13J57J43K7j84m55
$$ -68 -18 98 30 -260 -75 77 225 -130 46 67 -67 -134 136 61 -79 147 118 -95 62 205 232 48 -407
4871d07P11j04n7j54l46L29J27Q5J9p7J54l19J1J72j40k29K90r9J42j36J39j19
$$ -407 304 200 143 -11 -357 -28 99 184 203 126 280 -39 -28 144 4 -225 65 -34 108 -28 111 -8
4893hj47K69k42J47j59O3M64l24N4k37L09Q7n09K44K49k61j10N5K4l3L09k20o4
$$ -8 -155 114 -128 19 -140 -77 387 63 117 -120 189 276 -233 11 260 -1 -111 -56 -32 -65 244 24 -40
4916d0K23n50K35J19k3j22K4L24m17K17j67p0K44k14j14K25j03L01j31p7o0J74
$$ -40 183 -367 -132 -13 -36 -158 -134 190 -227 -10 -177 -247 -3 -217 -331 -106 -209 92 -39 -116 -176 -2
4938bj53K48j29Ql53M73P9j70M8k94L15k44K72k32Jm25O49l16K29l86K03K24L4
$$ -2 -155 93 -36 -28 -381 92 171 1 49 -245 70 -174 98 -134 -133 -558 91 -225 4 -382 -179 45 79
4961G9N4j72k39L42J2k42m3K22l5k55J77M6J78j07k38K26J88Kn1k02QJ75J07l54
$$ 79 133 -39 -278 64 76 -166 -209 13 -22 -277 -100 -54 124 17 -221 5 193 195 144 -58 -50 125 232 -122
4985a22J33M6K84j77l94J67K1j11K31j86L39j04K1j28J56l0k5K00j54o0%j83K98
$$ -122 11 57 341 164 -230 -63 -42 -153 78 -108 231 127 148 20 176 146 121 321 167 107 107 -76 222
5008B22j70P1J3J46j98k18J99q5J74j87J76l08N71l80l53O4J78L53j44j92K81
$$ 222 52 123 136 282 84 -134 65 -20 154 -33 143 -165 406 26 -327 -263 -85 268 124 -68 213
5029B13J20k64j05Q1k21K44J87k29q9J81q9j9o8J00P0j70k48O1K66k51L20k32
$$ 213 333 69 -36 45 -176 68 255 26 -63 118 29 10 -58 42 112 -58 -306 -245 21 -230 90 -142
5051a42j25K8M60k16q0P1r7n5k9j48J63N08m16k59J02L7K33k42L23k9L4l74J47
$$ -142 -267 -239 221 5 -75 -4 -101 -156 -185 -333 -170 338 -78 -337 -235 -198 35 -207 116 87 121 -253 -106
5074a06q0M8R9k43J15P1l01L37%j17q3K08k6Q5l08M57l61M9L06L03l79m38L42
$$ -106 -186 -138 -39 -282 -167 -96 -397 -60 -60 -177 -260 -52 -78 7 -301 156 -205 -156 150 453 74 -364 -22
5097b2J71ol05J89J10J13q1m20L19n0m3J36k10J15O8J1J51l98p8L08L93m94k11
$$ -22 149 143 -162 27 137 250 169 -251 68 18 -25 111 -99 16 84 95 246 -152 -230 78 471 -23 -234
5120b34L29K09l76K1j99M36j71r8P5k7M7J50k80J88j81K46r0L5K40n06N39l47
$$ -234 95 304 -72 -51 -250 186 15 -83 -8 -35 12 162 -118 70 -111 135 45 80 320 -186 353 6
5142Fm4K34n6k19K81j35K59k76P0M7pj30N4j27J69J76o7j20o9k9P4l5l41K68J88
$$ 6 -38 196 140 -79 202 67 326 50 120 167 160 30 84 -43 126 302 235 115 46 17 91 56 -285 -17 171
5167A71j87J17j75o5J30M7J83j21j75K81K1k77J55j75J58l92J62J77mj13N7j29
$$ 171 -16 101 -74 -139 -9 38 221 100 -75 206 227 -50 105 -70 88 -304 -142 35 31 -82 -25 -154
5189a54K40J02k3r1j79K02l31L20J5J50J25m33%j34K4j09K79rJ8M4q9L7j71J2
$$ -154 86 188 165 74 -105 97 -234 86 101 251 376 -57 -57 -191 -167 -276 3 -6 12 56 -33 4 -167 -155
5213a55J70j7Q5n62L98k62N83k8m12L15N7k53k5R0R3K12l13k5J76J42k47O8l31
$$ -155 15 -2 83 -479 -81 -343 240 212 -200 115 172 -81 -106 -16 77 289 -24 -49 127 269 22 90 -241
5236b41R3J56K66k34M8nj7k00J01j00K75k98K62j94J14N6K3l35M5M21j73r4L03
$$ -241 -148 8 274 40 88 83 66 -134 -33 -133 142 -156 106 -88 26 82 105 -230 -185 236 63 -31 272
5259B72k33j36o0M02k5k04j6j67J61N9j26l5M9J58o6p9K05k5n8J93k9j43j2j09
$$ 272 39 -97 -157 245 220 16 0 -167 -6 53 -73 -108 -59 99 33 -46 159 134 76 269 240 97 85 -24
5283b4Q0j29J7P3J11k22m4M48k39j57j32J07L27q6j2j90O5J19K92l21R7l93K02
$$ -24 56 -73 -56 17 128 -94 -138 310 71 -86 -218 -111 216 130 118 -72 -7 112 404 83 180 -213 -11
5306a1Q8p8K10j96J17N8j88M5K2k74K35j11J29K38l66k07K01j50J84k06R7K69
$$ -11 77 -1 209 13 130 188 0 45 67 -207 28 -83 46 284 -82 -289 -88 -238 -54 -260 -163 106
5328A06j56m4J74r1j06J12l09J91K75n3q5J27l46M0J47L46l27r7k57K87O3p8K17
$$ 106 -50 -94 80 -11 -117 -5 -314 -123 152 99 14 141 -205 -165 -18 328 1 -96 -353 -66 -3 -81 136
5351A36k87O3j04L8K97q0J42j91J48j20p9P9K40m06K33o6J51j95m5J57Q6m15K82
$$ 136 -151 -88 -192 -154 143 63 205 14 162 42 -37 42 282 -124 109 43 194 -1 -46 111 197 -218 64
5374F4J6r5L93p22J04K86m5j76Q9K80k69L20k15J55k60J48j99L1J15k72k30M90
$$ 64 80 -15 378 -344 -240 46 1 -175 -86 194 -75 245 30 185 -75 73 -126 -95 20 -252 -482 8
5396Hk2M2K71k65j17J63m0J9k07L20k21J71j26l6O0j06J8o3K86Mp7k48J76r7K5
$$ 8 -14 28 299 34 -83 80 40 59 -148 172 -49 122 -4 -40 20 -86 -68 -131 155 159 82 -166 10 -87 -62
5421f2J46K0l27K23P5Q5q2p3K51Kq39O24l03K30j72J35K87l12l44M92j51J03L9
$$ -62 84 104 -223 0 75 160 78 5 256 258 -581 43 -260 -30 -202 -67 220 -92 -436 56 -95 8 47
5444D7K27k98o7J67l92L05J51l87J49J07k59J61Q5Lk54M60l86O4J19j37r5K74
$$ 47 274 -24 -91 76 -316 -11 140 -247 -98 9 -250 -89 -4 -1 -255 205 -181 -117 2 -135 -230 44
5466D4k98K40K3j35K57n3m11L89P7r5l2P8j58l7L94k05l27L30k42J76k39J62j27
$$ 44 -254 -14 9 -126 131 78 -333 56 133 38 6 84 -74 -111 283 78 -249 81 -161 15 -224 -62 -189
5489a89K31j72K55l82J45N92o24P6L29j54P5l19j93M06n4j01J32j51J26j62L58
$$ -189 42 -130 125 -257 -112 480 -144 -68 261 107 182 -137 -330 76 22 -79 53 -98 28 -134 224
5510B24k45j83K30K55j04k25P0p5J45k0k9k05l6J47o1L1J19j53J99j08R6j0J49
$$ 224 -21 -204 26 281 177 -48 22 -53 92 72 43 -162 -198 -51 -112 -81 38 -115 84 -24 72 62 211
5533B11j21q9ok5K28q4J5j60K40j03r8K5o0P5J69q4k11m0K01l20J10L31m35J54
$$ 211 90 1 -5 -30 198 114 129 -31 209 106 8 33 -27 48 217 133 -78 -118 83 -237 -127 204 -231 -77
5557g7r1J79K61j17j9j14j32K78l09J95k48M45Pj61n2Q0O7k41K94l45O2M9k32
$$ -77 -168 11 272 155 136 22 -110 168 -141 54 -194 251 258 97 45 125 192 -49 245 -100 -38 11 -221
5580b21L64J29l48j85J83J91l7K19m17L08j94J5j89J2M28m32L6o7J84Lj14K41
$$ -221 143 272 -76 -261 -78 113 76 295 -122 186 -8 7 -182 -170 258 -174 -138 -205 -21 -18 -132 109
5602A09q3k6K4j11j22r5N70k8m05J33j17L80j64k50K93j81j73Q5J98k91K05K15
$$ 109 26 0 24 -87 -209 -304 266 238 -167 -34 -151 229 65 -185 108 -73 -246 -161 37 -254 -49 166
5624A66k61J66n4j58J80q9K39j45J72M5j81O5k15K76R5k47NN4m3m80N62k52NL59
$$ 166 -95 71 17 -141 39 -50 189 44 216 261 80 145 -70 206 301 54 59 113 70 -410 152 -100 -95 264
5648B64k70K03j41pk39M43l94M2OJ44N0k1N2j90M11l88Q4J91m86J51K03oj30J39
$$ 264 -6 197 56 49 -190 253 -141 -99 -93 51 101 80 132 -58 353 -35 49 240 -246 -95 108 102 -28 111
5672A11k67L55k25J12j15J49k37J63O7j13l55N53k55k60K85j56J64m6j43L04k20
$$ 111 -156 199 -26 86 -29 120 -117 46 113 0 -355 198 -57 -317 -32 -188 -24 -70 -213 91 -129
5693a29J26j91J09L57o03M35K6j3j73K50N3j79n3jJ95p1k45L00l25K2l1p7K06
$$ -129 -3 -194 -85 272 -331 104 130 117 -56 194 247 68 15 14 209 138 -107 193 -132 -110 -141 -218 -12
5716a2lj20p7J50P1L4j05q6J96o2l00L58j92L81k61l12K69J59k60J18n4O8j4K78
$$ -12 -15 -135 -212 -62 9 43 -62 -148 48 -14 -314 44 -148 233 -28 -340 -71 88 -172 -54 -108 -40 -54 224
5740B24m9j81o1K02k74q3K08Q8J9q8q2J49K37m40L53o03L88J25j80r7K7J41J16
$$ 224 175 -6 -67 135 -139 -222 -14 74 93 5 -77 72 309 -131 222 -381 7 132 -48 -145 -118 23 139
5763A39r0j94J63K87k38j69Q1m7J04K2j6J06J96m54P3J43J39N5n92L7J48J76J49
$$ 139 49 -145 18 305 67 -102 -21 -68 36 58 42 148 344 -110 -37 106 245 300 -292 -255 -107 69 218
$$ [...]
8191d2
##END NTUPLES=NMR FID
##END=
