##TITLE=1H_LR-717-C2-B
 D2O, 8 sc, 
 30.10.2020
##JCAMPDX= 6.0         $$ Bruker NMR JCAMP-DX V2.0
##DATA TYPE= NMR FID
##DATA CLASS= NTUPLES
##ORIGIN= UXNMR, Bruker Analytische Messtechnik GmbH
##OWNER= root
$$ XWIN-NMR		Version 3.5
$$ Fri Oct 30 13:05:19 2020 Russian Standard Time (UT+4h)  she@DPX200
##.OBSERVE FREQUENCY= 200.1315066352
##.OBSERVE NUCLEUS= ^1H
##.DELAY= (6, 6)
##.ACQUISITION MODE= SIMULTANEOUS
##.ACQUISITION SCHEME= undefined
##.AVERAGES= 8
##.DIGITISER RES= 18
##SPECTROMETER/DATA SYSTEM= spect
##.PULSE SEQUENCE= zg30
##.SOLVENT NAME= CDCl3
##.SHIFT REFERENCE= (INTERNAL, CDCl3, 0, 15.7039)
##AUDIT TRAIL= $$ (NUMBER, WHEN, WHO, WHERE, WHAT)
$$ ##TITLE= Audit trail, XWIN-NMR		Version 3.5
$$ ##JCAMPDX= 5.01
$$ ##ORIGIN= Bruker BioSpin GmbH
$$ ##OWNER= she
$$ F:/spectra/data/she/nmr/H-F/1/audita.txt
$$ ##AUDIT TRAIL=  $$ (NUMBER, WHEN, WHO, WHERE, WHAT)
(   1,<2020-10-30 13:04:15.70 +0400>,<she>,<DPX200>,
      <created by zg, POWCHK disabled, PULCHK disabled
       configuration hash MD5:
       00 E9 B6 7A A2 85 ED C7 34 08 36 98 17 FE 4E 26
       data hash MD5: 16K
       94 4D B0 1D C7 93 B4 EB F6 2E 26 0A 9B C6 70 36>)
$$ ##END=
$$ 
$$ hash MD5
$$ CC 61 9C 1B 24 44 CD DA 97 97 A5 D7 EE A8 9C 09
##$RELAX= 
##$RELAX= 
##$RELAX= 
##$RELAX= 
##$RELAX= 
##$RELAX= 
$$ Bruker specific parameters
$$ --------------------------
##$DU= <F:/spectra>
##$EXPNO= 1
##$NAME= <H-F>
##$PROCNO= 1
##$TYPE= <nmr>
##$USER= <she>
##$AMP= (0..31)
100 100 100 100 100 100 100 100 100 100 100 100 100 100 100 100 100 100 
100 100 100 100 100 100 100 100 100 100 100 100 100 100 
##$AQSEQ= 0
##$AQ_mod= 1
##$AUNM= <au_zg>
##$AUTOPOS= <>
##$BF1= 200.13
##$BF2= 200.13
##$BF3= 200.13
##$BF4= 200.13
##$BF5= 200.13
##$BF6= 200.13
##$BF7= 200.13
##$BF8= 200.13
##$BYTORDA= 1
##$CFDGTYP= 0
##$CFRGTYP= 5
##$CHEMSTR= <none>
##$CNST= (0..31)
1 1 145 1 1 1 1 1 1 1 1 1 1 1 1 1 1 1 1 1 1 1 1 1 1 1 1 1 1 1 1 1 
##$CPDPRG= <>
##$CPDPRG1= <>
##$CPDPRG2= <>
##$CPDPRG3= <>
##$CPDPRG4= <mlev>
##$CPDPRG5= <mlev>
##$CPDPRG6= <mlev>
##$CPDPRG7= <mlev>
##$CPDPRG8= <mlev>
##$CPDPRGB= <>
##$CPDPRGT= <>
##$D= (0..31)
0 1.2 0 0 0 0 0 0 0 0.06 0 0.03 0 0 0 0 0.0002 0 0 0 0 0 0 0 0 0 0 0 0 
0 0 0 
##$DATE= 1604048655
##$DBL= (0..7)
120 120 120 120 120 120 120 120 
##$DBP= (0..7)
150 150 150 150 150 150 150 150 
##$DBP07= 0
##$DBPNAM0= <>
##$DBPNAM1= <>
##$DBPNAM2= <>
##$DBPNAM3= <>
##$DBPNAM4= <>
##$DBPNAM5= <>
##$DBPNAM6= <>
##$DBPNAM7= <>
##$DBPOAL= (0..7)
0.5 0.5 0.5 0.5 0.5 0.5 0.5 0.5 
##$DBPOFFS= (0..7)
0 0 0 0 0 0 0 0 
##$DE= 6
##$DECBNUC= <off>
##$DECIM= 32
##$DECNUC= <off>
##$DECSTAT= 4
##$DIGMOD= 1
##$DIGTYP= 9
##$DL= (0..7)
0 120 120 120 120 120 120 120 
##$DP= (0..7)
150 150 150 150 150 150 150 150 
##$DP07= 0
##$DPNAME0= <>
##$DPNAME1= <>
##$DPNAME2= <>
##$DPNAME3= <>
##$DPNAME4= <>
##$DPNAME5= <>
##$DPNAME6= <>
##$DPNAME7= <>
##$DPOAL= (0..7)
0.5 0.5 0.5 0.5 0.5 0.5 0.5 0.5 
##$DPOFFS= (0..7)
0 0 0 0 0 0 0 0 
##$DQDMODE= 0
##$DR= 18
##$DS= 0
##$DSLIST= <SSSSSSSSSSSSSSS>
$$ [...]
##$SUBNAM2= <"">
##$SUBNAM3= <"">
##$SUBNAM4= <"">
##$SUBNAM5= <"">
##$SUBNAM6= <"">
##$SUBNAM7= <"">
##$SUBNAM8= <"">
##$SUBNAM9= <"">
##$SW= 16.9725356469052
##$SWIBOX= (0..15)
0 0 2 0 0 0 0 0 0 0 0 0 0 0 0 0 
##$SW_h= 3396.73913043478
##$TD= 16384
##$TD0= 1
##$TE= 0
##$TE2= 300
##$TE3= 300
##$TEG= 300
##$TL= (0..7)
0 120 120 120 120 120 120 120 
##$TP= (0..7)
150 150 150 150 150 150 150 150 
##$TP07= 0
##$TPNAME0= <>
##$TPNAME1= <>
##$TPNAME2= <>
##$TPNAME3= <>
##$TPNAME4= <>
##$TPNAME5= <>
##$TPNAME6= <>
##$TPNAME7= <>
##$TPOAL= (0..7)
0.5 0.5 0.5 0.5 0.5 0.5 0.5 0.5 
##$TPOFFS= (0..7)
0 0 0 0 0 0 0 0 
##$TUNHIN= 0
##$TUNHOUT= 0
##$TUNXOUT= 0
##$USERA1= <user>
##$USERA2= <user>
##$USERA3= <user>
##$USERA4= <user>
##$USERA5= <user>
##$V9= 5
##$VALIST= <valist>
##$VCLIST= <CCCCCCCCCCCCCCC>
##$VD= 0
##$VDLIST= <DDDDDDDDDDDDDDD>
##$VPLIST= <PPPPPPPPPPPPPPP>
##$VTLIST= <TTTTTTTTTTTTTTT>
##$WBST= 1024
##$WBSW= 4
##$XGAIN= (0..3)
0 0 0 0 
##$XL= 0
##$YL= 0
##$YMAX_a= 275220
##$YMIN_a= -256303
##$ZGOPTNS= <>
##$ZL1= 120
##$ZL2= 120
##$ZL3= 120
##$ZL4= 120
##$ABSF1= 10
##$ABSF2= 0
##$ABSG= 5
##$ABSL= 3
##$ALPHA= 0
##$AQORDER= 0
##$ASSFAC= 0
##$ASSFACI= 0
##$ASSFACX= 0
##$ASSWID= 0
##$AUNMP= <proc_1d>
##$AZFE= 0.1
##$AZFW= 0.1
##$BCFW= 1
##$BC_mod= 2
##$BYTORDP= 1
##$COROFFS= 0
##$CY= 11.3945322036743
##$DATMOD= 1
##$DC= 2
##$DFILT= <>
##$DTYPP= 0
##$F1P= 15.9154993809931
##$F2P= -4.1035820241983
##$FCOR= 0.5
##$FTSIZE= 0
##$FT_mod= 4
##$GAMMA= 1
##$GB= 0.15
##$INTBC= 1
##$INTSCL= 1
##$ISEN= 128
##$LB= 0.24
##$LEV0= 0
##$LPBIN= 0
##$MAXI= 10000
##$MC2= 0
##$MEAN= 0
##$ME_mod= 0
##$MI= 1.114404
##$NCOEF= 0
##$NC_proc= 0
##$NLEV= 6
##$NOISF1= 3.799351
##$NOISF2= 2.8
##$NSP= 1
##$NTH_PI= 0
##$NZP= 0
##$OFFSET= 15.70392
##$PC= 1
##$PHC0= -11048.33
##$PHC1= 6.400881
##$PH_mod= 1
##$PKNL= yes
##$PPARMOD= 0
##$PSCAL= 0
##$PSIGN= 0
##$REVERSE= no
##$SF= 200.130013532006
##$SI= 16384
##$SIGF1= 3
##$SIGF2= 2
##$SINO= 400
##$SIOLD= 16384
##$SREGLST= <1H.CDCl3>
##$SSB= 0
##$STSI= 0
##$STSR= 0
##$SW_p= 3612.71676300578
##$SYMM= 0
##$S_DEV= 0
##$TDeff= 0
##$TDoff= 0
##$TI= <>
##$TILT= no
##$TM1= 0
##$TM2= 0
##$TOPLEV= 0
##$USERP1= <user>
##$USERP2= <user>
##$USERP3= <user>
##$USERP4= <user>
##$USERP5= <user>
##$WDW= 1
##$XDIM= 8192
##$YMAX_p= 0
##$YMIN_p= 0
$$ End of Bruker specific parameters
$$ ---------------------------------
##NTUPLES= NMR FID
##VAR_NAME=  TIME,          FID/REAL,        FID/IMAG
##SYMBOL=    X,             R,               I
##VAR_TYPE=  INDEPENDENT,   DEPENDENT,       DEPENDENT
##VAR_FORM=  AFFN,          ASDF,            ASDF
##VAR_DIM=   8192,          8192,            8192
##UNITS=     SECONDS,       ARBITRARY UNITS, ARBITRARY UNITS
##FACTOR=    0.0002944,     1,               1
##FIRST=     0,             0,               0
##LAST=      2.4114304,     0,               0
##MIN=       0,             -256303,         0
##MAX=       2.4114304,     275220,          0
$$ Real data points
##PAGE= N=1
##DATA TABLE= (X++(R..R)), XYDATA
$$ [...]
2410A618L098j553m473l235J309M534K931q34m542l555J343M519L161r92m127
2425g98l814Q65M411L673p48m025l770L12M767L570r41m093l606O25M205L632
2441D265o69l945l615O0M119L712j97l627l972m7L939L875J56l787l933k88L628
2458c26M275n7l760l613l55L296M245N70m030l643m37L111M092Q63l682m015p08
2475d174L444L920J055l633l745p46L228L775J033l060m270p40K438M431J476
2490D432l033m340j245K900L817J640k692m392j338K670M384J340k663l896j812
2505d228K700M215J645k485m356k147K909M098J830k240m065j889J995M398J765
2520D145j905m323j932J550M484K188j965m037k316J617M635K059j855l929k284
$$ plain form
2410 1618 4716 3163 -1310 -4545 -3236 1298 4229 3395 -1147 -4702 -3359 1160 4321 3329 -798
2425 -798 -4612 -3747 664 4337 3589 -436 -4206 -3894 873 4443 3502 -591 -4197 -3572 633 4265
2441 4265 3596 -349 -3964 -3904 215 3927 3730 103 -3869 -3916 23 3898 4054 267 -3666 -3954 -326
2458 -326 3949 3892 132 -3481 -3836 -540 3705 4275 245 -3398 -3835 -724 3368 4231 549 -3466 -4174
2475 -4174 -730 3190 4245 612 -3133 -3879 -651 3124 4157 1097 -3173 -3913 -1475 2956 4432
2490 4432 1399 -2941 -4186 -1286 2531 4171 1479 -2913 -4251 -1581 2803 4143 1480 -2416 -4228
2505 -4228 -1528 2687 4332 1847 -2509 -4656 -1747 2351 4181 1941 -2124 -4013 -2018 2380 4145
2520 4145 2240 -2083 -4015 -2465 2019 4207 2242 -1795 -4111 -2494 2141 4200 2345 -1584 -3868
2535c868J368L965K864j950m308k312J419M065K883j534l989k377P08M425K468
2550C827j052l954k677R11L863L036j077m103k660J056L797K715n83l841l140
2565c882R87L226L529o92l726l228P38L323L071L7l802l054K68L405L349l49l036
2582A64l428O1L399K912K98l400l524K37L350L088K08l328l380R3L000L292J03
2599C145k461m021k27L101L834j74k676l677l88K997L509M14k877l077r52K910
2615f20L593O34k717l586r28K707L703P08k493l579r05K249L930R52k671l603
2631b626j206K491L742J166k379l428j232J849L859J408k236l622j070J840L520
2646B076J540j971l802j280J810L651J733k336l292j854K088L397J820j799l843
$$ plain form
2535 -3868 -2500 1465 4329 2379 -1929 -4241 -2822 1243 4126 2592 -1397 -3774 -3066 1359 3827
2550 3827 2775 -1179 -3856 -2945 918 3954 2877 -1226 -3886 -2830 967 3682 3099 -742 -3882
2565 -3882 -2895 331 3860 3168 -558 -3786 -3048 275 3346 3383 -419 -3473 -3205 200 3549 3200 164
2582 164 -3264 -3203 196 3108 3406 6 -3518 -3281 69 3157 3365 37 -3343 -3250 -250 3042 3145
2599 3145 684 -3337 -3564 -463 3371 3197 521 -3156 -3544 -547 2962 3376 499 -2578 -3530 -620
2615 -620 2973 3607 890 -2696 -3624 -917 2786 3494 1001 -2578 -3483 -1234 2696 3648 977 -2626
2631 -2626 -3832 -1341 2401 3567 1188 -2240 -3472 -1623 2236 3644 1408 -2214 -3284 -1444 2076
2646 2076 3616 1645 -2157 -3437 -1627 2024 3757 1421 -1871 -3725 -1637 1760 3580 1781 -2062
2661b062j533K105L129J709j376l257k300J819L079J966j214l292k224J137L714
2676A400K351j501l419k134J161L255K269j070l282k477J118L395K338j505k971
2691a072k329J035L453K077o26l255k555O64L392K456p32l216k147J13L465K560
2707C283p99k969k629M76K959K791l70k903k805J18K996K703Q8k979k651k34K728
2724a97L063n6k703k702k9K782K696O0k836k899K60K278K849L85k920k530k56
2741b755K396K940M02k394l161m82K476K992N95k466l077n15K636K890M74k361
2757E90k866q78K410K915P28j993l468n92K285L079O62j808l218q79K083K928
2773A978R26j619l480p51J825L054R79j388l240j574J972K997J257j487l057j719
$$ plain form
2661 -2062 -3595 -1490 1639 3348 1972 -1285 -3585 -1766 1313 3279 2065 -1227 -3451 -2314 1400
2676 1400 3751 2250 -1169 -3303 -2142 1113 3382 2312 -970 -3447 -2329 1066 3404 1899 -1072
2691 -1072 -3401 -2366 1087 3164 2538 -717 -3272 -2608 784 3240 2508 -708 -2855 -2742 723 3283
2707 3283 2484 -485 -3114 -2638 321 3112 2742 -161 -2966 -2848 148 2851 2939 -40 -2691 -2925 -197
2724 -197 2866 2810 107 -2595 -2624 158 2854 2914 78 -2821 -2561 -283 2566 2951 31 -2499 -2755
2741 -2755 -359 2581 2983 589 -2572 -3054 -578 2414 3009 543 -2534 -3049 -413 2477 2951 590
2757 590 -2276 -3154 -744 2171 2899 906 -2562 -3154 -869 2210 2872 1064 -2154 -3033 -950 1978
2773 1978 2904 1285 -2195 -2946 -1121 1933 2912 1524 -1716 -3290 -1318 1679 2936 1449 -1608 -3327
2789c327J807L178J236j570k836j804J871K808J620j464k731j728J505K787J664
2804C016j484k627j857J325K919J795j048l385j588J154K880K048j439k855j919
2819c065J108K840K093r62l110j677P66L069J553n44l038k129J143K693K260j002
2835A998k808k231J126K535K266n52k626k335K67K798K116j88k721k264L66K823
2851E70J907J01k845k253K01K702K036r4k565k414L57K451K276j26k285k460J21
2868b320K325K363J88k551k311m52K171L005j69j882k692k48K464K396K40k087
2884D40k321p99K099K793O31k305k586l87J757K721O25k023k657o63J911K706
2900A942N14j838k619o11J872K412J219k322k414j019K015K631J116k233k357
$$ plain form
2789 -3327 -1520 1658 2894 1324 -1512 -3316 -1445 1363 2983 1519 -1212 -2940 -1435 1352 3016
2804 3016 1532 -1095 -2952 -1627 1292 3087 2039 -1346 -2934 -1780 1100 3148 1709 -1146 -3065
2819 -3065 -1957 883 2976 2014 -1096 -2773 -2007 1062 2615 2071 -967 -3096 -1953 740 3000 1998
2835 1998 -810 -3041 -1915 620 2886 2334 -292 -2627 -2360 438 2554 2366 -355 -2619 -2253 570
2851 570 2477 2578 -267 -2520 -2319 383 2419 2325 -240 -2654 -2297 154 2430 2304 19 -2441 -2320
2868 -2320 5 2368 2556 5 -2306 -2758 -587 2418 2249 367 -2325 -2573 -109 2287 2527 440
2884 440 -1881 -2680 -581 2212 2843 538 -2048 -2435 -678 2043 2668 645 -2012 -2675 -764 1942
2900 1942 2456 618 -2001 -2612 -740 1672 2891 569 -1845 -2864 -849 1782 2898 665 -1692
2915a692p12J475K523R00j665k388r07J301K681J058j445k662q76J454K310J118
2931B473j118k737j016J034K849R37j107k534j444J317K529J371q33k670j669
2946b618J145K520J293o53k592j708J234K524J428j177k138k062J272K563J337
2961B368r98k270j630Q27K445J701p43k375j683M36K495K020q22k301j883M97
2977a916K421K057o34k620j550K05K298K146m04k328k103L42K376J972j74k497
2993d09j816K26K004J990J31k097k179K68J923K006K75k082k339K83J774K033
3009A991L1j940k135j55J928K180L66k084k273j62K135K143J21j823k300k73J863
3026c87K321M18k183j997l84J786K065M02j646j874o54J576K142O72j460k421
$$ plain form
2915 -1692 -2404 -929 1594 2494 829 -1559 -2466 -1165 1516 2574 1129 -1533 -2409 -955 1355 2473
2931 2473 1355 -1382 -2398 -1364 1485 2422 1315 -1219 -2663 -1346 1183 2554 1721 -949 -2618
2946 -2618 -1473 1047 2340 1687 -905 -2613 -1379 1145 2573 1396 -742 -2804 -1532 1031 2368
2961 2368 1370 -900 -2530 -1703 742 2443 1700 -675 -2358 -1922 573 2593 1771 -530 -2413 -1916
2977 -1916 505 2562 1928 -692 -2242 -2037 261 2407 2003 -325 -2428 -2086 290 2262 2088 -409
2993 -409 -2225 -1999 5 1995 2126 29 -2150 -1882 41 2047 2322 240 -2099 -1816 -42 1991
3009 1991 2022 82 -2053 -2208 -280 1900 2266 182 -2091 -2253 -118 2025 2146 323 -1977 -2250 -387
3026 -387 1934 2352 169 -1828 -2212 -426 1639 2041 395 -1479 -2133 -557 1585 2257 797 -1624
3042a624p97J897J804P94j387k036j111J771K462M22j446k111r31J671K005Q30
3058B213j273k558n19J352K372N46j182k324p75J041K239J084j195k569o09J022
3074a135K214J214j136k275r57R06K121J164q99k456p52Q30J964J446j022k149
3090i22j207J000J725J710j055k122j340R45K096J259o81k020j313M56K159J394
3106B084o78k051j492N51K137J415n71j728j807P88J737J745l70k130j646L49
3122a667K054J579m67j630j619j59K147J594j39j738j724j39K098J676n42j330
3138fj994L34J658J951j09j726j528m64J790J679K13j804j957J68J443K060L08
3155B016j965j746j65J827J566M24j810j623l71J545J758L89j534j883j50J292
$$ plain form
3042 -1624 -2421 -524 1280 2074 687 -1349 -2460 -689 1773 2195 749 -1362 -2293 -622 1383 2213
3058 2213 940 -1618 -2137 -785 1587 2133 951 -1373 -2148 -1107 1132 2216 1021 -1548 -2157 -1135
3074 -1135 1079 2293 1157 -1118 -2075 -1169 952 2116 1217 -1239 -1991 -1161 803 2249 1227 -922
3090 -922 -2129 -1129 596 2306 1251 -871 -2211 -1266 830 2089 1408 -612 -1925 -1469 690 2084
3106 2084 1406 -645 -2137 -1586 551 1966 1395 -333 -2140 -1352 385 2130 1760 -370 -2016 -1667
3122 -1667 387 1966 1499 -131 -1750 -1909 238 1832 1693 -45 -1769 -1908 190 1866 1324 -6
3138 -6 -2000 -1666 -8 1943 1834 108 -1420 -1884 -94 1585 1798 -6 -1963 -1795 -352 1708 2016
3155 2016 51 -1695 -1860 -33 1533 1957 147 -1476 -1847 -302 1456 1845 311 -1572 -1722 -430
3171d30K022M39j506j972k05J081K086M69j418k179k97J357J861M22j264k025
3187a559j95J184J722Q10j102k062p43J317J692Q52j152j933q22J135K015N91
3203A750q18j941r39J086J989P11r70j883r10Q97J961Q60r44j667j162Q72J984
3220H76R81p83j876j073P31K102Q21o34j723j356R26J823R31r28j349j163M10
3237a284J908J137q60j504j055O75J557J482p80j700j116J16J833J297l67j712
3253c73j264L93J592J345k65j625j351L17J592J208q7j698j434K85J454J575j02
3270A562j690j561K50J727J516k69j382j680k3J756J187K13j490j743K28J286
3286a13J626q8j434j418o3J564J433Q5j287j640l59J377J859j5j246j653l51J739
$$ plain form
3171 -430 1592 2031 525 -1447 -1652 -571 1515 1984 566 -1613 -1910 -553 1308 1730 466 -1559
3187 -1559 -1754 -570 1152 1962 860 -1202 -1945 -628 1064 1916 764 -1169 -1991 -856 1159 1750
3203 1750 932 -1009 -1948 -862 1127 1838 868 -1015 -1925 -1028 933 1793 849 -818 -1980 -1108 876
3220 876 1857 1074 -802 -1875 -1144 958 1779 1145 -578 -1934 -1008 815 1746 818 -531 -1694 -1284
3237 -1284 624 1761 901 -603 -1658 -983 574 2056 1276 -424 -1540 -1424 409 1706 1339 -373
3253 -373 -1637 -1244 348 1693 1428 -197 -1548 -1231 361 1569 1482 -216 -1650 -1365 89 1664 1562
3270 1562 -128 -1689 -1439 288 1804 1535 153 -1527 -1550 206 1393 1606 116 -1627 -1399 -113
3286 -113 1513 1425 -9 -1427 -1490 74 1507 1592 305 -1335 -1694 -317 1542 1527 281 -1372 -1723 16
3304A6J289K18j083j952k11J495J492J76r60j854n4J033J761L24j400j302o86
3321a698J464J492L27j274j517j59P08J864L73j178j367n58R56J405Q17r25j974
3338a244n56R70J816P49j148j422j022J245J509P38p91j578q84R90J381P90m48
3355A095j651q59O87J233R95p12j328j104P94J501R13p05j541j106J003J461O96
3372A372k69j574j153Q74J297R02m06j582r28L26J633J290o51j682j264Q21J600
3389F06O28k19j447j360N08J858Q00k48j500j172L50J434J480m71j355j259j75
3406a542J717J387m36j175j371K76J169J455k73j441j078Q2J164J490j21j673
3422c70q10k9J162J263oj253j146m6J063J544j8j184j244m41J447J257M6r32j581
$$ plain form
3304 16 1305 1523 440 -1512 -1723 -228 1264 1440 480 -1374 -1428 -395 1366 1690 290 -1012 -1698
3321 -1698 -234 1258 1585 311 -1206 -1365 -657 1207 1580 402 -965 -1523 -567 838 1655 730 -1244
3338 -1244 -1800 -830 986 1735 587 -835 -1857 -612 897 1635 844 -734 -1618 -628 753 1543 1095
3355 1095 -556 -1415 -728 505 1500 788 -540 -1644 -850 651 1564 859 -682 -1788 -785 676 1372
3372 1372 1103 -471 -1624 -750 547 1449 1043 -539 -1467 -1141 492 1782 1131 -551 -1815 -994 606
3389 606 1234 1015 -432 -1792 -1284 574 1374 1126 -374 -1546 -1196 238 1718 1247 -108 -1367 -1542
3406 -1542 175 1562 1126 -49 -1420 -1144 25 1480 1207 -234 -1312 -1230 -66 1424 1303 -370
3422 -370 -1180 -1209 -47 1216 1210 -43 -1189 -1235 -172 1372 1354 170 -1074 -1515 -68 1189 1235 303 -1278
3441a278j55J273J343K21r45j456o69J459J373L23j027j843Q7R55J389j35n54
3458C61j117p24J064J473M60j103j289n23P60J417O12q87j405m04Q31J537L86
3475A449p42j575p49J216J437L59r05j267o11O18J620L07n96j085p83O20J478
3492G91M57o49r24j043O10J462N88m80j586m85L44J319R21m79j288q38N90J042
3510C52J059q00j273p83M33J326R24m55j279q78L75J441O86k90j252q84N84J029
3528C15R18m11j053j081L14J352J015k11j337j044R7J470P83j97j042j391L55
3545a148J535Q61j82r74j264Q4J254J113j30j097j362K48J221Q75L52j300j058
3562i72k56J323J055k02r40j258J67J001J121j6j007j224l7J001J651j6j352r82
$$ plain form
3441 -1278 -1433 -160 1183 1404 459 -997 -1666 -207 1166 1489 462 -1381 -1294 -339 1050 915 361
3458 361 -756 -1480 -416 1057 1517 414 -875 -1398 -638 779 1391 504 -901 -1305 -474 1063 1449
3475 1449 707 -868 -1617 -401 1036 1395 490 -777 -1388 -770 850 1157 561 -524 -1307 -687 791
3492 791 1248 599 -325 -1368 -758 704 1292 812 -774 -1259 -915 404 1325 846 -442 -1280 -690 352
3510 352 1411 611 -662 -1445 -1012 314 1238 783 -496 -1374 -999 442 1128 838 -414 -1298 -714 315
3528 315 1233 822 -231 -1312 -998 354 1369 1158 -179 -1223 -1126 344 1127 930 -112 -1503 -1148
3545 -1148 387 1248 1066 92 -1172 -1088 166 1279 1149 52 -1310 -1062 159 1034 1386 86 -972
3562 -972 -1228 95 1150 948 8 -1250 -1083 -82 1039 1023 16 -1208 -1245 -244 1407 1391 39 -943
3580i43k43J075J274k10r66p65l64J076J023L16j016j243j20P55J175M54j005
3597B73j116m38R31J192L92p82j407l89J093J080L40q23j048n83J072J103L32
3614A222o08j529l70Q17J059O26p76j091o03N67J464N00o27j432m58O05J412M41
3632A219o45j019n43M06J083N92l61j136j081Q64J223K90r5j368m26N9J570P08
3650A340q57q59p57L99J392L06j70j109q61L67J080O86j37j284n86K95J217O57
3668A119k71j388n63L46J056R30j88j178j018M49J110N80J3j317q29M89Q48P21
3686I09K7j318o87J39J145R95l3q64j630K95J249P47J28j222j199N76R36Q45j72
3705H66p92j015J20O27J075K74j042j110J87O97R90K08j124r05j97J304P40R3
$$ plain form
3580 -943 -1186 -111 1163 953 -13 -778 -1142 -66 957 1273 257 -986 -1106 -351 824 1278 273
3597 273 -843 -1281 -350 842 1234 452 -955 -1344 -251 829 1169 346 -702 -1285 -213 890 1222
3614 1222 614 -915 -1285 -468 591 1217 441 -650 -1253 -686 778 1278 651 -781 -1239 -634 778 1219
3632 1219 574 -445 -988 -582 501 1093 732 -404 -1485 -621 602 892 797 -571 -997 -938 632 1340
3650 1340 483 -376 -1133 -734 658 964 794 -315 -1176 -809 271 957 820 -464 -1050 -755 462 1119
3668 1119 848 -540 -1103 -757 299 1229 1041 -137 -1155 -706 404 984 997 -320 -1149 -660 188 909
3686 909 936 -382 -1069 -930 215 1210 1177 313 -1317 -1022 227 974 1102 -120 -1319 -743 193 1038 866
3705 866 74 -941 -821 -194 881 1155 113 -997 -810 -113 877 1085 -39 -944 -1141 163 903 996
3723I96o94j225p3J111M09M23p43j021m36J054Q39M84j031q88k81O55J512k7q21
3742B43r43l69P33J114L80q64j044l33P24J037J51m66j068k22M14J213K58o07
3760C51j103l11O70Q94N33m88j128m52N54J089L51o10r02l73L08J210O14o29j230
3779f52m74N92J121O00q01q60p48O35J010N18k65r35o82K34R77P72l04j210p61
3798a233O84O43Q77k86q89q97N89P75O56k14j114r03L57J207P24r5r47r64K76
3817g54J236J97J44j026p27J06R92N52K61p17j114O1R15R65l15r97n16JP36P75
3837G75O4r71q57K81P75P97j18q80m93l50J009R37j02q12q18j62J052R42k53p25
3857I1p31l51O37J161K20r80o35l54N43R51N76r26q10J47L68P55M1n58q37k00
$$ plain form
3723 996 302 -923 -996 115 524 947 204 -817 -1253 -199 640 1124 93 -795 -1076 -421 1091 1064 243
3742 243 -700 -1069 -336 778 1158 294 -750 -1083 -359 678 829 363 -705 -927 -513 700 958 351
3760 351 -752 -1063 -393 501 1034 546 -582 -1034 -480 609 960 350 -552 -925 -617 593 1207 578 -652
3779 -652 -1126 -534 587 1187 386 -474 -1222 -587 423 941 676 -259 -941 -707 270 1042 738 -472 -1233
3798 -1233 -549 94 971 685 -204 -1101 -512 263 919 705 -409 -1312 -955 252 976 881 -66 -1030 -754
3817 -754 482 679 823 -203 -930 -824 168 720 981 264 -850 -789 126 1091 776 -221 -737 -736 0 775
3837 775 839 -132 -989 -708 67 864 746 -134 -627 -977 32 969 867 55 -763 -925 127 1069 816 91
3857 91 -640 -991 -354 807 1027 47 -588 -942 -399 552 1128 202 -608 -461 -93 662 703 145 -692 -892
3877h92P80O61L43r04o80k87P53R54J54m28j092P9M12O33P02p13j218m95R17J126
3897H05K1l51j095n27Q01Q32J13l23q00l25O76P89K26m04j066l67N44R95M97n34
3917E07r11p35N98R24N50n00o55r30O39R71K66j86j032k74J64J218L45l93p56
3936a90q90P01O18N26j13r96n26K48P56P74l99q92l77J26R01P27m42q42n37j55
3956i82J203O02j59q16o38O1R60O79K0r77p75J66P41R76k77j048o81M43N92R10
3976A000l25o03j116N24M95O70l4p17p43J92P39O26q9n90n42j63O64P22J00n14
3996B96j031p2O18O67L21o72o21j66N68P67k01o17l29l73P19O20K37p34p83j46
4016i32P40Q52J41o19o97m68O95P59L09p36o66n2O43N42K08l75r95J05K10P80
$$ plain form
3877 -892 -112 549 892 -12 -692 -979 -226 728 882 454 -638 -559 -147 486 1188 475 -743 -1238 -321 805
3897 805 826 475 -620 -1147 -346 486 599 276 -524 -849 -173 616 842 438 -628 -995 -451 544 1041 507
3917 507 -404 -1139 -541 383 933 433 -222 -1152 -513 458 724 538 -494 -768 -604 614 959 566 -190
3936 -190 -1080 -379 239 765 652 -344 -870 -622 134 908 509 -383 -760 -634 267 994 552 -290 -827 -982
3956 -982 221 823 664 -152 -790 -729 231 910 930 -47 -822 -656 85 1061 784 -264 -945 -502 90 1000
3976 1000 675 72 -1044 -520 -25 645 611 -106 -849 -657 82 708 619 29 -513 -676 -12 710 810 296
3996 296 -735 -807 -189 478 799 127 -494 -660 -92 675 474 -143 -472 -845 -126 494 731 -3 -786 -932
4016 -932 -192 660 801 182 -515 -983 -288 471 780 44 -622 -674 -31 511 719 344 -651 -546 -336 444
4036D44M47o12r50j6N98M66M60o34n00m12L03Q40M23l29q75o61P80P13M17o24
4056B78r03j70M37O99K50j52p25n65M78P73M02l01r00m46K68Q61N38m28r21j51
4076f78L69O18N90k62p69o23K59P51O73o87l05n77J27O93M52m50l38m25J22P27
4096B67L22j0q39k63R2N70M55J9q92n03L19O81K07K46q93l88n0Q40M03O0p10m65
4118e32j13P90N63p3q83n83K40O50O85k22n22p20Q8N99M71J46o52m27j67N36Q38
4139G12N8p20q16J91N25N51L49m57q98m63P78Q86J57q46m33k57N61N80L23l59
4159D22r74j99N63N88M54n23r14j48O38N64P3l59o92k21M98R70l10k09l12p06
4179g97N10O83M2l90n48k95M32Q92j3q0p13k92M68N10K46l96p02q0K21Q40J50
$$ plain form
4036 444 891 279 -671 -687 -89 377 837 203 -297 -709 -406 434 857 528 -347 -1008 -228 485 902 278
4056 278 -625 -795 -358 341 591 439 -286 -851 -373 400 802 501 -399 -845 -577 284 822 394 -527 -678
4076 -678 -309 309 899 637 -132 -755 -496 255 928 241 -64 -641 -514 179 631 181 -157 -582 -460 267
4096 267 589 579 -260 -523 -431 139 594 613 -279 -782 -463 218 425 671 -222 -610 -660 180 583 643 -67 -532
4118 -532 -645 145 708 635 -248 -831 -591 59 744 522 0 -720 -632 -33 438 584 -68 -495 -662 -126 712
4139 712 770 50 -766 -575 -50 501 850 393 -505 -968 -190 696 853 7 -426 -683 -122 458 781 422
4159 422 -552 -751 -188 400 854 331 -583 -731 -93 471 544 185 -507 -728 -230 740 430 221 -91 -797
4179 -797 -287 396 438 48 -500 -795 -363 529 516 436 -277 -569 -101 409 655 259 -443 -523 -302 538 688
4200F88m13m48m71Q1Q66J34j32o46l56L36O32M53l33q38Kj98P85N73k12r48k48
4221f93K23R25K49l62q79l31M10Q52K34l39n12m25L51K83P17l35o38l17K52M50
4241A15N17k44m86n07J28M49M25L07p49o93Q7O31O71l07n31m07l1O53L44N7m78
4262d9n65j24R48K23j3m69m17j47O54M79j06l72p06K79M76L35J00l60o12J6N11
4283H1N41j70n02n91K0L95Q91q1p49l43l2M85Q62m54m10m68P1O33K75K38o30n78
4305e16j14N43O30J58l58r53P8J51R28J06n89m15m04M93N93L85l36p69l80N75
4325a94N22J70n1q01k80L25N43K11j92p51j02L21N22K14k74m59k68l7Q60M37m11
4346C05o42l56N26O18P4k71k11n45K50M77M77n34m30j19J00N59J50J14m14o39
$$ plain form
4200 688 275 -173 -644 -563 303 437 305 -341 -697 -361 271 724 391 -447 -445 -643 142 715 503 -445 -693
4221 -693 -470 455 704 342 -537 -868 -458 394 628 289 -223 -648 -297 -14 703 368 -270 -587 -335 115
4241 115 632 388 -98 -605 -477 -28 397 704 -45 -738 -651 -20 651 344 -187 -594 -625 28 372 429 -49
4262 -49 -614 -738 210 433 420 -49 -466 -613 41 520 414 42 -664 -385 91 426 526 166 -446 -430 81
4283 81 622 452 -50 -641 -621 -226 665 584 -165 -508 -540 -55 807 353 -57 -525 -454 179 454 692 62 -516
4305 -516 -630 -87 543 701 343 -610 -532 -381 547 653 64 -351 -755 -262 331 716 380 -389 -769 -194
4325 -194 328 498 447 -354 -634 -309 234 445 253 -498 -600 -279 243 457 183 -276 -544 -581 279 716 305
4346 305 -337 -693 -167 451 525 254 43 -502 -252 225 702 168 -262 -381 -281 278 428 542 128 -511
4366e11K05P28K0j71n86j78oO07L56k12l15l39j62M68O40p9o13n22K33N88N80
4387G31m86n57j60m5N79N11n8n59o18K77L96P21l27p05k06j20P35M06Lp19k78
4408d79J0P75K99o2o91k41k15N50M65J63m64q90N79K49K39L64n19m99l79O37M82
4429C73O5k97o54J45K11Q42n7m71n31k55L87Q66J31n40p28J34J76N34L85o02o61
4450e47j21L54O63L46p59m22j77M05O41J1l8n51m88L17P27J5k15n16l53M59N71
4471C22L20n04l28l73J02Q91Rm00m94R7J71M23N69l90p14l61N60K82M01m75l61
4492b53n01N62M31M10m94m56k48K91L06M72%o28n31J95O83L36k79n83r2n2O36
4513B05J64Q6o25l30P8O13L00j63l16m29o0P77J75k55l23k05j59N39M03l75j72
$$ plain form
4366 -511 -306 422 442 271 -315 -493 -499 108 464 252 -63 -402 -564 -96 544 465 -148 -670 -437 151 731
4387 731 245 -312 -472 -517 62 573 515 -44 -662 -385 11 732 405 -300 -506 -626 109 515 518 -201 -479
4408 -479 -469 306 605 543 -148 -389 -604 -54 411 574 110 -780 -201 48 287 651 132 -367 -746 -109 373
4429 373 438 141 -513 -368 -157 685 628 157 -374 -629 -242 624 755 215 -513 -379 -203 331 716 114 -547
4450 -547 -668 -314 349 695 -64 -486 -663 -258 383 394 356 -195 -683 -366 361 376 161 -355 -708 -249 322
4471 322 642 138 -190 -563 -461 430 439 39 -455 -358 -187 236 805 415 -299 -660 -100 182 583 108 -253
4492 -253 -754 -192 239 649 155 -301 -549 -258 48 520 520 -108 -639 -444 239 575 296 -287 -379 -431 205
4513 205 369 455 -170 -500 -422 191 491 328 12 -417 -477 300 475 220 -103 -308 -467 72 475 100 -72
4534g2m85K39K89O24Qo87l81J19M45K90L5m37m39K9K83M86J15m54n59P6N38L62
4556D24j78j82l58k28M21M65P1m75o09J79N33M58Rl78o40P6L04N59k9n16r1j65
4578c50M72L79J4l71n14j91O61L39Pj20o30k02J81P48n2N5q58L1L16L57J93l94
4600G1k43l37M07L34N8R8o83k25K47K18M92j37o35k91L93N25K34m38m24j67K94
4621b09M57K90j42n79l55L41M64K42m91l58j8p2N01L28km55m56K56N54q8q5k01
4643g8m79K44M06K81j28k96m81K55N70J56l20k60l37p0M95O50l70j17m79k99P49
4664I2L37j81l96k96K56J16N72J38q84m4j26M07K96K3l89m07J87L70N74j06n89
4685e0l14m1P93j70J12l96l57k86N47N44j30m21l11J29L06L87j80k04j66j44L04
$$ plain form
4534 -72 -557 -318 -29 595 603 -84 -465 -346 99 389 424 -13 -452 -423 -140 346 461 7 -552 -476 62 424
4556 424 246 64 -294 -522 -101 364 435 -40 -649 -470 63 521 530 152 -488 -412 -108 451 422 -94 -185 -350
4578 -350 122 501 515 144 -370 -561 100 439 446 326 -304 -506 -325 423 371 426 -432 -401 -85 272 465 71
4600 71 -172 -509 -102 232 290 388 -295 -520 -273 -55 437 300 -335 -626 -233 292 526 88 -336 -503 -209
4621 -209 248 538 396 -183 -538 -197 267 509 18 -340 -358 -430 71 399 397 -58 -514 -258 296 208 123 -78
4643 -78 -557 -313 93 374 246 -50 -531 -276 294 450 130 -130 -467 -537 -42 608 238 121 -358 -657 92
4664 92 429 248 -148 -444 -188 -72 500 638 -246 -290 -416 -9 287 310 -79 -486 -299 71 645 539 -50
4685 -50 -364 -405 388 218 330 -66 -423 -709 -162 382 252 -169 -480 -351 -45 342 162 -42 -208 -352 -48
4706d8P49l93ro43M5K53O56O1o72m05J19K43O14j38l25n18k19M65L03M71n52l75
4728c18j76L41O56j01l76j75k51J03N86J67l99n93K07J31M95O0k93m3k19J25K94
4749B21L59m33n89N6L02J65N61m91m39K8J35K47J99j52n59j12J39O50K65l97k31
4770g6k35K25K90J75k44k94k26J61K96L25j87l99l7N8N30k1j38k62k18j75N87
4791A35J76Ok99m66L9L31M02o4m78m17M56O6O01k51j93m24K67J87L11r2k40m53
4813d00J69M30O3K45o79k17R7L08L14J41m69k83J2M7M54K03o61j69Q4L74L50j38
4835B75k97k28l0J8N46J29m78n84L32K64L76R7n66n61K34M29J42L23n39l39Q8
4856c69K70L04K03m23m00QL79K26J02mp35j00L63K84K27j90l63j37Q9P24j15k25
$$ plain form
4706 -48 701 308 299 -344 -299 -46 610 671 -1 -406 -287 -44 570 432 107 -411 -630 -165 138 609 57 -318
4728 -318 -494 -153 503 402 26 -149 -400 -297 289 456 57 -536 -329 -198 297 357 64 21 -198 -73 221
4749 221 580 147 -442 -386 -84 81 642 151 -288 -260 -125 122 321 169 -390 -502 -363 287 552 155 -76
4770 -76 -311 -86 204 379 135 -159 -385 -224 72 397 210 -189 -226 -168 362 341 203 -59 -277 -452 135
4791 135 311 317 18 -448 -409 -78 324 260 -218 -635 -179 -113 488 237 44 -380 -113 74 385 293 53 -400
4813 -400 -231 199 262 507 -172 -389 -292 16 330 471 2 -281 -269 -222 232 435 -226 -395 -311 63 413 275
4835 275 -22 -250 -280 -262 284 413 -65 -649 -317 -53 323 420 -146 -707 -473 -44 98 421 -118 -457 -369
4856 -369 -99 205 408 -15 -415 -407 -28 198 300 296 -439 -539 -176 108 335 145 -218 -355 -266 458 343 118
4878A18m94R7J99L24Q6j40m08l07N65L70j05k99l22k15K68L77J62n5m66k03K83
4899a65L71j47k2m2l32K46K17J72k70q7l31K53K26N46m37l43n02K78M68L70l91
4920G8l09QN0L80J84R5k59o84J93L28L04j12n94K79l94N42N38m41m48j20N7L44
4942A9L83p0m85l86L32L86K77k38j31l46q9L28J90J63m5r42M53J95L16m8l55k06
4964b99qL26J89P4k75k13n2J87M13k7m65j34j23L23K33K19k19n57n5L31M68M9
4986C85m47l92K0K92M17J1k69l9k95L05K92J91l98l71l9L57K64j73j01m44L29
5007a05p2N83K0q9l86n05N02J99p8q3n6k20Q1N7M90k12m14l1J9K43M68l31m80
5030d00LL24K07O1J34m92J17j32K50Q0o0k58k09L39J25N02l95l61j35N3N29K9
$$ plain form
4878 118 -376 -279 -80 244 330 190 -218 -525 40 410 305 6 -316 -531 -263 114 276 221 -245 -448 -165
4899 -165 206 59 37 -5 -337 -91 126 298 28 -59 -390 -137 89 635 198 -145 -647 -369 99 469 78
4920 78 -231 -223 -173 207 391 486 227 -457 -264 64 368 256 -338 -59 -453 89 627 186 -262 -382 -325 19
4942 19 402 332 -153 -539 -207 179 456 218 87 -259 -348 -20 170 333 288 -654 -201 -6 310 262 -93 -299
4964 -299 -307 19 208 282 7 -206 -258 -71 342 315 -150 -284 -407 -84 149 368 149 -408 -463 -132 336 385
4986 385 -62 -454 -434 -142 275 286 17 -22 -317 -12 280 471 73 -298 -337 20 284 111 10 -434 -105
5007 -105 -177 406 426 337 -49 -554 -52 147 69 -14 -70 -290 -209 -152 338 126 -288 -319 -300 -57 411 80 -400
5030 -400 -397 -73 134 195 329 -163 -46 -178 72 152 92 -166 -375 -36 89 591 196 -165 -300 -247 282 311
5052C11L3m06l74O0O21J21k63k48j4J88J8R7j5j81k43oL89NJ46k61q2r4L22K81
5076D05m03l90N2o4O94L4J08l65l92J60K45K75j97k66l92K27J68L22n9j01k27
5097a66K0J22L39K99r33O6qK21N42r9m47n0k32N06r0P1j12k73NJ16K71J74l30
5120A2l45jL45N11j34j59k43j30K83K6J28p4l71j78M20K69k54o5k04j39K56K67
5142B20K1j57k80j66K93K59K88k87m91k1J79M01K79n35n54M13N5K77K82k04l71
5163i9o3J38L11L1k98j74l48M86J41k5K50o41L7K51K07L79k53m67k32J89K59L5
5185A14Q9l89j1m9K85J54p1k48j78K90J08P9j30j11k27O9L90K01j39k72k77L34
5207A1j65L32J81m93r9Q0L04J17j86k15p8K1K75mq6k75O4Q8L43L19j73l50k14
$$ plain form
5052 311 344 -62 -436 -376 245 366 103 -145 -159 29 47 144 129 -52 -295 -301 88 93 239 -22 -104 -198 124 405
5076 405 2 -388 -336 -400 294 328 436 71 -321 -161 84 359 162 -104 -496 -269 -101 221 162 61 -166
5097 -166 -146 -24 315 614 -319 -253 -261 -40 502 403 -44 -94 -326 180 90 161 49 -224 -219 -103 168 342 12
5120 12 -333 -334 11 522 388 229 -14 -144 139 165 293 219 -152 -330 90 359 105 40 -164 -303 -47 220
5142 220 241 84 -196 -362 -69 190 478 191 -300 -321 -142 259 538 3 -551 -138 -83 194 476 272 -99
5163 -99 -162 -24 287 318 20 -154 -502 -16 125 100 350 -291 -254 -3 204 583 330 -137 -369 -180 79 114
5185 114 203 -186 -197 -246 39 193 122 -126 -304 -14 94 173 43 -68 -295 -226 164 365 226 -46 -323 11
5207 11 -154 178 359 -134 -233 -153 151 268 82 -133 -211 -190 85 81 -5 -280 -216 -128 215 534 361 11 -203
5230b03j02N54j24K55m60%j03J56J07k54n5J61p4o6O78o66L55j17m56K93K13K75
5252C67l84l63J00L04M11j84l97j99L2J38N38Rm70m1J44k22L04O5r5l12k10M06
5274e9J12L09m29j64K57j44L77o4o9m42q9M44J83J23k73k07M6l4K61j3M1k29l40
5297d03L65J73q9J18l64j82L79K26L9k13k21k47K60N30rk57k8l14P3K18m9nj49
5320a49J94j19J58J12k21p2m05O15j19p6K83k31k56K57N2OK08l40j0j30J52J11
5342B0J48j0m97K51K88j1q0k78OJ8M7K59j1k76K2j10M07K34k64k51j12O4J23M60
5366D47k45k99P9q3P6M73l63j53j72J48lL51r4j58j19K9K73P2k99P4k34m0L3L46
5390A39r1j69j36o9N10p1O7m44K7Q4J10J31J65l59l8Q1O9L31n7j31n23J19L64
$$ plain form
5230 -203 -305 249 125 380 -80 -80 -183 -27 80 -174 -229 -68 -142 -208 470 -196 159 42 -414 -121 92 367
5252 367 -17 -380 -280 24 435 251 -146 -345 -313 -175 363 372 -98 -139 5 -217 87 152 57 -255 -465 -59
5274 -59 53 362 -67 -231 26 -118 259 195 126 -316 -405 39 222 345 72 -135 -89 -123 138 125 166 -63 -403
5297 -403 -38 135 46 164 -200 -382 -3 223 262 49 -172 -419 -159 371 362 105 77 -237 -164 54 5 0 -149
5320 -149 45 -74 84 196 -25 -97 -502 113 -6 -82 201 -30 -286 -29 23 29 237 -103 -113 -243 -91 20
5342 20 168 158 -339 -88 200 189 109 -169 -163 -145 -98 161 150 -126 -104 -214 193 427 163 -88 -200 -136 -13 447
5366 447 202 -97 -18 -101 -25 448 85 -68 -240 -92 -95 256 162 4 -115 -86 187 259 -40 34 -200 -240 -207 139
5390 139 48 -121 -257 -326 184 113 180 -264 -237 -153 -43 88 253 -106 -144 -63 6 337 280 149 -374 -255 109
5413A09K38r0l06m6p0K79K8K4J74m99j94L86P7J13j35m85J99R5L45R0m18R6k01
5436a91j17L81N8O8l47r0J55M06j84k92q7q5J55R6K93k82m39K04R2K76K4j38n5
5459i9j26LJ95R0J13m09Q4q4K62J96j4j95l47L75j15L32m24J4j73J61K27J46l5
5482A77j31k21Q9J55K66K3n63J30k29L03L29k92k97j08Q6N21k25J74J3m52o2K03
5504a11N66l46j17l19Q7J41L14k8k96j29L75k40L23O7l98j09N6J1K65J31j08n02
5526c67J3K73L64J24n87L6o0j25N51M6k07k35k6J20J46P1k8k67k7O3J91l0pok17
5551a91k46P46j21k60j10K96k84N06l4j85k02k12Q7K60K03q5l01o8L70R1o9j3
5573A78j62l35R9L44R8p2l20K8L46j82J47M2l19kJ0J96K39m78j83O0L46K80M3
$$ plain form
5413 109 347 257 -49 -95 -165 114 142 166 340 -159 -353 33 110 223 88 -397 -198 -103 242 332 -86 10 -191
5436 -191 -308 73 131 199 -148 -238 -83 323 139 -153 -240 -325 -170 -74 219 -63 -502 -298 -206 70 94 -44 -99
5459 -99 -225 -222 -27 63 176 -233 -149 -233 29 225 211 16 -331 44 -71 261 -163 -149 -322 -161 66 212 177
5482 177 46 -175 -86 69 335 358 -205 -75 -304 -1 328 36 -261 -369 -283 238 13 187 200 -252 -314 -111
5504 -111 455 109 -8 -327 -240 -99 215 187 -109 -238 137 -103 220 287 -111 -220 -164 -153 112 243 135 -367
5526 -367 -354 -81 283 407 -180 -144 -204 -329 222 268 61 -174 -200 -80 66 137 109 -158 -185 -122 69 39 32 26 -191
5551 -191 -437 309 188 -72 -182 114 -170 336 302 117 -85 -297 -210 50 253 168 -133 -201 169 260 191 178
5573 178 16 -319 -220 124 222 150 -170 -142 204 22 169 211 -108 -110 -100 96 335 -143 -326 -266 80 360 403
5596D03k27k30j76M6L13K04j7n32K0O9K99L02m7n68j4O8J52j91J4Q7j13J32mJ47
5620A37K73k48l20K12q1K35n8j53k08q9L02L54j73k06m43J95L17K96m94K73n43
5641d22P7N52q2M6l80r8K92LK51m5k44O7l71N17J4R7l73o2j23L96j68K10N1k76
5665g1r6N9K72K6l0m71J50J73J31J68l37k0m6M0L40J33m21j15R0L1l1J16J04k79
5689h4q3J57J90j11o0q6K6K68OL14o82J76j02j02L03q0R1l03m44M52J70K1k2n4
5713c9k3R8K86n6j17l65M2J47J20L00m09J8K03k68K06N9J18n13o0K90j4J92j63
5736E2j1l00M00j60K23p8k14o3K27K03j39M6k36l36M14N9j35P2k13J28n8J41K78
5759C00k92o0q6J77J52j07P8l90Q0k75M73L40l14j77l32L22L8K1J56j29j06j34
$$ plain form
5596 403 176 -54 -230 -184 129 333 316 -216 -196 -127 172 474 427 -141 -155 -87 65 -126 -112 -25 -138 -6 -10 137
5620 137 410 162 -158 54 -27 208 150 -3 -211 -300 2 356 183 -23 -466 -271 46 342 -152 121 -422
5641 -422 -345 207 125 171 -209 -307 -15 -12 239 194 -50 17 -354 163 177 274 -99 -161 -284 112 -56 154 205 -71
5665 -71 -167 -108 164 190 160 -311 -161 12 143 311 -26 -46 -92 -52 288 421 0 -115 -25 6 -25 91 195 -84
5689 -84 -167 -10 180 69 9 -77 -51 217 223 537 -145 31 -71 -173 130 50 141 -162 -606 -154 16 37 15 -39
5713 -39 -62 36 322 266 149 -216 -174 -27 93 393 -16 2 205 -63 143 202 320 -193 -253 37 23 215 52
5736 52 41 -259 141 -19 204 126 -88 -151 76 279 140 186 -50 -386 28 87 -48 24 -189 -61 -119 22 300
5759 300 8 -52 -138 39 191 84 162 -228 -148 -423 50 390 76 -101 -433 -111 -73 -52 104 -25 -131 -265
5781b65M44m7p7j20n9MR2J68K52n03p0J39L37k2k50J20j92j12J31L14k10m2p2
5804d0n1L2J19J26j54l32J57N7L19j17k40J23k21Q2K66J12k15p6J52j44K59m7
5826A67o5m90K43m8J84j2N6j36q9K7J95Lnj43n5N7L74k39l80L65j15J91r6N9M1
5851H9j29j15L51k47K59p3j33j60O3K83K33l71P6k81j7K86J52l98M7k04R9K5K71
5874A06P7k43j14J37J26j14J79m25K38L1j23K61oj90M07q0k15r6K99j65k62j10
5896b82K34M37k18j48k94K74P4J65l1j90k91K63Q8M5l7j19k74jL45K7j3k2N1l21
5920b38L69J46m2l38n5k3J03J2K30j73j1m6O9K66p7k14M3j37K12J74l55j24J30
5943g9k96L67j25J78Q4q9P9k99K62j27L5L0k40J45K16k9k46J9q4J24K92J10j88
$$ plain form
5781 -265 179 132 55 -65 -124 -120 -28 140 392 -111 -181 -42 295 273 23 143 -49 -161 -30 284 74 32 -40
5804 -40 -91 -59 60 186 32 -300 -143 -86 233 116 -124 -1 -222 -140 126 238 23 -53 99 -45 214 167
5826 167 102 -388 -145 -193 -9 -21 35 -101 -190 -163 32 35 30 -113 -168 -111 263 24 -356 9 -106 85 -11 48 89
5851 89 -40 -155 196 -51 208 135 2 -158 -95 188 421 50 126 -155 -172 114 266 -132 -85 -289 -190 -165 106
5874 106 183 -60 -174 -37 89 -25 154 -271 -33 -2 -125 136 130 -60 347 267 52 -44 255 90 -172 -282
5896 -282 -48 389 171 23 -271 3 77 242 211 21 -270 -7 81 126 89 -30 -304 -305 40 67 54 32 83 -238
5920 -238 131 277 235 -103 -158 -181 -78 -66 164 -9 -20 -66 3 269 192 -22 21 -116 96 270 -85 -209 -79
5943 -79 -375 -8 -133 45 129 40 119 -180 82 -45 -10 20 -220 -75 141 112 -134 -115 -199 -75 217 327 139
5966A39j93K45k84N3J18l42o0KL32j53j9J97k11j32K08K71j56n3M4p6M6J8J47
5989A41k01o4j67J84N7J08J89j36k92K28J16r8K40l78j23J28J66m18M50O2l93
6010b01K39k24L84l3k91P0J34j68j2j58K35L7j59J48J72n5j25o0r3K59Q3j22j44
6033h4l0J75J53J37m53J0p0J47j2P4qk8j72P7J79P4ql57J25J40j5l9k50j8K89
6058C6j81L39OQl32K98k66j0p0K16J08m02K40j20L09K51m59l6k8R4J12%j96J07
6082B4n6K55j46j82J99k06j16P2M47l25r5q4O4J0M11q8j36l92L71q0K53j17j38
6105e5q9m1K56k34K58l6q2j44K12K93k21k20N8j5J05r0K73k54kr9o0L23J5l7k27
6130a13p0K51L14m54J72k86k30M11oo1J47l59O1J33J11Q2l8j32j28K62j17J91
$$ plain form
5966 139 -54 191 -93 -40 78 -264 -324 -322 10 -143 -162 35 -176 -308 -100 171 15 -38 6 -70 -24 -6 141
5989 141 -60 -124 -291 -107 -50 58 247 111 -181 47 163 65 305 -73 -196 -68 98 -320 130 192 -201
6010 -201 38 -186 198 165 -126 -56 78 -90 -102 -260 -25 12 -147 1 173 118 -7 -67 -160 99 182 60 -84
6033 -84 -114 61 214 351 -102 -92 -162 -15 -27 47 39 11 -161 -84 95 169 161 -196 -71 69 54 15 -235 -253 36
6058 36 -145 194 200 208 -124 174 -92 -102 -172 44 152 -250 -10 -130 179 430 -29 -65 -93 1 113 113 -83 24
6082 24 -32 223 77 -105 94 -112 -228 -156 291 -34 -129 -213 -149 -139 272 184 48 -344 27 -53 200 83 -55
6105 -55 -144 -185 71 -163 95 59 -23 -167 45 338 117 -103 -45 -60 45 -45 228 -26 -28 -127 -187 136 151 114 -113
6130 -113 -183 68 382 -72 100 -186 -416 -5 -11 -72 75 -284 -223 -90 21 103 65 -67 -195 67 -50 141
6152A41J41k82l32M29j71J67Q4k98n5K2J98N2l2j36l24L90%J7L6m7k66M47q8o5
6176B8M6j72n7L05r9P9k8j56j95K65j6J57l6N7k55k3j52K71J4j51L86k37j73L57
6200B15r7q4o9K8M9J23Or4n4k03K80q1R7j59j75l3L67Qq1K76n70J58J29L33l68
6225Akj82J24P7J77k06J05l77L1L80k06J70L6k22L7j14K37K65j34m36r5L04L14
6248B84l29j5L7n9l6J24L2J42j94R8j71J6L26j12j80j45J49J31j82K08j59r9O5
6271f9K30k64K04j40j09J48j67J30J88m14J83j78J69L48k38L2o2k05L47j3k1j73
6293g4N7j56Q8K85r2P4l07K01n8l4P9j15l49M23J41L7j66k88L11j39K18Kj57p0
6317h9K30k04K67j90Q2M5l11P3L20j33J42q1k44m05J44M69q6N7k84J13J45j31
$$ plain form
6152 141 282 0 -332 97 -74 93 177 -121 -176 -154 44 96 64 -72 -396 -6 -6 11 47 0 -266 181 93 28
6176 28 74 -98 -155 150 51 130 102 -54 -249 16 0 157 121 178 -77 -100 -252 19 33 -118 268 31 -142 215
6200 215 118 34 -35 -7 42 165 171 77 23 -180 100 19 116 -43 -218 -251 116 124 43 319 -251 -93 36 369 1
6225 1 -1 -183 -59 18 195 -11 94 -283 -252 128 -78 92 128 -94 -57 -171 66 331 197 -239 -334 -30 284
6248 284 -45 -60 -23 -82 -118 6 38 180 -14 84 -87 -71 255 143 -37 -182 -33 98 -84 124 -35 -134 -69
6271 -69 161 -103 101 -39 -148 0 -167 -37 151 -263 -80 -258 -89 259 21 53 -9 -214 133 120 99 -74
6293 -74 -17 -173 -85 200 108 182 -125 76 18 -16 63 -52 -401 22 163 200 34 -254 57 -82 136 138 -19 -89
6317 -89 141 -63 204 14 96 141 -170 -97 223 90 232 151 -93 -498 -354 115 29 86 -198 -85 60 -71
6339g1L3N6j7Ol3r1K47j53j38P5O8J65o6J10m01R2J55J86K8k82k4j30J58R7K6
6364I6L7m14J34J46Q4j10J89k23J65J40r0L9j51j93K9q5M09r3p3j14J81j59K63
6387B07J7j21L6k81k44M03Q5P6j90%J91l1r5J19k08j62L10j99M7L2L1L3j23J83
6411A16l22j90K89M9J41o4J24k6k66P7J14M3j99L6R3j78K3O3J19J60m02L8L02
6434A40l8j4k7j23j20L1K37j23J81k36l8L24m22M82j00m05K57j17M0J76J28l04
6456g1q8Q7K70p1q9L3l84J57k3J43k6J25N0q7N5j82M17k45k01K41M1J89j85j91
6480c5o1J45Pj8p2J12j94N0J37Q1J55k19k04L0J15n3J97m08N7n1K74%J1P9l93
6505b58K37J16j56J12J22l42J45O2J03r2J99m34K13PQ6O9j56ml31J44J96Q6R8
$$ plain form
6339 -71 -38 18 1 7 -26 -117 130 -23 -161 -86 -18 147 81 191 -210 -118 37 223 251 -31 -55 -185 -27 70 96
6364 96 133 -281 -147 -1 83 -27 162 -61 104 244 154 193 42 -151 -122 -207 202 109 36 -78 103 -56 207
6387 207 224 103 139 -142 -386 17 102 178 -12 -12 179 148 53 172 -36 -198 112 -87 -40 -8 23 56 -67 116
6411 116 -206 -396 -107 -58 83 19 143 117 -149 -72 42 85 -114 -78 15 -163 -140 -77 42 202 -200 -162 140
6434 140 102 88 61 -62 -182 -151 86 -37 144 -92 -130 194 -228 254 154 -251 6 -111 -71 105 233 -71
6456 -71 -159 -72 198 127 38 71 -313 -156 -179 -36 -62 63 113 26 81 -101 316 71 -130 111 152 341 156 -35
6480 -35 -96 49 56 38 -34 78 -116 -66 71 152 307 88 -116 -86 29 -24 173 -235 -178 -229 45 45 56 135 -258
6505 -258 -21 95 -61 51 173 -169 -24 38 141 49 248 -186 27 34 120 189 33 29 -302 -158 38 124 222
6528B22m4j77oR2l29L52j39O7J39k08J38n1j18J7K05N9k46j07K89o7N6j29N1N4
6552A20k22R4k45M10qk32K13l43J62N9N9j21J12q9l9K84m40K72o8j59P2K47j66
6575b8r0K03j31n4j93K42n6KM7nl8M58n51K12j9j66L76J21m52K91l41J17J60m5
6599F0j92Q1ko8R5p2J16j28j17K49l34L16K75l58j66K66q4K89k66J10J17l60R1
6622h2J21K08j00l58K5K90j16K4j16N1P9q0K75l03M3K5J31j84L3J44k18j23J10
6645a21j08J63K53j89J34j75L2m9J40l51J03K1p4L45o3r2pJ71m84M93O6m27K17
6668bN3k21KL13j77O4Pj75j14J53J78k45J50J08K68n76r5R0L48n8j54L27p6l6
6692A32k41M3j56L47pj19q4N4lJ59k1k88n8K48L0J55j92J04L7o2o3J75j91P1j5
$$ plain form
6528 222 178 1 -5 87 -242 110 -29 38 177 -31 107 56 -62 -45 160 219 -27 -134 155 88 144 15 66 120
6552 120 -102 -8 -253 157 149 -83 130 -213 -51 8 67 -54 58 -31 -70 214 -226 46 -22 -181 -109 138 -28
6575 -28 -118 85 -46 -100 -293 -51 -107 -105 -58 -63 -101 357 -194 18 -1 -167 209 330 -122 169 -172 -55 105 60
6599 60 -132 -51 -53 -121 -26 -98 18 -110 -227 22 -312 4 279 -79 -245 21 -63 226 -40 70 187 -173 -82
6622 -82 39 247 147 -211 -186 104 -12 12 -104 -53 26 -54 221 -82 -39 -14 117 -67 -34 110 -108 -231 -121
6645 -121 -229 -66 187 -2 132 -43 -11 -60 80 -271 -168 -147 -221 124 61 -31 -38 133 -351 142 208 -219 -2
6668 -2 51 -170 -168 145 -32 32 39 -136 -250 -97 81 -164 -14 94 362 -214 -309 -219 129 71 -83 244 168 132
6692 132 -109 -66 -222 125 118 -1 -85 -31 -34 125 104 -184 -242 6 36 191 -1 103 140 78 15 190 -1 70 55
6717E5%o6J37Qk55k01M36J27k31J54n6j4j86J14J58p1k78J36QJ40K0j57r0J36
6741B4j03jL40l18J23K4k48J29K53k23Rm2J62j86j02J75n8j75M01J6Rmj5k57j05
6766a72K33j60l2l6n1K39q1K50l36O8j56J11K67J89j77j54p1L5K36r0p5m6k11
6789b20K94j5P7r8j7Q1k18J15K94l42l30M57k31K99k9l9r7j39O9J55j17J76j85
6812f0j1Q7n4j25L08l57K3l4K28P0l0J59l44Q6j86O8J87J24l00Q1K39r2J55l02
6836h0k36K43R9J6j50R3M4j14l0P8J96k42Q7M5l13M49M3l9k49J31l52J82M03J1
6860C15l94k94L12j50N13m94J83m22L24L21k20o8o5q2K71k28L46m8k76q2K99k11
6882a50K71j62J66j35J18k37J38Q2j5jk00rM00j87o1j71J1Q2O9K74k26j53KJ06
$$ plain form
6717 55 55 -11 126 134 -121 -322 114 241 10 164 108 94 -92 22 180 109 -169 -33 -25 115 135 -22 -112 24
6741 24 -79 -80 260 -58 65 89 -159 -30 223 0 9 -33 129 -57 -159 16 -42 -217 184 200 209 205 190 -67 -172
6766 -172 61 -99 -131 -167 -218 21 -60 190 -146 -78 -234 -123 144 333 156 2 -69 -34 202 112 37 -9 -220
6789 -220 74 59 136 38 21 102 -116 -1 293 -49 -379 78 -153 146 117 78 -19 -158 -89 66 -51 125 -60
6812 -60 -71 16 -38 -163 145 -212 -189 -223 5 75 45 204 -140 -54 -240 -172 15 139 -161 -80 159 67 222 -80
6836 -80 -316 -73 26 42 -108 -15 29 -85 -115 -37 159 -83 4 49 -264 185 228 189 -60 71 -281 -99 304 315
6860 315 -79 -373 -61 -211 302 -192 -9 -431 -107 214 -6 -74 -139 -221 50 -178 168 120 -156 -238 61 -150
6882 -150 121 -41 125 -10 108 -129 9 91 76 75 -125 -134 266 79 18 -153 -142 -60 9 283 57 -96 -94 12
6906A2j49n4pJ78l52J24M67k40J04l09L87J21j83K69l49k05J54J34j0N3k07p2
6928a34p7J27M8K3L7n2l6j10J5J84K8L2j95k9K25rj20L3n8P2J6j6J75j97P8j54
6954i4L4M46l77j75K90j66L6pr2J12j56o1J40k57Q7J94L6k35K62K62k58J67r5
6977I3L2k60M46j85J5j85P6J19k03L9k63L85o0J01J9o1O2j42j78J27Q9l8N0p0
7001Hj15J90l0K6p2j28J97j02l9J3kM2j27J77j89MK24j47K40l14J84J63k38J93
7025A58j6k27L33j9l09J16j86K89l80K47o3O6k31L40j28N5J9P2k15R3Q0l32M12
7048A74m50K84K18j37n2p2n5j52M00o4p4J91k22N8j22J52l25K08l3K04r1L6Q2
7071A58m74M24l96N87k95l9O9K73k67oj50K08j61R3J39l35J26k5rP7J7j02R1n4
$$ plain form
6906 12 -137 -191 -198 -20 -372 -248 219 -21 83 -226 161 282 99 368 19 -186 -32 102 92 145 -62 -134
6928 -134 -211 -84 -36 -13 24 -28 -64 -174 -159 25 53 85 -110 -139 86 77 -43 -10 -68 4 20 4 179 -18 60 -94
6954 -94 -60 386 9 -166 124 -42 -6 -13 -105 7 -149 -210 -70 -327 -240 -46 -10 -245 17 279 21 188 93
6977 93 125 -135 311 126 141 -44 32 151 -52 -13 -276 109 49 150 169 108 170 28 -150 -23 66 28 78 8
7001 8 -107 83 53 79 7 -121 76 -26 -65 -52 -54 -12 -139 38 -151 -147 77 -70 170 -144 40 203 -35 158
7025 158 142 -85 248 229 -80 36 -150 139 -241 6 -57 9 -222 118 -10 45 64 136 -79 14 94 -238 174
7048 174 -276 8 226 89 37 -35 -90 -242 158 94 20 211 -11 47 -75 77 -248 -40 -73 131 40 76 158
7071 158 -316 108 -288 299 4 -35 34 307 40 34 -116 92 -69 24 163 -172 -46 -71 -80 -3 14 -88 3 -51
7095e1mj28j11J50J50J13k01L8K15j82j39K90j22J41j73J6J63p9o4M8j48j44L27
7118A05j50l7j60M5M12j29p9K84j09k66K14q3n1JR5l47K60J8r4k3q7o0M14m53
7142b80L85J17k86P3J25K6K9k32j97L82p3L3j28O8j04J83j39l0l7L08p2m1k54
7165a44J84Q8j65J14j88J12J34mj39j2k82O98l88l4O6o4r5O5l4J30q1K65k07j20
7189a01j44J34M01l42J21m04K05J22J04k8k40J23J54j26R7O7k80%N9K9K24Ml75
7212a96J35J96l69M9K59k12k0K24l9N8k11j9J40l1MJ60l05L24p3L5kk48M33l39
7236d7j87K64k52K0J36k47J69J87r5L2O1O8j23m6J01j77J43N1k12K09j30J28P
7259F0O2K6k60K40l24L00K7k76J16K60j59j33J93rm43J87J76p3L4l10M84P5m84
$$ plain form
7095 -51 -55 -183 -294 -144 6 119 -82 -44 171 -11 -150 140 18 159 -14 2 165 86 22 70 -78 -222 105
7118 105 -45 -82 -242 -197 215 86 7 291 182 -84 130 47 -4 -3 92 -255 5 23 -71 -94 -181 -241 173 -280
7142 -280 105 222 -64 9 134 160 189 -43 -240 142 69 102 -26 42 -62 121 -18 -48 -85 223 151 110 -144
7165 -144 40 128 -37 77 -111 1 135 131 -8 -20 -302 396 8 -26 40 -24 -119 -54 -88 42 -39 226 19 -101
7189 -101 -245 -111 290 -52 69 -335 -130 -8 96 68 -172 -49 105 -21 76 143 -137 -137 -78 -49 175 179 -196
7212 -196 -61 135 -234 -185 74 -138 -158 66 27 85 -126 -145 -5 -36 -32 128 -177 147 74 109 107 -141 292 -47
7236 -47 -234 30 -222 -202 -66 -313 -144 43 -52 -20 41 109 -14 -60 41 -136 7 58 -154 55 -75 53 60
7259 60 122 148 -112 128 -196 104 131 -145 -29 231 72 -61 132 123 -320 -133 43 -30 4 -306 178 253 -231
7282b31K49m4J55j85j6k5MK87j53J15k84Q4Q0k18L4R4J74J98l3j7r0l63r5K97
7306A7l1m1K9j02J19L8q6n6J30P2j68K49J0k75K04j88R4j9J5m3pP5q1o5J10J63
7332A63k86j1L0J31j74J46Lm8j04K22p7J43K9k90L3qQ7kM4R9r8Qo5L7O3l9j91
7359a55K32K61j98l03Q9J48p1K8j00J11O1Jr7J70l50M61k45K9k2p7O9M1j3J3P
7384I0O6j31j83L60l67K83pJkp6o3Rn1J36j35J49j02n4P6k3N5l62M01j52kJ13
7410B9m3k3o2L2K01k94K58j16J7j42J90K6K3M5j78K70k65OK24l54O5J74J15o0
7434A38j93r0L53k89kn8O7J29j09k3M62k72l4j27J88j92j15J05Q2lj37K62k30
7457h8K51l87R5K2K30m3p3j96J95m5KJ64k71N23l21j30L9k4K86m23K70l3j33J65
$$ plain form
7282 -231 18 -26 129 -56 -72 -97 -93 194 41 156 -128 -44 36 -182 -148 -54 120 318 285 268 178 -185 -280 17
7306 17 -14 -55 -26 -128 -9 29 -57 -113 17 89 -79 170 180 -95 109 -79 15 -4 11 -32 -39 36 -45 -110 0 163
7332 163 -123 -134 -104 27 -147 -1 2 -46 -150 72 -5 138 167 -123 -90 -98 -11 -13 31 130 32 40 -25 12 75 36 -155
7359 -155 77 338 140 -163 -74 74 3 31 -69 42 103 104 7 177 -173 288 43 72 50 -27 42 83 70 83 90
7384 90 156 25 -158 202 -165 118 111 112 110 34 -29 -20 -71 65 -70 79 -23 -77 -1 -24 31 -331 70 -82 -84 29
7410 29 -14 -37 -99 -67 134 -160 98 -18 -1 -143 47 73 96 141 -37 233 -32 -26 198 -156 -91 83 198 138
7434 138 -55 -145 208 -81 -83 -141 -74 55 -54 -77 385 113 79 -48 140 -52 -167 -62 20 17 -120 142 -88
7457 -88 163 -224 -129 -107 123 80 7 -189 6 -39 -37 127 -144 379 58 -72 -33 -57 229 -194 76 43 -90 75
7481G5J34l34K19j86j54K73k8k4K40l70n0J07L55l90J74K9j35K64j97p3p5J24
7503b2rR1j6K47p9j70j48K20j2j11k7j98L75Q3q5j66J90l30R5l8Q2K69j96M1p7
7528Ip1L6O9m2p2LJ15k3J07k3j58k7Q0kO6j0J22j43Mj17K21p0j61J16J21j75J00
7555G5j12K41j47j97J61L3j24k0Rj79K18N3Qj64K53k61K39J9j44J1L02j31k62
7578a19K00l8p6J02j6k7k21J39L4J20rk97K50Q7k73Q7k2J99o8j62m7p2J3N1J20
7603d5J78j10K1m3J19J04k11p2J87j24j92K60k20%N6J0P0p2P5p5k75M17j17J88
7627A29j69K07j53L1k29n4L16m9J15j0p6N6M8j01o7R5l7R3k1l28K99j67n9J15
7651a6j31K32l56J77k9K52l78J42J38J19j78L5j19NL04j80j28O7L39k58l1J73
$$ plain form
7481 75 209 -125 94 -92 -246 27 -1 -25 215 -155 -205 -98 257 -133 41 70 -65 199 2 -71 -146 -22
7503 -22 -31 60 44 291 212 42 -106 114 102 -9 -36 -234 141 224 139 -27 163 -167 -72 -110 -28 241 45 86 9
7528 9 -62 -26 43 1 -71 -68 47 24 131 108 -50 -77 3 1 67 57 179 36 40 -77 144 74 -87 29 150 -25 75
7555 75 -37 204 57 -140 21 54 -70 -90 -81 -260 -42 11 19 -145 108 -153 86 105 -39 -28 274 143 -119
7578 -119 81 43 -33 69 53 26 -195 -56 -22 98 89 -208 42 129 -144 -57 -79 120 52 -110 -157 -229 -216 -165 -45
7603 -45 133 23 44 1 120 224 13 -59 128 4 -188 72 -148 -148 -92 -82 -12 -84 -9 -84 -359 58 -59 129
7627 129 -40 167 14 45 -184 -238 78 29 144 134 58 114 162 61 -6 89 52 145 124 -204 95 -72 -131 -16
7651 -16 -147 85 -271 -94 -123 129 -249 -107 31 150 -28 7 -112 -107 197 17 -111 -44 295 37 6 179
7673A79k60N8j79K25J89l38M43k17j07J9M8J09rJ0j17kk80K27K27k39M5p8J41
7696I4m70M17j81J18j28K71m0j33J33r6L9P9l94M98k91M6J6k01L29q5K34j93P7
7719A39j34j44J11j69j30M52p3p8o4p9J13j44M54ml95N19m29J30j01oKj62L19
7742A27j28o9J42p7J36m23L53Q2n5k14M4ql9J15p7k6K76j50P0k16J75R5P0k60
7766e7J16m9K9Q9r1J56p7k20K0o3K64m7K30l75J72k36J35j05J07L3k2j71J71k8
7790a9J4K53k84J39r1L40m82L02k83j01L34J37k23j37K6P0k3J8O1j31J51n9q1
7813f9j40L34j41J25j03K6q6m7K0j3N6N9K3j17R2J62k81j14L91j94K25j73p3K7
7837a1N4k68K04j19Q0k8q8K62j08J00K2k39P0q2j4Q0J95o5k14K91r5j46J10J36
$$ plain form
7673 179 -81 -23 -202 23 212 -126 317 100 -7 12 60 169 160 170 53 51 -229 -2 225 -14 31 -47 94
7696 94 -376 41 -140 -22 -150 121 81 -52 81 -15 24 103 -291 207 -84 -38 -22 -223 106 21 255 62 139
7719 139 5 -139 -28 -197 -327 125 52 -26 -90 -169 -56 -200 254 250 -145 374 -55 75 -26 -32 -30 -192 127
7742 127 -1 -70 72 -5 131 -292 61 143 88 -126 -82 -90 -129 -14 -91 -117 159 9 79 -137 38 133 203 -57
7766 -57 59 10 39 128 37 193 116 -104 -84 -147 117 70 300 -75 97 -139 -4 -109 -2 31 9 -162 9 -19
7790 -19 -5 248 -36 103 12 352 -130 172 -111 -212 122 259 36 -101 -75 -5 -28 -10 51 -80 71 12 -69
7813 -69 -209 125 -16 109 6 32 -54 -101 -81 -94 -38 21 44 -73 19 181 -100 -214 177 -17 208 35 -38 -11
7837 -11 43 -225 -21 -140 -60 -88 -176 86 -22 78 100 -139 -69 -151 -165 -85 110 45 -169 122 27 -119 -9 127
7861A27j1k13J14k26J52L1j23K07j37j29L89j19k59K34J17o9j51K24k13P8n1j07
7883a35R8M2P9l19K99j2J30j39p0L34l37r7O6r9J43Nj69M20k10J07o2k20K79L8
7907A71j33k38J54j20J17J46j69J03P6p9k15L27n27N41k86O2j48K95P4J8j10R
7929F8O0J21n62M25O5j57R3j54j20K18K00l65J69%K0K6l2l39K28n6N6l0n4K10
7953I0Q0j87j18K0m9K38K34m39J8J99r9q5R4N9k09L09n7k10j9J66Ol97L27J83
7977A54j39O9k25J43j11K25k00n1O2j20R5K23n9k22K19q5J9J47R6k84J61j23n
8000a1j47M9R8k21J37J84j82K91j57o5R1j3j91N5J73k02p8J95R1K1q9J83k82K6
8024d4q4n1R4M4mJ11k38J28R5M5L01m07J75j9k24K14k36j99M15j71j19J28R9n3
$$ plain form
7861 127 116 -97 17 -209 -57 -26 -149 58 -79 -208 181 62 -197 37 154 85 -66 158 -55 23 -28 -135
7883 -135 -37 5 84 -235 64 52 182 43 -27 307 -30 -127 -61 -160 -17 -12 -181 239 29 136 74 -146 133 171
7907 171 38 -200 -46 -166 -49 97 -72 31 107 28 -187 140 -387 154 -132 -70 -218 77 151 169 59 68
7929 68 128 249 -313 112 177 20 113 -41 -161 57 257 -108 61 61 81 107 75 -264 -36 -92 -36 -66 -120 90
7953 90 170 -17 -135 -115 -164 74 308 -131 -113 86 -13 -98 -4 55 -154 155 98 -112 -131 35 41 -356 -29 154
7977 154 15 84 -141 2 -109 116 -84 -135 -73 -193 -98 125 66 -156 63 -22 -3 144 240 -44 117 -6 -11
8000 -11 -158 -109 -11 -232 -95 89 -93 198 41 -24 67 54 -137 -82 91 -111 -189 6 97 118 29 212 -70 -44
8024 -44 -128 -179 -85 -41 -45 66 -172 -44 51 96 397 -10 165 146 -78 136 -100 -299 116 -55 -174 -46 53 0
8048@J88k37Q1J3L5L3k05j16J71j07K02j35J84l85K59K51j88k80K7P1L9J89k02
8071a12K1Q3J20l36L35k50K30K6n3J43J3k44p5J5L18l34L1r3K43O1m5r0J3K44
8095B64l40q3J22k10J03J42k34M32n0o9L9n1l67K31J48k24J47J76k30k02L04j40
8117i2J40l00O5J03P2Q2L15l06L0o8q7N8J11k49O2R0P6J07j60j02K2k1J35J5n5
8142D3k3n8J18K9o3J06k3j01J72j65pM9q6j12O7J02j0j43L82k45l1J13j70O3Q0
8167H7l48L10L0k01J86j72M5j8J18j68L21k99J56j00M4J24L6k41M2J17q3k6K87
8190B47j75
$$ plain form
8048 0 188 -49 32 45 80 113 -92 -208 -37 -144 58 -77 107 -278 -19 232 44 -236 -209 -138 -99 90 -112
8071 -112 -91 -8 112 -224 111 -139 91 117 64 207 220 -24 -99 -84 234 -100 -69 -162 81 142 97 7 20 264
8095 264 -76 -159 -37 -247 -144 -2 -236 196 146 77 116 65 -302 -71 77 -147 0 176 -54 -256 48 -92
8117 -92 48 -252 -187 -84 -12 70 385 79 109 41 -46 12 123 -126 -64 26 102 209 49 -53 -31 -52 83 98 43
8142 43 20 -38 80 109 46 152 129 28 200 35 28 77 -9 -121 -54 48 38 -105 277 32 1 114 -56 7 87
8167 87 -261 49 79 -122 64 -108 -63 -81 37 -131 190 -109 47 -53 -9 115 151 -90 -48 69 -14 -40 247
8190 247 72
8191G2
$$ Imaginary data points
##PAGE= N=2
##DATA TABLE= (X++(I..I)), XYDATA
0@%%%%%%%%%%%%qJ6j6J8k6L2m0M8n6P2q1R0j07J26j49J74j99K28k61K99l39L82
34B03m34M91n52O18o92P72q59R56j063J177j301J439j589J752j931K129k345K582
52A353k845L139l468L836m255M737n293N947o729P682q874J0420j2508J5497k0177
67a1538K8576m8300J82009J24473l24429j42187j5930J95247K37555J0530k42067
78f061j73922k3829J72230K34385L4875k17709k02133l1883J79052K29128K9143
89B23276j93679j96145n2106J65865K40632L6726j97645j93079l9818J48392K20193
100A62612N4103j74125k01284m8892J40556K13385O9039j59348k13648n3742J47474
111f3870K01780O2037j36433k00152p2616J30849K06932P0257j27045j94803q2686
$$ plain form
0 0 0 0 0 0 0 0 0 0 0 0 0 0 -8 8 -8 10 -16 16 -24 24 -32 40 -41 49 -58 68 -81 93 -106 122 -139 160 -179 203
34 203 -231 260 -292 326 -366 406 -453 503 -560 617 -684 755 -834 918 -1013 1116 -1229 1353
52 1353 -1492 1647 -1821 2015 -2240 2497 -2796 3151 -3578 4104 -4770 5650 -6858 8639 -11538
67 -11538 17038 -31262 150747 275220 -49209 -191396 -207326 -12079 225476 236006 -6061
78 -6061 -179983 -203812 -31582 202803 237678 19969 -182164 -214047 -34995 194133 223276
89 223276 29597 -166548 -218654 -52789 187843 224569 26924 -166155 -205973 -57581 162612
100 162612 216715 42590 -158694 -207586 -67030 146355 215394 56046 -157602 -211344 -63870
111 -63870 137910 199947 63514 -136638 -209254 -78405 128527 198784 71739 -123064 -205750
122b05750J17612K07526Q0405j21206j92945q3881J06469J99939Q8054j10665
132H5558j88733q6417R6562J88514R2483r0577j83125j02222Q5318J92475R8824
143A88660q7593j78772j03546P6719J87401J00915q1740j70346j01159O2067J75129
154F7735J10511o8956j67852j05178N1376J66626J18872n4495j68946j14476M8093
165a16690J65295J19378m8524j64290j14979M2178J56777J19363l7924j55952
175c5368j17905L1126J49770J23920k7295j51383j22360K4120J44635J25642j8828
186A26074j45727j25682J9084J38348J23245r267j35335j27858O759J32298J27953
197A29892J60j31070j32922L66J31160J29571J834j26012j29783l582J22600J26749
$$ plain form
122 -205750 -88138 119388 199793 78587 -114358 -198239 -91770 108169 196223 85558
132 85558 -103175 -189592 -93030 95484 187967 97390 -85735 -187957 -102639 89836 188660
143 188660 101067 -77705 -181251 -104532 82869 183784 102044 -68302 -169461 -107394 67735
154 67735 178246 109290 -58562 -163740 -112364 54262 173134 118639 -50307 -164783 -116690
165 -116690 48605 167983 119459 -44831 -159810 -117632 39145 158508 120584 -35368
175 -35368 -153273 -122147 27623 151543 124248 -27135 -149495 -125375 19260 144902 126074
186 126074 -19653 -145335 -126251 12097 135342 126075 -9260 -137118 -130359 1939 129892
197 129892 130052 -1018 -133940 -133574 -2414 127157 128991 2979 -126804 -130386 -7786 118963
209A18963R011j15586j29223j4347J15416J28991J6813j09262j31024k2980J11528
220b1700J32016K1584j06413j29592k7041J05005J30998K5820r9442j26866l3295
231a28926R5122J30760L5221r3315j28860m0310R0547J32278L9900r0298j28082
242h5963m2130Q4313J29041M4023q2528j25388m7316P5570J26540N2171p5272
253E3061j26200n3222O9871J26238N7793p0527j26525n5803O6002J22688O0268
264A23644o3183j23742o0082N9316J19863O5394n5495j23138o5847N5099J19727
275E1556O8339n1359j21461o7766N1025J15950O8808m3967j15905p2040M2882
286g3938J12638P3947l5835j13421p8903L6349J13967P8155l2588j12440q1301
$$ plain form
209 118963 127974 12388 -116835 -131182 -15766 113225 130038 20776 -110248 -133228 -21700
220 -21700 110316 131900 25487 -104105 -131146 -26141 104857 130677 31235 -95631 -128926
231 -128926 -33804 96956 132177 38862 -89998 -130308 -39761 92517 132417 42119 -85963
242 -85963 -128093 -43780 85261 129284 46756 -78632 -125948 -50378 76162 128333 53061
253 53061 -73139 -126361 -56490 69748 127541 57014 -69511 -125314 -59312 63376 123644
264 123644 60461 -63281 -123363 -64047 55816 121210 65715 -57423 -123270 -68171 51556
275 51556 119895 68536 -52925 -120691 -69666 46284 115092 71125 -44780 -116820 -73938
286 -73938 38700 112647 76812 -36609 -115512 -79163 34804 112959 80371 -32069 -113370
297a13370L3162J12031P8326k9220j07287q1329K6454J07023P9994k2141j02367
308a8724q4152J8142J03890Q5030j7657j00641q6526J3829J02158Q6481j4107
319H7723r8367q6236R355R7101Q7772q332r3781q8006K375R2746R1560j916r2394
332d00r0523j634R0066R3495K109q9774r1084n048Q5053R2800Q154q4465r2398
345h3649j0290Q0828R3189J4164q0608r3803j4727P7350R3418J7859p5563r4059
357g5891j8822P2992R2785K2646p0450r4599k3903O8937R3389K7728o6642r6545
369f8375k7517O7577R3388K9303o3754r5224k9528O3764R0727L1548n6274r3136
381e7501l6313N7644R2047L7727n2790r3916m1834N4635R4593L9754n1281r3130
$$ plain form
297 -113370 -80208 31823 110149 80929 -26358 -107687 -81233 25790 105784 83643 -18724
308 -18724 -102876 -84734 19156 104186 86529 -14112 -100638 -86809 15349 101830 87723
319 87723 -10644 -96880 -87525 9576 97348 89016 -4765 -92771 -90396 2350 93910 91994 -400
332 -400 -90923 -92557 -2491 91004 93113 3339 -87745 -92793 -7740 85060 93214 8749 -83649
345 -83649 -93939 -13111 80078 94242 13634 -80169 -94896 -17546 75872 93731 18168 -75891
357 -75891 -94713 -21721 71064 93710 23260 -71339 -95242 -26305 67084 94812 28170 -68375
369 -68375 -95892 -28315 65073 94376 30622 -64602 -94130 -30366 60361 91909 35635 -57501
381 -57501 -93814 -36170 55877 93604 40814 -53102 -94936 -40301 54292 94046 42765 -50365
393e0365m2544N0666R1710M2380m6198r0394m6017M4438R0304M6961m1615q9561
405d0235n0132M0386R0237M9603l8904q7880n1631L6102Q8406N1687l5215q5137
417c2713n2680K9771Q5499N5953k9540q4994n6269K6587Q4101N9581k6426q5559
429b6689n7617K5374Q1414N9501k2130q2033n9309K0266P8857O2103j6719q0249
441a7231o2972J6134P7845O5164j4056p9344o3498J3281P5184O5036r214p6047
453i718o4751R129P1638O5949l822p2135o8362L466P0995O8981j056p1257o8996
466f9939J189O9149O8646M64o7245o8157k828O4968O9238M518o3530o9171p861
479g0559O3224P0512P617o0829p0252j1461O0598P2333J0105n9236o9559j4278
$$ plain form
393 -50365 -92909 -42243 49467 91847 45649 -44745 -90762 -46324 43980 90941 49326 -40235
405 -40235 -90367 -49981 40256 89859 50955 -36925 -88556 -52454 35952 87639 52424 -32713
417 -32713 -85393 -55622 29877 85830 56290 -28704 -84973 -58386 25715 85296 58870 -26689
429 -26689 -84306 -58932 22482 81983 59853 -22180 -81489 -61223 17634 79737 63018 -17231
441 -17231 -80203 -64069 13776 78940 64884 -14460 -77958 -64677 10507 75543 66329 -9718
453 -9718 -74469 -65340 6298 72247 68425 -3710 -72072 -68606 2389 71370 70314 -943 -69939
466 -69939 -68750 399 69045 69509 2264 -65893 -68721 -3753 65485 70003 6473 -62698 -70559
479 -70559 -7335 63177 70794 9965 -60287 -71748 -11150 61183 71288 12052 -57507 -71785
491g1785N7488P2142J3610n6677o9594j7092N3142P2753J8480n3936p1599j9914
503g2982N1880P3049J9318n1146o9425k1644M5996P1620K4745m6961o9849k6356
515g1755M2549P2831K9496m5574p1313k7485M0474P1497L1533m2248p0981k9305
527g0281L8168O9252L3405l7716o9183l2506L3705O8497L7402l3767p0495l5992
539f9511L2279O9374L8085l1955o9027l6801K9267O6660L9362k7521o6415l9920
551f6123K5374O5429M2339k3150o6549m3427K2320O6282M4168k1195o5692m5236
563f5460K0468O4762M4912j8698o2876m6551J6307O2983M6902j4609o1830m8033
575f1723J2299O1996M8938j3198n9348m8598R167N9392N0516r655n7721m9828
$$ plain form
491 -71785 -14297 57845 71455 14778 -54816 -71908 -18766 53987 72467 18531 -53068 -72982
503 -72982 -21102 51947 71265 20119 -49306 -70950 -24954 46666 71411 24450 -45399 -71755
515 -71755 -29206 43625 73121 27547 -43766 -71251 -30777 40720 72253 30005 -40976 -70281
527 -70281 -32113 37139 70544 32828 -36355 -68861 -35156 33341 70743 36976 -33519 -69511
539 -69511 -37232 32142 70227 38272 -30755 -67556 -38289 28371 67733 40212 -26203 -66123
551 -66123 -40749 24680 67019 43869 -22680 -66107 -43787 22495 66663 45468 -20224 -65460
563 -65460 -44992 19770 64682 45984 -16892 -63443 -47136 15847 62749 48140 -13690 -61723
575 -61723 -49424 12572 61510 48312 -11036 -59634 -50467 8925 59441 49786 -7935 -57763
587e7763N519N7487N2651o080n7355n1207L416N6060N3838l678n6298n1543J565
600e3388N3832N4011j487n3388n1453j763N0379N4546L593n1199n3914n172M9070
613f333N6346O309n0168n5001o506M7312N5722Q370m7392n5208q417M4844N4693
626D4571J1593m3602n6288j2198M3136N5845J3854m1876n6920j4656M1964N5545
638D0968J5127l9139n5959j6798L8539N5249J7858l6104n5853k0295L6363N5860
650C5816K0315l4249n6244k2371L4516N5920K1874l2015n5140k4707L1693N5308
662C0716K4220k9040n4986k6878K8768N5402K6894k7613n4368k8314K6347N4982
674B6130K7955k5600n2835k9187K3115N3027L0400k2427n2063l0825J9741N2431
$$ plain form
587 -57763 -52244 5243 57894 51814 -5541 -56748 -53332 2728 56566 52888 -3410 -54953 -53388
600 -53388 444 54455 52968 -420 -51873 -53636 -3257 51289 54882 3683 -50231 -55403 -6333
613 -6333 50013 56322 6154 -48847 -55353 -8041 47681 56051 8659 -46549 -54966 -10122 44571
626 44571 56164 12562 -43726 -55924 -12788 43057 56911 15035 -41885 -56541 -14577 40968
638 40968 56095 16956 -39003 -55801 -17262 37987 55845 19741 -36112 -56407 -20044 35816
650 35816 56131 21882 -34362 -56733 -22217 33703 55577 23562 -31578 -56285 -24592 30716
662 30716 54936 25896 -29090 -55968 -27200 28202 55096 27483 -26885 -55199 -28852 26130
674 26130 54085 28485 -24350 -53537 -30422 22605 53005 30578 -21485 -52310 -32569 19862
686A9862L2869j9696n2485l2869J8170N2200L4196j8030n1753l3549J6455N0102
698A5472L5502j5511n0381l4411J3515M8571L6667j1715m9601l6822J1296M8192
710A0774L7750r674m8003l8782R604M7014L7890p149m5784l9900O787M5251L9698
723D5476m423m5245m1135M494M4966L9787k799m3097m1724K675M2854M0036n05
736D1360m0792m2165q26M1569M1411J615l9577m3003l236M0591M2712K817l8766
749C710m2496m594L8086M3065M618l6477m2327p365L5945M3665Q144l5503m3847
762c5376r378L4883M4973R195l4372m3929j0232L3098M3919J1201l2423m2576
774c1017j2729K9840M4123J4283l0154m3375j4848K7921M4484J6526k8797m4333
$$ plain form
686 19862 52731 33035 -19450 -52319 -34149 18051 52247 34217 -17536 -51085 -34630 15472
698 15472 50974 35463 -14918 -49329 -35814 12757 49424 37709 -11892 -48714 -37418 10774
710 10774 48524 38850 -9153 -47935 -38331 8683 46573 39424 -6360 -46260 -39473 5778 45476
723 45476 41053 -4192 -45327 -40833 4133 43920 41121 -1976 -43700 -41025 1829 41865 41360
736 41360 568 -41597 -42423 -854 40557 42172 2595 -40408 -43644 -3053 39659 42476 3710
749 3710 -38786 -43380 -5294 37771 42389 5912 -36415 -43780 -7835 35830 43974 8471 -35376
762 -35376 -44754 -9871 35102 44297 9925 -34004 -44236 -11138 32781 43982 11559 -31017
774 -31017 -43746 -13906 30217 44500 14346 -29029 -43877 -15956 28528 45054 16257 -28076
786b8076j5928K7172M3625J7885k6713m4046j7483K5515M2626J9447k4190m3785
798b3951j9308K3637M2326K0592k2099m3509k0970K2426M2117K1485k0042m3024
810b0320k2285K0068M1526K3180j7557m2623k4579J8200M1708K4443j6262m1671
822a6172k6138J6692M1618K4658j4429m0416k6858J3677M0884K6278j2173l9555
834a1934k8280J1318M0037K8476j0880l9119k9255R698L9799K8790r411l8132
846h893k9423P972L7791L0070p253l6791l0175N298L6524L1495n044l6057l1631
859c6117M231L5484L2630l789l5819l1459L097L3748L2484j702l3986l2237Q59
872c2576L2423L3199Q33l3094l3312r28L1743L3824K011l1913l3620k335L0641
$$ plain form
786 -28076 -44004 -16832 26793 44678 17965 -26081 -43564 -18049 24577 44024 19834 -23951
798 -23951 -43259 -19622 22704 43296 21197 -22312 -43282 -20856 21261 42746 22704 -20320
810 -20320 -42605 -22537 18989 42169 24612 -18011 -42590 -24390 17318 41761 25499 -16172
822 -16172 -42310 -25618 16000 40658 26229 -14187 -41045 -27368 13516 39794 27621 -11934
834 -11934 -40214 -28896 11141 39617 28737 -10382 -39637 -29939 9860 38650 29239 -8893
846 -8893 -38316 -30344 7447 37517 30264 -6527 -36702 -31404 5120 36615 31571 -4486 -36117
859 -36117 -31886 3598 36228 32439 -3380 -34839 -31742 2006 34490 32788 -1198 -33435 -32576
872 -32576 -153 33046 33879 785 -32527 -33455 -1712 32112 34123 2210 -31410 -33745 -3104
885c104L3863M149l0651l4359m131K9618L3815N747k8679l5472n768K8801L4300
898B8129O555k7487l4779p502K7413L4095Q034k5377l4541r555K5047L4728J0022
911C4782k4110l5098j1332K4324L5085J1411k2965l5348j2350K3452L4801J1694
923C4346k1448l4218j3800K1156L4946J3116j9605l4159j5496J9382L5559J5313
935C5092j9523l3980j6309J7799L5129J6218j7398l3622j7058J5978L3476J8149
947C3951j5346l3618j8718J4607L3560J9873j4693l3429j9376J3243L3182K0106
959C3342j3080l2759j9943J1444L2036K1714j0935l2473k1418J0341L1412K2294
971C1975r007l2522k2217R440L0798K2328p376l0963k3644P486L0323K3305n617
$$ plain form
885 -3104 30759 34908 4257 -30102 -34233 -4615 29200 34947 6268 -29204 -34972 -6171 28129
898 28129 34684 7197 -27582 -35084 -7671 26424 34458 9081 -25460 -35015 -9968 24760 34782
911 34782 10672 -24426 -35758 -11434 23651 35062 12097 -23251 -35601 -12149 22652 34346
923 34346 12898 -21320 -35120 -13964 20982 34098 14493 -19666 -35162 -15780 19779 35092
935 35092 15569 -18411 -34720 -16921 18208 34426 17028 -16594 -33652 -17674 15802 33951
947 33951 18605 -15013 -33731 -19124 14436 34309 19616 -13813 -33189 -19946 13236 33342
959 33342 20262 -12497 -32440 -20996 11040 32754 21819 -10654 -32072 -21731 9681 31975
971 31975 22968 -9554 -31771 -22331 8467 30795 23419 -7544 -31188 -23702 6621 29926 24309
984B4309l0310k4574N857L0086K4643m783l0048k5373N169K9485K4566l906k8538
997c417k5367L205K8492K4289j828k6644k6484J112K7395K6186m36k6432k6703
1010b6632m60K6909K6844K40k5972k6459j528K5270K7422J395k4665k7017k801
1023b7454K4408K7847K976k4074k7139m305K3093K8280M538k3482k6959n627K1750
1036f148K8577O034k2300k7490o566K0453K8348P805k0901k8345p446J9570K8122
1049A9713R247k0233k8028q919J8472K8245R919j8098k8540r871J7301K7835J1426
1062B8469j7093k8600j1162J6756K7729J2051j6024k8181j1875J5649K7336J2240
1074B7295j4214k7459j3617J3797K7630J4185j3203k7632j5131J3287K7888J4705
$$ plain form
984 24309 -6001 -30575 -24718 5368 30011 25228 -4820 -30193 -25024 4461 29027 25121 -3417
997 -3417 -28784 -25579 2913 27202 25374 -1270 -27754 -26642 753 26939 26503 71 -26632
1010 -26632 -27092 -183 26661 26901 929 -25530 -27058 -1788 25634 27029 2364 -24653 -27454
1023 -27454 -3046 24801 27777 3703 -23436 -27741 -4648 23632 28170 4688 -22271 -27898 -6148
1036 -6148 22429 28463 6163 -21327 -27893 -7440 20908 28713 7812 -20533 -27979 -8409 19713
1049 19713 28960 8727 -19301 -28220 -9748 18497 28416 10318 -18222 -28093 -10792 17043 28469
1062 28469 11376 -17224 -28386 -11630 16099 28150 12126 -16055 -27930 -12281 15055 27295
1074 27295 13081 -14378 -27995 -14198 13432 27617 14414 -13218 -28349 -15062 12826 27531
1086B7531j2429k7364j5391J2027K7509J4842j1119k6091j6520J0229K6889J6570
1098B6683r907k5622j7552Q545K6558J7871q763k5629j7825P162K6235J8243p600
1111A8399k4964j8624N903K5359J9379o336k4728j9299N553K4477J9848n197k4537
1124d767j9429M549K4015J9401l587k3348k0259L076K3069K0726k632k2808k0973
1137b2967J691K2434K1458r02k2633k1889J469K1634K1278L20k1849k1869K62
1150b1563K0819K1491J543k0790k2336j535K0351K1737K720j9504k2829l044K0102
1163b838K2088L137j8629k2814l692J8798K2027M296j7268k3073n120J7922K2603
1176A7437N431j6719k3052o755J7667K2672O176j6172k2672p247J6318K2811P064
$$ plain form
1086 27531 15102 -12262 -27653 -15626 11883 26725 15606 -10485 -27005 -16776 10113 26683
1098 26683 16776 -8846 -26398 -17853 8705 26576 17813 -7816 -25641 -18479 7756 25999 18399
1111 18399 -6565 -25189 -19286 6073 25452 19116 -5612 -24911 -19358 5119 24967 19770 -4767
1124 -4767 -24196 -19647 4368 23769 20182 -3166 -23425 -20349 2720 23446 20814 -1994 -22967
1137 -22967 -21276 1158 22616 21714 -919 -22808 -21339 295 21573 21893 44 -21825 -21563
1150 -21563 -744 20747 22290 1500 -20836 -22371 -2020 19717 22437 2933 -19896 -22940 -2838
1163 -2838 19250 22387 3758 -19056 -22748 -3950 18077 22373 5105 -17968 -23088 -5166 17437
1176 17437 22868 6149 -16903 -23658 -5991 16681 22857 6685 -15987 -23234 -6916 15895 22959
1189B2959j5500k2452q031J4894K3272Q027j4417k2940q532J3743K2888R291j3934
1202I268k2302r550J2332K2888J0514j2923k2525j0483J1613K2864J1524j2037
1214A1183k2764j1262J1024K2755J2109j1272k2314j1737R927K1929J2626r819
1226A2385k1735j2586Q870K1266J3479q139k1916j3385P930K1192J3759o596k2079
1239g555j4119P758K0564J4227n833k1573j4680O177K0809J4706m901k0936j5631
1252b0987N566K0174J5545m477j9714j6230M299J9853J5733l439j9719j6243L109
1265a6530J9455J6350k563j8814j6888K092J8842J7064j859j8132j7450R38J8429
1278I34J7285n79j7935j7492o5J7953J7697J73j7568j7379j243J7089J8336Q55
$$ plain form
1189 22959 7459 -14993 -23024 -8130 15142 23169 8752 -14188 -22720 -8977 13911 23202 9268
1202 9268 -13034 -22584 -10252 12636 23150 10227 -12298 -22781 -11168 11696 23220 11183
1214 11183 -11581 -22843 -11819 10936 23045 11773 -10541 -22278 -12351 9578 22204 12385
1226 12385 -9350 -21936 -13066 8200 21679 13540 -8376 -21761 -13831 7361 21120 14524 -7555
1239 -7555 -21674 -13916 6648 20875 15042 -6531 -21211 -15034 5775 20481 15580 -5356 -20987
1252 -20987 -15421 4753 20298 15821 -3893 -20123 -15824 4029 19762 16323 -3396 -19639 -16530
1265 -16530 2925 19275 16712 -2102 -18990 -16898 1944 19008 17149 -983 -18433 -17495 934
1278 934 18219 17640 -295 -17787 -17852 101 17798 17971 403 -16976 -18219 -1130 17206 18061
1292A8061j7084j7740j331J6198J8252J742j5890j7839k567J5062J8514L403j5739
1305C042j8257l541J4586J8760M625j5256j9056l775J4424J8583M911j4314j8825
1318a4093m626J3454J8051N794j2936j8845n618J2555J8600O450j2077j9094o526
1331a8911J2256J8378P145j1204j9285p310J1353J8561P637j0302j8896q473J0619
1344h432J8663Q577r630j8591r351R767J8687Q729q835j8636r791R069J8863R204
1358A8293q071j7704j0907P704J8505J0187p334j7489j1366P001J8227J0909p053
1371A0902j6923j1723O205J7621J1528n888j7247j2062N090J7645J2435n159j7291
1384d867j2321M344J7399J2972m718j7124j2320L737J6595J2750l330j6301j3010
$$ plain form
1292 18061 977 -16763 -18094 -1896 16356 18098 2208 -15631 -18198 -3136 15378 18781 3042
1305 3042 -15215 -18756 -4170 14590 19215 3959 -15097 -18872 -4448 14135 19046 4732 -14093
1318 -14093 -18719 -5265 12786 18580 5644 -13201 -18819 -6264 12336 18786 6709 -12385 -18911
1331 -18911 -6655 11723 18868 7664 -11621 -18931 -7578 10983 18620 8318 -10578 -19051 -8432
1344 -8432 10231 18808 9178 -9413 -18764 -8997 9690 18419 9584 -9052 -18843 -9774 9089 18293
1358 18293 10222 -7482 -18389 -10685 7820 18007 10673 -6816 -18182 -11181 7046 17955 10902
1371 10902 -6021 -17744 -11539 6082 17610 11722 -5525 -17587 -12497 5148 17583 12424 -4867
1384 -4867 -17188 -12844 4555 17527 12809 -4315 -16635 -12898 3697 16447 13117 -3184 -16194
1397a6194K947J5670J3603k008j6385j4011K489J5738J3803j548j5734j4272J648
1410a4254J5642J3856p54j5110j4383O69J4616J4323K73j4810j4771J59J4245
1423b99J4456P04j3937j4931p15J3662J4477J401j2870j4888k398J3518J4671
1436A2851K207j2263j5419k708J2736J5479K549j2485j4999l575J2604J5195L028
1449A5200j1433j5025m379J1512J5522L855j0921j5156m760J0807J5836M520j0774
1462D804j4784n499R797J6149N020j0092j5124n415Q712J5804O238r231j5294
1475h915o407Q456J5519P212r110j5094p108Q087J5531P629q305j5338p589P823
1489g609J4905Q035p321j5459p584O924J4689Q550o518j5127q527O403J4546R025
$$ plain form
1397 -16194 -13247 2423 16026 14018 -2367 -16378 -13889 1849 15652 14104 -1630 -15902 -14254
1410 -14254 1388 15244 14490 -620 -15003 -14334 282 14605 14878 68 -14703 -14544 -299
1423 -299 14157 14861 924 -14007 -14722 -1060 13417 14818 1948 -12940 -15338 -1820 12851
1436 12851 15058 2795 -12624 -15332 -2596 12883 15432 2947 -12052 -15627 -3023 12172 15200
1449 15200 3767 -11258 -15637 -4125 11397 15252 4331 -10825 -15585 -4778 11058 15578 4804
1462 4804 -9980 -15479 -5682 10467 15487 5395 -9729 -15144 -6432 9372 15610 6379 -8915
1475 -8915 -15322 -6866 8653 15865 6755 -8339 -15447 -7360 8171 15800 7495 -7843 -15432 -7609
1489 -7609 7296 15331 8010 -7449 -15033 -8109 6580 15130 8612 -6515 -15042 -8639 5907 14932
1503A4932n706j4912r049N901J4115R453n023j4809r549M978J4621R541m467j4441
1517d415j0143M785J4063R575l304j4210j0414L885J3666J0067k732j3469j1091
1530a3737K616J3902J0720k375j3107j1714K180J3702J1136k021j3038j1298J257
1543a1777J3340J1272j397j2169j1705L96J2593J1822n37j2314j1605r8J1873
1556c06J2282K71j2214j1877j97J1121J2551Q70j1732j1823j051J0548J2712J798
1570A2953j1549j2290j640J0511J2568K436j1043j2981j511J0166J2413K795j0013
1583B815j2944k638R712J2568L338r506j3168l247R809J2166M059q873j2934l954
1597a2797Q961J2518M361q353j3079m649Q343J2578N012p684j3062n409Q091J3102
$$ plain form
1503 14932 9226 -5686 -14735 -8834 5281 14734 9711 -5098 -14647 -9669 4952 14493 10026 -4415
1517 -4415 -14558 -9773 4290 13865 10561 -3649 -14063 -10178 3488 13555 10823 -2646 -13737
1530 -13737 -11121 2781 13501 11126 -1981 -13695 -11515 2187 13323 11302 -1736 -13034 -11777
1543 -11777 1563 12835 11438 -731 -12436 -12040 553 12375 11838 -476 -12081 -12179 -306
1556 -306 11976 12247 33 -11844 -12041 -920 11631 12501 769 -11054 -12105 -1557 11155 12953
1570 12953 1404 -10886 -12526 -2015 10553 12989 1946 -11035 -12546 -2380 10033 12828 2815
1583 2815 -10129 -12767 -3055 9513 12851 3345 -9823 -13070 -3261 8905 12964 4091 -8843 -12797
1597 -12797 -3836 8682 13043 4690 -8389 -13038 -4695 7883 12895 5211 -7851 -13260 -5169 7933
1611G933M991p418j2708o216P966J2917N286p035j2596n697O487J2798N878o104
1625F482j2711o484N981J2916O372n793j2246p337N601J2931O877n564j1931p697
1639a2603M958J2645P214m814j1915p578M156J2219P666m134j1958p581L606J1713
1653C594Q508l460j2238q093L206J1425Q824k998j1527q562K495J1040R409k428
1667I195j1366r104K306J0858R434j852j1309r400J971J0659R007p80j0558r976
1681a0915J356J0667R531o25j0629j0052P12J0297R928l29j0118r838j2R946R466
1696I385P39r539j0154q89R809R989R72r210j0389j402R318J0808R41r037j0261
1711h920j773R201J0397J513q728j0325j719Q272J0386K162q053j0404k583P836
$$ plain form
1611 7933 12924 5506 -7202 -13418 -5452 7465 12751 5716 -6880 -12577 -6090 6708 12586 6482
1625 6482 -6229 -12713 -6732 6184 12556 6763 -5483 -12820 -7219 5712 12589 7025 -4906 -12603
1639 -12603 -7645 5000 12214 7400 -4515 -12093 -7937 4282 11948 7814 -4144 -11725 -8119 3594
1653 3594 12102 8642 -3596 -11689 -8483 2942 11766 8768 -2759 -11321 -8826 2214 11623 9195
1667 9195 -2171 -11275 -8969 1889 11323 9471 -1838 -11238 -9267 1392 10399 9619 -939 -10915
1681 -10915 -9559 1108 10639 10014 -615 -10667 -9955 342 10270 9941 -177 -10015 -10027 -81 9385
1696 9385 10124 585 -9569 -10458 -649 9340 10312 1102 -9287 -10689 -1371 9437 10378 1341 -8920
1711 -8920 -10693 -1492 8905 10418 1690 -8635 -10354 -2082 8304 10466 2413 -7991 -10574 -2738
1725b738J0936K696q014j0463l051P321J0986L096p298j0631l476O679J1188M010
1739A1241p501j0528m103P018J0835L866o679j0763m039O348J0219N031o189j0852
1753f096m407N631J0603N031n627j0634n467N740J0721N217n065j0590n418N010
1767e351J0352N393m736j0159n787M453J0321N757l859j0514o347M029J0351O337
1781A0240l724j0154o768L957J0037O170l017r927o806L180R665O992k754r535
1795b444p783L186R444P231k371r589p446K059R964P356k170r323p646J677R522
1810A667P871j723r151p627O92R276Q055j397q496q098J003Q735P789m65q467
1825c36q065j15Q527Q546p1q270q362j14P639Q793O22q498q524l56P908Q657N42
$$ plain form
1725 -2738 8198 10894 2880 -7583 -10634 -3313 7673 10769 3471 -7160 -10636 -3957 7231 11241
1739 11241 3740 -6788 -10891 -3873 6962 10828 4149 -6614 -10653 -4305 5914 10945 4756 -6096
1753 -6096 -10503 -4872 5731 10762 5135 -5499 -10966 -5226 5495 10712 5647 -4943 -10361 -5351
1767 -5351 5001 10394 5658 -4501 -10288 -5835 4486 10243 6384 -4130 -10477 -6448 3903 10240
1781 10240 6516 -3638 -10406 -6449 3588 9758 6741 -3186 -9992 -6812 2853 9845 7091 -2444
1795 -2444 -10227 -7041 2403 9634 7263 -2326 -9772 -7713 2251 9607 7437 -1886 -9532 -7855 1667
1810 1667 9538 7815 -1336 -8963 -8271 1005 9060 7663 -833 -8931 -7928 807 8596 8131 -336
1825 -336 -8401 -8516 11 8557 8486 216 -8146 -8260 -621 8172 8794 296 -8228 -8584 -676 7981 8523
1842H523p793q660p70P657Q369J468p295r002j431P404Q411J966o868r243j601
1857h865O840Q703K124o462q976k406O806Q695K440o284q905k665O167Q959K711
1872H882n746r006l156O009Q977K912n591r056l527O001Q854L243n043q550m116
1887h913N108Q988L495m711q777m103M570R296L906m825q360m449M014R032M744
1902I015m422q744m402L572Q846M976m221q639m770L674Q754N460l786q953m886
1917h526L243Q131N602k991q273n465K446Q358N623k201q652n706K469Q149O151
1932H358k184q476o009K466P680O275j869q021o241K043P703O016j191q156o404
1947h010J546P767O174p06p646p019J076P583O754q53p244o812O47P184O795k29
$$ plain form
1842 8523 730 -7930 -8700 -1043 7326 8794 1499 -7503 -8934 -1530 6881 8847 1979 -7264 -8865
1857 -8865 -2025 6678 8802 2340 -6636 -9042 -2236 6459 8899 2615 -6290 -8955 -2788 6171 8882
1872 8882 3136 -5870 -9026 -3017 5960 8872 3281 -5775 -9302 -3301 5553 8796 3753 -4797 -8913
1887 -8913 -3805 5183 8678 3967 -4810 -8913 -4343 4953 8859 4034 -4326 -8775 -4761 4271 9015
1902 9015 4593 -4151 -8553 -4981 3865 8841 4620 -4019 -8789 -5115 3639 9099 5313 -3640 -8526
1917 -8526 -5283 2848 8450 5459 -2814 -8279 -5833 2525 8148 5947 -2705 -8411 -5942 2207 8358
1932 8358 6174 -2302 -8311 -5845 1835 8110 6241 -1780 -8021 -5978 1725 7741 6550 -1606 -8010
1947 -8010 -6464 1303 7477 6771 -875 -7894 -6818 765 7519 6666 -578 -7390 -6743 441 7236 7007
1963G007p167p041j66P531O948j02o600p341k39P065O763M45o750o808r03O792
1979e66P220N25o291p128j155O340P195J309o359p242j124N905P436J597o053
1994A609p601j498N504P788J941n799p332k113N100P991J976n383p457k242N125
2009b391P498K557n440p368k369M707P498K748m741p271k697M402P261L295m309
2024C380p690l024L953P540L424l988p743l297L985P595L024l486p350l883L799
2039c761P393L576l023p491l871L262P257L901k964p276m159L020P146M042k464
2054D588p002m828K622P073M668k299p180m615K097P159M770k461o554n020J825
2069e157P108M929j759o448n421J561O737N360j680o555n385J401O261N824j591
$$ plain form
1963 7007 -160 -7201 -7367 164 7112 7010 410 -6931 -7170 -105 6658 7103 353 -6455 -7358 -566
1979 -566 6654 7179 888 -6240 -7395 -1055 6140 7449 1090 -6152 -7276 -1371 6065 7662 1609
1994 1609 -5992 -7490 -1986 5802 7743 1944 -5388 -7501 -2401 5590 7566 2183 -5274 -7516 -2391
2009 -2391 5107 7664 2224 -5144 -7513 -2806 4692 7440 2699 -4572 -7269 -2867 4394 7689 3380
2024 3380 -4310 -7334 -3381 4159 7583 3595 -4148 -7445 -3460 4135 7159 3673 -3677 -7560 -3761
2039 -3761 3632 7208 4185 -3306 -7177 -3915 3342 7243 4279 -2997 -7156 -4136 3010 7052 4588
2054 4588 -2414 -7242 -4620 2453 7121 4822 -2358 -6973 -4876 2283 7053 4592 -1962 -6982 -5157
2069 -5157 1951 6880 5121 -1327 -6748 -5187 1550 6910 5230 -1325 -6710 -5309 952 6776 5185
2084E185o427n142Q73O572N202n97o569n138N10N861O177o97o193n675M07N854
2100B03N775K36o266n983J94N838N906J70o063n984P5N632N896O70n805o148l72
2117f026N507O142O55n152o649m50M792O296Q37m681o374j357N150O233J277m759
2133A441o418j424M923O416J185m492o311j720M604O300J564m059o283k113M283
2148b104O438J922m040o084k598L876O561K189l900o069k816L986O512K422l680
2163B615o239k724L377O465K718l256o195k991L060O280L320l328o228l283L121
2178c288O348L439l252o173l158K830O178L206k591n899l550K210O026L815k296
2193C845o248l642K177N786M191j862o058m017J899N725L926j477o273l818J663
$$ plain form
2084 5185 -1242 -6384 -5511 1061 6263 5666 -903 -6041 -5531 330 6507 5810 -383 -6058 -5651 203
2100 203 5978 6214 -52 -6035 -5841 -3 5903 6073 10 -5974 -5899 -267 5629 6299 494 -5654 -6026
2117 -6026 -519 5623 6278 1126 -5523 -5973 -1181 5115 5952 1271 -5103 -6460 -1310 4923 6200 1441
2133 1441 -4977 -6401 -1478 4938 6123 1631 -4680 -6400 -1796 4504 6068 2009 -4274 -6387 -2104
2148 -2104 4334 6256 2216 -3868 -6466 -2590 3971 6160 2260 -3809 -6625 -2639 3873 6295 2615
2163 2615 -3624 -6348 -2971 3494 6212 2956 -3239 -6230 -3170 3110 6430 3102 -3126 -6409 -3288
2178 -3288 3060 6499 3247 -2926 -6084 -3254 2924 6130 3539 -2360 -5910 -3700 2326 6141 3845
2193 3845 -2403 -6045 -3868 1918 6109 4247 -1811 -5828 -3929 1796 5722 4245 -2028 -5846 -4183
2208d183N850L963j261n893m228J347N835M376j192n764m594J253N825M305r35
2223D704n649m602R31N279N072j262n202m939P99N425M920q80n093m755K41N369
2239C58M799j74m854n146l6M873N228j60m698m688p04M946N097L45m840n004n87
2256e245M627N159O35m482n224o74M323N310J251m712n265p27L801N503R63m161
2272A082n236j295M230N229J276l660n632j332L782N458J578l718n645j368L473
2287a778N200K089l476n716j911L785M943K241l021n916k030L283N397K116k926
2302B280n540k282L367N149K587l045n380k620L116N097K320k702m884k720K311
2317b946N444K643k119n332k732J929N560K732k080n163l130K009N287L051k351
$$ plain form
2208 -4183 1667 5630 4369 -1524 -5752 -4405 1430 5806 4614 -1150 -5744 -4491 1334 5639 4704
2223 4704 -945 -5547 -4616 663 5735 4473 -729 -5668 -4869 556 5476 4596 -497 -5252 -5011 358
2239 358 5157 4983 129 -5017 -5053 -180 5048 4888 190 -4498 -5202 -256 4841 5186 346 -4658 -5245
2256 -5245 -618 4541 5176 694 -4530 -5204 -881 4429 5680 968 -4297 -5024 -1223 4280 5243 1082
2272 1082 -4154 -5449 -1219 4010 5286 1626 -4006 -5338 -1556 3902 5480 1762 -3883 -5251 -1778
2287 -1778 3422 5511 2035 -3681 -5592 -1807 3136 5377 2356 -3560 -5590 -2307 3090 5206 2280
2302 2280 -3260 -5542 -2175 2974 5561 2516 -2864 -5484 -2368 2729 5049 2347 -2537 -5257 -2946
2317 -2946 2498 5141 3022 -2310 -5042 -3113 2447 5179 3099 -2064 -5194 -3185 2102 5153 2802
2332B802m667l338J997N033L290j918n038k961J124N272L563j718m878l684J331
2347c790N214L769j405n020l524J012N016L714j022n249l504O28M826M243j095
2362C813m636m089R98M385M224o69m563m121Q22M209M081l17m431m147K65M476
2378C00L703K21m151m237L7L845M221K10l876m455q3M108M097N68l972m724m93
2395d681M294M258N14l469m858n78L830M297Q84l745m380r02L727M332R95l424
2411A094m472j280L410M709R64k999m723j153L076M691J338l293m638j580L072
2426a784N065J330l039m203j880K580M948J666k922m548j501K410M551J873k532
2441B014m899j411K045M559K404k693m360k245K055M899K230k265m574k186K221
$$ plain form
2332 2802 -1865 -5203 -3206 1827 5117 3199 -1839 -4800 -3676 1596 5159 3441 -1437 -5121 -3790
2347 -3790 1424 5193 3788 -1232 -4756 -3744 1272 4986 3964 -1285 -4789 -4161 665 4908 3813
2362 3813 -823 -4912 -3914 471 4695 4026 -537 -4658 -3836 373 4454 4137 -294 -4441 -4176 300
2378 300 4003 4224 73 -4164 -4127 -282 3939 4149 273 -4182 -4265 -157 3940 4508 536 -4188 -4681
2395 -4681 -387 3871 4385 916 -3942 -4520 -690 3607 4491 746 -3634 -4536 -809 3523 4518 1094
2411 1094 -3378 -4658 -1248 3461 4425 1426 -3297 -4450 -1374 3317 4655 1362 -3276 -4856 -1784
2426 -1784 3281 4611 1572 -2631 -4511 -1931 3017 4683 1761 -2787 -4288 -1878 2673 4546 2014
2441 2014 -2885 -4296 -2251 2308 4712 2019 -2341 -4586 -2531 2368 4598 2333 -2241 -4427 -2206
2456b206M281K520k211m631k121J714M586K490j889m307k745J966M254K656j478
2471B879m739k418J379M336K812j277m283k956J390M188K812r55m184k958J197
2486b777M053K939j060l975l560J007M450K732l82l797l664O78M106L169n36m019
2502f36l334P60L776L431o16l530l860O55L488L613k67l673l425k46L940L895
2518C971l49l531l567o2L264L686L45l806l560l29L495M144L7l535l585l84L221
2535e45L618P70l378l449q03K832M037Q21l211l801o65L128L482J092l049l927
2551c048j040L001M132J101l054m000r00K884L625J127k486l848j218K444L967
2566B687J200k296l987j664K690L890J435k335l760j829K357L886J276j732m167
$$ plain form
2456 -2206 2075 4595 2384 -2247 -4368 -2654 1932 4422 2533 -1774 -4519 -2553 1701 4357 2879
2471 2879 -1860 -4278 -2899 1437 4249 2972 -1311 -4267 -2877 1311 4123 3168 -1016 -3974 -2777
2486 -2777 1276 4215 3155 -820 -4380 -3373 1077 3809 3427 -370 -4034 -3356 750 3919 3383 -636
2502 -636 -3970 -3210 566 3997 3381 -149 -4009 -3354 134 3747 3480 -193 -3618 -3864 76 3971
2518 3971 3622 91 -3476 -3538 -274 3412 3757 -49 -3609 -3938 -443 3701 3738 203 -3382 -3766 -545
2535 -545 3073 3843 465 -2984 -3787 -955 3082 3903 692 -3109 -3774 -646 2836 3928 879 -3048
2551 -3048 -4088 -1087 3045 4146 1092 -2908 -3808 -924 2701 3828 1342 -2506 -3724 -1280 2687
2566 2687 3887 1591 -2396 -4060 -1370 2520 3955 1620 -2140 -3969 -1612 2274 3550 1818 -2349
2581b349j507K293L668J822k013l974j974K035L926J973j712m073j997J847L925
2596A890J654j406l723k455K013L551K204j637l692k044J209L745K386j513l655
2611a473k087J181L454K598j234l693k268J178L398K619r74l635k704R05L469
2626G34K863q71l766k450P56L484K644p50l190k838O35L175K698m43l066k885
2642c270K85L287K803l5l484k633L45L252K849j24l394l264M93L009L280m82k953
2659c6l244K7L108L265q8k666l344m27L084K933L88k933l018l15K827L008O69
2676C238k917k995n98K821L107N81k742l139n45K359L365P59k541l307o36K260
2692i30L417R96k654l216p85J978L734Q60k412k943r56J697L042J570k428l018
$$ plain form
2581 -2349 -3856 -1563 2105 3927 1914 -2060 -4034 -1999 1927 3900 2188 -1885 -3882 -2035 1890
2596 1890 3544 2138 -1585 -4040 -2027 1524 3728 2091 -1601 -3645 -2436 1309 3695 2182 -1473
2611 -1473 -3560 -2379 1075 3673 2439 -1254 -3522 -2344 1054 3673 2699 -936 -3640 -2735 734
2626 734 3597 2726 -1040 -3490 -2734 750 3394 2644 -546 -3384 -2749 426 3124 2681 -385 -3270
2642 -3270 -2985 302 3105 3070 -414 -3047 -2702 550 3399 3275 -119 -3383 -2890 119 3399 2917 -36
2659 -36 -3280 -3253 -145 3120 3032 366 -2978 -3405 -321 2612 3000 67 -2951 -3266 -439 2569 3238
2676 3238 321 -2674 -3272 -451 2656 3237 495 -2644 -3189 -830 2535 3294 753 -2554 -3190 -930
2692 -930 2487 3483 829 -2387 -3172 -1194 2540 3400 988 -1955 -2911 -1214 1828 3398 970 -2048
2708b048j138J939L053J478j935l160j345K009K817J548k024l097j420J613L286
2723A576J807j731l383j480J692L130J493j436l231j836J527L402J799j325l449
2738a445j655J452L108J845j320l076k133J314L076J916j056l074k262J228L263
2753A181K149j212l077k397J307L031J949o79l036k106N84L104K009n23k947k412
2769c075M95L303J993k39l049k154J08K776K787m49l121k118J79K854K516l84
2785B422k772k197k00K964K620k79k660k700K22K722K667l59k650k202k33K419
2801b16K815J72k634k582j9K059K975K52k250k986l32K442K591O91k653k626n59
2818b860K413K768K43j693l183n3J668L073O00k210l034p33K505K546M76j732
$$ plain form
2708 -2048 -3186 -1247 1806 3284 1349 -1811 -3156 -1147 1670 3218 1194 -1903 -3323 -1710 1576
2723 1576 3383 1652 -1731 -3211 -1519 1611 3104 1668 -1563 -3399 -1872 1530 3329 2004 -1445
2738 -1445 -3100 -1648 1460 3305 1985 -1091 -3224 -1910 1166 3082 2026 -1048 -3310 -2082 1181
2753 1181 3330 2118 -959 -3356 -2049 982 2931 2252 -784 -2890 -2306 798 2807 2284 -663 -3075
2769 -3075 -2580 723 2716 2477 -572 -2726 -2618 158 2945 2496 -625 -2743 -2564 290 2806 2422
2785 2422 -350 -2547 -2747 217 2837 2558 -102 -2802 -2580 142 2809 2450 -200 -2402 -2635 -216
2801 -216 2599 2771 137 -2445 -2464 -405 2570 2822 572 -2414 -2746 -304 2287 2978 325 -2301 -2860
2818 -2860 -447 2321 2564 871 -2312 -2365 -697 2376 2976 766 -2268 -3001 -496 2050 2526 794
2834G94k849q66K165K764O74j740k840r72K088K677Q29j695k578j491J744L164
2850A868J168j951k893r53J392K950J511j957k856j019J300L197J026j373k822
2865a412j374J426K640J482j408k558j807J452K848J449j350k724j592J191K989
2880A252J633j279k634j560O83K824J927j003k861j823J064K431K100p78k971
2895i95j802R34K726J795o46k667j868P89K512J761n81k387k133O09K680J798
2911B525m81k478j934L96K539J905l54k498k196N43K290K069j69k426k153L16
2927b106K582J882k13k259k085J47K174K319l43j969k012j30J992K347m4k124
2943A58k356J4J845K610J16k110k270l59K176K395L27k383k159l75K025K323O04
$$ plain form
2834 794 -2055 -2921 -756 2008 2682 942 -1898 -2870 -782 1895 2724 1029 -1549 -3040 -1296 1868
2850 1868 3036 1085 -1808 -2761 -1369 1581 3092 1135 -1721 -2740 -1440 1757 2783 1410 -1412
2865 -1412 -2786 -1360 1280 2762 1354 -1204 -3011 -1559 1289 2738 1388 -1336 -2928 -1737 1252
2880 1252 2885 1606 -1028 -2588 -1905 919 2846 1843 -1018 -2841 -1777 654 2754 1976 -995
2895 -995 -2797 -1863 863 2658 2012 -655 -2523 -1734 778 2539 1958 -429 -2562 -1953 727 2525
2911 2525 2044 -434 -2368 -1972 567 2472 2118 -380 -2576 -2033 257 2326 2157 -269 -2422 -2106
2927 -2106 476 2358 2145 -114 -2199 -2052 122 2441 2098 129 -1883 -2013 -21 2326 2282 158
2943 158 -2198 -2184 -339 2271 2387 277 -1993 -2352 -176 2219 2546 163 -1996 -2371 -346 1977 2581
2960B581k064k236m35J623K397P29k134k231n74J738K410N20j697k099r34J506
2976i00K431J084j832k579q10J788K551O74j505k536o72J221K385J128j396k339
2992a307r17J156K430J157j357k508r35J239K457R96j246k574p11P54K579J102
3008B315j116k363j023P63K483J185p65k332j538J085K477J196r77k126j563O73
3024a626K576J300q44k309j604R75K474J445r72j966j820P36K459J547r54k235
3040h18j312M51K302J602p30j898j568O2K377J643k80k185j572OK301J903n79
3057A705j969j827J63K328J593k45k112j609K51J932J637N1j808k041k5J932J942
3074A898K75k260j801j92J907K122k1j760k168R6J777J895L37j500k419j43J581
$$ plain form
2960 2581 517 -1719 -2154 -531 1866 2595 461 -1770 -2344 -606 1804 2324 627 -1472 -2406 -900
2976 -900 1531 2615 783 -1796 -2606 -818 1733 2407 902 -1634 -2306 -1085 1300 2428 1032 -1307
2992 -1307 -2224 -1068 1362 2519 1162 -1346 -2281 -1042 1415 2411 1165 -1409 -2120 -1366 1213 2315
3008 2315 1199 -1164 -2187 -1424 1059 2244 1479 -853 -2391 -1306 1171 2367 1390 -736 -2299 -1626
3024 -1626 950 2250 1406 -903 -2507 -1532 942 2387 1415 -551 -2371 -1635 824 2371 1417 -818
3040 -818 -2130 -1679 623 2225 1495 -403 -1971 -1909 468 2111 1831 -354 -1926 -1920 381 2284 1705
3057 1705 -264 -2091 -1928 400 1993 1748 -364 -1973 -1722 210 1847 1898 90 -1951 -1976 -44 1898
3074 1898 2173 -87 -1888 -2080 -173 1949 1928 168 -2000 -1904 -127 1768 2105 605 -1814 -1957 -376
3091c76J933N48j718j987l85J804J901J45j313k146l69J561J831L10j263j925
3107a449m17J400J861O51j572j926p82J834J990M90j417j995o95J185K186Q33
3123B177j372j993j102J405K277P67j426j862o75Q85K362Q95j507j883r02Q34
3139a120J996J300j007k284p86Q00K123J063r96j994j077J119J696J106q42k106
3155a009j033R59J749J166p36j617j120L01K085J182n67j870j315O32J688J522
3171B017o52j861j433M74K136J002l44j923j450O64J657J596n45j910j265N45
3187a292J577J789n31j568j851J2K145J496j88j556j921J77J972J489l20j492
3203f2j613j66J992J659j33j779j666J36J449J771qj696j519k00J789J783R5j941
$$ plain form
3091 -376 1557 2105 387 -1600 -1985 -181 1720 1865 552 -1594 -1963 -402 1429 1739 476 -1449
3107 -1449 -1866 -466 1395 2046 474 -1452 -2234 -400 1590 2080 663 -1332 -2027 -842 1344 2177
3123 2177 805 -1188 -2290 -885 1392 2159 733 -1129 -1804 -919 1443 2338 831 -1052 -1954 -1120
3139 -1120 876 2176 1169 -1115 -1901 -1101 1022 2085 1089 -905 -1982 -863 833 1939 1097 -1009
3155 -1009 -2042 -1083 666 1832 1096 -521 -1641 -1340 745 1927 1360 -510 -1825 -1193 495 2017
3171 2017 1365 -496 -1929 -1455 681 1683 1339 -584 -2034 -1370 287 1883 1338 -572 -1837 -1292
3187 -1292 285 2074 1543 -25 -1876 -1864 281 1777 1589 33 -1888 -1711 261 1750 1430 -62
3203 -62 -1675 -1841 151 1810 1677 -102 -1768 -1632 -183 1588 1580 -116 -1635 -1835 -46 1737 1832 -109
3221a09j455l83J687J832J48j438j657n25J690J742J14j266j908J00J061J855
3237A488K50j480j551m49J263J779N92j646j684l44J243J700N39j236j817l50
3253a703J355J319J008j459j879l18J058J839N42j223j763o90J198J848N59r81
3269G10j978k94R00J505J154j385j891r07J430J765Q27r87j804r25J056J907P44
3286A827q49j821r52Q39J567J239q61j718j326J027J953R66j204j525q85N21J627
3303D25J301p77j594j003M02K135O87k18j781j249O62J588J417j051j621r54L16
3320a315J866J234n05j557j492O61J644Q45k64j640r22N31J241J214j58j751j010
3337a378K74J091J714k80j581j543L57J445J472k64j500j229L1J424J251p5j169
$$ plain form
3221 -109 -1564 -1947 -260 1572 1720 282 -1375 -1900 -210 1532 1646 380 -1528 -1428 -367 1488
3237 1488 1738 258 -1293 -1742 -479 1300 1892 246 -1438 -1782 -539 1161 1700 464 -1353 -1703
3253 -1703 -348 971 1979 520 -1359 -1677 -619 1220 1762 539 -1224 -1914 -716 1132 1691 710
3269 710 -1268 -1562 -662 843 1997 612 -1279 -2186 -756 1009 1836 849 -955 -1880 -824 1083 1827
3286 1827 978 -843 -1795 -956 611 1850 989 -729 -2055 -1028 925 1891 687 -838 -1723 -1202 425
3303 425 1726 949 -645 -1648 -1246 889 1576 1358 -423 -1672 -1010 578 1995 944 -677 -1631 -1315
3320 -1315 551 1785 1280 -277 -1769 -1108 536 1381 1117 -523 -1445 -914 327 1541 1383 -368 -1378
3337 -1378 -1104 -13 1701 1421 -160 -1703 -1346 99 1571 1307 -193 -1422 -1391 33 1284 1209 40
3354D0j379P6J314J299L0j288j446p6J325J336J07j090j618k92J531J573O6j109
3372C99j735l99J514J571J9j128j338k65J210J284M94j588j086n56J233J593M46
3389A668j376j253n07R11J660M01j115j612m13J278J278O16j212j471j12N63J746
3406A050N77j008j520o39Q78J538N81o11j684n38P81J299Q57q49j552p54P98J448
3424F52Q07o27j533q84R83J414N39n49j449p74K77J732R05n84j674r16N31J696
3442E46P74m78j305j125O36J468J074o38j155j280M35J546R98o39j025j403N59
3459a012J220J278k61j407q46P6J130J248o03j037j196L57J088J348l02j236r99
3476a154K28J113J285m04j333j034J65J297J188K1j364j279J60Q97J381K7j482
$$ plain form
3354 40 -1339 -1263 51 1350 1380 92 -1354 -1430 -105 1231 1338 248 -1370 -1662 -131 1442 1508 399
3372 399 -1336 -1735 -221 1350 1369 241 -1097 -1362 -152 1132 1626 38 -1048 -1604 -371 1222 1668
3389 1668 292 -961 -1468 -557 1103 1504 389 -1223 -1636 -358 920 1536 324 -1147 -1259 -696 1050
3406 1050 1627 619 -901 -1540 -662 876 1457 846 -838 -1376 -595 704 1561 712 -840 -1594 -796 652
3424 652 1459 832 -701 -1585 -602 812 1351 802 -647 -1421 -1144 588 1493 909 -765 -1681 -1150 546
3442 546 1320 842 -463 -1588 -952 516 1590 952 -203 -1483 -1048 498 1496 857 -168 -1571 -1012
3459 -1012 208 1486 1225 -182 -1028 -952 178 1426 823 -214 -1410 -1053 35 1383 1081 -155 -1154
3476 -1154 -926 187 1472 1068 -265 -1299 -1134 163 1351 1372 8 -1271 -1111 -214 1167 1194 -288
3493b88r90J8J295J149L38j320j543J11R75J453J56j299j427K86R98J194O1j039
3511A28j277J05J003Q93L14j043j255O4R49J452l80n36j464j15J030J015M60q08
3529E35j365n47Q81J553J66p84j359m80J064J270M91o60j790k47O38J454M94r74
3547C40r83o01O32J487M66p20j523j18L29J481O28p56j272p92R36P72J007o06
3565G07j204p70Q18J266M47o55j322m72M73J292P85n39j506o07O33J318O20m06
3583H78j349n53J85J222P93n24j109o27L70Q76J452q66j344p36O70J172P12l56
3601H66j450p72N23J069J052l20j009r88J08J426Q28k55j352r28M75J104O70J16
3619A163j185j004M9J039J148k24r83j233K82J044R55m2r78j103j73J265J178
$$ plain form
3493 -288 -1278 -1260 35 1184 1522 202 -1341 -1230 -255 1198 1354 55 -1372 -1086 -88 1106 1167 128
3511 128 -1149 -1044 -41 852 1166 123 -1132 -1068 -119 1333 953 417 -1047 -1162 -132 883 1343 535
3529 535 -830 -1377 -496 1057 1223 439 -920 -1400 -336 934 1425 765 -1025 -1272 -634 820 1314 340
3547 340 -643 -1244 -612 875 1341 621 -902 -1020 -691 790 1418 662 -610 -1402 -466 306 1313 707
3565 707 -497 -1267 -449 817 1264 609 -713 -1185 -712 580 1365 826 -680 -1287 -654 664 1284 878
3583 878 -471 -1024 -839 383 1176 652 -457 -1084 -714 162 1614 748 -596 -1332 -662 510 1222 866
3601 866 -584 -1356 -833 236 1288 968 -41 -1029 -921 505 1333 1078 -274 -1202 -727 377 1047 1163
3619 1163 -22 -1026 -977 62 1210 986 3 -1230 -948 96 1051 1009 31 -1072 -1245 20 1198
3636A198l9j204p42q7R26J031J87j174j269J87O84J369R6j220p89k82J171Q38
3654H81J54p41j116j85P46J323R7o94j262r4P34R36L91q73j151m71J074J127N5
3673I31n85j083k91J012J026L65j102j136p8N21J176L93p91j267j38J061O56J58
3691H28k38j402k15M63J111O44n36j290m71P48J113J03l91r42p57R16R99M49p29
3710D03r11n84M12J456M12q05p38q07O76J068O56n35j227n76N02J049P31n26q33
3729a77q97K38J251M81k27o82j220M97J228O72m71q12p90O9J058O96o2r67q00
3748i15J96Q50M72K05j062p93J62Q95R66j81j015j050N39R43O69m3r22p62j34
3767i80J055R03L8j225p12j45J161N92K75j155q64L03O50Q95J64r25j053N0R43
$$ plain form
3636 1198 1159 -45 -787 -874 52 1083 1270 96 -1173 -986 -302 1067 1163 -57 -846 -1128 43 881
3654 881 1035 294 -822 -1007 -261 1062 1159 465 -797 -891 -157 779 1170 297 -854 -1325 -251 876 931
3673 931 346 -737 -1028 -16 1010 1375 273 -863 -941 -420 756 1149 358 -909 -1047 14 670 828
3691 828 590 -812 -1027 -564 547 1191 655 -635 -1106 -358 755 858 467 -475 -1232 -316 683 1132 403
3710 403 -508 -1092 -680 776 1188 383 -355 -1162 -486 582 1238 703 -524 -1100 -598 451 1182 656 -177
3729 -177 -1074 -836 415 896 669 -13 -1233 -736 492 1164 693 -119 -909 -840 218 914 852 -115 -915
3748 -915 -719 131 603 808 -254 -1047 -885 10 976 795 -220 -1270 -731 212 881 838 -84 -846 -980
3767 -980 75 978 1016 -209 -921 -1066 95 687 962 -193 -1057 -754 -104 791 955 30 -1023 -973 -30
3786c0R03J08p01j545J96J032P58J86q29r48r0Q98O48L85o91j244K24O01Q64K75
3806A000o41j356L85N24P92L19q28p99m23L14J605J75j051o47l07L75J298M0m15
3825C60j040k83M22J148M10n47j094n35P11J161J27l83q88m16K53J041P70p82
3843D35j018l06L13O89Q69l66j051n36N04Q72N74k87r97o90O51P76M16p8q18r56
3863a004L73J229J63j60j096j90K81N17P24l26q59p34M61Q17O52q4r98p66L55
3882f45P86Q83n32o47n77j21Q11Q30k84n44q23O4J064O13j26p67p78L9R69Q00
3902A015m0j111r10L23R63M44rp05o39k74R22P70O0r96n69N1P17P79j57q50o97
3923i13o0R60Q01M0p44o27l00Q38P44j4n61j025m6O66R86Pq79n69j43O71Q37K06
$$ plain form
3786 -30 873 981 280 -1265 -1069 -37 721 907 78 -870 -960 -62 586 971 280 -964 -740 -139 725 1000
3806 1000 359 -997 -612 -88 704 1023 195 -604 -1027 -713 892 1067 16 -631 -938 -563 735 775 360
3825 360 -680 -963 -541 607 1017 470 -624 -1159 -448 713 840 457 -431 -847 -594 447 1217 435
3843 435 -583 -889 -576 113 982 616 -435 -971 -467 405 979 692 -305 -995 -344 432 848 770 -48 -1004
3863 -1004 -631 598 761 601 -495 -685 -404 113 837 511 -348 -1082 -621 196 848 764 -234 -1000 -645
3882 -645 141 1024 492 -155 -732 -853 -42 788 504 -40 -863 -799 265 878 752 -15 -793 -754 215 1015
3902 1015 975 -136 -1046 -723 240 684 675 -30 -669 -943 -21 749 809 -187 -756 -705 12 791 634 -216 -913
3923 -913 -973 -13 788 828 84 -543 -843 -5 739 725 164 -861 -907 -241 745 752 -127 -696 -839 -168 669 875
3945H75n44j049m9O47O15M86p47p50k58R01N45J83o54n90m34N18P36L12n36p73
3965e66j66N36R09L29p21r54k04N92P73K74n21r77j77N55O97M69n41r14l14N25
3985c96R37J15j47p65o17K09Q44Q00o69r38r3J66R78L62j48q60l79J66O83O37
4005H85k80p76o43M01N21P76m46p71o08L30R68J97P6j016m11L92P05M83L6r46
4025a27o40L30N44P48k5p74q31O1O11Q37M2p53q32J92O44O95j31q60n43K20J007
4046D15J69J01p22p16L7Q62P63j12p93o92P8N75Q34k69o30o07l10J025N13K28
4066G49n90p67l26Q46R08m28r3r15j79O29Q26J20j014m02n4N15Q02j93l31p32
4086f29j02N04O22L95m55j333M63N91N46K62m94j149m9P62N97J64j38j055j67
$$ plain form
3945 875 331 -718 -767 -120 495 981 234 -516 -774 127 672 855 201 -389 -823 -305 431 743 207 -566
3965 -566 -732 -196 713 1042 321 -633 -837 -245 528 802 281 -696 -873 -318 379 848 307 -607 -921 -396
3985 -396 541 656 509 -256 -873 -664 180 980 311 -627 -720 -554 424 786 638 -222 -601 -435 248 885
4005 885 605 -171 -814 -413 108 884 438 -333 -941 -611 357 554 630 -386 -797 -405 300 783 819 -127
4025 -127 -767 -437 107 855 830 56 -775 -714 -103 734 776 23 -809 -617 27 722 591 -269 -812 -592 415
4046 415 584 685 -37 -753 -716 146 909 797 4 -688 -610 -35 799 530 -100 -707 -1017 8 521 749
4066 749 159 -608 -934 -88 820 392 299 -616 -795 -166 660 780 -234 -636 -690 -175 627 434 103 -629
4086 -629 -731 -227 395 790 335 -998 -535 56 602 864 370 -779 -828 -66 531 695 557 -498 -665
4105f65K10R07K32o82p19N4M61P44L73n60q49j90J88P86M63l21o84n63N89K86
4125F0L41q2l24q31M31J180Nl97n87o81P23O53K64j01r40k23J67N53M08j60r27
4146d68l77N26N48M89j36p58p42N45O52N69n14o17m76p6R98N52j51p29o37K56
4166e46P14L83k1q04l72J87O82N63k17o37n07K21O57N33k90n97o25J64P68L97
4186F53j93m13r93L18O33M85q8n06o68K28N62N80J56q79n90L82M84L56Q9n06q09
4207g19J56N19N00M02j076k41M5L90N89K20p96o77q6P13O64R8o47m87j8N80L56
4228D85K43o01o86q2M07P58O1m77l29p25P88O65L04o08o05k84L82N42K84N9r98
4249d17k67M89N18J19o7o39m10K95Q58K24n03p73p5L25N76L74m32o96l47M44Q08
$$ plain form
4105 -665 -455 452 684 2 -717 -663 -202 542 915 355 -494 -684 -496 290 753 432 -252 -815 -226 60
4125 60 401 319 -5 -836 -405 775 780 383 -204 -885 -162 491 755 654 -286 -509 -342 211 619 459 -468
4146 -468 -845 -319 229 718 582 -176 -918 -373 279 848 334 -283 -759 -835 163 715 564 -165 -802 -546
4166 -546 168 551 530 -274 -646 -459 223 786 569 -68 -575 -354 303 836 546 -51 -676 -512 256 653
4186 653 460 47 -946 -628 5 490 402 -104 -772 -544 18 598 754 -125 -715 -333 151 507 596 90 -719
4207 -719 -563 -44 456 858 -218 -459 -414 -24 565 785 -11 -688 -774 -61 603 701 54 -433 -451 129 485
4228 485 728 127 -559 -641 -234 524 585 108 -221 -946 -158 507 811 203 -402 -686 -304 238 522 581 -417
4249 -417 -684 -195 323 442 375 -264 -674 -379 479 703 200 -573 -648 -323 253 627 195 -501 -848 -404 404
4270D04J21j98n16o04N81M42N06n11o54q3J35O48K69R0j110j10K63M82P51o08
4290B98m46l36K13N06M20j36o31n83R5R42M83l02j074j97K95O11N95m10n10l63
4310e30k41J107K10L4o19o36J27O39L66j2n57l93JO64M86k24n39n40NO03N37k
4332D86m98n50J76O50L95Q1o41o69j05L96R34j05m88m87j02M93M38L4j33r09j06
4353g10M98P80K6m53o04j18K16P59J70n58n46p4M03N26M30q93l76NN48K77J38
4374D44k26p27L0J86O38K14n62l93j54N43N04K7k76p82k5M09N37K75n06o50k93
$$ plain form
4270 404 525 327 -189 -793 -212 230 736 225 -429 -512 -377 271 540 630 -480 -590 -327 155 906 298
4290 298 -148 -484 -271 235 655 519 -112 -695 -600 342 825 523 -551 -748 -453 158 753 343 -167 -530
4310 -530 -771 336 546 580 -39 -675 -548 91 457 445 -112 -505 -504 160 646 422 -117 -657 -652 -49 488 486
4332 486 -12 -562 -386 264 659 740 99 -570 -675 -279 655 550 62 -425 -527 -34 404 438 305 -604 -710
4353 -710 -212 568 594 141 -463 -581 -365 394 564 6 -540 -614 -211 315 745 -148 -524 -519 29 306 444
4374 444 218 -509 -479 -293 345 559 -3 -396 -550 -7 497 524 248 -534 -559 -150 387 662 156 -494 -787
$$ [...]
8191d5
##END NTUPLES=NMR FID
##END=
